##TITLE=31Pdec_83-2021
 CDCl3, 24 sc
 24.08.2021
##JCAMPDX= 6.0         $$ Bruker NMR JCAMP-DX V2.0
##DATA TYPE= NMR SPECTRUM
##DATA CLASS= NTUPLES
##ORIGIN= UXNMR, Bruker Analytische Messtechnik GmbH
##OWNER= root
$$ XWIN-NMR		Version 3.5
$$ Tue Aug 24 10:30:24 2021 Russian Standard Time (UT+4h)  she@DPX200
##.OBSERVE FREQUENCY= 81.013821
##.OBSERVE NUCLEUS= ^31P
##.ACQUISITION MODE= SIMULTANEOUS
##.ACQUISITION SCHEME= undefined
##.AVERAGES= 24
##.DIGITISER RES= 16
##SPECTROMETER/DATA SYSTEM= spect
##.PULSE SEQUENCE= zgpg30
##.SOLVENT NAME= CDCl3
##.SHIFT REFERENCE= (INTERNAL, CDCl3, 0, 248.564)
##AUDIT TRAIL= $$ (NUMBER, WHEN, WHO, WHERE, WHAT)
$$ ##TITLE= Audit trail, XWIN-NMR		Version 3.5
$$ ##JCAMPDX= 5.01
$$ ##ORIGIN= Bruker BioSpin GmbH
$$ ##OWNER= she
$$ F:/spectra/data/she/nmr/P31/1/pdata/1/auditp.txt
$$ ##AUDIT TRAIL=  $$ (NUMBER, WHEN, WHO, WHERE, WHAT)
(   1,<2021-08-24 10:28:36.03 +0400>,<she>,<DPX200>,
      <created by zg, POWCHK disabled, PULCHK disabled
       configuration hash MD5:
       00 E9 B6 7A A2 85 ED C7 34 08 36 98 17 FE 4E 26
       data hash MD5: 32K
       CE F7 D5 57 EE 5D A6 6F 0A D9 F3 53 DD CF AE 3F>)
(   2,<2021-08-24 10:28:40.10 +0400>,<she>,<DPX200>,
      <Start of raw data processing
       efp BC_mod = 2 LB = 1 FT_mod = 6 PKNL = 1 PHC0 = -7879.359 PHC1 = 1205.674 SI = 64K 
       data hash MD5: 64K
       70 B9 D7 20 B7 02 67 A1 17 ED 60 38 9A B2 11 A9>)
(   3,<2021-08-24 10:29:19.31 +0400>,<she>,<DPX200>,
      <pk PHC0 = 364.7432 PHC1 = -842.0004 
       data hash MD5: 64K
       C1 D4 CC 2D 95 E9 F8 6A 12 5A 1C 05 73 E3 F1 00>)
(   4,<2021-08-24 10:29:22.34 +0400>,<she>,<DPX200>,
      <abs ABSG = 5 
       data hash MD5: 64K
       32 F4 C9 DB 73 5B 3D A2 27 34 02 50 F0 E4 B9 A2>)
$$ ##END=
$$ 
$$ hash MD5
$$ D5 12 DC B5 F4 57 F9 08 9F 19 78 98 85 20 0F 71
##$RELAX= 
##$RELAX= 
##$RELAX= 
##$RELAX= 
##$RELAX= 
##$RELAX= 
##$RELAX= 
##$RELAX= 
$$ Bruker specific parameters
$$ --------------------------
##$DU= <F:/spectra>
##$EXPNO= 1
##$NAME= <P31>
##$PROCNO= 1
##$TYPE= <nmr>
##$USER= <she>
##$AMP= (0..31)
100 100 100 100 100 100 100 100 100 100 100 100 100 100 100 100 100 100 
100 100 100 100 100 100 100 100 100 100 100 100 100 100 
##$AQSEQ= 0
##$AQ_mod= 1
##$AUNM= <au_zg>
##$AUTOPOS= <>
##$BF1= 81.014009
##$BF2= 200.13
##$BF3= 200.13
##$BF4= 200.13
##$BF5= 200.13
##$BF6= 200.13
##$BF7= 200.13
##$BF8= 200.13
##$BYTORDA= 1
##$CFDGTYP= 0
##$CFRGTYP= 5
##$CHEMSTR= <none>
##$CNST= (0..31)
1 1 145 1 1 1 1 1 1 1 1 1 1 1 1 1 1 1 1 1 1 1 1 1 1 1 1 1 1 1 1 1 
##$CPDPRG= <waltz16>
##$CPDPRG1= <>
##$CPDPRG2= <waltz16>
##$CPDPRG3= <>
##$CPDPRG4= <mlev>
##$CPDPRG5= <mlev>
##$CPDPRG6= <mlev>
##$CPDPRG7= <mlev>
##$CPDPRG8= <mlev>
##$CPDPRGB= <>
##$CPDPRGT= <>
##$D= (0..31)
0 1 0 0 0 0 0 0 0 0 0 0.03 2e-05 3e-06 0 0 0 0 0 0 0 0 0 0 0 0 0 0 0 0 
0 0 
##$DATE= 1629786515
##$DBL= (0..7)
120 120 120 11 120 120 24 19 
##$DBP= (0..7)
150 150 150 150 150 150 150 150 
##$DBP07= 0
##$DBPNAM0= <>
##$DBPNAM1= <>
##$DBPNAM2= <>
$$ [...]
##$SUBNAM3= <"">
##$SUBNAM4= <"">
##$SUBNAM5= <"">
##$SUBNAM6= <"">
##$SUBNAM7= <"">
##$SUBNAM8= <"">
##$SUBNAM9= <"">
##$SW= 501.771253377433
##$SWIBOX= (0..15)
0 1 3 0 0 0 0 0 0 0 0 0 0 0 0 0 
##$SW_h= 40650.406504065
##$TD= 32768
##$TD0= 1
##$TE= 0
##$TE2= 300
##$TE3= 300
##$TEG= 300
##$TL= (0..7)
0 120 53 12 22 120 120 120 
##$TP= (0..7)
150 150 150 150 150 150 150 150 
##$TP07= 0
##$TPNAME0= <>
##$TPNAME1= <>
##$TPNAME2= <>
##$TPNAME3= <>
##$TPNAME4= <>
##$TPNAME5= <>
##$TPNAME6= <>
##$TPNAME7= <>
##$TPOAL= (0..7)
0.5 0.5 0.5 0.5 0.5 0.5 0.5 0.5 
##$TPOFFS= (0..7)
0 0 0 0 0 0 0 0 
##$TUNHIN= 0
##$TUNHOUT= 0
##$TUNXOUT= 0
##$USERA1= <user>
##$USERA2= <user>
##$USERA3= <user>
##$USERA4= <user>
##$USERA5= <user>
##$V9= 5
##$VALIST= <valist>
##$VCLIST= <CCCCCCCCCCCCCCC>
##$VD= 0
##$VDLIST= <DDDDDDDDDDDDDDD>
##$VPLIST= <PPPPPPPPPPPPPPP>
##$VTLIST= <TTTTTTTTTTTTTTT>
##$WBST= 1024
##$WBSW= 4
##$XGAIN= (0..3)
0 0 0 0 
##$XL= 0
##$YL= 0
##$YMAX_a= 3526
##$YMIN_a= -3543
##$ZGOPTNS= <>
##$ZL1= 120
##$ZL2= 120
##$ZL3= 120
##$ZL4= 120
##$ABSF1= 248.5645
##$ABSF2= -253.2056
##$ABSG= 5
##$ABSL= 3
##$ALPHA= 0
##$AQORDER= 0
##$ASSFAC= 0
##$ASSFACI= 0
##$ASSFACX= 0
##$ASSWID= 0
##$AUNMP= <proc_1d>
##$AZFE= 0.1
##$AZFW= 0.5
##$BCFW= 0
##$BC_mod= 2
##$BYTORDP= 0
##$COROFFS= 0
##$CY= -3
##$DATMOD= 1
##$DC= 0
##$DFILT= <>
##$DTYPP= 0
##$F1P= 0
##$F2P= 0
##$FCOR= 1
##$FTSIZE= 65536
##$FT_mod= 6
##$GAMMA= 0
##$GB= 0
##$INTBC= 1
##$INTSCL= 5.30512e-09
##$ISEN= 30
##$LB= 1
##$LEV0= 0
##$LPBIN= 0
##$MAXI= 10000
##$MC2= 0
##$MEAN= 0
##$ME_mod= 0
##$MI= 50
##$NCOEF= 0
##$NC_proc= -5
##$NLEV= 6
##$NOISF1= 182.463
##$NOISF2= 159.3651
##$NSP= 0
##$NTH_PI= 0
##$NZP= 0
##$OFFSET= 248.5645
##$PC= 4
##$PHC0= -7514.616
##$PHC1= 363.6735
##$PH_mod= 1
##$PKNL= yes
##$PPARMOD= 0
##$PSCAL= 0
##$PSIGN= 0
##$REVERSE= no
##$SF= 81.014009
##$SI= 65536
##$SIGF1= 159.3651
##$SIGF2= -187.1042
##$SINO= 113.3802
##$SIOLD= 16384
##$SREGLST= <1H.CDCl3>
##$SSB= 0
##$STSI= 65536
##$STSR= 0
##$SW_p= 40650.406504065
##$SYMM= 0
##$S_DEV= 0
##$TDeff= 32768
##$TDoff= 0
##$TI= <>
##$TILT= no
##$TM1= 0
##$TM2= 0
##$TOPLEV= 0
##$USERP1= <user>
##$USERP2= <user>
##$USERP3= <user>
##$USERP4= <user>
##$USERP5= <user>
##$WDW= 1
##$XDIM= 65536
##$YMAX_p= 362203707
##$YMIN_p= -62456371
$$ End of Bruker specific parameters
$$ ---------------------------------
##NTUPLES= NMR SPECTRUM
##VAR_NAME=  FREQUENCY,     SPECTRUM/REAL,   SPECTRUM/IMAG
##SYMBOL=    X,             R,               I
##VAR_TYPE=  INDEPENDENT,   DEPENDENT,       DEPENDENT
##VAR_FORM=  AFFN,          ASDF,            ASDF
##VAR_DIM=   65536,         65536,           65536
##UNITS=     HZ,            ARBITRARY UNITS, ARBITRARY UNITS
##FACTOR=    0.620285442955139, 1,           1
##FIRST=     20137.2065510759, 0,            0
##LAST=      -20513.1999529892, 0,           0
##MIN=       -20513.1999529892, -62456371,   0
##MAX=       20137.2065510759, 362203707,    0
$$ Real data points
##PAGE= N=1
##DATA TABLE= (X++(R..R)), XYDATA
$$ [...]
37805 467267 329901 201673 479068 843224 805099 461410 203066 114847 125582 299082
37795 299082 524113 407655 -39639 -142996 451044 1064952 924493 299269 -45184 -79841
37785 -79841 -312803 -680971 -611356 -67840 390146 588046 885010 1263672 1165052 472058
37775 472058 -140080 -169677 85980 234142 450352 948960 1337763 1107152 448967 30717
37765 30717 110225 329475 302642 28387 -249793 -295295 -16984 397121 529903 176475
37755 176475 -281894 -221057 449082 1101476 1120988 614299 188574 173915 374095 559725
37745 559725 811300 1181076 1365343 1097089 661288 552099 697325 555377 35116 -269158
37735 -269158 2140 381887 323701 79201 254834 771130 907143 341135 -404927 -653729
37725 -653729 -295504 284509 653593 559067 -14547 -801385 -1367708 -1412515 -984224 -425784
37715 -425784 -102499 -78566 -44043 279805 661136 569440 -50089 -592109 -611578 -451305
37705 -451305 -678880 -1196682 -1378118 -938644 -247139 153847 11925 -523388 -942681 -722726
37695 -722726 12246 403085 -136085 -1048690 -1294020 -679255 72382 442855 583922 645590
37685 645590 414255 -119313 -446973 -153055 565554 1225254 1515294 1273816 492464 -399299
37675 -399299 -718640 -326288 143021 150485 -50740 43501 347641 386784 92725 -126007
37665 -126007 -32209 166972 205357 60662 -176562 -443659 -622036 -528886 -125464 358468
37655 358468 591664 408376 -88759 -621239 -899083 -764748 -297131 173073 267163 -52511
37645 -52511 -346236 -176806 291690 494176 302073 207496 472753 626909 242446 -266533
37635 -266533 -251029 116563 140568 -247167 -459388 -331494 -367704 -774544 -1061029 -874268
37625 -874268 -518208 -320965 -147604 105800 177448 12184 64431 559416 996436 889919
37615 889919 510388 363334 389133 241516 -40480 -216355 -355380 -595228 -694339 -385483
37605 -385483 91855 339398 400320 492335 464222 107566 -287526 -319084 -147159 -133438
37595 -133438 -100642 291903 677527 368359 -477030 -971323 -816164 -604183 -671075 -583480
37585 -583480 -105447 194360 -163196 -728829 -771030 -290174 168270 355212 440626 543367
37575 543367 628172 741550 968577 1232361 1391148 1420832 1315832 993988 500940 109790
37565 109790 3027 38611 22775 6318 103876 232501 259674 222448 185345 86336 -46006
37554 -46006 49144 489028 907309 827413 284868 -226002 -365805 -219888 11430 285852
37544 285852 618423 934798 1129378 1156186 1021889 790990 611930 614262 722247 654895
37534 654895 203541 -484122 -953980 -852695 -305476 184517 264249 73829 -11433 144127
37524 144127 369973 486732 463938 349171 249847 318545 537046 616631 389838 170918
37514 170918 338458 666522 597827 179605 78675 472146 616327 -18360 -754570 -521413
37504 -521413 647676 1628852 1638584 1028738 588108 592762 773842 862205 856890 853935 802124
37493 802124 501802 -103167 -666339 -685908 -123725 445799 499022 169697 -42911 33078
37483 33078 144349 54522 -240970 -644626 -1001547 -1102280 -922501 -755022 -823321 -915856
37473 -915856 -742874 -477168 -476410 -569321 -180004 754336 1499551 1381550 583085 -126457
37463 -126457 -217397 195916 584467 533167 163184 -5387 239625 431741 103968 -376982
37453 -376982 -218639 614019 1276684 1220982 838862 681227 665103 467504 178774 51385
37443 51385 -21565 -257716 -490243 -420510 -169370 -107223 -272196 -388984 -358208 -308746 -228820
37432 -228820 51546 504732 857953 925128 745856 416855 18354 -306669 -401508 -239462
37422 -239462 61832 301054 264576 -41014 -199934 218176 971732 1304511 989903 680037
37412 680037 872579 1137634 919468 503657 404137 288782 -479038 -1510786 -1732659 -1035287
37402 -1035287 -460432 -565806 -723583 -421706 -145458 -311055 -315794 432087 1273303 1156468
37392 1156468 315782 -2448 626056 1256264 1011554 226645 -199974 -8115 305659
37383 305659 263601 -75412 -288691 -78476 410871 738604 659034 378206 215724 162822
37373 162822 9262 -188744 -86674 443611 1026949 1142127 672826 7650 -390233 -458476
37363 -458476 -516323 -748067 -868166 -526561 54659 235555 -184528 -676464 -747620 -593723
37353 -593723 -650470 -844153 -766487 -409215 -210922 -374130 -560782 -378801 96023 390428
37343 390428 101903 -688313 -1368069 -1283266 -440482 418581 623543 266276 -128567 -343558
37333 -343558 -492903 -522383 -210392 337830 652173 453474 -63251 -544917 -799428 -799035
37323 -799035 -653082 -563436 -541761 -276991 364553 864450 607410 -138240 -426291 68502
37313 68502 604059 489496 20685 -152280 -66520 -229548 -657727 -806520 -429078 61174
37303 61174 218308 142935 216305 509722 724178 658984 517791 623978 908312 904588 379052
37292 379052 -236655 -325902 99966 441813 377610 257522 472565 843292 955834 801717
37282 801717 677951 611452 310048 -304615 -857181 -934762 -565768 -175513 -129561 -366241
37272 -366241 -473246 -147682 436855 800385 669423 191762 -321596 -650035 -655330 -317888
37262 -317888 102150 207593 -73742 -405145 -548198 -635421 -730424 -506184 229165 968326
37252 968326 998286 367727 -142010 -32910 388927 607774 563992 495512 456062 300624
37242 300624 -23270 -425709 -815108 -1091725 -1092673 -748386 -259023 60211 107246 24368
37232 24368 -87416 -294521 -592381 -725284 -460367 9388 184995 -138682 -613085 -832415
37222 -832415 -876701 -1083599 -1430504 -1538925 -1284295 -974107 -803392 -565470 -148537 93831
37212 93831 -129012 -447706 -266990 344861 711009 472830 -17717 -292034 -284305 -117439
37202 -117439 164340 379607 131186 -651003 -1337430 -1222321 -440573 150234 36297 -369668
37192 -369668 -351600 187449 659014 516096 -166474 -817800 -940396 -545475 -98945 -46345
37182 -46345 -379436 -724335 -848452 -901739 -1046774 -1081002 -740174 -257180 -171837 -522466
37172 -522466 -719503 -473022 -339480 -838673 -1413864 -1027338 289568 1282199 1076039
37163 1076039 237668 -150639 115377 433233 421984 234933 71496 -1872 161224 602216
37153 602216 888767 512606 -271392 -569565 -5394 743655 838205 287142 -269349 -440029
37143 -440029 -324217 -77554 305303 767611 1083022 1081689 834808 558038 409343 387411
37133 387411 374411 289163 204553 247310 389234 466921 424434 364984 312012 131723 -179673
37122 -179673 -324546 -7216 703869 1460686 1962103 2073505 1797218 1318696 945350 800305
37112 800305 697730 490965 347439 433855 557401 485297 430243 735644 1174726 1143221
37102 1143221 611972 281910 557069 926409 754547 221106 -29890 154048 386533
37093 386533 453985 492134 496935 212084 -386751 -916507 -1043450 -811484 -412280 80811
37083 80811 620802 1058920 1242179 1128128 805318 525632 590665 962154 1128971 696710
37073 696710 -30745 -470158 -595126 -784935 -951116 -597819 117495 234861 -664539 -1667882
37063 -1667882 -1668474 -774045 27080 186552 -44171 -240082 -150626 330932 937112 980914
37053 980914 148957 -850571 -1054335 -491984 -22573 -77076 -296910 -375663 -473005 -655798
37043 -655798 -624490 -242568 192731 415232 474942 428964 214183 -44792 -58861 163382
37033 163382 287268 153882 -100415 -399062 -691592 -626539 84059 947971 1072449 395490
37023 395490 -194075 -149289 97244 51421 -107513 -125416 -239795 -619101 -887607 -759157
37013 -759157 -570666 -651135 -713706 -425774 -62180 -31474 -229155 -377819 -506306 -587511
37003 -587511 -273855 438016 871987 625372 249426 307405 424732 87828 -292662 -117151
36993 -117151 191570 -139566 -784948 -782923 -184110 48604 -295296 -402004 62094 406681
36983 406681 169915 -177015 -154233 57888 265658 669239 1157705 1024848 -29932 -1222997
36973 -1222997 -1546841 -898492 8685 479143 348692 44023 236014 1026007 1551965
36964 1551965 1010691 -51178 -323218 392328 908365 455479 -329396 -641824 -677590
36955 -677590 -906852 -1092472 -841172 -457855 -447159 -653449 -597709 -266305 17815 112740
36945 112740 -20240 -429496 -788944 -514932 260273 550483 -61824 -650417 -344669 292591
36935 292591 244327 -313810 -491085 -273243 -377123 -822556 -921881 -595538 -500512 -819526
36925 -819526 -1032855 -976172 -1047901 -1232594 -996768 -372457 -82653 -292188 -280954 261902
36915 261902 669297 515629 371299 690351 907331 450274 -172338 -205798 111735 112401
36905 112401 -69329 102204 333008 -157578 -1181325 -1592347 -888594 147772 643678
36896 643678 624093 483306 235379 -216059 -601647 -600310 -326433 -125925 -119315 -209885 -297477
36885 -297477 -269865 -50639 162567 26729 -388779 -547918 -202926 194296 163315 -116310
36875 -116310 -194246 -55403 52010 165067 413053 539681 253791 -127805 -65246 305578
36865 305578 395606 207118 304616 689702 660134 56403 -326955 -61031 123198 -428282
36855 -428282 -1086417 -887525 -57007 449989 488134 680063 1075779 1040376 501543 171877
36845 171877 298649 244175 -293942 -616640 -168222 448429 330650 -404920 -909663 -851768
36835 -851768 -645815 -599241 -505022 -140784 304517 456261 176542 -312187 -621523 -542256
36825 -542256 -253576 -98427 -149769 -197705 -165374 -214376 -350215 -310304 -63027 -49262 -574063
36814 -574063 -1206408 -1195321 -410838 459422 674448 191097 -382038 -455308 -33576 362812
36804 362812 331747 34311 -91968 89545 353273 506519 533242 407956 122445 -107687
36794 -107687 -26839 234634 264636 -55284 -405136 -477446 -247833 169417 558878 575242
36784 575242 147326 -170951 171546 799247 808905 115892 -406033 -292987 -123482 -433914
36774 -433914 -851943 -829160 -493749 -182605 205250 737384 937273 466573 -170657 -318075
36764 -318075 -140590 -218715 -572414 -801434 -842276 -869233 -766401 -417483 -204997 -466388
36754 -466388 -749412 -424930 202369 288716 -169148 -287483 301361 861750 618278 -246395
36744 -246395 -935332 -935312 -388078 117367 71823 -389399 -578442 -174016 287616 269738 133561
36733 133561 490019 1044498 1002603 430392 195157 529770 673012 168594 -412931 -442022
36723 -442022 -133971 -12799 -105989 -175143 -255462 -467282 -641754 -568552 -363713 -256146
36713 -256146 -243820 -247443 -365173 -663483 -884590 -683546 -127295 280509 162163 -240788
36703 -240788 -300869 188377 650114 485564 17602 68052 584655 538006 -445751 -1239143
36693 -1239143 -734145 516176 1129089 836035 509175 568379 542275 186320 -56688 103223
36683 103223 368110 434843 295718 -113352 -845999 -1496565 -1548480 -1184221 -1030183 -1158345
36673 -1158345 -1135885 -972246 -1098470 -1424415 -1369953 -872484 -429953 -138089 320324 737676
36663 737676 534618 -97869 -337977 -56087 195375 475035 1283855 2054191 1537601 30683
36653 30683 -639029 56352 478379 -323170 -940282 -152538 799807 334079 -673824 -364572
36643 -364572 963756 1457657 745876 142755 179315 86720 -307154 -183807 533494 815208
36633 815208 250952 -375724 -574315 -783098 -1152409 -1075495 -420547 10060 -216147 -503318
36623 -503318 -387040 -297975 -602938 -858954 -658167 -383998 -484181 -688790 -559807 -226838
36613 -226838 -14829 153496 470603 781369 846423 718890 526828 222054 -183138 -448306
36603 -448306 -387995 -72625 302961 469539 131364 -590153 -957439 -483122 195810 94570
36593 94570 -618864 -868486 -390481 -70505 -348644 -491814 33703 581349 461992 126409
36583 126409 312874 726706 544043 -220357 -772783 -724286 -431124 -289107 -336091 -475972
36573 -475972 -587775 -494773 -203854 -7713 -26515 65263 478810 824298 667918 267568
36563 267568 190418 420635 456398 187751 60537 315651 593548 466407 -8151 -462153
36553 -462153 -702987 -811232 -843538 -638500 -48167 664149 897598 387929 -387421 -797144
36543 -797144 -859268 -1002701 -1213434 -1099398 -774840 -844431 -1303984 -1329133 -579159 132931
36533 132931 80162 -260088 -129376 165206 -145202 -807621 -830578 -96003 442057 260567
36523 260567 -57607 75742 375419 331394 35389 -129802 -130073 -152930 -178778 -40477 323983
36512 323983 875073 1444471 1607020 1017564 60948 -316631 270828 1117822 1347495 949595
36502 949595 513233 335797 311529 405942 662238 884076 845512 730891 859001 1039053
36492 1039053 763788 71278 -372966 -219838 75017 -25488 -400646 -607952 -556119 -407376
36482 -407376 -121551 376782 739813 467629 -328223 -896116 -713461 -49711 457662 489585
36472 489585 184890 -115004 -101957 262280 577847 324010 -460819 -1062503 -905906 -273149
36462 -273149 102681 5062 -89866 208868 630995 615776 55403 -532456 -552559 33934
36452 33934 645690 654407 7341 -769064 -1160257 -1133515 -996222 -956265 -949751 -818738 -541192
36441 -541192 -288187 -247592 -342634 -237998 183277 483393 181124 -443102 -562818 47503
36431 47503 642039 584752 245440 320422 730204 859144 592714 372956 336256 137213
36421 137213 -318665 -639899 -601940 -453204 -372747 -162998 249035 475877 178847 -409924
36411 -409924 -782437 -746349 -496656 -301168 -293810 -404465 -391194 -138180 60071 -176677
36401 -176677 -664110 -745630 -209713 291158 39417 -821023 -1484738 -1432014 -881776 -399272
36391 -399272 -304423 -468109 -563560 -474026 -389473 -437237 -394174 -16243 490941 703657 615232
36380 615232 610441 804552 880234 669581 425470 358604 351426 316074 390770 555628 494546
36369 494546 118981 -175541 -84639 140716 130913 -31861 -25266 190934 374323 320817 -15272
36358 -15272 -476724 -655274 -250495 387054 533874 101981 -184129 105856 469519 385980
36348 385980 211526 503416 981317 952355 429941 45702 69082 255893 491935 832740
36338 832740 1020271 727659 253465 232301 639939 821093 563638 375325 522976 551706
36328 551706 73850 -593090 -929420 -838327 -456819 146815 733476 827626 316322 -239506
36318 -239506 -281330 61075 311622 363668 448267 629184 758715 804206 844484 823733 633198
36307 633198 380216 285479 346994 363737 271100 209756 256816 314595 309383 304884 331358 248569
36295 248569 -87909 -576536 -913613 -922320 -757578 -702067 -805427 -854745 -696402 -404913
36285 -404913 -70754 356428 843663 1094922 863239 335853 -59404 -163744 -143563 -117586
36275 -117586 -52143 -8352 -139194 -371004 -401922 -119645 256945 542847 787311 983227
36265 983227 916010 536271 200458 236874 460614 430342 64319 -304688 -410103 -277647
36255 -277647 -10608 311166 479269 263481 -170382 -273686 182779 679623 601964 152171
36245 152171 104022 644915 1050352 751121 161627 -19530 132009 64660 -218226 -267990
36235 -267990 -234131 -831657 -2040482 -2760675 -2268198 -1256433 -786536 -833005 -644498 -71590
36225 -71590 345937 361056 232832 52961 -356333 -862523 -1032987 -776756 -394052 -19841
36215 -19841 361422 430444 -167162 -999202 -1138285 -448059 190887 168366 -116639 -115586
36205 -115586 44217 30397 -84490 -171207 -389869 -696227 -601382 44272 611304 606205
36195 606205 429506 568086 657124 199132 -301293 41572 1011766 1495470 1114733 636979
36185 636979 636510 720619 403533 -88809 -349407 -487510 -789622 -1122559 -1136794 -785219
36175 -785219 -307311 62208 153516 -62703 -260966 8718 628487 851173 273601 -502102
36165 -502102 -624301 -120773 250725 121346 -96119 21450 259529 141762 -339339 -659244
36155 -659244 -362812 436693 1168085 1352483 1026349 613354 414109 332924 139850 -156598
36145 -156598 -335749 -260708 6838 313689 479114 329749 -124128 -580035 -729329 -652493
36135 -652493 -695566 -927069 -1012476 -760681 -491085 -576965 -839091 -779033 -344024 -33566
36125 -33566 -152363 -353466 -172407 281006 520671 421744 358471 580911 800046 551876
36115 551876 -230270 -1159588 -1772530 -1835391 -1417108 -837126 -476129 -467425 -579538 -524480
36105 -524480 -359340 -416331 -788269 -1066619 -783357 -57836 443518 300773 -110782 -100208
36095 -100208 435464 934984 1006030 902843 966281 1008970 676159 121783 -220499 -379217
36085 -379217 -717111 -1073849 -787553 166154 770504 232654 -867731 -1342288 -953182
36076 -953182 -483523 -447207 -548716 -483120 -471140 -683778 -783050 -500533 -207599 -385367
36066 -385367 -838203 -979861 -716367 -476367 -409131 -129972 585965 1323292 1513720 1113742
36056 1113742 543559 169050 86160 225300 380667 255607 -217454 -646029 -559138 -37691
36046 -37691 314171 107809 -362721 -515849 -139984 497554 1023412 1242202 1159160 929649
36036 929649 759198 714654 673698 565974 554258 786240 1044385 907367 303207 -322051
36026 -322051 -500946 -261711 -25377 -87804 -349489 -534131 -536837 -482476 -495726 -540175 -551170
36015 -551170 -624969 -904379 -1291583 -1479133 -1326031 -1004132 -687384 -339029 38982 221299
36005 221299 97284 -30494 170932 541421 651180 413124 64316 -340022 -898203 -1354698
35995 -1354698 -1216297 -526964 17127 -15880 -233617 -82749 362304 655997 667189 572739
35985 572739 419206 124166 -233444 -478573 -571584 -514620 -240863 120289 154792 -276702
35975 -276702 -672448 -552943 -234147 -355803 -812927 -855408 -260563 301246 263977 -94946
35965 -94946 -230395 -135427 -163162 -390015 -570769 -539454 -333247 -46002 208728 314519
35955 314519 301384 332444 436623 487141 552099 907782 1460796 1545388 730594 -427501
35945 -427501 -952227 -656998 -282708 -435837 -909384 -1186583 -1133692 -916658 -592021 -133378
35935 -133378 339257 670779 878541 985123 799799 196217 -496551 -778047 -660092 -658439
35925 -658439 -989240 -1192573 -821979 -156086 175951 57878 -82466 -4705 79786 13451
35915 13451 -38145 -6788 -161026 -617369 -975312 -838301 -445304 -337707 -549493 -612295
35905 -612295 -332209 -65531 -113439 -288373 -307666 -257929 -353671 -481245 -357727 -51406
35895 -51406 15724 -357872 -832770 -905822 -468561 114839 394741 214919 -206651 -460825
35885 -460825 -267665 253277 657570 661211 521497 714727 1214405 1426623 1045890 623342
35875 623342 853612 1520904 1740198 1214874 598790 435570 407736 44088 -412827 -456150
35865 -456150 -234919 -315332 -695781 -751945 -175885 604925 1020048 898479 378408 -260773
35855 -260773 -624180 -511860 -260269 -340839 -622929 -565345 -149422 50735 -122216 -72979
35845 -72979 512730 990067 667363 -119916 -480758 -186465 185711 132517 -277157 -670882
35835 -670882 -726671 -369556 79263 143567 -156008 -224858 200146 521026 170384 -412986
35825 -412986 -400793 167656 555158 537711 546405 664918 448043 -120459 -410694 -172986
35815 -172986 69266 18989 146050 705252 1022292 503008 -261062 -260650 429528 782443
35805 782443 293475 -470401 -798324 -627787 -292099 -18834 139148 223524 323766 378990
35795 378990 118532 -471104 -797347 -306714 581511 806227 42351 -855088 -1032585 -688881
35785 -688881 -526891 -633491 -523962 -97443 113882 -238869 -757672 -851477 -573157 -523213
35775 -523213 -974315 -1470608 -1460187 -1029476 -669799 -479646 -91737 555010 919012 629989
35765 629989 99535 -83232 8978 -44958 -173137 21781 417069 470137 163447 51729
35755 51729 249722 217877 -180047 -300571 124570 330420 -272916 -986799 -824591 -57824
35745 -57824 265849 -21154 -139409 207719 476494 427084 533572 977029 1212063 947802
35735 947802 698855 865548 1019512 655353 12422 -398702 -506217 -396399 53911 681017
35725 681017 819110 291540 -5414 636896 1460037 1253811 234957 -279163 111709
35716 111709 469241 186413 -200889 -231984 -356884 -915347 -1263695 -741547 189906 612409
35706 612409 456968 347682 512094 644449 637944 707331 858716 852840 649023 375630
35696 375630 -25316 -587491 -896665 -522146 160499 254241 -447566 -1164932 -1233176 -887921
35686 -887921 -646218 -484236 -130581 209589 29672 -669720 -1236423 -1114569 -435600 233715
35676 233715 515269 457725 281752 73784 -226444 -635180 -1035798 -1276142 -1260258 -953553
35666 -953553 -446790 -34490 -8930 -269475 -372099 -139331 38440 -222653 -675025 -768526
35656 -768526 -429878 -75752 48254 53245 -46088 -431483 -1002745 -1285996 -1050612 -648294
35646 -648294 -509531 -610811 -651779 -485501 -182056 88003 96054 -244262 -615493 -568187
35636 -568187 -159020 81924 -52528 -176927 -48707 8764 -202312 -225196 307401 868789
35626 868789 704247 27145 -220253 266939 746369 494995 -284416 -828116 -713188 -221008
35616 -221008 7750 -350058 -868579 -808640 -140553 263716 -179850 -858924 -853193 -308672
35606 -308672 -93004 -349175 -390054 1730 218837 -22410 -166867 166586 534568 506200
35596 506200 367022 457163 530628 361403 304275 583198 660026 104151 -437206 -45362
35586 -45362 1015313 1557267 1059101 182661 -286348 -295716 -237967 -377034 -685929 -882186
35576 -882186 -637158 -57254 233327 -113358 -567683 -445245 51559 194439 -74200 -114895
35566 -114895 272515 522916 272472 -92716 -112354 150894 465751 817543 1128331 1078837
35556 1078837 542417 -161918 -678743 -927045 -866637 -418458 168552 339758 -72948 -543769
35546 -543769 -503982 16250 592585 898079 799996 349000 -108548 -166624 95930 171775
35536 171775 -123294 -399245 -366739 -240216 -206652 -49012 326003 516358 259433 -11903
35526 -11903 216632 721138 875132 542262 122886 -88495 -122122 -63107 35330 98009
35516 98009 170971 402305 652520 497767 -62976 -354843 79723 780184 1082560 1084225
35506 1084225 1252288 1469486 1240600 604428 80393 -134535 -206393 -86190 335675 636679
35496 636679 269085 -459092 -634011 -19816 687264 936776 838057 521602 -103413 -735105
35486 -735105 -726992 -101327 310780 126355 -22258 357225 741707 514370 25610 -22620
35476 -22620 321893 543599 567210 601643 473362 -54555 -563840 -411607 246822 625433
35466 625433 443130 187059 248755 473847 631948 706804 607711 165776 -437155 -750768
35456 -750768 -707851 -694046 -829477 -739537 -291161 -47 -281241 -715068 -581839 108258
35446 108258 651020 638162 400027 369685 464121 381121 200135 253655 475926 350543
35436 350543 -320083 -981189 -1010697 -578388 -365480 -568795 -737787 -609491 -481145 -550434
35426 -550434 -496467 -96222 278885 282851 245540 581054 920189 603522 -141144 -350075
35416 -350075 292148 992942 1006872 581505 380965 490653 474974 137095 -216439 -181727
35406 -181727 324607 992556 1350096 1174019 710853 346890 123469 -135128 -293334 6249
35396 6249 622788 819142 198329 -664382 -907431 -416196 203743 452300 328775 45880
35386 45880 -237273 -405672 -414800 -361480 -359278 -377586 -332897 -239697 -133527 22201 206541
35375 206541 283241 235545 261725 436835 498231 226840 -162237 -312235 -229767 -165844 -147052
35364 -147052 -2241 229822 291569 81507 -264778 -616575 -887933 -939919 -764130 -638037
35354 -638037 -734174 -736009 -304183 233050 258572 -126124 -184333 263666 491218 18853
35344 18853 -577324 -494848 194863 808010 983692 809133 373131 -196861 -487643 -192603
35334 -192603 362863 597473 462314 368170 462046 530189 558175 792000 1167976 1218122
35324 1218122 723767 70577 -217962 -24971 356579 511668 201575 -357175 -597663
35315 -597663 -300160 1404 -230872 -609778 -335537 463261 770437 206863 -390139 -290567
35305 -290567 81813 21721 -277131 -201995 136967 114717 -332389 -657738 -618410 -500230
35295 -500230 -445950 -232281 200783 565279 694120 739496 800866 750540 514453 190313
35285 190313 -142548 -415388 -431929 -133648 62178 -318639 -1025575 -1230323 -579614 356574
35275 356574 861388 889293 893195 1152258 1489821 1475777 834303 -161245 -766673 -556602
35265 -556602 -37759 -27599 -499223 -643678 -124369 432068 441232 186132 227396 549589
35255 549589 794227 900622 978686 882563 459122 -10485 -120795 86510 309007 532363
35245 532363 896747 1196890 1095300 781377 833248 1332270 1633615 1228778 442995 6150
35235 6150 185806 620020 874853 894996 873572 862064 692436 314559 30462 173004
35225 173004 600478 782389 442195 -137479 -524859 -579788 -388085 -79870 111778 -69230
35215 -69230 -523613 -771413 -541267 -113084 149799 272799 387232 351172 57996 -200082
35205 -200082 -146767 -35965 -247350 -585798 -529792 -30804 487110 823329 1127560 1377846
35195 1377846 1319643 982071 734777 742468 812640 829192 866269 828453 494236 24040 -78297
35184 -78297 331284 818991 993403 893912 638125 191155 -314105 -523166 -388966 -317077
35174 -317077 -527443 -707548 -568272 -283063 -50048 307102 874784 1219668 967134 511914
35164 511914 561814 1106727 1401879 995453 307143 43379 338600 666027 501728 -50830
35154 -50830 -379713 -152729 184018 -7478 -559470 -584037 292594 1276695 1335632 422584
35144 422584 -612246 -1056807 -878455 -445571 -147470 -211552 -552073 -824449 -820954 -679521
35134 -679521 -548749 -328664 1946 137897 -86275 -277733 -229 521508 714237 484031
35124 484031 188756 -58405 -428944 -783274 -721805 -320875 -156410 -392583 -477080 -59675
35114 -59675 371384 232759 -228798 -315723 85623 429282 383357 242360 368220 619835
35104 619835 554986 9693 -697496 -1069600 -857003 -241615 328786 503798 276062 -93176
35094 -93176 -346059 -409207 -355258 -259588 -132251 23762 145757 158774 66100 -84208 -304331
35083 -304331 -615999 -887270 -893904 -624687 -360861 -334909 -468986 -579346 -636655 -625276
35073 -625276 -371706 164033 588145 471435 -12761 -293666 -274699 -496272 -1230174 -1905178
35063 -1905178 -1860254 -1351832 -1260453 -1865997 -2454841 -2296559 -1570943 -998403 -830727 -663319
35053 -663319 -205536 228310 203131 -176983 -410312 -248097 112260 415014 599155 647013
35043 647013 489393 158345 -187660 -453652 -626729 -629215 -450388 -405469 -850547 -1562615
35033 -1562615 -1849649 -1425287 -718775 -164549 242258 436097 49706 -793659 -1146204
35024 -1146204 -450926 442442 353797 -544663 -1102240 -944081 -720813 -712612 -444332 95982
35014 95982 84908 -768655 -1512216 -1286063 -560663 -320614 -675184 -1028055 -1101796 -1026388
35004 -1026388 -780274 -273583 223348 314805 -20011 -548735 -1105038 -1429643 -1147109 -374635
34994 -374635 118839 -95419 -450450 -331949 -114488 -433640 -933109 -774520 -101231 132315
34984 132315 -268244 -448905 63608 675536 786075 639486 685996 806809 644571 196546
34974 196546 -277962 -523889 -280307 485067 1179770 1029699 130472 -556017 -476318 -96963
34964 -96963 2937 -111083 -261473 -662698 -1335481 -1713888 -1488575 -1235481 -1502941 -1836657
34954 -1836657 -1516745 -792001 -473395 -616206 -564072 -172037 -36915 -431151 -825994 -686833
34944 -686833 -123646 440103 741030 686711 356505 92155 167145 326524 86248 -520822
34934 -520822 -982757 -1068373 -997597 -858827 -501034 -96110 -116576 -529115 -667065 -218391
34924 -218391 270126 244419 -92122 -320615 -556297 -1062616 -1528287 -1392577 -692248 -22881
34914 -22881 221901 113370 -156398 -407263 -376952 26134 425905 361632 -75542 -393585
34904 -393585 -419525 -404871 -427287 -221415 233759 422164 -96429 -1019813 -1542262 -1203089
34894 -1203089 -346224 262663 232478 -83507 -115471 87623 -87690 -782773 -1190481 -619076
34884 -619076 350682 524195 -237723 -873252 -735810 -423740 -594282 -827360 -413624 340925
34874 340925 521392 27351 -334060 -148690 74033 -143139 -519252 -625363 -632231 -930600
34864 -930600 -1361904 -1382227 -881639 -375957 -328052 -596889 -693345 -408454 -27974 57973
34854 57973 -151360 -271269 -43208 305648 357572 44625 -332296 -557951 -681561 -738361
34844 -738361 -638852 -441121 -386868 -474312 -327470 228144 752300 721334 264063 -45286
34834 -45286 5201 119129 109351 165981 396834 539642 363785 40349 -147664 -227499 -389655
34823 -389655 -579068 -544360 -273020 -116582 -374558 -870460 -1088316 -776655 -316425 -301229
34813 -301229 -738640 -959316 -513878 151669 313542 23394 -44054 276606 383346 -46260
34803 -46260 -489968 -481182 -404773 -752344 -1105775 -696429 290961 856412 590483 103666
34793 103666 -64999 -145392 -439033 -674776 -561086 -412745 -635341 -966658 -831769 -219066
34783 -219066 363614 655737 810022 868445 654429 252755 60757 178928 204162 -121049
34773 -121049 -456422 -405189 -189173 -330276 -815744 -1076888 -825986 -449727 -380127 -462930
34763 -462930 -289406 101227 297679 225033 306575 782650 1254502 1187746 641152 188113
34753 188113 212260 532134 673408 317403 -453555 -1162014 -1258133 -649946 128706 451064
34743 451064 217768 -217339 -559576 -719898 -614344 -235874 112291 74094 -241921 -407388
34733 -407388 -377131 -590426 -1242748 -1917490 -2166032 -2044061 -1804167 -1440157 -877467 -317943
34723 -317943 -32458 6185 12821 93569 261154 511830 702910 646543 510793 740879
34713 740879 1322424 1578825 1094952 395787 192373 356792 280823 -63697 -170806 45606
34703 45606 115784 -133312 -271849 41583 602958 1035011 1167506 972681 568618 334665
34693 334665 566708 984242 1047694 760996 618391 746426 734348 420018 179273 225411
34683 225411 254841 59943 -104078 -66372 -69458 -211612 -136907 323535 749716 809056 812779
34672 812779 1116477 1455322 1406174 1079975 814642 583174 261869 88921 248479 358133
34662 358133 19555 -439612 -467669 -258096 -452758 -1042316 -1352221 -1087487 -640238 -315115
34652 -315115 21325 379683 424534 76118 -218243 -128396 50916 -152672 -695922 -1033244
34642 -1033244 -720576 93941 753932 766212 426644 462951 910549 885738 -87072 -1117803
34632 -1117803 -1078555 -225913 278133 167994 224419 662109 671138 -80351 -682130 -365934
34622 -365934 302207 380362 -43848 -225577 13572 263435 366592 513220 689002 662731
34612 662731 429141 223730 230878 564241 1241904 1889011 1880231 1151467 423641 215406
34602 215406 166339 -154636 -391905 -85207 350702 263371 -5241 413237 1361258 1666550
34592 1666550 834074 -242053 -559548 -205201 105451 37933 -247996 -537442 -697607
34583 -697607 -638820 -414722 -196826 -53085 61630 126082 119853 161144 246047 28190 -679660
34572 -679660 -1355882 -1306189 -656436 -185559 -221532 -374822 -344868 -237542 -30263 459941
34562 459941 921692 711814 -65025 -483715 -154997 192136 -72751 -534353 -571017 -327921
34552 -327921 -166199 100880 617220 810015 237618 -422110 -224873 579508 939589 585698
34542 585698 203747 176943 191740 119436 304863 791893 1100076 1013884 891103 963451
34532 963451 960597 632295 79773 -563182 -1200176 -1453001 -956562 -109748 190743 -218820
34522 -218820 -530144 -217674 241855 291672 156817 220240 216105 -247700 -847000 -944964
34512 -944964 -519285 -32048 366061 853040 1330800 1434157 1097634 613979 183348 -160486
34502 -160486 -279035 -52375 291857 416302 378536 460811 576513 354298 -182431 -527007
34492 -527007 -363902 116820 661995 1240094 1740621 1874911 1640450 1480737 1667752 1864787
34482 1864787 1663744 1265398 1168368 1341353 1218812 561708 -128898 -260650 93535 351345
34472 351345 160901 -280919 -569285 -495111 -120011 309191 473073 225011 -197234 -410249
34462 -410249 -408936 -576022 -1016066 -1224663 -760228 31084 434461 349821 301875 508075
34452 508075 577024 298863 112870 421762 925409 1087012 894462 667886 399452 -142648
34442 -142648 -781265 -980208 -586654 -71553 102866 12952 11676 192427 315237 167748
34432 167748 -138670 -253476 23567 463632 647105 501683 391635 570416 802523 739684
34422 739684 440662 228531 196486 166274 32859 -147166 -342795 -556394 -699052 -688377
34412 -688377 -601470 -535057 -440233 -304071 -305465 -513223 -633160 -405448 -71695 -44005 -263437
34401 -263437 -340899 -218714 -180535 -249979 -128207 220304 459356 485150 619033 985553
34391 985553 1178475 862922 345176 181448 443882 710983 679117 501378 506802 747097
34381 747097 921492 774197 475561 399007 522778 424780 25479 -153403 151512 349045
34371 349045 -106194 -653034 -331602 689789 1291041 1072068 792262 954261 1018080 473810
34361 473810 -236565 -467098 -289635 -74690 169888 433112 327931 -239640 -607727 -260971
34351 -260971 344308 572401 665039 1161298 1743341 1635734 870570 201273 -75660 -297018
34341 -297018 -543299 -503624 -230480 -141436 -195168 82573 631202 770141 296135 -156929
34331 -156929 -160440 -115593 -432096 -792661 -758438 -538451 -569099 -724854 -534121 40367
34321 40367 548472 697674 672122 812040 1198354 1560101 1525446 1034136 475196 244492
34311 244492 237031 66410 -274549 -382501 -104311 220817 311322 307256 390267 433118 272748
34300 272748 6580 -223189 -456924 -716171 -845887 -745859 -492080 -93904 517472 1091344
34290 1091344 1081010 360556 -473856 -877298 -1059806 -1470378 -1905792 -1738002 -922760 -180866
34280 -180866 -60960 -281889 -235902 160774 420898 179425 -352837 -710937 -755105 -690926
34270 -690926 -571075 -164000 483199 754058 225701 -506400 -421637 505560 1169113 816605
34260 816605 1406 -338747 -157504 -74793 -287563 -382471 -83947 395168 737597 818486
34250 818486 627827 263212 -18144 -61593 -80942 -346956 -695542 -731047 -486768 -452165
34240 -452165 -852650 -1278874 -1209162 -630741 45973 490902 664734 641530 454113 173246
34230 173246 14445 188003 561730 619125 -1280 -941050 -1387160 -990762 -239193 214687
34220 214687 259665 139450 -70475 -389041 -582061 -397299 -77162 -155723 -694853 -1147420
34210 -1147420 -1110712 -839005 -777282 -868917 -663406 -34540 528565 485464 -58758 -456670
34200 -456670 -330707 -3149 79814 68276 412205 979705 1079217 476276 -221495 -485541
34190 -485541 -585872 -931125 -1216991 -885005 -101054 413617 356376 9464 -424692 -957814
34180 -957814 -1314690 -1022104 -164165 517323 466142 -172601 -937506 -1448127 -1366687 -579529
34170 -579529 382912 672582 139174 -464502 -521000 -253510 -103647 2908 299811 577571
34160 577571 517261 314527 402519 738885 889506 717813 517755 495253 529900 477403
34150 477403 383588 348923 406004 547144 709337 764066 659544 507681 422157 382345 349720
34139 349720 350901 346570 234067 90912 149769 402816 556066 530347 589864 745514 565114
34128 565114 -3757 -181315 608566 1672679 1837910 1065284 389365 338560 389688 126307
34118 126307 -62197 144616 294148 -48095 -467284 -372374 -18979 -94412 -584848 -842362
34108 -842362 -657226 -491061 -583036 -541600 -81005 405259 391360 -23918 -303316 -209883
34098 -209883 8617 92462 93889 173212 293770 253822 -37813 -402788 -542003 -363829
34088 -363829 -143415 -263251 -746666 -1147528 -1022939 -457530 48685 207442 232781 403119
34078 403119 581001 450124 90997 -75355 57037 106888 -126558 -243368 140357 680095
34068 680095 722677 275486 -23667 99833 201956 -71113 -392851 -319858 5911 151002
34058 151002 61990 -12662 -31349 -110753 -134653 82154 316080 136810 -396217 -735180
34048 -735180 -625754 -401876 -351255 -296100 -97454 -115950 -706004 -1514239 -1767722 -1182474
34038 -1182474 -207455 582336 974190 1013972 798581 494517 302866 271765 295601 327838
34028 327838 383101 313913 -97472 -688005 -872664 -329742 481969 809946 500423 93043
34018 93043 85094 425136 736823 714766 237843 -580568 -1328140 -1583977 -1436094 -1411287
34008 -1411287 -1702166 -1819801 -1333267 -616449 -380902 -669969 -865854 -640079 -344449
33999 -344449 -380378 -675365 -944388 -1063182 -1028241 -913559 -971977 -1369053 -1734897 -1498079
33989 -1498079 -798760 -442200 -699117 -882918 -547178 -299692 -711424 -1153527 -727821
33980 -727821 157864 322261 -329933 -720767 -363794 43281 22946 77864 557108 882972
33970 882972 606067 294199 567337 1026560 1004539 720026 757487 935464 683929 163498
33960 163498 4719 186173 167807 -18536 160136 599896 528377 -224169 -861786 -805716
33950 -805716 -405411 -145409 65095 393719 591640 508613 516987 885623 1207378 991164
33940 991164 433311 56966 -96870 -355614 -710698 -789082 -456772 6048 312869 391868
33930 391868 235372 -116027 -423052 -400009 -102648 62555 -174879 -589028 -699221 -340709
33920 -340709 103340 133226 -227847 -440447 -220475 -14830 -350198 -933703 -967500 -323642
33910 -323642 240778 198208 -68936 -30719 161556 118200 -19938 92913 240915 -73469
33900 -73469 -708747 -944516 -518811 -311 49793 -205186 -253653 26508 293820 214525
33890 214525 -207753 -665616 -788821 -457397 40113 254778 31006 -385628 -702314 -878738
33880 -878738 -1000254 -1007719 -734113 -205099 248560 307602 66491 -48280 160849 379146
33870 379146 263162 10438 56236 287018 98392 -620630 -1114663 -740155 115580 581271
33860 581271 465015 304551 411225 483478 235900 -119160 -236329 -127906 -51817 -128012
33850 -128012 -271582 -384127 -461427 -566622 -756713 -971712 -984613 -569316 221777 996552
33840 996552 1295849 969293 315702 -193835 -400195 -566680 -866190 -949543 -400560 470703
33830 470703 835677 456353 4968 9295 88556 -284857 -811905 -838145 -442291 -293946
33820 -293946 -578297 -793052 -605937 -256399 -27621 116994 274014 460573 784381 1275713
33810 1275713 1546063 1169463 459686 266932 838760 1440230 1324246 583265 -182688
33801 -182688 -564279 -470495 -25820 371521 271624 -289747 -799382 -960069 -976566 -1023806
33791 -1023806 -936473 -646214 -419231 -384699 -309070 -110033 -79766 -298969 -390560 -216240
33781 -216240 -216738 -605627 -847861 -523549 -118382 -246140 -606908 -532403 -132471 12354
33771 12354 -32190 239590 630500 405382 -352950 -644515 -84363 459654 208766 -411353
33761 -411353 -581533 -316792 -209867 -443189 -719906 -843116 -772372 -384519 247832 579597
33751 579597 201727 -418018 -407488 350878 1121392 1380822 1349973 1314164 1072117 468054
33741 468054 -25052 159440 782757 1013501 519642 -163858 -453372 -403778 -321149 -136630
33731 -136630 360045 901490 922200 373308 -125225 -93221 238576 362408 152472 -167737
33721 -167737 -423306 -539532 -413221 -59968 265623 407034 613564 1169516 1832903 2029522
33711 2029522 1583102 912814 503149 478262 680631 844579 686683 147732 -433423 -682537
33701 -682537 -693781 -820084 -1023125 -923720 -540614 -404214 -714564 -921448 -508207 222276
33691 222276 566881 339072 -28848 -82234 304462 962209 1474674 1390712 725347 65583
33681 65583 -125370 -74385 -239817 -578241 -704704 -529223 -239813 119703 505342 532129
33671 532129 -53116 -699142 -609287 48792 301019 -174708 -612612 -424312 -8680 129249
33661 129249 199783 444355 411504 -269600 -1001551 -1016897 -616607 -646358 -1060859 -1066254 -551932
33650 -551932 -269800 -499142 -609121 -244984 35736 -225956 -594442 -530230 -279844 -342157
33640 -342157 -596197 -601583 -337607 -43701 280979 615767 544892 -166628 -914690 -905712
33630 -905712 -298945 17609 -282538 -606950 -407448 164625 691882 994277 1018425 721717
33620 721717 273724 -11871 -81808 -123765 -110315 167671 542785 508540 18412 -293410
33610 -293410 10155 556916 784604 715659 678411 653154 429099 145738 113765 228282
33600 228282 102187 -239190 -303460 141944 712865 935326 794200 563154 360048 138735
33590 138735 -15865 121933 579830 1009007 986525 483104 -85479 -338053 -363900 -537917
33580 -537917 -944289 -1191160 -878218 -109720 563262 658637 205704 -239740 -56840 790541
33570 790541 1573453 1491273 577477 -337980 -619048 -452355 -364323 -509385 -740368 -1036411
33560 -1036411 -1389493 -1453826 -858101 106045 600380 233598 -419007 -540449 -70992 308722
33550 308722 67726 -607551 -1153693 -1279884 -1124906 -912961 -704792 -536037 -581575 -972447
33540 -972447 -1512015 -1772500 -1489055 -735494 226545 1064646 1406888 1094600 479279 145107
33530 145107 201089 174268 -216303 -565673 -387836 127194 415843 368747 330247 386554
33520 386554 241971 -128607 -252382 180981 823211 1102105 894533 543178 406351 573084
33510 573084 847145 875352 477241 -55118 -225796 907 131051 -93729 -254933 90918
33500 90918 679319 937223 868843 957157 1273792 1338042 976731 696279 875253 1092824
33490 1092824 735945 -45983 -523610 -385984 -43716 76116 73913 266911 683621 1085520
33480 1085520 1274021 1175196 776919 188001 -317643 -487272 -310851 10976 253653 260326
33470 260326 -32169 -504505 -833596 -722477 -215571 271565 298861 -190964 -801412 -1045078
33460 -1045078 -799306 -362103 -54297 97833 201318 211444 37614 -194963 -286186 -288663
33450 -288663 -353589 -303067 190473 928080 1187232 634070 -191852 -592319 -521589 -359803
33440 -359803 -272512 -218688 -262991 -402744 -349231 34701 333461 143419 -204943 -106223
33430 -106223 319930 390728 -40955 -387641 -296946 -103557 -136776 -252834 -321925 -558542
33420 -558542 -1020238 -1310129 -1154592 -826936 -642182 -471008 -141014 96593 -50183 -385011
33410 -385011 -508345 -376502 -191881 10940 279180 472452 476704 494507 729319 940428
33400 940428 711100 67405 -525043 -731143 -624161 -440697 -299414 -138498 198154 710281
33390 710281 1014721 639832 -285211 -950024 -761674 -75835 286525 45541 -352340 -403761
33380 -403761 -63796 345621 490447 321227 137305 242498 495322 460520 71644 -243894
33370 -243894 -256353 -287170 -582854 -800173 -540658 -27927 212872 69316 -189287 -379578
33360 -379578 -429860 -233160 101969 158261 -208456 -540614 -475499 -336135 -473090 -504282
33350 -504282 40366 725915 758293 257579 33362 238817 262324 -47808 -107325 276312
33340 276312 506488 257552 22765 183974 360059 175978 -58987 13496 150378 79300
33330 79300 122440 593257 1067980 971949 540502 490088 955993 1417368 1546661 1514290
33320 1514290 1487511 1382525 1163344 941101 708600 337217 -107237 -366307 -368455 -329747
33310 -329747 -406647 -485537 -399427 -169764 46205 121432 30015 -137861 -214084 -119777 -13511
33299 -13511 -146492 -507276 -717800 -417422 262120 757941 711034 415909 430137 801343
33289 801343 1010162 759281 435055 516317 844615 881697 491131 21221 -284800 -512776
33279 -512776 -745037 -933113 -1105696 -1281823 -1164453 -403806 713947 1312305 912177
33270 912177 45613 -370056 -41543 531563 731340 474316 235267 469149 1016817 1261842
33260 1261842 986418 731321 967929 1286022 1002023 321971 117732 583104 942072
33251 942072 657643 145283 -16142 136365 351949 690502 1159478 1372596 1096801 717726
33241 717726 681141 849073 852026 700159 601921 552828 548697 807881 1292515 1416157 804009
33230 804009 1646 -190017 192213 481400 442979 423776 550140 497733 131506 -217634
33220 -217634 -259744 -89064 88275 204756 235471 163895 79976 48196 -83336 -459886
33210 -459886 -882965 -1008895 -804447 -487212 -121302 358618 805688 944925 784119 602991
33200 602991 561337 609365 688018 702007 449919 -32913 -236692 241037 1007121 1290345
33190 1290345 951876 511669 242819 -85980 -520766 -699755 -534913 -462639 -708116 -878083
33180 -878083 -643921 -306595 -271273 -416977 -432404 -378284 -435680 -430194 -124479 252708 276912
33169 276912 -27746 -276976 -337601 -403921 -541479 -578614 -421554 -114479 356314 950393
33159 950393 1339878 1211470 790293 646453 953498 1336602 1473883 1398093 1142459 610788
33149 610788 -1400 -154222 339721 941583 1048098 716854 411572 345559 448411 681899
33139 681899 952711 956755 573253 205957 249574 426955 223596 -188327 -132682 519476
33129 519476 1194462 1550634 1804087 1964478 1575171 591146 -231254 -330883 -94297 -70815
33119 -70815 -66965 296910 680806 500497 -55920 -312647 -161967 -38895 -44003 70482
33109 70482 156042 -218066 -893640 -1195658 -967168 -763204 -902849 -1086292 -1084256 -1032618
33099 -1032618 -878491 -342576 345181 508915 114159 -69873 245709 345716 -223581
33090 -223581 -799306 -696197 -282075 -134114 52835 691193 1138192 550507 -529577
33081 -529577 -760390 -7551 550624 378312 306098 932673 1539491 1299380 613817 372408
33071 372408 531738 382348 -116785 -226897 365322 1044182 1191606 1009930 1045804 1288591
33061 1288591 1224399 665434 70066 -70914 160110 331612 270263 158259 150690 222481
33051 222481 346845 470567 314516 -362493 -1178810 -1286050 -415758 610727 807861
33042 807861 175913 -486572 -665851 -524723 -356050 -207099 -87219 -66976 -39298 230069
33032 230069 660126 806868 455869 -21873 -140166 94181 304397 326576 367061 599678
33022 599678 888661 1017940 991655 917157 711863 211158 -398439 -562127 -688 813174
33012 813174 1116229 717186 111643 -223686 -321651 -464179 -754838 -1090610 -1326582 -1334744
33002 -1334744 -1077084 -711936 -461660 -328787 -130361 171374 393861 387937 129130 -376013
32992 -376013 -935792 -1019713 -277610 747049 1009445 262934 -590120 -711319 -315797 -68935
32982 -68935 -62576 42414 262537 316765 189936 111746 103723 23882 -60170 3488 61064
32971 61064 -161489 -551772 -721682 -595463 -480846 -542407 -582096 -417439 -170567 -51307
32961 -51307 -23001 203319 846862 1693837 2119156 1706384 868354 519705 1009897 1737253
32951 1737253 1997332 1801414 1567906 1415726 1183103 851968 529048 216620 -43699
32942 -43699 -34388 288676 577491 579206 542126 739185 924372 761238 487037 560025 861349
32931 861349 879831 570648 381513 436351 328852 -151307 -633560 -716491 -492461 -299133
32921 -299133 -243597 -194878 -76802 15584 -43930 -216917 -275847 -61132 253443 330659 107934
32910 107934 -181426 -418870 -670164 -811554 -570757 -88020 91165 -178979 -391369 -227232
32900 -227232 -47808 -159573 -236676 -1616 160273 -69434 -198300 285602 883605 778189
32890 778189 205194 136789 751511 1206707 970750 492883 362174 521710 579020 389268
32880 389268 104326 -58130 -30482 -59119 -468810 -1048883 -1080763 -367882 257558 33617
32870 33617 -614886 -780948 -444748 -276312 -423030 -449745 -276950 -226602 -255913 -64295
32860 -64295 137345 -110062 -565821 -561564 -168631 -91627 -396900 -414752 -26331 38232 -542622
32849 -542622 -1122757 -1128388 -762696 -340657 194653 709608 691486 93034 -373202 -255633
32839 -255633 -28655 -292550 -902065 -1331588 -1403232 -1261658 -1048331 -890705 -834511 -647308
32829 -647308 -130756 345509 203465 -421171 -786644 -625467 -380133 -295906 -124695 101718
32819 101718 -98124 -742079 -1126055 -835958 -270572 161337 586752 1065009 1231536 963756
32809 963756 689815 650007 553474 301520 267363 476333 336379 -351860 -924500 -892196
32799 -892196 -643614 -579430 -385318 176466 543600 198874 -392040 -447740 35273 516474
32789 516474 729672 662273 268956 -185291 -91464 544658 751217 -43007 -920396 -663399
32779 -663399 476377 1200982 1012562 590732 478028 438450 239550 168243 422500 587884
32769 587884 118150 -924187 -1845240 -1959225 -1227789 -318870 57971 -107983 -251266
32760 -251266 -63572 186905 228589 166088 76890 -243671 -790501 -1064856 -703513 -47071
32750 -47071 303457 201386 -95177 -358881 -441655 -204881 238997 467732 246367 -140023
32740 -140023 -302074 -258519 -306813 -595832 -993264 -1183149 -853148 -62859 597302 592568
32730 592568 143458 -122057 -130715 -355109 -850388 -1042034 -653885 -175344 -149888 -541252
32720 -541252 -972251 -1068595 -525102 534265 1257647 884562 -104163 -492256 -12111 449622
32710 449622 401447 336892 509687 375591 -213387 -443040 118436 650752 357524 -293497
32700 -293497 -432865 -92834 181208 313483 471356 470447 178976 -16054 186790 463597
32690 463597 491017 495145 630461 512810 -25332 -427776 -292645 -32647 -15838 170139
32680 170139 847423 1391892 1094471 271901 -273149 -347152 -205595 112207 551900 687095
32670 687095 287427 -242756 -538910 -797050 -1135041 -1184708 -880202 -837361 -1327239 -1729381
32660 -1729381 -1662731 -1705333 -2203371 -2360217 -1491601 -311565 86401 -214432 -437736 -443047
32650 -443047 -527336 -528819 -162864 259413 341437 302005 402563 332998 -69782 -246235 144966
32639 144966 523539 433634 375302 710681 764027 60253 -558172 -233522 446955 531497
32629 531497 298688 453470 667620 371321 133173 680353 1283401 769167 -422600
32620 -422600 -836536 -232804 355173 457741 528699 691974 571679 260726 219465 365594
32610 365594 345642 394984 848050 1212461 861977 208932 55446 273367 280822 260347
32600 260347 651919 992522 586431 -154147 -343712 -124556 -241897 -598135 -538785 -144740
32590 -144740 17015 -9232 98899 38486 -519468 -1030247 -944079 -776682 -1114474 -1369264
32580 -1369264 -838802 -142625 -169363 -457857 -145518 327284 63377 -552964 -592415 -271509
32570 -271509 -295537 -342527 146047 533826 64733 -518102 -188565 445350 255951 -324157
32560 -324157 -221855 248129 221345 150916 819961 1499719 1152971 425259 366107 375108
32550 375108 -367971 -791332 264134 1495073 1108730 32547 251172 1220591 1079636
32541 1079636 264893 562267 1536960 1374107 465998 659819 1645849 1632962 942928 1301025
32531 1301025 2182278 1626233 151688 7428 984569 917599 -44817 251836 1668720
32522 1668720 1923096 886053 617024 1252711 1015408 148237 587513 1888075 1800785
32513 1800785 654749 711598 1563374 921464 -474843 170862 2256071 2638205 1515464
32504 1515464 1807419 3145383 2548627 664874 881918 2644846 2522768 1359979 2818616
32495 2818616 5445753 4654798 2099312 3618026 8080784 8815532 6280703 7572243
32487 7572243 12724249 14708146 14235467 19488891 29180665 33579356 35743975 50375241
32479 50375241 75564160 92835663 108679763 163442502 268847308 361681322 362203707
32472 362203707 270954664 167729962 114550526 99235890 82352102 57901930 43486349
32465 43486349 40360677 34685542 24547285 19518710 20004230 17600298 11890027 9848979
32457 9848979 11361889 9914492 5606531 4586760 7046073 7312531 4790162 4295839
32449 4295839 6255705 6227120 3787131 3030245 4360032 3975611 1586343 1006638 2781384
32440 2781384 3283603 1616221 881848 1998868 2297464 962074 334983 1104888 1274239
32431 1274239 516573 806113 2179736 2356801 1048618 427036 963371 873082 -55739
32422 -55739 -89747 772927 670572 -357035 -306028 869389 1069504 60461 -80478 1079691
32412 1079691 1579309 768465 281881 758572 915565 443506 605569 1396576 1247835
32403 1247835 132510 -117797 805408 1032457 -81888 -875274 -491808 -237715 -919267
32394 -919267 -1459659 -1118290 -698431 -675770 -346027 416581 673496 300097 266873 588297
32384 588297 154809 -970851 -1343167 -683636 -363792 -835433 -897746 -134349 241790 -277135
32374 -277135 -551621 -21997 250112 -334230 -785756 -413267 16395 -109592 -228363 -6218
32364 -6218 -55623 -488928 -463035 102208 95871 -732768 -1071661 -261211 523231 282252 -242956
32353 -242956 -78297 386646 409944 221012 278556 316707 70148 -49191 210218 392607
32343 392607 278610 373210 862163 1109719 758339 315342 151291 -41902 -350152 -301087
32333 -301087 112500 187805 -244591 -437084 -30283 372446 369373 366007 572562 530450 103910
32322 103910 -143219 24545 185215 267231 698089 1239285 986470 -50550 -689717 -373179
32312 -373179 90609 62092 -31143 104080 -55598 -626556 -770875 -160773 285708 -56692
32302 -56692 -486144 -322184 -69544 -316132 -615962 -438888 -182344 -278014 -296078 100385
32292 100385 294593 -186927 -646654 -326873 299005 397308 163942 282319 675250 851552
32282 851552 911971 1188899 1376965 986160 260057 -201802 -348713 -466673 -502282 -317458
32272 -317458 -177300 -297395 -344517 -22143 322914 287862 92556 77081 92764 11224
32262 11224 211992 858900 1295572 921344 129983 -349060 -475807 -528049 -345662 174919
32252 174919 415256 -143643 -880033 -815105 -91099 329536 162476 -17344 90116 217601
32242 217601 314307 636462 990249 789842 30863 -586640 -695310 -693357 -911604 -1028200
32232 -1028200 -657387 -11445 377412 266530 -196218 -691259 -890901 -690080 -391733
32223 -391733 -375871 -511253 -258224 508905 1182449 1191295 756817 508495 578666 561258
32213 561258 310817 223482 515014 718860 362180 -190182 -198520 274954 409410 -40202
32203 -40202 -286349 189993 678329 330498 -384090 -302788 639738 1305322 1052182 537931
32193 537931 560214 959183 1121382 918257 617852 307334 -79520 -407508 -439159 -188562
32183 -188562 91268 219876 252305 376312 667872 906015 760680 286612 -10961 147556
32173 147556 358503 125664 -375264 -608505 -509771 -437341 -484563 -474900 -515259 -871094 -1329453
32162 -1329453 -1370825 -1005850 -783544 -901174 -942820 -595358 -16966 592428 1175221 1477386
32152 1477386 1153266 357114 -325026 -629347 -748550 -708791 -312194 203806 213508 -336567
32142 -336567 -691952 -337192 289145 451274 28541 -494721 -572513 12787 910620 1302978
32132 1302978 696309 -381961 -964868 -843594 -581849 -451625 -151922 386660 770993
32123 770993 892669 1115162 1494626 1561828 1120846 559536 154316 -211785 -446589 -165320
32113 -165320 506158 814628 403422 -231869 -580672 -692172 -665620 -364825 27887 -42815
32103 -42815 -626001 -1060879 -993320 -827287 -811713 -525463 240261 870909 769177 179910
32093 179910 -297446 -420341 -154623 503094 1164323 1203290 653572 261151 353378 475747
32083 475747 432805 658767 1098938 855677 -337283 -1329576 -1101050 -183628 355362 475406
32073 475406 703658 891530 560656 -44500 -304488 -223722 -161916 18152 621466 1291625
32063 1291625 1376905 854284 183848 -399019 -798379 -754872 -345944 -269816 -869823 -1423881
32053 -1423881 -1211967 -682275 -623446 -791765 -474901 74023 6139 -608011 -865535 -523308
32043 -523308 -253277 -404841 -571042 -483248 -409813 -531324 -682870 -772591 -792258 -510690
32033 -510690 140373 578414 276434 -279621 -264780 95121 -89935 -739369 -845248 -269431
32023 -269431 -142771 -1006375 -1780342 -1346056 -218744 267700 -149240 -496726 -43691
32014 -43691 813495 1165301 628146 -332228 -920871 -784453 -243422 257420 693133 1185655
32004 1185655 1445666 1028141 114220 -525272 -499827 -273461 -438890 -870855 -901932 -182947
31994 -182947 865334 1457432 1228338 569924 124032 31851 -60048 -302610 -420382 -314285
31984 -314285 -348847 -721659 -1052788 -1019697 -913329 -1054667 -1126226 -693502 12964 493824
31974 493824 781957 1124345 1218627 626887 -254075 -530783 -74093 381774 405326 324965
31964 324965 443809 580038 566867 533568 501419 300392 40814 80021 372369 436713
31954 436713 126782 -149875 -153869 -158101 -340393 -410315 -155753 126169 88289 -159108 -315209
31943 -315209 -344575 -368366 -346410 -144893 212424 531839 612439 395335 64771 -56356
31933 -56356 129879 342400 304214 97959 -74190 -215953 -323118 -175607 242556 464657
31923 464657 205480 -54142 198710 535869 193577 -559822 -652310 159119 857682 615313
31913 615313 -175267 -663066 -609310 -302798 -11665 76734 -153224 -477840 -462034 -79138
31903 -79138 221955 211167 133057 146642 111846 95719 400972 838527 724239 -9131 -453952
31892 -453952 -26105 577444 415311 -279130 -536488 -136416 203036 -19946 -511782 -773351
31882 -773351 -650391 -224599 337985 730973 703474 406417 230615 263874 227982 4912
31872 4912 -100053 233694 869626 1289029 1073812 298296 -489291 -712829 -295088 280129
31862 280129 479007 217259 -182538 -375896 -232136 161915 564762 718599 555727 239527
31852 239527 -29129 -153635 -104063 70407 172963 52137 -86962 116098 550997 610566
31842 610566 49666 -527486 -450673 71924 326065 182000 157932 444651 581667 283553
31832 283553 -60030 -45262 130137 131306 87955 225253 314753 111815 -1314 440357
31822 440357 1002930 775028 -238371 -1021425 -982360 -574519 -214438 404707 1350211 1774120
31812 1774120 1090047 92022 -115022 256382 215389 -282533 -415783 -98691 -149985 -757923
31802 -757923 -1064649 -617281 -87030 -83652 -276431 -218759 -111107 -172468 -125521 86148
31792 86148 -84266 -776430 -1140225 -536081 396184 686337 411823 262033 294041 76750
31782 76750 -320572 -423037 -202146 -23011 70332 298073 558747 559649 360266 218548
31772 218548 121718 -16405 -8174 233566 359979 176762 120442 544852 1040949 1137262
31762 1137262 1107051 1299400 1292091 675376 96122 373372 1020894 908083 99928 -282590
31752 -282590 92471 408363 230038 76732 239524 239512 -175658 -535778 -509414 -333698
31742 -333698 -85150 534049 1336909 1506223 752846 -161144 -463791 -241419 56861 264585
31732 264585 311132 67280 -292339 -371401 -219476 -294105 -621283 -721743 -512273 -459238
31722 -459238 -636620 -507620 70295 498313 441171 327212 469873 547019 373931 324583
31712 324583 492123 296091 -476653 -1031520 -637102 317908 965547 1056728 836449 426634
31702 426634 -50890 -265096 -160808 -163828 -431500 -480412 -53299 293298 50651 -424772
31692 -424772 -588716 -588043 -769817 -892226 -582545 -88440 172657 341548 646496 707736
31682 707736 169126 -418433 -307445 168046 49328 -669030 -971941 -384483 394101 653627
31672 653627 590430 661473 739626 468933 15197 -118990 141083 333457 120162 -291318
31662 -291318 -518191 -563565 -747718 -1128097 -1308585 -986995 -423497 -72762 49570 259501
31652 259501 600431 779801 662158 414737 195068 77544 184100 438267 358450 -313181
31642 -313181 -940357 -708155 64155 217908 -555907 -1286095 -1235352 -859699 -797711 -819745
31632 -819745 -434356 173672 482704 363561 -86607 -873864 -1719247 -1926002 -1257372 -450267
31622 -450267 -268099 -529689 -644938 -572707 -583485 -560905 -277693 -10210 -181068 -653026
31612 -653026 -961875 -965472 -739808 -197449 611789 1169483 1063061 612738 407211 544716
31602 544716 823329 1242575 1717917 1740124 1025035 155090 -127829 47399 61870 -110473
31592 -110473 -3071 377595 523315 308773 160523 308378 499387 526193 515028 601672
31582 601672 710323 697868 461893 -10291 -487473 -583668 -209670 317607 756720 1143783
31572 1143783 1418871 1450442 1571525 2273803 3154072 3330270 3435747 5688261 10666292
31563 10666292 15255423 15685685 12034628 7848569 5601991 4576151 3355792 2185641
31555 2185641 1848449 1892357 1402702 609843 432792 923628 1271138 1113579 906472 996738
31545 996738 1073563 718784 48896 -412796 -311870 223608 771138 1017650 943475 687445
31535 687445 413771 330746 579241 981245 1161620 1044848 895794 734330 210753 -646561
31525 -646561 -1135716 -824520 -268108 -187914 -431130 -460711 -402130 -696406 -1040009 -705640
31515 -705640 167304 609047 241542 -242771 -227705 13249 -46487 -399387 -694162 -737119
31505 -737119 -548230 -280891 -206631 -436814 -655318 -496419 -90271 201528 401548 696542
31495 696542 813203 353784 -350721 -541999 -199830 -66932 -408536 -616234 -281551 181714
31485 181714 349318 447111 734410 901361 645113 327584 445870 774415 625209 -157352
31475 -157352 -929540 -1019458 -508495 -138246 -467187 -1189816 -1467339 -972373 -272472 28014
31465 28014 90563 358295 695183 663091 387475 401904 734219 864752 573472 160850
31455 160850 -164270 -454735 -591780 -371218 -53213 -132569 -495157 -495911 17852 434669
31445 434669 268841 -286630 -794595 -972962 -635211 120866 656058 414412 -205368 -351757
31435 -351757 -30443 1222 -357128 -343288 260789 654528 364684 -8674 59311 138720
31425 138720 -199571 -463411 -88662 527521 673916 408042 197272 20880 -345671 -602360
31415 -602360 -339987 113786 70512 -475928 -898526 -907961 -806908 -806363 -688872 -265222 229707
31404 229707 347201 -95025 -731801 -865957 -200109 649355 761960 97511 -430331 -213480
31394 -213480 300275 400448 72692 -246182 -360963 -297676 -23594 331942 349769 -109890
31384 -109890 -531249 -386735 134092 459728 413270 240291 137938 178169 465885 967519
31374 967519 1356982 1361223 1093726 810730 569904 341237 174124 50138 -125205 -225293
31364 -225293 15656 459091 569806 190323 -183034 -145130 119885 343730 578393 767697
31354 767697 568545 39745 -138812 333113 773913 514244 -104393 -391383 -384471 -490866
31344 -490866 -570415 -269146 105064 -27533 -472639 -505036 -42235 287217 219873 166892
31334 166892 361991 457949 166805 -302408 -639913 -778353 -696452 -338408 115822 289495
31324 289495 71561 -243804 -343247 -156847 250196 736734 1034274 940693 596904 341979
31314 341979 314594 396992 457078 408558 147503 -294458 -619848 -551126 -185568 138355
31304 138355 229145 116230 -119792 -393961 -621649 -816595 -1021643 -1077936 -758257 -222195
31294 -222195 58528 -12223 -4593 274162 408255 131141 -89847 255902 890652 1177754
31284 1177754 1023613 768925 495826 76310 -301573 -288875 22281 166336 -70929 -480300
31274 -480300 -779464 -816549 -593109 -361032 -448009 -739608 -705539 -219992 138905 -12918
31264 -12918 -238529 -57116 247661 233398 129642 300229 410642 8819 -507522 -438871
31254 -438871 69630 383833 516984 852336 1049703 450524 -557114 -850889 -309908
31245 -309908 1526 -433465 -907295 -878141 -812974 -1089608 -1153396 -509010 297610 462755
31235 462755 62462 -285592 -376099 -391664 -359631 -231086 -170328 -271740 -291452 -67012
31225 -67012 123771 265 -261401 -368377 -376271 -460384 -541905 -480403 -340319 -176535 115472
31214 115472 465192 531018 254193 105044 400874 764832 703365 386603 352729 659429
31204 659429 822744 490477 -225853 -997047 -1495191 -1454096 -876021 -181887 115920 -78394
31194 -78394 -416481 -545267 -432064 -304854 -393993 -697848 -949072 -883769 -551662 -237901
31184 -237901 -103109 -94599 -188650 -440418 -738940 -789179 -449234 114972 651575 967040
31174 967040 858604 251618 -510832 -866900 -680700 -394331 -396240 -552016 -546428 -384613
31164 -384613 -297297 -360761 -452186 -446614 -291757 -20789 191385 142746 -117729 -287989 -178577
31153 -178577 91408 338479 550716 767915 907658 854369 628817 387594 297374 380658
31143 380658 417160 118902 -456952 -840652 -710256 -323462 -103606 -21469 209660 520277
31133 520277 572041 356781 186437 133727 6512 -156783 -131600 -47327 -283008 -771121
31123 -771121 -1015277 -880617 -726268 -652343 -341111 153143 234487 -257342 -627426 -350884
31113 -350884 132213 183362 -59246 -95505 17803 -157668 -643021 -1032160 -1097852 -918446
31103 -918446 -578306 -160429 148890 295723 460476 635036 481046 -2846 -125863 612106
31093 612106 1636475 1948337 1423435 799208 534346 407669 231920 221385 441459 489797
31083 489797 74692 -455254 -506959 1884 548024 622552 281148 19208 142175 388115
31073 388115 298077 -160241 -613778 -872789 -1096648 -1297197 -1136873 -470276 287006 629769
31063 629769 513009 178496 -244324 -667840 -873466 -729434 -373001 19149 369768 515657
31053 515657 345957 259836 831347 1725719 1746118 514642 -705681 -697512 -73330 -271078
31043 -271078 -1278251 -1687974 -891811 118182 344249 3434 -255197 -357109 -484454
31034 -484454 -537632 -481923 -613907 -956178 -935149 -201598 688850 957857 602900 210171
31024 210171 94615 146121 279524 487647 551097 180743 -525491 -1093245 -1171458 -829582
31014 -829582 -402310 -209813 -359248 -655223 -757532 -537111 -200763 -1549 37956 43393
31004 43393 98407 234749 459303 701225 868319 992840 1140321 1160400 790854 82053
30994 82053 -550346 -796975 -719171 -461740 -37319 437324 632974 407943 71945 -10179
30984 -10179 131597 264336 369780 564727 759807 713179 360684 -138845 -607492 -895217
30974 -895217 -840548 -430219 72152 381785 520126 679105 829480 719919 273411 -245597
30964 -245597 -541014 -617874 -704304 -896733 -986285 -712241 -174137 165422 19970 -323700
30954 -323700 -384227 -147004 -12058 -143975 -308800 -391446 -567282 -801090 -720474 -291790
30944 -291790 -94650 -486503 -965996 -909329 -527006 -436962 -612430 -516741 -108337 92345
30934 92345 -89615 -286765 -345577 -486662 -585402 -151881 671974 943300 233181 -635298
30924 -635298 -757982 -380135 -235726 -263768 94472 701159 844922 453596 218261 413741
30914 413741 479101 28905 -488449 -523180 -203164 29161 57512 -43317 -339123 -779903
30904 -779903 -971677 -674413 -249103 -148549 -209113 47002 581203 866144 700896 463567
30894 463567 472569 573156 537643 481624 617176 854671 931051 795607 627487 533070 431561
30883 431561 252666 100170 137079 340792 449675 230294 -196759 -408423 -148701 331939
30873 331939 537986 290822 -108147 -261329 -80866 200616 294886 105185 -182200 -234537
30863 -234537 83025 478384 485786 6855 -536510 -691911 -503274 -387100 -539294 -693997
30853 -693997 -571016 -367819 -533645 -1072745 -1407697 -1137523 -661893 -674094 -1163111 -1413299
30843 -1413299 -1057473 -597860 -600184 -835102 -683013 -83851 452905 617990 529880 268803
30833 268803 -216077 -660840 -537907 212154 970876 1229412 1154477 1062925 785358 35010
30823 35010 -897864 -1387120 -1298657 -1071083 -988740 -862946 -523713 -168823 1204 147604
30813 147604 484445 805900 653235 -74320 -915548 -1307284 -1114544 -640700 -191537 260774
30803 260774 919650 1709530 2150186 1851204 1055389 432421 292117 299009 122631 15809
30793 15809 345554 794128 659961 1055 -211698 551048 1455884 1361845 411265 -220182
30783 -220182 -9480 370584 315297 169685 396257 666131 506537 285556 665588 1371128
30773 1371128 1432089 617568 -249460 -542859 -561716 -694724 -638420 -12401 798805 1090139
30763 1090139 828395 577118 586218 567564 368927 279256 476603 641595 444077 111069
30753 111069 107533 369628 294424 -394404 -1139395 -1223315 -743884 -465437 -692325 -807715
30743 -807715 -223127 636213 819116 147087 -543995 -504036 97757 622218 813082 887352
30733 887352 1041220 1214481 1271845 1185092 1041612 976930 1056710 1172164 1125299 846115
30723 846115 439037 29419 -300116 -444120 -327323 -28647 312278 677476 1063385 1274546
30713 1274546 1125142 808188 705563 810560 724360 294424 -151150 -324868 -321682 -288429
30703 -288429 -188792 -93964 -232686 -480850 -314313 335778 699684 213409 -474208 -273080
30693 -273080 782389 1525635 1231088 456700 99800 234999 284725 -63432 -575161 -941421
30683 -941421 -1121718 -1173383 -1009579 -514545 155671 591439 588365 460151 630135 960277
30673 960277 878501 271093 -222478 -107644 213479 73991 -412093 -571167 -273886 -111154
30663 -111154 -421102 -814463 -885468 -805843 -872041 -945790 -782943 -576926 -688398 -1008541
30653 -1008541 -1043045 -584847 57418 495343 606869 421667 -21284 -568180 -927991 -947077
30643 -947077 -814506 -841690 -1063861 -1177681 -899741 -316026 184855 319989 200376 166314
30633 166314 357846 537487 398180 -8331 -263440 -35499 534408 970227 951502 595312
30623 595312 261496 158676 173649 49371 -292163 -609499 -588320 -270847 -96088 -334456
30613 -334456 -624154 -416717 148188 290140 -319042 -1001791 -988806 -471086 -211098 -401690
30603 -401690 -556294 -403099 -206744 -168377 -140545 -60615 -88406 -168541 -36254 174478
30593 174478 -37970 -654697 -945966 -538081 -12590 47265 -29736 318341 845579 915941
30583 915941 579971 408455 478341 348888 -47104 -282713 -213579 -130622 -74667 256699
30573 256699 758173 806001 206153 -372639 -313734 87387 107108 -424698 -1053112 -1360883
30563 -1360883 -1304123 -1021348 -647215 -300290 -69474 -13038 -187414 -540306 -774931 -566050
30553 -566050 10019 502181 642169 631902 757462 982402 1100666 1048872 839395 386897
30543 386897 -311137 -921884 -1000468 -511741 43678 108469 -375998 -928846 -1035293 -669050
30533 -669050 -267371 -202090 -410951 -614804 -699205 -679764 -462840 29612 548755 686480
30523 686480 410403 121303 88031 136764 45779 -71292 -29164 33227 -143905 -468462
30513 -468462 -575375 -362460 -117540 -38117 51180 304386 462410 214189 -195598 -187136
30503 -187136 280979 561011 271646 -105142 -35328 118480 -326646 -1119057 -1295154 -665209
30493 -665209 -128708 -261046 -545362 -492038 -564750 -1198670 -1703336 -1206301 -177460 145510
30483 145510 -395582 -776526 -500944 -232788 -487277 -782243 -582630 -214623 -217768 -417876
30473 -417876 -287063 179145 510135 441220 127857 -127223 -67299 380341 921625 1080514
30463 1080514 758611 367499 271007 404767 575350 752331 874005 755847 439861 288559
30453 288559 485697 758363 801280 641568 401048 91335 -147640 -49016 272951 268042
30443 268042 -274453 -835039 -899708 -632415 -410535 -167972 278554 667252 658764 452988
30433 452988 436466 486230 257314 -74340 -64063 149612 4792 -476328 -604644 -106097
30423 -106097 412695 375251 30216 -45547 209019 422341 418733 336062 272551 193968 143887
30412 143887 235233 395075 350844 -10637 -384093 -304736 294762 903331 963678 552172
30402 552172 293946 528150 842971 666024 64769 -405578 -507061 -523340 -659461 -712950
30392 -712950 -520882 -325704 -376344 -448886 -172761 296540 382696 -80227 -541124 -483349
30382 -483349 -155877 -179128 -603438 -849918 -618855 -342354 -472198 -748260 -620064 -129458
30372 -129458 157743 4662 -244055 -286870 -223040 -154479 77290 514466 854168 885078
30362 885078 813752 864313 880940 669043 433028 462193 596161 448696 48122 -181112
30352 -181112 -46833 197935 301455 309252 306996 161047 -302958 -995783 -1553792 -1591066
30342 -1591066 -996259 -110257 425092 204368 -471349 -799546 -279453 725457 1324120
30333 1324120 1011871 170374 -405547 -383310 -101541 64658 191775 460732 671457 524433
30323 524433 185008 76452 214155 275376 271650 514997 857525 687660 -67475 -633594
30313 -633594 -473637 -45329 6225 -188432 -161640 29633 88442 186004 591554 912993
30303 912993 569214 -139659 -297122 314837 976277 1154388 1061841 945501 626218 60780
30293 60780 -329842 -292134 -150179 -205904 -235422 8419 254945 156226 -82894 -15669 327331
30282 327331 493029 271701 -64900 -148707 111383 488593 630935 429948 278489 681894
30272 681894 1470490 1792387 1194913 319578 52386 301921 246677 -360738 -870200 -808528
30262 -808528 -575132 -726413 -1110337 -1192450 -887375 -545604 -326429 -124023 -22531 -254351
30252 -254351 -648784 -668195 -175587 327048 469342 501089 638851 481840 -284764 -1031130
30242 -1031130 -887833 -133054 89069 -482304 -774763 -67623 843864 880153 300702 146786
30232 146786 545924 647139 105744 -411461 -359054 -58301 35493 97440 485589 1011288
30222 1011288 1164677 828592 382052 223147 436308 799152 934113 600871 3657
30213 3657 -328829 -104419 428539 843487 1030802 1181885 1407393 1546031 1349885 806766
30203 806766 259280 108690 327619 430445 106684 -307465 -288562 109054 358785 247221
30193 247221 75035 59727 45322 -78705 -167636 -219473 -494323 -964481 -1104590 -600347
30183 -600347 90530 270287 -173537 -793732 -1143314 -998997 -379122 266919 246590 -506720
30173 -506720 -1083018 -705930 93784 150821 -652217 -1253102 -1036198 -663841 -894686 -1376934
30163 -1376934 -1272882 -549742 98542 333227 435294 571584 497469 117865 -215825 -202324
30153 -202324 22749 228770 465110 813327 1052564 928257 610342 539881 835402 1118325
30143 1118325 984909 485227 59838 64681 390559 565562 288162 -186094 -357294 -163999
30133 -163999 -60884 -311566 -562270 -393701 25022 241283 236182 337613 564521 633264
30123 633264 587544 794737 1199543 1214349 628541 62843 127059 586867 817064 703708
30113 703708 584067 547975 332126 -178419 -745651 -1021471 -742492 127366 1149849 1547098
30103 1547098 975457 -129 -553985 -520219 -309109 -186340 -132343 -201733 -450396 -616757
30093 -616757 -427584 -140542 -233009 -625838 -798144 -615849 -411776 -265182 83172 517522
30083 517522 497901 -60615 -551731 -591103 -497597 -546190 -427960 102075 652271 785010
30073 785010 665519 613049 505874 194319 38210 392142 923694 1088298 965306 966868
30063 966868 1016778 752929 333626 261147 499207 539610 326441 321017 567230 504801 -51036
30052 -51036 -495927 -357724 26191 179450 239451 511375 766647 625300 312926 354365
30042 354365 650650 525064 -260899 -1105510 -1360444 -1086137 -765602 -605904 -464195 -287875
30032 -287875 -247284 -391667 -446691 -122596 481608 942830 971372 678660 369167 196340
30022 196340 96902 -49494 -309258 -657279 -934363 -943224 -734390 -667720 -951961 -1222486
30012 -1222486 -910465 -31652 758430 988753 881075 860722 944931 923593 818710 748345
30002 748345 566422 126013 -221357 62229 845054 1297972 914498 150762 -207433 -3830
29992 -3830 251037 97898 -390575 -759797 -647531 -189122 22108 -416955 -1095042 -1155935
29982 -1155935 -409777 339002 333055 -173841 -382539 -40065 418059 583527 413363 -11173
29972 -11173 -542241 -829383 -604576 -105336 184597 158105 40332 -136511 -463743 -648685
29962 -648685 -242141 558117 974255 671639 120898 -218807 -446810 -731512 -917652 -923125
29952 -923125 -927728 -865566 -370717 421343 721003 209137 -370530 -314517 18334 -25563
29942 -25563 -249191 -76072 338329 396766 122291 19306 122389 79606 -7048 268852
29932 268852 749737 887752 704374 677860 734461 323524 -458294 -817825 -516192 -219132
29922 -219132 -348267 -500340 -328165 -99393 28861 424290 1147891 1478533 878822 -156212
29912 -156212 -773513 -784497 -544840 -326328 -274904 -507757 -806937 -678976 -97077 338358
29902 338358 327944 314892 572427 606161 94520 -307670 63860 694196 600876 -167164
29892 -167164 -684934 -543309 -166235 97676 282247 247133 -294053 -1083632 -1421474 -1111496
29882 -1111496 -662962 -436259 -239822 65276 202430 -21476 -382338 -662500 -948970
29873 -948970 -1259538 -1301058 -894251 -311491 70925 196319 210499 199195 241493 455876
29863 455876 764309 834468 502138 87461 38723 340727 503703 157344 -485539 -827093
29853 -827093 -516258 166958 589581 389966 -249748 -895927 -1243282 -1192757 -798695 -277330
29843 -277330 94507 212752 167791 35208 -116849 -30098 517044 1169011 1181946 457083
29833 457083 -84672 384753 1476440 2087548 1756129 971394 339014 32387 4580 189569
29823 189569 435020 615928 801652 1009312 964419 512432 53978 42898 235032 71051
29813 71051 -307381 -172464 607840 1263222 1216114 797385 546160 412870 97701 -298977
29803 -298977 -457295 -359727 -205051 -31738 199497 339835 224644 -15289 -118598 -81170
29793 -81170 -123716 -330726 -536408 -562441 -443148 -405918 -631622 -978287 -1026215 -573051
29783 -573051 12445 218303 103585 180173 548075 642339 79582 -658597 -765156 -105786
29773 -105786 661303 849145 381387 -227241 -336817 263065 1112987 1522736 1343207 1073679
29763 1073679 1074856 1030247 524224 -139626 -221904 410579 1043154 1041668 589607 248851
29753 248851 147505 23381 -103065 169317 928725 1594354 1573386 1014418 529178 333330
29743 333330 138340 -142989 -160865 203648 454546 141832 -469008 -812614 -810616 -774129
29733 -774129 -757301 -548842 -197346 -15050 -72421 -151394 -187889 -304118 -417284 -311591
29723 -311591 -117947 -190532 -435941 -341575 156707 416661 -1018 -665121 -881054 -550045
29713 -550045 -33398 464121 903523 1067198 730621 117174 -240213 -140288 61957 -64258
29703 -64258 -498291 -797263 -599269 -69568 206729 -143071 -827067 -1222363 -1079267 -675429
29693 -675429 -361341 -263323 -394242 -694647 -929811 -871848 -603307 -335074 -10452 479226
29683 479226 799586 507540 -126023 -338931 -27319 115166 -177957 -286692 97156 261877
29673 261877 -302572 -811245 -304705 722022 928141 70333 -751758 -713576 -123773 404224
29663 404224 727221 917123 975082 1025223 1215405 1324064 1043507 653964 710897 1030336
29653 1030336 810288 -71936 -741166 -608949 -151850 3835 -22028 91493 168643 27106
29643 27106 16870 344371 422830 -273454 -1133746 -1095727 -170962 600918 636063 393321
29633 393321 425023 635867 707957 641073 596858 640081 818099 1127124 1309965 1084717
29623 1084717 635108 445967 600921 712450 601600 500997 464773 182831 -372064 -692867
29613 -692867 -479370 -123746 -75444 -192381 -149056 -51555 -160014 -364316 -431778 -457309
29603 -457309 -579590 -570206 -221205 180920 327097 487199 978109 1361026 996727 207049
29593 207049 -43010 397969 682894 380558 112479 426182 903791 912088 545201 259428
29583 259428 127391 -22 -62457 -27200 -122224 -380743 -428311 -171620 -125780 -493979
29573 -493979 -552715 267548 1228986 1168369 186889 -552550 -530985 -321833 -343323 -240847
29563 -240847 241716 713917 840428 821383 790305 453769 -219979 -611995 -296380 247360
29553 247360 323675 2689 -154538 -19195 58732 -57065 -119419 4978 108678 -26969
29543 -26969 -340307 -553834 -395613 154184 718497 802541 385967 34667 209935 671314
29533 671314 832145 531461 130227 -62225 -116359 -219783 -369012 -437970 -398601 -337156
29523 -337156 -279285 -108894 245183 576238 549784 184755 -48820 152274 435110 288619
29513 288619 -145661 -261414 79500 384372 371260 358764 595713 793430 683987 534218
29503 534218 656693 816816 616418 170527 -65699 83367 470438 937872 1245295 975012
29493 975012 49415 -850357 -953611 -393177 18747 -52015 -130909 166245 501865 358620
29483 358620 -196777 -613577 -505970 31984 617093 901038 785930 448451 146355 -11302
29473 -11302 -90636 -206439 -423150 -668181 -682186 -249739 394146 640019 226457 -342584
29463 -342584 -416528 -34101 247290 209254 182037 404808 647495 608858 338197 84413
29453 84413 -30662 -37805 4529 48434 78510 111917 71298 -235074 -776916 -1063731 -616351
29442 -616351 313099 883072 650021 79960 -106696 190557 484830 414073 132537 26363
29432 26363 238455 535959 604441 431315 312531 423613 534846 350508 11723 -60543
29422 -60543 178091 265100 -93519 -540168 -538759 -134555 106224 -107608 -378127 -143722
29412 -143722 579226 1214274 1332932 1073599 747390 300876 -499865 -1461773 -1977831 -1763173
29402 -1763173 -1223730 -900196 -856999 -854194 -800689 -699182 -408642 122215 550547 489183
29392 489183 72707 -206062 -149772 20056 109056 126458 75375 -38831 -47180 137513 207031
29381 207031 -139229 -569276 -477356 51959 312242 108913 80343 592272 1037752 753687
29371 753687 67752 -198037 104744 422708 432643 383190 530356 720842 631783 164539
29361 164539 -422018 -646774 -214024 571731 1020185 850668 478961 315315 196745 -130178
29351 -130178 -410609 -310492 -97991 -242008 -547612 -405037 172918 481557 164373 -321211
29341 -321211 -424238 -127617 292090 601439 557847 53364 -523912 -606586 -281854 -205666
29331 -205666 -492564 -427956 324027 980067 737661 8537 -219607 171038 450175 252970
29321 252970 -69157 -228377 -339256 -419906 -242922 177946 502997 570779 508055 332451
29311 332451 -13960 -255623 -41455 374852 424774 244829 551966 1309344 1501380 709003
29301 709003 -50285 209599 957319 1058368 535063 310430 565918 530440 -135040 -798621
29291 -798621 -866184 -470912 43527 568269 933598 868249 522124 421783 661088 713706
29281 713706 267836 -356805 -853250 -1333968 -1793856 -1842384 -1383431 -941713 -855005 -750098
29271 -750098 -342293 -124144 -566878 -1158149 -1045555 -299437 271426 333898 255909 257392
29261 257392 159036 -25460 -33140 10067 -367881 -1108284 -1467002 -1029506 -299482 66026
29251 66026 98008 185573 318583 146495 -413045 -1034041 -1373470 -1336448 -1027015 -638710
29241 -638710 -336027 -115350 150072 481317 749580 887027 933128 829127 444381 -84175
29231 -84175 -346060 -188008 24761 -75947 -340713 -404576 -279229 -238251 -251740 -28813
29221 -28813 352338 371725 -144257 -584217 -302427 438473 758913 340919 -185974 -173434
29211 -173434 195220 314801 77165 -96697 8498 155936 169344 197092 306813 264160
29201 264160 -14589 -167255 95968 458196 398526 -27410 -230672 122175 714834 998044
29191 998044 735531 129539 -361152 -332919 206124 781802 930306 686275 423645 323775
29181 323775 260807 127288 -36335 -206098 -367846 -364957 -63399 333041 457029 282440
29171 282440 108954 11589 -278589 -804050 -1108113 -818340 -217186 81990 -142039 -588244
29161 -588244 -893685 -951688 -824498 -582833 -283536 3378 192199 221061 150882 186249
29151 186249 450239 744109 728119 377193 29978 -92492 -153790 -332222 -450597 -247162
29141 -247162 157632 381098 294682 122204 32066 -75746 -310367 -576215 -743194 -827195
29131 -827195 -853488 -720361 -389646 -66008 52267 95155 301099 534610 405741 -66752
29121 -66752 -343608 -137013 125061 -17214 -276663 -64970 530096 871686 783468 707177
29111 707177 793621 614417 32130 -397402 -309229 -126504 -248746 -309066 72414 394359
29101 394359 16616 -620948 -520188 322984 888234 643132 119759 -142747 -280607 -448076
29091 -448076 -369208 9406 171941 -139651 -381137 -42261 510358 615318 295028 36315
29081 36315 -52368 -219103 -438023 -434733 -235824 -140387 -194895 -181152 -85057 -111106 -246822
29070 -246822 -272150 -224787 -395594 -768989 -907431 -578437 -144946 -106780 -508825 -1006111
29060 -1006111 -1288336 -1223157 -783006 -110967 434668 560272 347400 101598 -58929 -229919
29050 -229919 -348192 -110968 557397 1182499 1161945 459073 -331075 -590598 -197922 496558
29040 496558 998561 996179 583382 177959 52475 18025 -199777 -428550 -313743 -24600
29030 -24600 -106858 -545346 -630473 -38509 595470 625716 340070 388442 754221 957190
29020 957190 907551 857471 782557 514114 261165 305056 397360 189043 10176 371573
29010 371573 887343 686144 -150961 -616505 -340253 -41292 -159296 -147608 372538 766079
29000 766079 385857 -373741 -752638 -719515 -681162 -642823 -385928 -67631 44462 121482
28990 121482 450288 836504 880194 609307 360042 259721 238197 289278 353551 242136
28980 242136 1154 -22547 208812 229832 -138102 -362967 -65399 255255 -27249 -678692
28970 -678692 -1025477 -924721 -652344 -268086 190905 317572 -76729 -380695 -31605 439901
28960 439901 161009 -612747 -854188 -408505 -120681 -313677 -328449 175911 568822 328196
28950 328196 -159990 -389715 -516904 -788976 -887360 -488636 25685 68963 -263264 -369649
28940 -369649 -8844 463019 594979 256280 -327385 -713436 -557985 25108 563935 780211
28930 780211 810768 794848 576914 35453 -559564 -777012 -472870 139260 701316 883793
28920 883793 557905 -33852 -407888 -267563 257433 786166 972738 695396 188537 -69557
28910 -69557 137111 433180 337584 -14091 -67179 251328 371757 -17069 -430547 -296101
28900 -296101 182630 302059 -185521 -787971 -911916 -497355 25318 227970 53123 -235296
28890 -235296 -372104 -303960 -126294 41264 72578 -87277 -256245 -134111 260397 507387
28880 507387 339771 -1324 -231473 -494851 -949067 -1212760 -836829 -146399 61165 -374529
28870 -374529 -832162 -919417 -933941 -1129065 -1198422 -863998 -456506 -460464 -799115 -952204
28860 -952204 -586527 180991 944742 1252036 920212 288487 -59828 63199 334107 482553
28850 482553 590243 704163 594585 166762 -247926 -327353 -209577 -211195 -338839 -388551
28840 -388551 -336625 -316717 -320717 -188881 147673 570660 851159 749734 207318 -449107
28830 -449107 -670680 -221841 545277 1046468 1000819 582718 187664 82470 154644 21809
28820 21809 -462578 -903327 -809434 -269230 128420 13294 -433903 -817966 -857103 -440776
28810 -440776 239651 667008 538322 264585 427370 817720 673067 -112722 -786613 -917323
28800 -917323 -960957 -1283524 -1414787 -853640 18265 488584 500638 436177 326416 -14741
28790 -14741 -357844 -267961 190008 549225 617115 521117 260676 -179109 -398927 46659
28780 46659 837004 1094706 552002 -54084 30757 664659 1143346 1065168 567684 -11803
28770 -11803 -387367 -398905 -140677 24765 -190229 -616381 -748312 -313642 380621 769440
28760 769440 643791 308430 134189 147023 146681 15097 -278349 -767444 -1307847 -1489082
28750 -1489082 -1093720 -527245 -383219 -646936 -759923 -428317 105988 571025 899058
28741 899058 931200 491664 -125502 -348975 -175216 -206068 -656037 -1006099 -914033 -729975
28731 -729975 -717397 -516760 87693 580221 524298 311791 409487 481307 55423 -499453
28721 -499453 -559934 -342858 -461194 -765471 -642275 -191810 -46604 -181677 -573 439968
28711 439968 415702 -151754 -463083 -156789 185027 173993 237586 632545 787428 268657
28701 268657 -366069 -375323 91805 382935 308629 84404 -271117 -828172 -1327116 -1449897
28691 -1449897 -1299497 -1139962 -909497 -464563 -61909 -88835 -474816 -823453 -981433 -1051758
28681 -1051758 -995247 -671895 -196000 153914 323124 442065 504252 436542 382792 537953
28671 537953 778820 833283 732346 688166 600158 170300 -468151 -751982 -475291 -123846
28661 -123846 -179839 -466783 -490018 -145107 245533 406054 288310 -77951 -568636 -866298
28651 -866298 -730188 -385704 -320633 -613964 -781380 -456712 38146 58265 -575903 -1392799
28641 -1392799 -1787664 -1530571 -855485 -261976 -148454 -417437 -532473 -208321 111734
28632 111734 -140763 -696040 -674377 113972 736029 377680 -510406 -866946 -466364 -40781
28622 -40781 -89244 -265192 -90188 281710 335337 -63725 -498899 -492787 -27584 405331
28612 405331 296499 -278334 -671207 -429652 130442 390561 281727 247031 435372 462616
28602 462616 93207 -326273 -372523 -111272 147397 358815 639701 844032 653875 80894
28592 80894 -443919 -553978 -305361 23625 298327 544545 710043 624210 253772 -146857
28582 -146857 -285482 -179655 -101215 -193354 -327786 -363254 -327152 -264880 -140899 -6169
28572 -6169 -10961 -92534 53677 448731 602111 188646 -331786 -294788 126706 77926 -738674
28561 -738674 -1562847 -1521538 -621980 443203 1096830 1190612 835285 289204 -116570 -235087
28551 -235087 -257709 -463782 -877270 -1262957 -1363409 -1065404 -466257 124085 364005 174300
28541 174300 -205231 -486791 -578674 -563496 -565950 -657781 -770770 -710177 -386934 897 188735
28530 188735 201071 271785 441755 494381 309057 21564 -214486 -379888 -447362 -345109
28520 -345109 -166795 -190935 -545030 -990774 -1154071 -888016 -373969 60621 245460 350811
28510 350811 656295 1062587 1092153 589615 101158 172365 566509 709238 651926 883704
28500 883704 1301839 1215657 500159 -87910 -60539 95670 -180658 -592409 -550326 -175240
28490 -175240 -81292 -448904 -878355 -978676 -661288 -50373 510149 591266 191196 -140413
28480 -140413 -32596 197304 172336 169940 605865 1136798 1017599 223713 -497741 -691136
28470 -691136 -640740 -684738 -723806 -608113 -471053 -413096 -270302 40785 279211 229105
28460 229105 38153 -10380 129416 287122 308327 154736 -64492 -87720 277668 837041
28450 837041 1102481 820694 255585 -157367 -286296 -295971 -280520 -110139 299296 697673
28440 697673 689856 281616 15291 303468 782518 740481 148000 -265263 -78830 262214
28430 262214 242230 22500 -65638 -198774 -584833 -779305 -272114 547076 851692 619336
28420 619336 534761 754852 732180 328717 104485 243494 155012 -433112 -865121 -598481
28410 -598481 -87423 20412 -90468 92155 419912 400569 132634 125544 396773 470410
28400 470410 156812 -292290 -685445 -945120 -791298 -35563 837374 1029652 446862 -195773
28390 -195773 -352989 -199703 -111975 -144848 -204818 -264184 -196629 178435 675420 768287 290375
28379 290375 -239724 -275244 54421 189049 -115933 -575777 -803398 -722033 -577747 -648759
28369 -648759 -916085 -1027653 -689799 -48808 478017 679422 632063 401005 5845 -323083
28359 -323083 -245264 229896 696856 848861 711202 348416 -248810 -870021 -1115364 -923700
28349 -923700 -683038 -612585 -455819 -43703 291229 241245 81114 258508 703966 970318
28339 970318 840772 429230 -88580 -481028 -465677 -108527 47283 -327246 -809914 -842211
28329 -842211 -563595 -466474 -517606 -318882 50269 124269 -68002 10652 466637 747332
28319 747332 502587 24929 -321408 -476019 -345969 213687 865592 935197 386490 -14285
28309 -14285 168110 435535 280678 -13638 -35660 -23536 -308587 -547905 -277464 190186
28299 190186 213883 -110927 -106452 424535 993570 1201111 1092445 802764 426284 200667
28289 200667 297386 470711 387624 203099 298503 565969 531923 145474 -139428 -90882
28279 -90882 32869 3943 -67683 -22117 151867 422530 668771 625063 273198 107272
28269 107272 490326 943450 728588 600 -385160 -182082 -33184 -330671 -642878 -555463
28259 -555463 -309515 -215880 -103999 201524 409752 222326 -166807 -407718 -448213 -361609
28249 -361609 -125521 177433 354298 474542 751634 927116 450970 -493192 -936869 -506552
28239 -506552 -49772 -322787 -840806 -764849 -225741 109674 209425 440603 609779 296474
28229 296474 -117857 163207 997587 1354047 791652 -32493 -475365 -632728 -698158 -447499
28219 -447499 199605 740511 677136 122310 -499323 -944415 -1076629 -746019 -81043 451708
28209 451708 590947 584973 701980 777265 558436 204699 82758 247892 433947 423061
28199 423061 170752 -298855 -854249 -1192660 -1066050 -580749 -126034 8496 -116010 -186220
28189 -186220 43581 472008 689961 392338 -253746 -757687 -794770 -415727 161775 728121
28179 728121 1039195 887669 369921 -96215 -185631 -2918 116563 55722 18375 194233
28169 194233 456796 502441 276165 110450 302832 656556 698280 348466 44602 82266
28159 82266 199545 75778 -99554 32407 315156 223254 -366532 -1002264 -1290096 -1305206
28149 -1305206 -1274622 -1190825 -915002 -467570 -71556 34378 -164183 -352265 -173462 243668
28139 243668 294795 -290442 -902941 -739906 126051 846202 895933 578833 418393 534480
28129 534480 729791 794473 616568 309772 246430 616446 1012547 899479 425521 207447
28119 207447 343635 338597 94212 168270 742781 1123800 775363 185569 90465 390008
28109 390008 527230 493954 668097 922947 716658 8437 -626119 -833077 -820660 -782133
28099 -782133 -551600 -23530 521826 731443 550384 172934 -142899 -184813 38458 232323
28089 232323 166594 12039 24544 24513 -356906 -954553 -1124916 -634610 -3056 229998 130748
28078 130748 29757 -7674 -40738 43820 287306 397236 159372 -93626 106626 594929
28068 594929 716797 272009 -168137 -68647 335309 416626 33253 -324282 -208361 253728
28058 253728 565080 406687 -116889 -656499 -919491 -840984 -577387 -358712 -289017 -267791
28048 -267791 -145469 38970 49208 -261693 -702976 -875996 -568275 31709 521397 642095
28038 642095 453327 215844 130218 158608 102264 -113495 -289907 -218451 -62702 -234767
28028 -234767 -777344 -1126730 -780601 -51913 231148 -228516 -864547 -1079034 -974434 -968979
28018 -968979 -1058607 -917745 -526835 -197797 -36854 139917 345444 365140 259325 427082
28008 427082 948383 1300714 1038292 400427 -86636 -293226 -388889 -343195 -4179 457014
27998 457014 649331 509620 377764 494556 729994 852516 809047 677873 528122 367532
27988 367532 137177 -182976 -403538 -264883 120828 271962 38057 -60220 388493 915490
27978 915490 799446 241945 154337 780871 1323310 1132938 543610 162094 -28009 -351368
27968 -351368 -711874 -757095 -502021 -269579 -151176 37456 328443 479503 275473 -246850
27958 -246850 -811410 -1028881 -698679 -131964 75346 -208777 -415248 -59115 530882 657894
27948 657894 228626 -164060 -50390 441008 921330 1175571 1159846 855355 307125 -282192
27938 -282192 -593447 -372497 313444 976468 1076544 617927 168559 127030 230414 40135
27928 40135 -359461 -538661 -421302 -343543 -444367 -437478 -84931 447048 844724 1007164
27918 1007164 1015842 935844 785128 603100 474192 518723 807085 1187489 1305306 972408
27908 972408 435957 81035 -46481 -182443 -399940 -534844 -534584 -544096 -589972 -510999 -330649
27897 -330649 -391383 -897382 -1526915 -1740505 -1382084 -790228 -369144 -207907 -114505 97334
27887 97334 407894 648045 705982 618787 461421 264662 113559 179994 493963 794908
27877 794908 826216 709288 781716 1096937 1361550 1395685 1364425 1444851 1518776 1367299 997369
27866 997369 607344 340482 204616 150821 137698 188734 414090 853900 1296662 1448673
27856 1448673 1314140 1158559 1031791 661017 -1943 -483767 -372265 83708 371843
27847 371843 494023 823554 1293069 1353265 845783 310433 151190 49525 -365323 -739273
27837 -739273 -501833 120140 295481 -226436 -760360 -658591 -106867 291976 298562 102083
27827 102083 -78080 -151093 -120801 -116523 -269772 -432926 -316806 -53443 -198314 -877256
27817 -877256 -1375560 -1040688 -226512 235705 222913 291297 616655 749925 509295 370125
27807 370125 681930 1083714 1054903 607030 83695 -359012 -724799 -924164 -888841 -747442
27797 -747442 -644437 -565112 -492071 -482838 -450449 -183364 241203 413327 174137 -119743
27787 -119743 -157562 -100132 -139750 -67474 289427 572157 357640 -131107 -305721 -34352
27777 -34352 303153 433637 380509 165053 -172953 -328660 -10788 547581 817618 703428
27767 703428 592081 693164 817020 842430 901652 1000557 932087 703130 583261 563115
27757 563115 252730 -412050 -813146 -394481 532380 1124648 977676 412171 -80896 -322884
27747 -322884 -382601 -334371 -201688 -10105 202630 402126 543960 543747 303340 -144042
27737 -144042 -503900 -406252 134982 589828 464206 -100655 -539150 -613584 -620879 -806224
27727 -806224 -949137 -759935 -418621 -379249 -716900 -993121 -848458 -478695 -319703 -398011
27717 -398011 -303814 153710 609979 696920 622003 761287 868957 320446 -801180 -1530685
27707 -1530685 -1234182 -427719 36053 85491 188322 430093 529106 518579 685892 915378
27697 915378 774010 275258 -62878 -8019 99904 -29475 -250093 -371324 -467399 -611281
27687 -611281 -692511 -656292 -575314 -389268 46159 561700 738571 498965 246137 284880
27677 284880 473042 570352 560260 495039 368588 248022 203127 74700 -299920 -644905
27667 -644905 -530994 -133380 -119672 -649148 -1081044 -904712 -406647 -149820 -298693 -711751
27657 -711751 -1188410 -1365114 -896251 -25386 530611 514859 394364 478291 474981 256369
27647 256369 278983 727332 971272 509999 -189084 -457806 -410519 -454612 -454279 -199664 -114807
27636 -114807 -570918 -1013651 -785258 -361310 -641984 -1351103 -1381807 -591008 21760 -31457
27626 -31457 -144477 92148 209552 -123789 -442753 -344243 -144289 -191953 -288791 -238748
27616 -238748 -248774 -356312 -190796 257435 385154 -20096 -292256 21595 329576 -53826
27606 -53826 -775118 -1008315 -618537 -39485 497372 871864 725488 23033 -477353 -163523
27596 -163523 433546 475498 213040 471030 1076897 1087263 498167 343964 870032 998477
27586 998477 172044 -558309 -184146 562817 325556 -732559 -1175850 -446469 447590
27577 447590 521894 83892 19796 523287 1042898 1110513 775714 379044 200413 279855
27567 279855 429140 444693 317638 136008 -144219 -582894 -930065 -765022 -102186 439818
27557 439818 308942 -345062 -950927 -1252652 -1445281 -1656253 -1673881 -1312091 -771821 -416609
27547 -416609 -307565 -178871 138964 466589 532566 356585 216777 247532 235136 -87586
27537 -87586 -644396 -1063535 -1094443 -822500 -457268 -90598 237704 395440 268005 -39942
27527 -39942 -282087 -349028 -334708 -325256 -276796 -153319 -47143 -68984 -213774 -429278 -722670
27516 -722670 -1065296 -1266630 -1144175 -833993 -717894 -929069 -1119656 -923604 -505798 -336488
27506 -336488 -452098 -342157 259474 836531 699561 -68087 -682050 -618491 -122970 260288
27496 260288 301155 129612 -15804 52564 331773 562440 519604 366261 409180 541925
27486 541925 398035 89185 172648 682112 882186 401885 -61641 218471 851367 990586
27476 990586 661218 518074 621122 473612 114667 86396 295337 22709 -729106 -1016154
27466 -1016154 -473770 10061 -272634 -717272 -467461 210906 495919 311305 133647
27457 133647 -16378 -423895 -833768 -708771 -196500 18494 -221201 -398582 -222133 53352
27447 53352 233923 428006 598471 493768 139860 -133905 -239885 -401628 -641555 -719134
27437 -719134 -618288 -571288 -566801 -384493 -148607 -238633 -566810 -583191 -149475 236108
27427 236108 293681 384027 772193 1089015 925006 448583 49760 -152723 -96035 384671
27417 384671 1048392 1139787 384979 -369334 -202153 556337 816016 309767 -173792 -109781
27407 -109781 95062 -18799 -201460 -60099 192264 117005 -182929 -253801 -49348 74905
27397 74905 44669 137862 302025 51222 -643650 -963873 -319871 603777 643543 -201656
27387 -201656 -808382 -647511 -474319 -927471 -1416547 -1155366 -531900 -453543 -838306 -886549
27377 -886549 -587760 -717435 -1297454 -1316899 -361491 589486 596724 82571 -2578 396790
27367 396790 665597 629250 589255 571824 336268 -32753 -227462 -307684 -580159 -958506
27357 -958506 -1010931 -626159 -134064 220860 462047 552561 353036 -38636 -298443 -291756
27347 -291756 -164559 -10076 234482 534461 692183 576069 217969 -270085 -690730 -815342
27337 -815342 -683527 -659433 -892921 -965681 -483994 206516 428269 141142 -102562 -114312
27327 -114312 -299289 -821773 -1202291 -1023187 -512904 -130133 -18366 -160496 -602100 -1143646
27317 -1143646 -1241109 -683687 -36235 106533 35872 494222 1462226 2064774 1778651 1085885
27307 1085885 628852 288238 -359938 -1039149 -964921 -51866 762741 708459 170223 13505
27297 13505 302175 347262 -87752 -353478 124144 1014261 1537694 1370057 790032 248807
27287 248807 68398 261931 403198 22119 -624248 -646665 226824 1018411 716449 -300557
27277 -300557 -798893 -373540 214914 263924 -138098 -618497 -967951 -971478 -530690 -98302
27267 -98302 -266381 -770143 -691859 115004 673086 343781 -230674 -237471 44898 -130046
27257 -130046 -699449 -1002269 -870932 -668834 -485246 -84809 468219 823936 886516 750085
27247 750085 282203 -571792 -1255772 -1137409 -503884 -256725 -616965 -921832 -778187 -577021
27237 -577021 -638655 -663147 -413325 -239030 -450196 -744218 -742648 -600654 -591725 -550372 -277017
27226 -277017 -98613 -400913 -865373 -812069 -191749 345070 366292 147740 166886 496977
27216 496977 838595 917955 749175 589279 610806 602416 201460 -498931 -912938 -735971
27206 -735971 -370462 -262951 -247140 -27523 105406 -264167 -781170 -708653 -132451 80946
27196 80946 -377123 -821178 -738917 -566416 -835330 -1246611 -1191532 -684174 -174908 159719
27186 159719 350970 223066 -314253 -813732 -770713 -382851 -219099 -288623 -112543 347732
27176 347732 560732 310552 33148 64437 157342 29375 -150097 -183700 -301135 -741802
27166 -741802 -1187955 -1077619 -347087 497080 956184 901197 462553 -110876 -475292 -353923
27156 -353923 194736 763448 926996 592058 41324 -354534 -480260 -501092 -535868 -454694
27146 -454694 -147787 153646 99330 -281021 -579965 -529998 -276092 -124389 -258044 -678275
27136 -678275 -1147366 -1226328 -709686 -4480 302178 215663 191824 249359 -93021 -813199
$$ [...]
##END NTUPLES=NMR SPECTRUM
##END=
