##TITLE=31Pdec_82-2021
 CDCl3, 24 sc
 23.08.2021
##JCAMPDX= 6.0         $$ Bruker NMR JCAMP-DX V2.0
##DATA TYPE= NMR SPECTRUM
##DATA CLASS= NTUPLES
##ORIGIN= UXNMR, Bruker Analytische Messtechnik GmbH
##OWNER= root
$$ XWIN-NMR		Version 3.5
$$ Mon Aug 23 10:40:13 2021 Russian Standard Time (UT+4h)  she@DPX200
##.OBSERVE FREQUENCY= 81.013821
##.OBSERVE NUCLEUS= ^31P
##.ACQUISITION MODE= SIMULTANEOUS
##.ACQUISITION SCHEME= undefined
##.AVERAGES= 24
##.DIGITISER RES= 16
##SPECTROMETER/DATA SYSTEM= spect
##.PULSE SEQUENCE= zgpg30
##.SOLVENT NAME= CDCl3
##.SHIFT REFERENCE= (INTERNAL, CDCl3, 0, 248.564)
##AUDIT TRAIL= $$ (NUMBER, WHEN, WHO, WHERE, WHAT)
$$ ##TITLE= Audit trail, XWIN-NMR		Version 3.5
$$ ##JCAMPDX= 5.01
$$ ##ORIGIN= Bruker BioSpin GmbH
$$ ##OWNER= she
$$ F:/spectra/data/she/nmr/P31/1/pdata/1/auditp.txt
$$ ##AUDIT TRAIL=  $$ (NUMBER, WHEN, WHO, WHERE, WHAT)
(   1,<2021-08-23 10:39:10.65 +0400>,<she>,<DPX200>,
      <created by zg, POWCHK disabled, PULCHK disabled
       configuration hash MD5:
       00 E9 B6 7A A2 85 ED C7 34 08 36 98 17 FE 4E 26
       data hash MD5: 32K
       FA 1A 25 0C C3 3F 26 65 90 AB 74 4A 37 B0 66 5C>)
(   2,<2021-08-23 10:39:13.32 +0400>,<she>,<DPX200>,
      <Start of raw data processing
       efp BC_mod = 2 LB = 1 FT_mod = 6 PKNL = 1 PHC0 = -7496.69 PHC1 = 353.0746 SI = 64K 
       data hash MD5: 64K
       73 4F C4 E1 34 D9 A9 06 56 AC 2A 83 37 E4 6F 96>)
(   3,<2021-08-23 10:39:41.79 +0400>,<she>,<DPX200>,
      <pk PHC0 = 100.1704 PHC1 = -226.4 
       data hash MD5: 64K
       A4 B4 8A 92 8A F6 F1 9C BD C6 64 BF 8C CE CC 09>)
(   4,<2021-08-23 10:39:45.07 +0400>,<she>,<DPX200>,
      <abs ABSG = 5 
       data hash MD5: 64K
       BB AE 9C 67 41 41 01 9F FC 5D 43 BE D2 3C 1D 21>)
$$ ##END=
$$ 
$$ hash MD5
$$ 5D EA 0B 02 3B 29 9A DF 70 01 1A 68 DE 66 B5 E8
##$RELAX= 
##$RELAX= 
##$RELAX= 
##$RELAX= 
##$RELAX= 
##$RELAX= 
##$RELAX= 
##$RELAX= 
$$ Bruker specific parameters
$$ --------------------------
##$DU= <F:/spectra>
##$EXPNO= 1
##$NAME= <P31>
##$PROCNO= 1
##$TYPE= <nmr>
##$USER= <she>
##$AMP= (0..31)
100 100 100 100 100 100 100 100 100 100 100 100 100 100 100 100 100 100 
100 100 100 100 100 100 100 100 100 100 100 100 100 100 
##$AQSEQ= 0
##$AQ_mod= 1
##$AUNM= <au_zg>
##$AUTOPOS= <>
##$BF1= 81.014009
##$BF2= 200.13
##$BF3= 200.13
##$BF4= 200.13
##$BF5= 200.13
##$BF6= 200.13
##$BF7= 200.13
##$BF8= 200.13
##$BYTORDA= 1
##$CFDGTYP= 0
##$CFRGTYP= 5
##$CHEMSTR= <none>
##$CNST= (0..31)
1 1 145 1 1 1 1 1 1 1 1 1 1 1 1 1 1 1 1 1 1 1 1 1 1 1 1 1 1 1 1 1 
##$CPDPRG= <waltz16>
##$CPDPRG1= <>
##$CPDPRG2= <waltz16>
##$CPDPRG3= <>
##$CPDPRG4= <mlev>
##$CPDPRG5= <mlev>
##$CPDPRG6= <mlev>
##$CPDPRG7= <mlev>
##$CPDPRG8= <mlev>
##$CPDPRGB= <>
##$CPDPRGT= <>
##$D= (0..31)
0 1 0 0 0 0 0 0 0 0 0 0.03 2e-05 3e-06 0 0 0 0 0 0 0 0 0 0 0 0 0 0 0 0 
0 0 
##$DATE= 1629700750
##$DBL= (0..7)
120 120 120 11 120 120 24 19 
##$DBP= (0..7)
150 150 150 150 150 150 150 150 
##$DBP07= 0
##$DBPNAM0= <>
##$DBPNAM1= <>
##$DBPNAM2= <>
$$ [...]
##$SUBNAM3= <"">
##$SUBNAM4= <"">
##$SUBNAM5= <"">
##$SUBNAM6= <"">
##$SUBNAM7= <"">
##$SUBNAM8= <"">
##$SUBNAM9= <"">
##$SW= 501.771253377433
##$SWIBOX= (0..15)
0 1 3 0 0 0 0 0 0 0 0 0 0 0 0 0 
##$SW_h= 40650.406504065
##$TD= 32768
##$TD0= 1
##$TE= 0
##$TE2= 300
##$TE3= 300
##$TEG= 300
##$TL= (0..7)
0 120 53 12 22 120 120 120 
##$TP= (0..7)
150 150 150 150 150 150 150 150 
##$TP07= 0
##$TPNAME0= <>
##$TPNAME1= <>
##$TPNAME2= <>
##$TPNAME3= <>
##$TPNAME4= <>
##$TPNAME5= <>
##$TPNAME6= <>
##$TPNAME7= <>
##$TPOAL= (0..7)
0.5 0.5 0.5 0.5 0.5 0.5 0.5 0.5 
##$TPOFFS= (0..7)
0 0 0 0 0 0 0 0 
##$TUNHIN= 0
##$TUNHOUT= 0
##$TUNXOUT= 0
##$USERA1= <user>
##$USERA2= <user>
##$USERA3= <user>
##$USERA4= <user>
##$USERA5= <user>
##$V9= 5
##$VALIST= <valist>
##$VCLIST= <CCCCCCCCCCCCCCC>
##$VD= 0
##$VDLIST= <DDDDDDDDDDDDDDD>
##$VPLIST= <PPPPPPPPPPPPPPP>
##$VTLIST= <TTTTTTTTTTTTTTT>
##$WBST= 1024
##$WBSW= 4
##$XGAIN= (0..3)
0 0 0 0 
##$XL= 0
##$YL= 0
##$YMAX_a= 6352
##$YMIN_a= -6113
##$ZGOPTNS= <>
##$ZL1= 120
##$ZL2= 120
##$ZL3= 120
##$ZL4= 120
##$ABSF1= 248.5645
##$ABSF2= -253.2056
##$ABSG= 5
##$ABSL= 3
##$ALPHA= 0
##$AQORDER= 0
##$ASSFAC= 0
##$ASSFACI= 0
##$ASSFACX= 0
##$ASSWID= 0
##$AUNMP= <proc_1d>
##$AZFE= 0.1
##$AZFW= 0.5
##$BCFW= 0
##$BC_mod= 2
##$BYTORDP= 0
##$COROFFS= 0
##$CY= -3
##$DATMOD= 1
##$DC= 0
##$DFILT= <>
##$DTYPP= 0
##$F1P= 0
##$F2P= 0
##$FCOR= 1
##$FTSIZE= 65536
##$FT_mod= 6
##$GAMMA= 0
##$GB= 0
##$INTBC= 1
##$INTSCL= 5.30512e-09
##$ISEN= 30
##$LB= 1
##$LEV0= 0
##$LPBIN= 0
##$MAXI= 10000
##$MC2= 0
##$MEAN= 0
##$ME_mod= 0
##$MI= 50
##$NCOEF= 0
##$NC_proc= -4
##$NLEV= 6
##$NOISF1= 182.463
##$NOISF2= 159.3651
##$NSP= 0
##$NTH_PI= 0
##$NZP= 0
##$OFFSET= 248.5645
##$PC= 4
##$PHC0= -7396.52
##$PHC1= 126.6746
##$PH_mod= 1
##$PKNL= yes
##$PPARMOD= 0
##$PSCAL= 0
##$PSIGN= 0
##$REVERSE= no
##$SF= 81.014009
##$SI= 65536
##$SIGF1= 159.3651
##$SIGF2= -187.1042
##$SINO= 113.3802
##$SIOLD= 16384
##$SREGLST= <1H.CDCl3>
##$SSB= 0
##$STSI= 65536
##$STSR= 0
##$SW_p= 40650.406504065
##$SYMM= 0
##$S_DEV= 0
##$TDeff= 32768
##$TDoff= 0
##$TI= <>
##$TILT= no
##$TM1= 0
##$TM2= 0
##$TOPLEV= 0
##$USERP1= <user>
##$USERP2= <user>
##$USERP3= <user>
##$USERP4= <user>
##$USERP5= <user>
##$WDW= 1
##$XDIM= 65536
##$YMAX_p= 399286972
##$YMIN_p= -1594715
$$ End of Bruker specific parameters
$$ ---------------------------------
##NTUPLES= NMR SPECTRUM
##VAR_NAME=  FREQUENCY,     SPECTRUM/REAL,   SPECTRUM/IMAG
##SYMBOL=    X,             R,               I
##VAR_TYPE=  INDEPENDENT,   DEPENDENT,       DEPENDENT
##VAR_FORM=  AFFN,          ASDF,            ASDF
##VAR_DIM=   65536,         65536,           65536
##UNITS=     HZ,            ARBITRARY UNITS, ARBITRARY UNITS
##FACTOR=    0.620285442955139, 1,           1
##FIRST=     20137.2065510759, 0,            0
##LAST=      -20513.1999529892, 0,           0
##MIN=       -20513.1999529892, -1594715,    0
##MAX=       20137.2065510759, 399286972,    0
$$ Real data points
##PAGE= N=1
##DATA TABLE= (X++(R..R)), XYDATA
$$ [...]
##PAGE= N=2
##DATA TABLE= (X++(I..I)), XYDATA
40131E05558K61162J07340j89975k96552j62702k0907R95j1209J9479P4068J37292
40120D24549J82889J17964o3500j60993k8698J36575M2387k29408l14990j21756
40110a4981M8651l931r2606n106J36495J05161l9233m4250J41903L00066K45906
40099G78075L8445j31859j57581j01947j19125k61422l52251j60585K37401M36534
40089B05685K08153j21906p3701K80137L67945n0696m85837l85485R7060L58039
40079C99394J86599n7163o0524O0038P7511M217l3540j4696K8713P6104L4240
40068G00893j77797l77635k47545J61826L84488J79724j22550j56070l7227l0559
40058B77548n1064Q3109K02467P1533j12658j8985K07578J73357p5219j66000
$$ y = [505558, 766720, 874060, 684085, 387533, 224831, 203924, 204919, 193710, 213189, 287257, 424549, 607438, 725402, 661902, 500909, 472211, 608786, 651173, 421765, 106775, -14981, 33670, 29739, -62867, -67973, 68522, 173683, 134450, 90200, 232103, 532169, 778075, 816520, 684661, 527080, 425133, 306008, 44586, -307665, -468250, -230849, 205685, 413838, 291932, 218231, 498368, 866313, 815617, 329780, -55705, 41355, 399394, 585993, 528830, 468306, 528344, 605855, 610072, 576532, 561836, 590549, 666653, 700893, 523096, 145461, -102084, 59742, 444230, 623954, 501404, 345334, 308107, 277548, 226484, 309593, 512060, 583593, 470935, 451950, 659528, 832885, 757666, 591666]
40048E91666r2251j58043k84742p0240L98012N10367J04481k23034o6030J77415
40038H87601L4247k72539k67336M655J51429O6252o9631j68560k21198j21084
40028B3836J33717K66868P8031k21124l04980j57053M8263K24859K86863Q7772
40018D67052k67933l73836r0257J78982J13534r218J52462L52131J73186k14995
40008D81108l11617p5932J23158J76800K58396L03209Q5816k33990k49235K843
39998E60556O9915j46715k28873L4727K97344K13064r5814l17843l31922j61523
39988a07084J10264K66144J25860j24973j17242J36807K46795P8633m9574O0874
39978F26504J58259o979k71784l41942j87061N1503K74971L71359K18005q4994
$$ y = [591666, 499415, 341372, 56630, -13610, 384402, 894769, 999250, 776216, 710186, 887601, 921848, 649309, 381973, 386628, 538057, 604309, 534678, 366118, 144920, 23836, 157553, 424421, 502452, 281328, -23652, -180705, -132442, 92417, 379280, 467052, 199119, -174717, -264974, -85992, 27542, 18324, 170786, 522917, 696103, 481108, 169491, 93559, 216717, 393517, 651913, 955122, 1040938, 806948, 557713, 560556, 630471, 483756, 254883, 289610, 586954, 800018, 704204, 386361, 54439, -107084, 3180, 269324, 395184, 270211, 152969, 289776, 536571, 615204, 565630, 626504, 784763, 777784, 506000, 164058, -23003, 28500, 303471, 674830, 892835, 807841]
39968H07841k37529j43250l0975n5234q3508k1899j3723j23205j51957M769J31975
39957H3305O7650m897R3107J92996R6739l6334K4266J36021J8414k26302k34374
39946B10591M8024K90162K68030J05715q140p0017j54039k48399k72476j59365
39936A0086P2915K57588J77362j48768l91753k94716j4367J21990Q0629P6402
39926e2632J48254J13113m2946p0501J23149K51859N4120k86848l72766j30761
39916b65959J22762J32924n043n5213M6017J89836K79502K81282J64610o0119
39906H30599k61605k83425j39254Q16L5596K0646J2665j0241j5809R9977K75351
39895E65316K30283j41779m95001m18327n266K65272J79972n39j1974P3396R6352
$$ y = [807841, 570312, 427062, 396087, 340853, 257345, 235446, 221723, 98518, -53439, -48670, 83305, 150955, 146058, 239165, 432161, 528900, 492566, 516832, 652853, 671267, 444965, 210591, 258615, 548777, 816807, 922522, 914382, 844365, 690326, 441927, 169451, 10086, 83001, 340589, 517951, 369183, -22570, -317286, -331653, -209663, -129034, -52632, 95622, 208735, 165789, 95288, 218437, 470296, 524416, 237568, -135198, -265959, -143197, -10273, -15316, -70529, -24512, 165324, 444826, 726108, 890718, 830599, 568994, 285569, 146315, 147131, 182727, 203373, 216038, 205797, 189988, 289965, 565316, 795599, 653820, 158819, -259508, -264774, 498, 180470, 179931, 167957, 241353, 337705]
39884C37705R4884J43675J47705K4867q2463k1178P7290k0076k36171k35030Q4013
39873C15221L83396K95616j10088m07983l07766N0286K95979K36366N635j50800
39863F05862j44754n8095K9251J10017J58023Q9781j13729l12415l22893j28358
39853h7310Q5254J27868P427j08335j15596p9734q1707o0080P7246K49861K79790
39842B94684J50703Q924r2508k21167l02554j25627K54087M20983J49576k10138
39832C26963k02647R1672K47092J59781R6749J51839J13058q3754j95455r1739
39822F13559K6338j4467r4048o6160j5498n8075j16537q1589l267M1683Q7327
39811C19266J39092R4962m6005j02224N701J01740N5697N858P3104R3604r0732
$$ y = [337705, 432589, 576264, 723969, 748836, 666373, 645195, 722485, 702409, 466238, 231208, 315221, 698617, 994233, 884145, 476162, 168396, 218682, 514661, 751027, 756662, 605862, 461108, 403013, 432264, 542281, 700304, 790085, 676356, 363941, 41048, -87310, -2056, 125812, 133239, 24904, -90692, -170426, -252133, -312213, -234967, 14894, 294684, 445387, 454311, 361803, 140636, -161918, -287545, -33458, 387525, 537101, 326963, 124316, 215988, 463080, 622861, 719610, 871449, 984507, 900753, 705298, 613559, 639897, 625430, 531382, 465222, 449724, 391649, 275112, 193523, 190256, 231939, 319266, 458358, 553320, 507315, 405091, 410792, 512532, 568229, 574087, 647191, 740795, 650063]
39800F50063k83562k02120N3515J47014L1738k9006O3385J12077J1339p4413k2965
39789D57065M4209J0738l1024J7176O5435J7166m1323j9848j9812j28725j75158
39778A95899K4625K71140J79570k13207l99242r4538L35217L83441Q7722j15517
39768F55110o5574k1676j55267k81888k07651l1585O6403R7320J37796J36684
39758C29672M9625m838O0525R9954l7499k05401j53350N8537J27544k9935j68515
39747A26319j01407O2997J54525J82141K15283K03193P2000j01871j67843j11155
39737E34182o4376j04553j33808k0248J82832K57435J02029j07042j50189p5860
39727D20402q6642j63068p4265J95805L40150J85156l4114n6852J5306k9705j20799
$$ y = [650063, 366501, 164381, 217896, 364910, 396648, 367642, 431027, 543104, 554443, 480030, 457065, 501274, 512012, 480988, 498164, 563599, 580765, 539442, 519594, 499782, 371057, 195899, 220524, 491664, 671234, 458027, 58785, -35753, 299464, 682905, 770627, 655110, 589536, 567860, 412593, 130705, -76946, -108531, -42128, 55192, 192988, 329672, 379297, 374459, 434984, 534938, 497439, 292038, 138688, 197225, 324769, 294834, 126319, 24912, 87909, 242434, 424575, 639858, 843051, 915051, 813180, 645337, 534182, 469806, 365253, 231445, 211197, 394029, 651464, 753493, 646451, 496262, 420402, 333760, 170692, 96427, 292232, 632382, 817538, 783424, 726572, 741878, 712173, 591374]
39716E91374p9842L430p3133k23910j88447K9067J66821J11206J26m1439p142
39705B88111Q8856J74207Q8539j60341k70607o3913J79640J54671M4833J45571
39695F69567K39278m3738m37925l53706R4740J86329k09411l86919M980L76400
39685A39595K13714r4089p088K47316J72525r3723q7678J28489J27836r8693j76024
39674D72180k2099R1940O1726J4393m3571j57660j37373J47710L23834l8062o03180
39663A09838n75212J12468N88249K64362l42802m10717M1815L24110J32321j19311
39653A25121k3134K33996K20251p2075k22209p285K68055K19620n6235j53056
39643E33049J8239J34043J6706j00243j9121P4618l2128j82065j20088P2430J48445
$$ y = [591374, 511532, 514962, 441829, 217919, 29472, 58539, 225360, 336566, 336692, 295253, 288111, 376967, 551174, 639713, 479372, 208765, 144852, 324492, 479163, 523996, 669567, 908845, 865107, 427182, 73476, 168216, 354545, 145134, -241785, -236805, 139595, 353309, 259220, 252132, 499448, 671973, 578250, 490572, 619061, 746897, 648204, 472180, 450081, 542021, 603747, 618140, 574569, 416909, 279536, 427246, 751080, 713018, 109838, -465374, -352906, 235343, 499705, 156903, -253814, -211999, 112111, 244432, 125121, 101987, 335983, 556234, 484159, 261950, 254665, 522720, 742340, 686105, 533049, 551288, 685331, 702037, 601794, 582673, 657291, 625163, 443098, 323010, 395440, 543885]
39632E43885J08701J03267Q5405p1256k32805j58800P6404J73904P2726k2217
39622F79214l2976p6204j53583j27545k1205n868o2883O527J90064K23760K3714
39611F43015j64759j60047q6989r1924q8328M3099K10800K37028Q7458j30926
39601D98427k75447k18303N0695L21063L24963N7156k13176k71700j45363L2919
39591A61234J57636J53177M1374p254J05006J87536L3934j65743n7428K52222
39581H61694K61186j45395m60838l16026j0192L4324p1673j017J45496L0847k62015
39570F6391l00327N972K66177K25958R5411J18984J81758P0163j28057j48927
39560D53503M0785J92073J14196r0462j75048n6239R5850Q8856l2742o4749K6839
$$ y = [543885, 652586, 755853, 841258, 770002, 537197, 378397, 454801, 628705, 701431, 679214, 646238, 570034, 416451, 288906, 267701, 261833, 198950, 205477, 395541, 619301, 643015, 478256, 318209, 231220, 139296, 50968, 94067, 304867, 541895, 629353, 498427, 222980, 4677, 55372, 376435, 701398, 758554, 545378, 273678, 128315, 161234, 318870, 472047, 513421, 506167, 611173, 798709, 832643, 666900, 609472, 861694, 1122880, 977485, 516647, 200621, 190429, 224753, 153080, 152063, 297559, 328406, 66391, -233936, -227964, 38213, 264171, 359582, 478566, 660324, 730487, 602430, 453503, 494288, 686361, 800557, 710095, 535047, 478808, 574658, 663514, 630772, 566023, 592862]
39549E92862K9242j63015k99568r6022L06191M75394K62395m2640j64109j60379
39539G40351j74739j51506j3302R6662J8773j16297p3560P4329L5460k05043l02788
39528g1660o3489K51560K98149J04473n0967m5620L6240J37722K51405K58960
39518A106773K0828l40392m78132k32702J57946L40214K08055p6115k80556k46673
39508A79246K1407K96175K76319o8906l93543l51966j4411K43723K20628P5808
39498D84480K5048L8508l6213j65627j34748J19157L38261K39288r5737k95068
39488E17349j70990O7867J54557J13430J01320P9995p8168k57760k06678L0574
39478C51496J34284L3170L7033K80668M09588J19744k95561l41196o5480N3583
$$ y = [592862, 622104, 459089, 159521, 63499, 369690, 845084, 1107479, 1064839, 900730, 740351, 565612, 414106, 400804, 497466, 516239, 399942, 326382, 400711, 436171, 231128, -71660, -135149, 116411, 414560, 519033, 468066, 422446, 458686, 596408, 847813, 1106773, 1127601, 787209, 309077, 76375, 234321, 574535, 782590, 706475, 425919, 179246, 200653, 496828, 773147, 704241, 310698, -41268, -55679, 188044, 408672, 484480, 509528, 548036, 511823, 346196, 211448, 330605, 668866, 908154, 812417, 517349, 346359, 414226, 568783, 682213, 783533, 863528, 785360, 527600, 320922, 351496, 485780, 518950, 555983, 836651, 1246239, 1365983, 1070422, 729226, 663746, 717329]
39468G17329j07030j47369J46487L91895J72141l12076m95140k02397J62451J66481
39458D92772j53790l95712k56626J61916M64985L65017j7313k93945k52985n3952
39448F0367N5967N2356L2703k4317j64822k27623n629L62954M72575J99991j13443
39437G01079j61051o2490n9829j10745p1201l3460j19549j37807J22419L95235
39427D62601K44708j86162k98545L6174K76777J11454p2355O2042J95095k0128
39417H11661k59947q2045K39785J45517k27098k56843J02849K73137O0346o8598
39407G38764J30417K57544J2637k78034k41394l9685J3946j6486N6390J26170
39397G60269K8096r7434m8420O7622L6993r4779j51246j17809n8936L4485R7930
$$ y = [717329, 610299, 462930, 609417, 1001312, 1173453, 861377, 366237, 163840, 326291, 492772, 338982, -56730, -313356, -151440, 313545, 678562, 661249, 367304, 114319, 60367, 116334, 168690, 201393, 177076, 12254, -215369, -220998, 141956, 614531, 814522, 701079, 540028, 477538, 417709, 306964, 235763, 202303, 82754, -55053, 67366, 462601, 707309, 521147, 222602, 258776, 535553, 647007, 574652, 636694, 831789, 811661, 551714, 469669, 709454, 854971, 627873, 371030, 473879, 747016, 807362, 738764, 869181, 1126725, 1139362, 861328, 619934, 580249, 594195, 577709, 634099, 760269, 788365, 690931, 642511, 710133, 747126, 652347, 501101, 383292, 324356, 358841, 456771]
39386D56771k8592k47134j71272K53929M81441J19517l93258l85422M7480K37675
39376C71135j1945k20736p2635J44536R9283q5585j37040o3470k2722j8204L1998
39365A4615R6661J04100R3174J29316J58819Q6814n1496j13446l4496Q1326P8583
39354F43970o2849j93170j72446m6827L0558K3423L2838R9438J42131J23822J11811
39343G32699J21142O7410n9678j45527j36802j03086o6064K4317J00925K3724
39333E59060j27304j07082N9355N5212j72061k41606L9404L02948J98867m7539
39323E19254o9423O412j41531l74521l00269L4294K19104J61668J47206K53119
39313D55313K43482P8465R994Q1079J9098k33400l39362j14128J47168J23461
$$ y = [456771, 428179, 181045, 9773, 263702, 745143, 864660, 471402, 85980, 133460, 371135, 359190, 138454, 65819, 210355, 309638, 224053, 87013, 23543, 821, -17383, 14615, 111276, 215376, 308550, 437866, 596685, 683499, 632003, 518557, 484061, 565387, 643970, 581121, 387951, 215505, 168678, 199236, 222659, 255497, 354935, 497066, 620888, 732699, 853841, 921251, 861573, 716046, 579244, 476158, 410094, 434411, 535336, 559060, 431756, 324674, 384029, 439241, 267180, 25574, 64978, 367926, 566793, 519254, 449831, 456243, 314712, -59809, -360078, -325784, -106680, 54988, 202194, 455313, 698795, 777260, 787254, 868333, 887431, 654031, 314669, 200541, 347709, 471170]
39303D71170p3519j32989J7191K23576L46592K98842M0103k84956l81379j56807
39293C67824J10620J29427j7930l5739J34552K37540P3434k22460l38797j51640
39283B86831J50864L00617K27859N6830r6499j95536j98315q5521K1467k2733
39273D45864j20015k1215K45925L30819P9304k03686k13476o8959j7224r994R1532
39262E38875J47648k4400k33083j54407J25385K25721O6112n7947K1184J33540
39252G88628R3227p3007k38543k75918q3084K50171L93037J60135j68154k10215
39242F36277k5023O3358K8501Q7994J90454O3165k28952k77941K2036K79133J97384
39231A036386k8959q7489J3607O0702n1634k55163l77299k41818J03104L01135
$$ y = [471170, 397651, 264662, 281853, 505429, 852021, 1150863, 1190966, 906010, 524631, 367824, 478444, 607871, 589941, 554202, 688754, 926294, 999728, 777268, 438471, 286831, 437695, 738312, 966171, 1023001, 926502, 730966, 532651, 447130, 468597, 445864, 325849, 304634, 550559, 881378, 960682, 756996, 543520, 474561, 457337, 447343, 538875, 686523, 662123, 429040, 274633, 400018, 625739, 691851, 633904, 655088, 788628, 881855, 808848, 570305, 294387, 211303, 461474, 854511, 1014646, 846492, 636277, 611254, 674612, 703113, 791107, 981561, 1044726, 815774, 537833, 559869, 839002, 1036386, 1007427, 919938, 933545, 994247, 942613, 687450, 310151, 68333, 171437, 472572]
39221D72572R7865k31897k08015J51005L55145J87417k1823K7199J67129R8200
39211A094797j60049l59087l46517j50264R5397K20644J56752K2257m6631o9442
39201D57857p4492L6814K35626K17248j34513l85530j26723L10397K87193j56118
39191F67759l99848k39931o9594o9632K3493K35544K03702q9432j62858J21272
39181B20475K77579O5992q0306J22982K73405L9435k12111r4627J01635m082j53933
39170E56444K7464K66706J14394k06881j74814J05591J04114j96537l06740q6541
39160B03200R4987M8985l215P1432J28039J02706R3823O2602j11368k86585k12874
39149A91732J400M0161m1455Q4459L39182K52319k23410n07085k46650J49836
$$ y = [472572, 570437, 338540, 130525, 281530, 636675, 824092, 802269, 829468, 996597, 1094797, 934748, 575661, 229144, 78880, 174277, 394921, 551673, 573930, 527299, 457857, 383365, 420179, 655805, 873053, 738540, 353010, 226287, 536684, 823877, 667759, 267911, 27980, -41614, -111246, -87753, 147791, 351493, 262061, 99203, 220475, 498054, 564046, 483740, 606722, 880127, 919562, 707451, 612824, 714459, 710377, 556444, 583908, 850614, 965008, 758127, 583313, 688904, 793018, 596481, 289741, 203200, 298187, 347172, 343957, 415389, 543428, 646134, 739957, 802559, 691191, 404606, 191732, 193132, 233293, 191838, 276297, 615479, 867798, 644388, 137303, -109347, 40489]
39139D0489J77780k5473l1805J36818J22549r6424j60882M8643J90366m315l00572
39128I7174k85937N6828L43762K99037N6119q2704j8529J06372J31437K2277j42602
39117E83234k21883j05749J29391K27516N2384j83426j60292J21638L49284L05433
39107A097530O6139j92970l55617l25956q9828J39902R7991j42343k10843M0474
39097A24479L28152L64159K16445Q4038k1272j57683k39577j76320o6038m2065
39087D14318o2500l6441j7281p9874j34825n9632Q8213J63699J43736Q9206O266
39076E14885r1839r2193O6140K25362J74005o4083k60378k70043j48351L106J59841
39065B16452L02621L27225J30977k04673m09482l00014k1613J27336R7071R8020
$$ y = [40489, 218269, 192796, 160991, 297809, 420358, 323934, 163052, 211695, 402061, 397746, 97174, -188763, -131935, 211827, 510864, 566983, 484279, 465750, 572122, 703559, 725836, 583234, 361351, 255602, 384993, 612509, 664893, 481467, 321175, 442813, 792097, 1097530, 1163669, 970699, 615082, 289126, 199298, 339200, 437191, 294848, 84005, 124479, 452631, 816790, 1033235, 1117273, 1096001, 938318, 698741, 522421, 456383, 414318, 351818, 315377, 298096, 218222, 83397, 23765, 111978, 275677, 419413, 508619, 514885, 423046, 330853, 396993, 622355, 796360, 732277, 471899, 201856, 53505, 56611, 216452, 519073, 846298, 977275, 772602, 363120, 63106, 41493, 168829, 265900, 363920]
39055C63920J84276J37136r4321j90517K9181K33727R0591j62612j19441R7662
39045E69602Q9306r6075j11765j4522j16304k43983N7830N80972N72226m9730
39035A237557m60296j94665J94521J41884q1370m5236N4036q4767j96417J5318
39025E80565K05019l4315l63787k16103K23521L03483o2296l59302l15333j28658
39015a67206L5689J82440K07736K9696r1460J24388M41659M06929O8707j32770
39005A105808r6232j13090k33499j63375J45136L25727J54825j36532k41388j47828
38995E99552l2836l1504j52572k39354q0743K48652L32078l1839m24152l26490
38985a39208J32621L77211J98671p9572j74050j23340k0097J13177J64953K5006
$$ y = [363920, 548196, 685332, 591011, 400494, 429675, 663402, 753993, 591381, 471940, 569602, 658908, 562833, 451068, 436546, 320242, 76259, 134089, 715061, 1287287, 1237557, 777261, 582596, 777117, 919001, 837631, 792395, 846431, 761664, 565247, 580565, 785584, 751269, 387482, 171379, 394900, 698383, 636087, 276785, -38548, -167206, -131517, 50923, 258659, 288355, 196895, 321283, 762942, 1169871, 1238578, 1105808, 1009576, 896486, 662987, 499612, 644748, 970475, 1125300, 988768, 747380, 599552, 566716, 535212, 382640, 143286, 62543, 311195, 643273, 611434, 187282, -139208, -6587, 370624, 569295, 489723, 315673, 192333, 172236, 285413, 450366, 475372]
38975D75372j54393j23113N8479J06954k4379j13794o2818K1139R2575J75237
38965D51259J53574p8108k99426j82717J77880L33615J02103k26092l33176k03734
38955a04822K3354K31054L11731K29271J03927L5697p1927k79966l65144j31468
38945a8293J78710J83283l7932p9399J12593J75323l4643k09533j06370J06120
38935B69859J75383J24024J11687J59132J50711n908k59903l83410j61445K57722
38925D37852L99846P3898k87543k10233J33343K26307M246j39976m1499O4452
38915F60693M3802M3917J16580J01105k5962o7099L6640R6282O424j08172j35266
38904G68944j03684n0753l286n8178k31940l07769j10011J74932K55202J74670
$$ y = [475372, 320979, 197866, 256345, 363299, 338920, 225126, 162308, 183447, 276022, 451259, 604833, 526725, 227299, 44582, 222462, 556077, 658180, 432088, 98912, -104822, -81468, 149586, 461317, 690588, 794515, 830212, 758285, 478319, 113175, -18293, 160417, 343700, 305768, 226369, 338962, 514285, 479642, 270109, 163739, 269859, 445242, 569266, 680953, 840085, 990796, 984888, 724985, 341575, 180130, 437852, 837698, 911596, 624053, 413820, 547163, 773470, 777716, 637740, 596241, 660693, 704495, 748412, 864992, 966097, 940135, 873036, 909676, 1005958, 1012382, 904210, 768944, 665260, 614507, 611221, 553043, 321103, 13334, -96677, 78255, 333457, 508127]
38894E08127J55561J63096L6460r6679l958J66533Q2274j71324k04742K684Q3245
38883G21277o3447j39324k2540N7168P034K8571J65681J66908n8859k67049k82259
38872C13161j97068q3786J04611K78318K46172O7605m500M7797K4064p1908o1271
38861F63195p546j21491k78178j57771J43117K07978J6873l8341J12216J20378
38851F60430o2707o6865J49596J43332j94047l58366p7623K25525J67039j8516
38841E67798j2186N2024j0331k5552J30288K01059K4374j30358o7240k3411j54871
38830E51594j81662M4444J54371q4021k54158J8814L49845J89850k50215l29812
38820B09050L4576L39130K80387K9075j64644j94800n0145J14171M5068j88104
$$ y = [508127, 663688, 826784, 863244, 766565, 762607, 929140, 1011414, 840090, 635348, 638032, 721277, 657830, 518506, 495966, 553134, 560168, 588739, 754420, 921328, 862469, 595420, 313161, 116093, 32307, 136918, 415236, 661408, 729013, 724513, 772310, 796374, 724466, 663195, 655649, 534158, 255980, 98209, 241326, 449304, 466177, 427836, 540052, 660430, 597723, 530858, 680454, 823786, 629739, 271373, 193750, 419275, 586314, 567798, 555612, 607636, 597305, 571753, 702041, 903100, 927474, 797116, 729876, 706465, 551594, 369932, 414376, 568747, 484726, 230568, 249382, 599227, 789077, 538862, 209050, 243626, 582756, 863143, 892218, 727574, 532774, 482629, 596800, 641868, 453764]
38810D53764j62251J98074L36532o8758m48230j79212L52330L16168k25502m31169
38800A41746l4508L15862J80020m9419N7717K53338J23849j84857k36012K86J55105
38789G23127L2546j73431k11440q2094L6294N3563P1924K03394L40361K47085
38779A241329q1706l28787k44864K2811J50203M5126j38980k59749k54780p8142
38769G2461K06695L62583K29027l3433j50308j01274o6686r1535n8610L5913M1671
38758D46504p3585j27147J7327K33633K76682Q2581j48995j80952j8975R6592
38748F03665J1202j34754j30914j5318L3518K4724R0876J50364n272k60864k19581
38737A47646J74619M50784K64258j11483k16229l2237J20577Q7741k9467j22457
$$ y = [453764, 291513, 489587, 826119, 757361, 309131, 129919, 482249, 798417, 572915, 141746, 107238, 423100, 603120, 553701, 611418, 864756, 988605, 803748, 567736, 568022, 723127, 755673, 582242, 370802, 288708, 325002, 378565, 450489, 653883, 994244, 1241329, 1159623, 830836, 585972, 608783, 758986, 804112, 665132, 405383, 150603, 72461, 279156, 641739, 870766, 837333, 687025, 585751, 519065, 427530, 368920, 404833, 446504, 372919, 245772, 263099, 496732, 773414, 855995, 707000, 526048, 507073, 603665, 614867, 480113, 349199, 333881, 367399, 392123, 482999, 633363, 628091, 367227, 147646, 322265, 773049, 1037307, 925824, 709595, 677358, 797935, 885676, 856209, 733752]
38727G33752j42490m8976R3155J06144l1239r1132M3199J48346J7502j81110j73402
38716D73749r503O8226K6200J0393M0082K1076k1419J3587Q8122P8755r353o5750
38704G14165m9577L946O7280R8987N5187l63K9373L9773j63114m33311l45771
38693A6575J23958M04691J36738k34316j24100K70672K93329j29445l93795j52612
38683B11695K34189L07047R7558q4425j08712m9754K1939P7613P7711N814r9871
38672F90804j76975j49681L7300K98343M00690K14646j00632k92975l05474k27393
38662C88653q9745Q3686J35789m9311k75181k03325J77795M77068L65044m3407
38652I67066l46495k92667N986K40735K27335M8887j07962j86007k40515k49895
$$ y = [733752, 591262, 542286, 635441, 741585, 710346, 619214, 662413, 810759, 828261, 647151, 473749, 464246, 532472, 558672, 569065, 609147, 630223, 608804, 622391, 710513, 789268, 779915, 714165, 664588, 668534, 735814, 834801, 889988, 889625, 918998, 958771, 795657, 362346, 16575, 140533, 545224, 681962, 447646, 323546, 594218, 887547, 758102, 364307, 211695, 445884, 752931, 850489, 766064, 657352, 607598, 629537, 707150, 784861, 790675, 690804, 513829, 364148, 401448, 699791, 1100481, 1315127, 1214495, 921520, 616046, 388653, 298908, 382594, 518383, 469072, 193891, -9434, 168361, 645429, 1010473, 967066, 620571, 327904, 333890, 574625, 801960, 850847, 742885, 556878, 316363, 66468]
38642F6468j10839J61495L82770L91102J79025j50857m17780m00144n4834L22649
38632C69055L86766J66840l7577j13143j56512j16532J43285M17792K97881j61200
38622A196655m10991k06983P2674R9882M5925R3083N6335j54624k34304n1133
38612E06519J5216k26183k91117J82512O66265M77193j32276l95811k23092j31200
38602D48026k05922m5582L01143K59603k55911n69612k64746K13691L13489J43014
38592C37193R3981J75902J62448P1173P8329J47451Q9138j06031k45129j97495
38582F06960l0118Q9872O3874k7376J034J76989K68634Q6558k12420l25440k16480
38571D82087r0827l5244L9838J33898J13369m7308k07826k55961j82780q089J90950
$$ y = [66468, -44371, 117124, 499894, 890996, 1070021, 919164, 501384, 101240, 46406, 369055, 755821, 922661, 885084, 771941, 615429, 498897, 642182, 1059974, 1357855, 1196655, 785664, 578681, 651355, 751237, 797162, 890245, 946580, 791956, 557652, 506519, 521735, 295552, 4435, 186947, 853212, 1330405, 1198129, 802318, 579226, 448026, 242104, 196522, 497665, 757268, 501357, -68255, -333001, -119310, 194179, 337193, 431174, 607076, 769524, 840697, 919026, 1066477, 1155615, 1049584, 804455, 606960, 576842, 666714, 730588, 703212, 704246, 881235, 1149869, 1236427, 1024007, 698567, 482087, 391260, 356016, 395854, 529752, 643121, 595813, 387987, 132026, -50754, -58843, 132107]
38560A32107K61396J75108J23438K04528K04411l1134k29030q0450J92401J38558
38550A091333j77846k77746p3982Q417j97606k93713J506L65203L72867J04137
38540I22570p8114o4021M819O0897J33070J67027O7242j39127l24212l83495k70414
38529I6242j6449K31634L19600K63331J87173J00252p3339k54007k46890o1894
38519E45653N6919r094r9909n8467O4922J66658K18198J69758k3739k01531j04616
38508G24752J98267K93081K626l10801k63336L40Q4820l7370o0634R8020J71440
38497I01205R026j63055q8706J36006K02213o912k99303m09933k49778M6085K38876
38486C15724J85690j0965q9400O4294K52543K18150l727j58209j56197j37244
$$ y = [132107, 393503, 568611, 692049, 896577, 1100988, 1069854, 840824, 760374, 952775, 1091333, 913487, 635741, 561759, 570176, 372570, 78857, 80363, 445566, 818433, 922570, 844456, 780435, 785254, 846151, 979221, 1146248, 1213490, 1074363, 750151, 366656, 96242, 79793, 311427, 631027, 894358, 1081531, 1181783, 1108444, 854437, 607547, 545653, 602572, 593478, 493569, 435102, 500024, 666682, 884880, 1054638, 1030899, 829368, 724752, 923019, 1216100, 1218726, 907925, 644589, 644929, 729749, 692379, 631745, 729765, 901205, 910231, 747176, 658470, 794476, 996689, 989777, 690474, 280541, 30763, 76848, 315724, 501414, 490449, 401049, 465343, 717886, 936036, 932309, 774100, 617903, 480659]
38476D80659j22844O2343L71704M02192j0238l80650k08206K20736K27408j89318
38466H53786l47005J2213L15389J04161k61593k43385N9608K05746J17293R036
38456H25249p2464j73599j60705M2455J87813P9960m7764N0240J47140m1455k65601
38445E71269j30430J83729K14322J9237J0984J45762K2719k71161k12698J96069
38435G49802L20312n7150l46137j26136J95488J28128j18065j07645O1625M3635
38425G43857q3899j2819J76525J48216p7696j57729p253J06524M6193k9841j9027
38414H33051k5651q0796l6705J29602J76681n7054l50317l39102J7003L71720
38404F38432L91607J16104j13634m6084J99825K72292M806l65481m64867k25418
$$ y = [480659, 357815, 420158, 791862, 1194054, 1183816, 803166, 594960, 815696, 1043104, 853786, 506781, 518994, 834383, 938544, 676951, 433566, 493174, 698920, 816213, 825249, 752785, 579186, 418481, 460936, 648749, 728709, 680945, 731185, 878325, 836870, 571269, 440839, 624568, 838890, 858127, 869111, 1014873, 1037592, 766431, 553733, 749802, 1070114, 1012964, 666827, 540691, 736179, 864307, 746242, 638597, 700222, 743857, 659958, 647139, 823664, 971880, 894184, 736455, 729202, 835726, 881919, 852078, 833051, 807400, 726604, 689899, 819501, 996182, 939128, 588811, 249709, 266712, 638432, 1030039, 1146143, 1032509, 986425, 1186250, 1458542, 1463348, 1097867, 633000, 407582]
38394D07582O1230J39344P4524M6138K4155j21344k78643j80081J28950K45294
38384E47149j396k33428p5108K61442L14015Q1209n5245J1678L9433k3472L8462
38373I04739J93077J20478j78024k77951m4217J02511q3602k22321K5331L40090
38363H80111K75474j3155r9032p2p210p4789L0184J69015K2083k76166k82186
38352F24257J4741J58899l1979k20733j46673K486j7128j16482p8219J01984K47600
38341E38753K25275N2622j13504r9608P2895J72467O8099q2062j01354o4053q4803
38330E84727n1859J42674K91422J32247j99069l16166j16516J31833J89860P3357
38320H62510p4561j21619j9290J04938N2938j19777j07918J55298L15054J37633
$$ y = [407582, 468812, 608156, 682680, 728818, 752973, 631629, 352986, 172905, 301855, 547149, 545753, 312325, 237217, 498659, 812674, 893883, 838638, 850316, 889749, 866277, 904739, 1097816, 1218294, 1040270, 762319, 718102, 820613, 737011, 514690, 540021, 880111, 1155585, 1142430, 1043398, 1043326, 1036116, 961327, 991511, 1160526, 1182609, 906443, 624257, 638998, 797897, 765918, 545185, 398512, 400998, 383870, 267388, 189169, 291153, 538753, 764028, 816650, 703146, 603538, 676433, 848900, 916999, 834937, 733583, 669530, 584727, 532868, 675542, 966964, 1099211, 900142, 583976, 467460, 599293, 789153, 862510, 787949, 666330, 647040, 751978, 804916, 685139, 577221, 732519, 1047573, 1185206]
38310A185206r5129n0865J19296R4351o3608r4471k4706l1432m8425N6324J23423
38299A169964l9718k47028k10531k4183M4454J1066L712q0640k86419k88032R5487
38288A48132L98468J36711l53223l76101O6509L93485M06575L79663L43250P6348
38278A619817k58846k57073k4543l9846k76729k39323J12391K71447Q8965k6875
38268I69385O6173K1744k19577k22648J23040L14799O7201k33688k09450j1703
38258F65276J19277K28882L01932J17447k59387l77186p1379K58611K77690J20972
38248A382135k0365j79316k85264j22717J73606J61321j61087k59168N2202K81596
38238A022943J12119q8189J7557J47616j7521k31366j48486P5172J21363M7547
$$ y = [1185206, 1090077, 1039212, 1158508, 1252859, 1189251, 1094780, 1070074, 1038642, 990217, 1046541, 1169964, 1130246, 883218, 672687, 648504, 692958, 704024, 707736, 627096, 340677, 52645, 148132, 546600, 683311, 330088, -46013, 20496, 413981, 820556, 1200219, 1543469, 1619817, 1360971, 1103898, 1079355, 1039509, 762780, 523457, 635848, 907295, 996260, 969385, 1035558, 1057302, 837725, 615077, 738117, 1052916, 1120117, 886429, 676979, 665276, 784553, 1013435, 1315367, 1432814, 1173427, 796241, 724862, 983473, 1261163, 1382135, 1361770, 1182454, 897190, 774473, 948079, 1109400, 948313, 689145, 741347, 1022943, 1135062, 1046873, 1064430, 1212046, 1194525, 963159, 814673, 889845, 1011208, 1058755]
38228A058755N6922R5084N9347O1690J45261R7611j42218k66044q7006J34402
38218A213804J39259M5826L993r1049k47861j96629J15459K93963J07383j14506
38208A269642n5683N5906r7952l45314l36763j12426N0894Q3234O5102l893q5462
38197D87285k9590J38827J75400N1712M3842J94707J67511j18077k40258L291
38187H74650J79051n3500l21547j59273K03211K37278m5462k12159j10000O2143
38177F54392J77521K26281J26792j06142j99841N44K06952J00260j53571j74481
38167H58707M0466J75214J02053r506l89J17393K28115J89525l0949k30117j88851
38156A251661l4355o8588k30451j61455J38638K37841j0955k17226j09923R2427
$$ y = [1058755, 1115677, 1210761, 1270108, 1331798, 1477059, 1574670, 1432452, 1166408, 1079402, 1213804, 1353063, 1398889, 1402882, 1311833, 1063972, 867343, 982802, 1276765, 1384148, 1269642, 1213959, 1269865, 1171913, 826599, 489836, 377410, 428304, 511538, 576640, 572747, 487285, 457695, 596522, 771922, 823634, 867476, 1062183, 1229694, 1111617, 871359, 874650, 1053701, 1000201, 678654, 519381, 722592, 959870, 914408, 702249, 592249, 654392, 831913, 1058194, 1184986, 1078844, 879003, 879547, 1086499, 1186759, 1033188, 858707, 899173, 1074387, 1176440, 1166934, 1166545, 1283938, 1512053, 1701578, 1670629, 1440512, 1251661, 1217306, 1148718, 918267, 756812, 895450, 1133291, 1122336, 905110, 795187, 887614]
38146H87614J83713K77969L73248K09306j48396k08560J21145K59057r8289m21382
38136A435425k37103Q9021M7773j47045n1796J72196J16112j14188j67411r8205
38126A044779j15766o5183K07839L64724J01035k18372j27937J20108K7962k31188
38116A108001j60393J19707J23629n6195N2131L27467K06731k48467l66441j0869
38106A095301J91635m9066k17665O1618L71904K28358j45812k50002p4406L6706
38096A248571j1362m2553j7218o4960j69060j35328Q8079K78167K22391J9591
38086A416318m3313R9609J76587k3360k95038k87549l3152R7961m5779k15313
38076H46971j78964M322K01632L68443M07060J95872j35803k79746j77690n7652
$$ y = [887614, 1071327, 1349296, 1722544, 1931850, 1783454, 1574894, 1696039, 1955096, 1856807, 1435425, 1198322, 1287343, 1335116, 1188071, 1136275, 1308471, 1424583, 1310395, 1142984, 1044779, 929013, 863830, 1071669, 1436393, 1537428, 1319056, 1191119, 1311227, 1339189, 1108001, 947608, 1067315, 1190944, 1134749, 1186880, 1514347, 1721078, 1472611, 1106170, 1095301, 1286936, 1237870, 1020205, 1081823, 1453727, 1682085, 1536273, 1286271, 1211865, 1248571, 1237209, 1194656, 1177438, 1112478, 943418, 808090, 896169, 1174336, 1396727, 1416318, 1373005, 1472614, 1649201, 1625841, 1330803, 1043254, 1010102, 1108063, 1062284, 846971, 668007, 672329, 873961, 1242404, 1649464, 1845336, 1709533, 1429787, 1252097, 1194445]
38066A194445j4528N9501J17505p53j46533j9600K12872Q3695l04765l10235J66874
38055A038478M31279J33774j64715j5983J54017r5826l62692j31883K63711K11943
38045A462103j43296k30183l0913L1821r5868j13030K2989J06494J11084J02833
38035A224034k2603k63287k95842J5915K79216J87404K4015P8533R8918j14275
38025A212028j64650K06810M44305M3492m55229k63615L24417M06638o4163l36421
38015A353612j64680j3146n0945M2579K55933J74233j80704k92896n1580P2419
38005A144825j26616k92175j85797J072J27681K71204L32855R6940k43240k35108
37995H91641Q1588J85326p8835k74197j17659J34733K04297J65370J39373P1861
$$ y = [1194445, 1179917, 1239418, 1356923, 1356170, 1209637, 1190037, 1402909, 1486604, 1181839, 871604, 1038478, 1469757, 1603531, 1438816, 1422833, 1576850, 1481024, 1118332, 986449, 1250160, 1462103, 1318807, 1088624, 1057711, 1089532, 993664, 880634, 903623, 1010117, 1121201, 1224034, 1201431, 938144, 642302, 658217, 937433, 1124837, 1148852, 1227385, 1326303, 1212028, 1047378, 1254188, 1698493, 1741985, 1286756, 1023141, 1347558, 1754196, 1690033, 1353612, 1188932, 1175786, 1124841, 1167420, 1423353, 1597586, 1416882, 1123986, 1072406, 1144825, 1018209, 726034, 540237, 541309, 668990, 940194, 1273049, 1369989, 1126749, 891641, 973229, 1158555, 1079720, 805523, 687864, 822597, 1026894, 1192264, 1331637, 1403498]
37985A403498m0370q9741j04231j88297k16813J1067L35670L85156J42531o2648
37975A575822r4518j01712j12075o353J20277L7626j71677j87742J2082J23249
37965A194979L8173j3103J06065K29055J69867m9223k66561k95018o3647J95469
37955A246056J15052k67301m48310j78114J52320J62890P1898K01271L51526K08159
37945A615447l2703l0058O9510l7184j87903p9597J12086O5350n8735M0876J68634
37934A645723J1908j82578l1507K12723P9820k26412j64731J64542K12417l8256
37924A683649j17156M8300R5711l3811p7334n1923j52398k08968K7095K62365
37914A475530Q7873k10829r0336K50800K02683j47810k01521L0728K748k70641
$$ y = [1403498, 1363128, 1273387, 1169156, 980859, 764046, 775113, 1110783, 1495939, 1638470, 1575822, 1481304, 1379592, 1267517, 1261164, 1381441, 1419067, 1247390, 1059648, 1071730, 1194979, 1233152, 1220049, 1326114, 1555169, 1725036, 1675813, 1409252, 1114234, 1050587, 1246056, 1361108, 1093807, 645497, 467383, 619703, 782593, 854491, 1055762, 1407288, 1615447, 1582744, 1552686, 1622196, 1585012, 1397109, 1317512, 1429598, 1494948, 1436213, 1477089, 1645723, 1657631, 1475053, 1443546, 1656269, 1736089, 1509677, 1344946, 1509488, 1721905, 1683649, 1566493, 1614793, 1710504, 1676693, 1599359, 1547436, 1395038, 1186070, 1213165, 1475530, 1563403, 1352574, 1262238, 1513038, 1715721, 1567911, 1366390, 1397118, 1399866, 1129225]
37904A129225k32598J20676K01833o0688r5978K18684L27527K2679k27711j65430
37894A238219q4964j13235J1097K65666K65444J5692m1217J44430J41986j17726
37884A725392k16967n9929k253j04867p4665K8344j03701k28458J61054P36394
37874A860344O03748k09327o64248l22111R6352N7960l9045J12749J04252k42398
37864A358276l47857P5317L90755J11947k54276j18921K18305K14172J0307R176
37854A667201J01746q051j85059j64822o1423p7768j04642j7348L8159n790N0853
37843A233056K28993K29857L424r1046N2426P3619j27324j24790K17795L62803
37833B058813j5165l98275k13319K85871M69522K34648n4036j80994j85965j20825
$$ y = [1129225, 896627, 1017303, 1219136, 1158448, 1062470, 1281154, 1608681, 1631360, 1403649, 1238219, 1153255, 1040020, 1051117, 1316783, 1582227, 1597919, 1556702, 1701132, 1843118, 1725392, 1508425, 1448496, 1446243, 1341376, 1266711, 1295055, 1191354, 962896, 1123950, 1860344, 2464092, 2254765, 1590517, 1268406, 1364758, 1422718, 1383673, 1496422, 1600674, 1358276, 1010419, 1085736, 1476491, 1588438, 1334162, 1215241, 1433546, 1647718, 1658025, 1667201, 1768947, 1760896, 1575837, 1411015, 1349592, 1271824, 1167182, 1149834, 1187993, 1182203, 1233056, 1462049, 1691906, 1695330, 1604284, 1656710, 1730329, 1603005, 1478215, 1696010, 2058813, 2043648, 1645373, 1432054, 1717925, 2187447, 2422095, 2368059, 2187065, 2001100, 1880275]
37823A880275n1442p7060j34768n0578J03397N6892j75995k79882j66126n4894
37813A049819Q350J90445L83823K68492o9060j85416k1372M3304n9166J4610K58348
37802A882177K11090j94989m19349j88288J11745J65142J67140K66217K31940
37793B232825k4436j98599j31734n3165q9418p7780K580j1961j7808K17228M46879
37782B294611K00995l31608m68968j27924R5184q741k8502J37285Q9736j68738
37772A683330j35237J83480J73406k27893l15595J36359M63477K96341J03536
37763B361204J59457M6696l52809m46288m0293J81229j36983l56135j115M05102
37753A820065L22762O8179L4912l9175l36711l89964L5713L39119P9120k53656
$$ y = [1880275, 1828833, 1751773, 1617005, 1566427, 1669824, 1726716, 1550721, 1270839, 1104713, 1049819, 1058169, 1248614, 1632437, 1900929, 1831869, 1646453, 1625081, 1668385, 1609219, 1623829, 1882177, 2093267, 1898278, 1478929, 1290641, 1402386, 1567528, 1734668, 2000885, 2232825, 2208389, 2009790, 1878056, 1824891, 1735473, 1657693, 1660273, 1648312, 1630504, 1847732, 2294611, 2495606, 2163998, 1695030, 1567106, 1662290, 1653549, 1625047, 1762332, 1852068, 1683330, 1548093, 1731573, 1904979, 1677086, 1361491, 1497850, 1961327, 2257668, 2361204, 2520661, 2567357, 2214548, 1768260, 1727967, 1909196, 1772213, 1416078, 1414963, 1820065, 2142827, 2211006, 2245918, 2206743, 1870032, 1480068, 1515781, 1854900, 1934020, 1680364]
37743A680364j59147K5655p3352q6347K87944N24193J80894k05419k9396K93879
37733B439268Q5709l73819l49399J04013L25884J36565p1460o6002O2159K22226
37723B515144L00669J11968k40106l36403q3264J11747O0365O7608K21859J50703
37713B880290j91052k92109j3897J00679j49189k08634J52133L13062p3349m06032
37703B111902k20007J4031j31657k23713J07561L60469J09359j24781J77822N44690
37693B725676L55657r1459k31809k08722l46331l84568q5276J31800j9774m2292
37683A802902L72923N66722L4534n21061k98023K31211J68309k84798l15053N8499
37673A816165J94546M0309L6087J58317N0851j86760k04052p4831k8984P8439
$$ y = [1680364, 1521217, 1546872, 1473520, 1387173, 1675117, 2199310, 2380204, 2174785, 2145389, 2439268, 2524977, 2151158, 1801759, 1905772, 2231656, 2368221, 2296761, 2230759, 2292918, 2515144, 2815813, 2927781, 2687675, 2351272, 2268008, 2379755, 2440120, 2507728, 2729587, 2880290, 2689238, 2397129, 2383232, 2483911, 2334722, 2126088, 2278221, 2591283, 2517934, 2111902, 1891895, 1905926, 1774269, 1550556, 1658117, 2018586, 2127945, 2003164, 2180986, 2725676, 3081333, 2989874, 2758065, 2549343, 2203012, 1818444, 1733168, 1864968, 1845194, 1802902, 2175825, 2742547, 2777081, 2256020, 1957997, 2189208, 2357517, 2072719, 1757666, 1816165, 2010711, 2051020, 2087107, 2245424, 2296275, 2109515, 1905463, 1830632, 1801648, 1880087]
37663A880087L40992L60048o5759l89872j80014J06011l6083k32210J7501L59090
37653B159791K58096n158P1501K55754J23187p5796J4980P7888j96624l51332
37643B332287o986K81800r330l37539p0660L00448P6370l11849j29233K37512
37633B362820K7071l84674j45381M47573M44275n8132j69321J61303K00070j06107
37623B779497j14355J95111K02655j20391j95695N236m4996l31860l13432J2997
37613B074767J24428n084P2486L01170J85655k12690l21470o4536Q9397K6173
37603B270296O3007K10460J89258O9816J12526J55536o4451k46451J084L26389
37593C087470J49600k91901l28106K76J23832R192Q2118K97035K25936q4067k16521
$$ y = [1880087, 2221079, 2581127, 2515368, 2125496, 1945482, 2051493, 2015410, 1783200, 1800701, 2159791, 2417887, 2412729, 2484230, 2739984, 2863171, 2787375, 2802355, 2880243, 2683619, 2332287, 2325301, 2607101, 2597771, 2260232, 2189572, 2490020, 2566390, 2254541, 2125308, 2362820, 2389891, 2005217, 1859836, 2307409, 2751684, 2693552, 2524231, 2685534, 2885604, 2779497, 2665142, 2860253, 3062908, 2942517, 2746822, 2752058, 2707062, 2375202, 2061770, 2074767, 2199195, 2194111, 2266597, 2567767, 2753422, 2540732, 2219262, 2154726, 2244123, 2270296, 2333303, 2543763, 2733021, 2802837, 2915363, 3070899, 3006448, 2759997, 2761081, 3087470, 3237070, 2945169, 2617063, 2617339, 2741171, 2750363, 2832481, 3129516, 3355452, 3271385, 3054864]
37582C054864j78720k71286l79260j95325Q9451R7671j0496J13731K73622J19826
37572B714078j02447l429J59724l0382k99692j72451J22693J07607l0909J31263
37562B596055L67329K34865n8422j01038q5711k92606l43428R0905M54971J81082
37552C044002k43337j34132J46032m6080l20747N888M93923K88418k86148k77203
37542B670616J84633J92636k42866k77373J89810M24382K31943J18115J61163
37533C653059m1777l70649k84841J26500K51918J7620j26693r7252j24412q6141
37523B917332J85852K88382j30934n56154l57478J31564K64278K14469M02187
37514C359498M44774j26766p26212n43647N6060K15868O3854K17426M37982J50873
$$ y = [3054864, 2876144, 2604858, 2225598, 2030273, 2119724, 2217395, 2206899, 2320630, 2594252, 2714078, 2611631, 2608202, 2767926, 2737544, 2437852, 2265401, 2388094, 2495701, 2464792, 2596055, 2963384, 3198249, 3139827, 3038789, 2953078, 2660472, 2317044, 2407949, 2862920, 3044002, 2800665, 2666533, 2812565, 2766485, 2445738, 2451626, 2945549, 3233967, 2947819, 2670616, 2855249, 3047885, 2805019, 2527646, 2717456, 3141838, 3373781, 3491896, 3653059, 3611282, 3240633, 2955792, 3082292, 3334210, 3351830, 3225137, 3127885, 3003473, 2917332, 3103184, 3391566, 3260632, 2704478, 2347000, 2478564, 2742842, 2957311, 3359498, 3804272, 3677506, 2951294, 2407647, 2463707, 2679575, 2743429, 2960855, 3398837, 3549710]
37504C549710k72725j35593K47213J83794m4350J48934L33234j11885n73951j96391
37494C127990M26835K26823l71141k44115L21862K29470k91893j43208M84607
37485C767230M38819k11375l28915J57354K37287j99867k80764N4052K2182l20865
37475C335138j83283K90738K39642j68314j5766M99913L46172l35237l96682K10500
37465C822821L87662p8369k82006J674P0460j69239j35493O3671j16564k90788
37455C273829K05486O80547N9549r07387n83767O97803J039752J15927m82569
37446D099170r5649J94364j56251l39767l4475M4269k09675m9306M62868M37035
37436D352583o5676j30417J44139j30152o37439k48602O76517O69178j91063l83765
$$ y = [3549710, 3276985, 3141392, 3388605, 3572399, 3528049, 3676983, 4010217, 3898332, 3324381, 3127990, 3554825, 3781648, 3410507, 3166392, 3488254, 3717724, 3425831, 3282623, 3767230, 4206049, 3994674, 3665759, 3823113, 4060400, 3860533, 3579769, 3633821, 3656003, 3335138, 3151855, 3442593, 3682235, 3513921, 3498155, 3998068, 4344240, 4009003, 3612321, 3822821, 4210483, 4132114, 3850108, 3851782, 3922242, 3753003, 3617510, 3681181, 3564617, 3273829, 3479315, 4159862, 4219411, 3312024, 2728257, 3426060, 4465812, 4581739, 4099170, 4003521, 4197885, 4041634, 3701867, 3667392, 3711661, 3501986, 3452680, 3915548, 4352583, 4286907, 4156490, 4300629, 4170477, 3533038, 3284436, 3960953, 4630131, 4439068, 4055303]
37426D055303K61377L71237k56122l23236L31630L84842l14419l53794M88734
37417D645552P03091j45978o23944j12816K04794k22549l44328K50110M88788
37408D842720O412j27462L75224L75030l79825o04146R0384M16041j48309m26727
37398D419342J32448M70473P5253r8671L33512M25518p5247j43124L91144L70074
37388F300722l65163n00977K32109M62184k09834m53503J86757M29765j83856
37379E898204l83704K95191N62307j12089m81870L7026L29946j09245k47790K45431
37369F033407K71650l60300l67131M40426O02841j81531l79403M17708O44347
37360G122014k09693n69224K00890N90160j30176n89984o3962K58029j43576p9432
$$ y = [4055303, 4316680, 4687917, 4431795, 4108559, 4440189, 4825031, 4510612, 4156818, 4645552, 5348643, 5202665, 4578721, 4465905, 4670699, 4448150, 4103822, 4353932, 4842720, 4849132, 4721670, 5096894, 5471924, 5092099, 4487953, 4578337, 4994378, 4846069, 4419342, 4551790, 5022263, 5097516, 4998845, 5332357, 5757875, 5682628, 5539504, 5930648, 6300722, 5935559, 5434582, 5666691, 6128875, 5919041, 5465538, 5652295, 6082060, 5898204, 5514500, 5809691, 6371998, 6259909, 5778039, 5815065, 6145011, 6035766, 5787976, 6033407, 6305057, 5944757, 5577626, 6018052, 6620893, 6439362, 6059959, 6477667, 7122014, 6912321, 6343097, 6543987, 7134147, 7003971, 6413987, 6350025, 6608054, 6464478, 6385046]
37350F385046P05296P25449k98538o23824K70172O36232j97869n60989K60722
37341G301697O42723j36803m88860K70615N48915k47570l88850P08276J073570
37332I283713j08380p94566J39049Q18081l2054p59303p0611N96678N6844l70415
37322H759036L73490J012743N06760j74833m19428j083353j900466j150860P73787
37313F696876J155992l53709q34741O60978J350540l1363q57030L44600J137519
37304I269662o006p67518L69258J091113j51886j007490J98171J151232P1588
37295A0218124q10981L31418J329797K99695o98394K06761J062318J13236o86784
37286A1365190K98202J022636p7099q08650L86678J151799j38751r84997L58926
$$ y = [6385046, 7090342, 7815791, 7517253, 6893429, 7163601, 7799833, 7601964, 7040975, 7301697, 7944420, 7807617, 7318757, 7589372, 8138287, 7890717, 7501867, 8210143, 9283713, 9175333, 8380767, 8519816, 9337897, 9305843, 8546540, 8475929, 9072607, 9129451, 8759036, 9132526, 10145269, 10652029, 10477196, 10057768, 8974415, 7073949, 5923089, 6696876, 7852868, 7499159, 6664418, 7325396, 8675936, 8644573, 7787543, 8132143, 9269662, 9263656, 8496138, 8865396, 9956509, 9804623, 8797133, 8995304, 10146536, 10218124, 9407143, 9738561, 11068358, 11368053, 10669659, 10876420, 11938738, 12051974, 11365190, 11663392, 12686028, 12608929, 11800279, 12186957, 13338756, 13200005, 12215008, 12573934]
37277A2573934J302833l0080j002866L85594J494000K23558q36429L92506J306142
37268A5809192q3146j008157M97784J437050k22270j223052O41189J898759R9806
37259A7847155j162276P63787K144297R5758j508056N30689K322194M17327j330528
37250B0120347O54863K455938L58913j585320N61039K675652O32111j383080Q63141
37241B5353604L006478O79948j488736J071646L447284Q61113j382385J752965
37233C3301917M416454J118058j704373K096255N568619J849991j553385L033808
37225D8127344P450165L027338j304189M417207J0480264N302568q89783M671757
37217H1282671J0328530J963133n066905P947215K2314436J2449017J074751K4484858
$$ y = [12573934, 13876767, 13846687, 12843821, 13229415, 14723415, 14946973, 14110544, 14503050, 15809192, 15726046, 14717889, 15215673, 16652723, 16430453, 15207401, 15848590, 17747349, 17847155, 16684879, 17448666, 19592963, 19688721, 18180665, 18711354, 21033548, 21450875, 20120347, 20775210, 23231148, 23590061, 22004741, 22565780, 25241432, 25873543, 24490463, 25353604, 28360082, 29040030, 27551294, 28622940, 32070224, 32931337, 31548952, 33301917, 37718371, 38836429, 37132056, 39228311, 44796930, 46646921, 45093536, 48127344, 55577509, 58604847, 57300658, 61717865, 72198129, 77500697, 76610914, 81282671, 91611201, 93574334, 88507429, 96454644, 118769080, 131218097, 132292848, 156777706]
37209A56777706M9390470k37152j16059761j82050232j21303282l168393N2755701
37202a63894943K9478034K133928J0612091K1849821R582141l659271K440683
37195i1457516J1070745N651318r26599M378700J0087961M785020j304272K340610
37187e5374033O945473L021714j709809J385514N409507K393079j524638R69725
37179c8483468M315343J747613j651672M48623L479584J618485r84753Q64611
37171b8645634L082825Q54592j685337K33896K658189Q71686j460393K14666K465539
37162b1409971R16775j180711L86042K471077Q96528j383807k04533J808569O78879
37153a7021152j193528n6596J790492P09701j145629k42118J463148O22453r37949
$$ y = [156777706, 206168176, 205931024, 89871263, -92178969, -213482251, -216650644, -163894943, -134416909, -132282981, -121670890, -99821069, -90238928, -93898199, -91457516, -80386771, -74735453, -75662052, -71283352, -61195391, -56410371, -57714643, -55374033, -48428560, -45406846, -47116655, -45731141, -40321634, -37928555, -39453193, -38483468, -34168125, -32420512, -34072184, -33623561, -30143977, -28525492, -29510245, -28645634, -25562809, -24708217, -26393554, -26159658, -23501469, -22629783, -24090176, -23875510, -21409971, -20493196, -21673907, -21287865, -18816788, -17920260, -19304067, -19508600, -17700031, -17021152, -18214680, -18271276, -16480784, -15771083, -16916712, -17158830, -15695682, -15073229, -16011178]
37144a6011178n8749J502134P01711q33040k23685J059370M57782n22580L73107
37135a3555128J369236K36039j024287J3469J357936M16683r79121j90940J144403
37126a1211710M64041p29543r653J151167M24168o96691Q1402J226905L88513
37117h911401r43267l26458R27607M19582p03299j91284Q50942K94057p31441
37108i314962j34231R48052M13224o49783j27008R98962O38112l92394j26939
37099g746967P94874O87443P3092N0575l25546j760800k291346n19271J274981
37090i762965P23264n55338p1415J042209N27402n85470j47364Q47576L08090
37081g674011p56203k14247R55144N34929o18543k50475R31869O67674n24167
$$ y = [-16011178, -16069927, -14567793, -13866082, -14699122, -14922807, -13863437, -13405655, -13928235, -13555128, -12185892, -11949853, -12974140, -12960671, -11602735, -11186052, -12165173, -12356113, -11211710, -10747669, -11477212, -11486865, -10335698, -9911530, -10608221, -10526819, -9299914, -8911401, -9854668, -10181126, -9253519, -8833937, -9537236, -9728520, -8877578, -8583521, -9314962, -9449193, -8501141, -8087917, -8737700, -8864708, -7865746, -7227634, -7620028, -7746967, -6952093, -6264650, -6191558, -6140983, -6466529, -8227329, -10518675, -11037946, -9762965, -9039701, -9595039, -9666454, -8624245, -8096843, -8682313, -8829677, -7982101, -7674011, -8430214, -8644461, -7689317, -7154388, -7772931, -8023406, -7091537, -6423863, -6948030]
37072f948030m45779N93156N86217k75412k54348M03400J59670n75901l10589
37063g067616M25600J28776n88048j87466O40871K67473n97904k05525P89902
37054f393937N18491n32028m75595M14705M23535k36531m9742O47345L60468m99495
37044e822784l95402K86846P0730n63790j07046Q31610N07195n79591n17896M64637
37034e825491N36782k36563k02849N31977L45140o13545n93470M37332P39688
37025d880999K3738k45558K28716K14039m13518m12614L05561M73739r3814k73323
37015e074033J15361J49865j45980J14525O51266L50041n03420n75391R2951K53731
37005d571084j61358q7182M42595L83296j71136j63735K82060J12723m71370l22021
$$ y = [-6948030, -7393809, -6800653, -6214436, -6489848, -6744196, -6340796, -6181126, -6757027, -7067616, -6642016, -6513240, -7101288, -7288754, -6647883, -6380410, -6978314, -7183839, -6393937, -5875446, -6407474, -6883069, -6468364, -6044829, -6281360, -6331102, -5683757, -5323289, -5822784, -6218186, -5931340, -5860610, -6424400, -6531446, -5699836, -5192641, -5772232, -6290128, -5825491, -5288709, -5525272, -5728121, -5196144, -4851004, -5464549, -6058019, -5620687, -4880999, -4857261, -5102819, -4874103, -4660064, -5073582, -5486196, -5180635, -4706896, -4800710, -5074033, -4958672, -4808807, -4954787, -4840262, -4188996, -3838955, -4342375, -4917766, -4824815, -4571084, -4732442, -4819624, -4377029, -3993733, -4164869, -4328604, -4046544, -3933821, -4405191, -4727212]
36995d727212L69360L46953l20950l81996K18623L34698j29463j79020J84194
36986d284813L8330m24168j54629N76013M88593l07936m66676J20020K48991k17905
36976d384180j90613L85518L80869k59686l37632L03767M66509j48174m53408
36967d237030n3148J80388p6589r5021K92010L59236J9604k1155K24827N5625
36957c351253l56545j77528L52051K22780l63660k54987M39881M35446l55637
36948c409452o10561K8492M16121O5401j33331K30215L88957K7411j39787J22222
36938c014312J15504l24481m65080j20309M0288j26546m0531K60047J17152k98817
36928c857085j37646M46030M22433j99334l24389K06595L39905j94934m05302
$$ y = [-4727212, -4357852, -4010899, -4331849, -4713845, -4495222, -4160524, -4289987, -4469007, -4284813, -4246483, -4670651, -4825280, -4249267, -3760674, -4068610, -4535286, -4415266, -4166275, -4384180, -4574793, -4189275, -3808406, -4068092, -4405724, -4101957, -3635448, -3783622, -4237030, -4290178, -4109790, -4186379, -4281400, -3989390, -3630154, -3610550, -3631705, -3406878, -3351253, -3707798, -3885326, -3533275, -3310495, -3674155, -3929142, -3489261, -3053815, -3409452, -4020013, -3991521, -3575400, -3509999, -3643330, -3413115, -3024158, -2996747, -3136534, -3014312, -2898808, -3223289, -3688369, -3808678, -3768390, -3894936, -3935467, -3675420, -3558268, -3857085, -3994731, -3548701, -3126268, -3325602, -3649991, -3443396, -3103491, -3298425, -3703727]
36919c703727P9793L70249J2082k78976m7076K14220K06160K69789L84138Q8742
36909b404606l82681k81207K14299J79980l50432m04745J22372L02031n5371j16624
36899c176984K88149L54924p4630k16341P9974P7531k82768k09301K96201K95470
36889b567775k98098m72060K4816K61833q7974k33001R2505J64341j53376p0725
36879c339514M60434M62892k11698m76697K2008K74722j70341l98998P4648M05108
36869b897436O7692k02446Q2215K60098o3314j86208K70959N33753R6322l58054
36859b396419k56240p0618k03372k01917J80219L70231J07456k3180K07215J96312
36849b090313k00744k48648K19989L36463j96627m76813o8460J84386k12957m54742
$$ y = [-3703727, -3623934, -3253685, -3241603, -3520579, -3567655, -3353435, -3147275, -2877486, -2493348, -2404606, -2787287, -3068494, -2854195, -2674215, -3024647, -3429392, -3307020, -3004989, -3060360, -3176984, -2888835, -2533911, -2608541, -2824882, -2744908, -2667377, -2950145, -3159446, -2863245, -2567775, -2865873, -3337933, -3313117, -3051284, -3139258, -3372259, -3279754, -3115413, -3268789, -3339514, -2879080, -2416188, -2627886, -3104583, -3082575, -2807853, -2978194, -3377192, -3302544, -2897436, -2829744, -3032190, -2949975, -2689877, -2753191, -2939399, -2668440, -2134687, -2038365, -2396419, -2652659, -2723277, -2926649, -3128566, -2948347, -2578116, -2470660, -2493840, -2286625, -2090313, -2291057, -2539705, -2319716, -1983253, -2179880, -2656693, -2725153, -2540767, -2753724, -3208466]
36839c208466N980L98439J03764k02502R2946L65583K3230k96764N1845M52581
36829b213364J59475l23550j87357K52074K27631j36353k35680q6171n2626p3281
36819b669202K5145L1617j42489j12814K26042L40610J0120j93756N4676K20947
36809b209104o0340k87897p9341J04886q3624j71262J54140L20737o6471l84515
36799b762791o8929L53696K02337j98735j97974P0060J21835K6041N8870O3070
36789b332520j22091j91414K1712J16426j06647j66023K09216M79101K24183j08747
36779a976804o3994J7410k32100m16211j28340K28615J56175p5802l3114O9286
36769b454879r0690k17151K9902L14929K08999m9698n5809L9790m5202j11211
$$ y = [-3208466, -3202486, -2804047, -2700283, -2902785, -2809839, -2444256, -2421026, -2717790, -2665945, -2213364, -2053889, -2377439, -2564796, -2312722, -2085091, -2221444, -2457124, -2543295, -2595921, -2669202, -2644057, -2612440, -2754929, -2867743, -2641701, -2301091, -2290971, -2484727, -2430051, -2209104, -2269444, -2557341, -2636682, -2531796, -2615420, -2786682, -2632542, -2311805, -2378276, -2762791, -2831720, -2478024, -2275687, -2474422, -2672396, -2602336, -2480501, -2454460, -2395590, -2332520, -2454611, -2646025, -2624313, -2507887, -2614534, -2780557, -2571341, -2092240, -1868057, -1976804, -2040798, -2023388, -2255488, -2671699, -2800039, -2571424, -2415249, -2491051, -2524165, -2454879, -2545569, -2762720, -2732818, -2417889, -2208890, -2258588, -2314397, -2274607, -2319809, -2431020]
36759b431020P8796K51743J15970r0108p2399J545n9884n4861J40057K35609P7930
36748a806622m7716j0005q1749k86197k30026J00561J96744n612N7387M35912
36738a677323L90392k60462o22708j88493K80523Q1079k80379j28717J78128N3134
36728b174826j86510N50L09307J89084j28061j36567l724j17323k49936l3651
36718b531657K56244J99721O303N0411J65476R6193O9134K27819J51502l35833
36708a644687n71669p6227N12213L96938j12761k16302O2820J28411q1839j68205
36698a771308q7961p0619m2789J28623J77380r8474l14578r7444K31511K14828
36688a730831L4272P3123J85586P1080r1319l2898M6957p9277j71411m1367q0
$$ y = [-2431020, -2352224, -2100481, -1984511, -2074619, -2147018, -2145473, -2205357, -2260218, -2120161, -1884552, -1806622, -1854338, -1864343, -1946092, -2232289, -2462315, -2361754, -2165010, -2170622, -2113235, -1677323, -1286931, -1547393, -2170101, -2358594, -2078071, -1996992, -2277371, -2406088, -2227960, -2174826, -2361336, -2360786, -2051479, -1862395, -1990456, -2127023, -2130747, -2248070, -2498006, -2531657, -2275413, -2075692, -2069389, -2018978, -1853502, -1757309, -1688175, -1460356, -1308854, -1644687, -2216356, -2292583, -1780370, -1383432, -1496193, -1712495, -1649675, -1521264, -1603103, -1771308, -1859269, -1929888, -1972677, -1844054, -1666674, -1765148, -2079726, -2177170, -1945659, -1730831, -1696559, -1623436, -1437850, -1366770, -1458089, -1490987, -1444030, -1523307, -1694718, -1736085, -1736165]
36677a736165k07056k20197J79033M14917P2374l02560j31022J97238R7308j50790
36667a786920l9311J47589n5893k86775n05M13972K45669k66035l50023k0540
36657a998772Q6621j04125j19740Q8512J39080J4369J0003P7322j6611j11390
36647a934731M8226K39200J64901L7284P8143l8101m82183o29997m0241N55269
36637b002230L04586l04168k41264L05130L18979k23980l60452J40248M60313
36628a602838K23484L803J34968J89923n9328k13211r7220j03852l63458m32604
36618b320333j24526J41525J19739J16555K94321L17823K3981k11175j14613N2117
36608a704586J9578o3044l3112m9331k00366k17054Q0508L88771L11961p0164
$$ y = [-1736165, -1943221, -2163418, -1984385, -1569468, -1497094, -1799654, -1930676, -1733438, -1636130, -1786920, -1826231, -1678642, -1734535, -2021310, -2021815, -1607843, -1362174, -1628209, -1978232, -1998772, -1912151, -2016276, -2136016, -2047504, -1908424, -1894055, -1884052, -1806730, -1823341, -1934731, -1886505, -1647305, -1482404, -1445120, -1366977, -1405078, -1887261, -2517258, -2557499, -2002230, -1697644, -2001812, -2243076, -1937946, -1618967, -1842947, -2203399, -2063151, -1602838, -1379354, -1375551, -1240583, -1050660, -1109988, -1323199, -1420419, -1524271, -1887729, -2320333, -2444859, -2303334, -2183595, -2067040, -1772719, -1454896, -1430915, -1642090, -1756703, -1704586, -1685008, -1748052, -1781164, -1830495, -2030861, -2247915, -2167407, -1778636, -1466675, -1536839]
36598a536839l06418j39098K18662L48139J07439j86804j55553J06895J61377
36589a382200p9907j90110O6560L16149J74568j45891k19618n0294P1880N6073
36579a382790j9045j33780k04002n3839K06012J77020j67586l19811n7995J55575
36569a800241L943j14252J28163L06757J5147l22548j72772J49557Q0920j44765
36559a870091M2148M52567M46111L5067k23839k07724k34057k90787j00406K01788
36549a749223K32854N3806j0002j4183j51665j67105J97670M90796J57713m21525
36539a380864m40796J9082J79722r7078k04470L4809J37664l7478n4006K00217
36529a643198K92554R7317J2310J48156J21174j54011k55283m6447P2684o9776
$$ y = [-1536839, -1843257, -1982355, -1763693, -1415554, -1308115, -1494919, -1650472, -1543577, -1382200, -1462107, -1652217, -1585657, -1269508, -1094940, -1240831, -1460449, -1510743, -1438863, -1382790, -1401835, -1535615, -1739617, -1793456, -1587444, -1410424, -1578010, -1897821, -1955816, -1800241, -1796298, -1910550, -1782387, -1475630, -1460483, -1783031, -1955803, -1806246, -1725326, -1870091, -1827943, -1375376, -929265, -894198, -1118037, -1325761, -1559818, -1850605, -1951011, -1749223, -1516369, -1462563, -1472565, -1486748, -1638413, -1805518, -1607848, -1117052, -959339, -1380864, -1821660, -1802578, -1622856, -1719934, -1924404, -1889595, -1751931, -1789409, -1843415, -1643198, -1350644, -1253327, -1241017, -1092861, -971687, -1125698, -1380981, -1427428, -1354744, -1424520]
36519a424520j27730N1343J20868q7702k23729m7017J65244J25577l4699q6450
36509a568815l1641O4305J83651K05997L1426j33840l7692J25956j0806k95897
36499a467356k34383J55896L17463N3142j93002j02404P3429M2593p8906q0982
36489a514510N222Q5224J62707J90231P6462q6142j01120J5610R3621J18287J59661
36478g94747J07569j49128m03374l77645j51072L5496J88881L60846L14800q8633
36468i57007m44300l20854K7446Q4458n9541L9029K94701K43722p5939j89293
36458a357578l8698N772p9811K1164K30581J50280j37569j52159R1470R2862j85231
36447a358917k23222J00755K98264J54970J3064J1742j32161l92099l12950J23207
$$ y = [-1424520, -1552250, -1500907, -1380039, -1467741, -1691470, -1738487, -1573243, -1447666, -1482365, -1568815, -1600456, -1536151, -1352500, -1146503, -1115077, -1248917, -1286609, -1160653, -1171459, -1467356, -1701739, -1545843, -1228380, -1175238, -1368240, -1470644, -1397215, -1354622, -1433528, -1514510, -1509288, -1424064, -1261357, -1071126, -994664, -1080806, -1181926, -1166316, -1072695, -954408, -794747, -687178, -836306, -1239680, -1617325, -1768397, -1732901, -1544020, -1183174, -868374, -957007, -1401307, -1722161, -1694715, -1610257, -1669798, -1630769, -1336068, -1092346, -1168285, -1357578, -1396276, -1390504, -1470315, -1449151, -1218570, -1068290, -1205859, -1358018, -1266548, -1173686, -1358917, -1582139, -1481384, -1183120, -1028150, -1015086, -1003344, -1135505, -1527604, -1840554, -1717347]
36437a717347L21369N8811j37758O7367K66339Q7218j82019j77799m3255j2945
36427a470019J1270R2395K7010j67967j14784K27031L31350k6077k91157j0069
36417a391017L94221K97813j48459l38142j54788J6455K788k108R3880J31534
36407a097823K2386j06520j19862l8634R682o3714j70089q7629K15770M07766
36397a028667K04694j41240j40665J96273L64363J31753j65100k05376j09407
36388h93372r3255r1979L1029J83099J75147j5724k39568l03407j07104J99349
36378a155785K85593O7475j03922M9307K63492J51394j50198k32412j07535r2444
36368a025035j56701l154K87826L26017R1538o5831p9014j84388l14447j49983
$$ y = [-1717347, -1395978, -1337167, -1474925, -1407558, -1141219, -1054001, -1236020, -1413819, -1457074, -1470019, -1458749, -1366354, -1339344, -1507311, -1622095, -1395064, -1063714, -1089791, -1380948, -1391017, -996796, -698983, -847442, -1185584, -1340372, -1323917, -1321129, -1323237, -1229357, -1097823, -1075437, -1181957, -1301819, -1340453, -1330771, -1394485, -1564574, -1652203, -1436433, -1028667, -823973, -965213, -1105878, -909605, -545242, -413489, -578589, -783965, -893372, -986627, -1078606, -1047577, -864478, -689331, -705055, -944623, -1248030, -1355134, -1155785, -870192, -802717, -906639, -857332, -593840, -442446, -592644, -825056, -932591, -1025035, -1181736, -1184890, -897064, -571047, -479509, -545340, -624354, -808742, -1123189, -1273172]
36358a273172J95447K41527l9065j69102k7278k4134k68817l19117j522K48863
36348a436370J65666P7273K18113K77413K8519k00137j12693L6508n1564j88332
36338a185604j12075Q726o4151j60701l1110J71149J60277Q044k5944O4630J07739
36327a059020Q5341Q6066P7387j1689r5511l2736J45308K38042P6800k80931n07496
36316a278439k82947K47518N07286K17844j70494j25324J85434K37353M941j22560
36306e79388q1593j28748k21453r7201J00116j0899k84238j97149K11546L25137
36296i63870l5327l40646k47233k7707O6240J54975K49648J19073j51697j43715
36286a320259J57312K75083O6785p3442l532o0187k84727k28401J81096L73996
$$ y = [-1273172, -1077725, -836198, -875263, -1044365, -1071643, -1095777, -1364594, -1683711, -1685233, -1436370, -1270704, -1193431, -975318, -697905, -669386, -869523, -982216, -945708, -997272, -1185604, -1297679, -1288953, -1353104, -1513805, -1544915, -1373766, -1213489, -1205445, -1231389, -1166759, -1059020, -973679, -887613, -810226, -821915, -917426, -950162, -804854, -566812, -490012, -770943, -1278439, -1561386, -1313868, -806582, -588738, -759232, -884556, -699122, -461769, -456828, -579388, -660981, -789729, -1011182, -1108383, -1008267, -1019166, -1303404, -1500553, -1289007, -963870, -999197, -1339843, -1587076, -1614783, -1548543, -1393568, -1143920, -1024847, -1176544, -1320259, -1162947, -887864, -821079, -894521, -898053, -958240, -1242967, -1471368, -1290272, -916276]
36276i16276P9174k32194j92961o9216q1951J9117K99737L38689K0317j42620
36266h78184O6886J26008k37989m44309o1084L82148K86695l5845l2333J06133
36256g21874n7087k85804j01154L04799L90050J48996m3985j38692k73828k77757
36246a056336J7751K82256J62059o2084N6743L21119K27505j56705l40086k19815
36236g67593r7557o5357P360L7910j29759k98428j82427N5522N9883r8528r2323
36225a571297M9749N4924j8280J13027L67596L70253P6448j66133j70670r2044
36215i86427n9763j7657N8908R8809Q5918M6570m4419j57491j48779P418J11792
36204a005121M6578l8315k2560k1769j04988j18759m561L9558p0683j28076l1690
$$ y = [-916276, -837102, -1069296, -1262257, -1331473, -1413424, -1394307, -1094570, -755881, -735564, -878184, -811298, -685290, -923279, -1367588, -1428672, -1046524, -759829, -795674, -828007, -721874, -778961, -1064765, -1165919, -861120, -471070, -322074, -366059, -504751, -778579, -1056336, -1038585, -756329, -594270, -656354, -599611, -278492, -50987, -207692, -547778, -767593, -865150, -930507, -923147, -885237, -1014996, -1313424, -1495851, -1440329, -1380446, -1478974, -1571297, -1521548, -1466624, -1484904, -1371877, -1004281, -634028, -557580, -723713, -894383, -986427, -1046190, -1063847, -1004939, -906130, -820212, -773642, -818061, -975552, -1124331, -1116913, -1005121, -958543, -996858, -1019418, -1041187, -1146175, -1264934, -1269495, -1229937, -1300620, -1428696, -1460386]
36193a460386L3577J2594J11447K99296K22134j20025k24270M6505J26927k63685
36183a215886n15420j19967M11789L71743K589j8062K42584K15915r5080k00920
36173i20715n5828l2540j26631j8612J84918Q5144k04533j81336J45799K53267
36163h71067K0511j09011L7297R9249r1419j99754j9584J62699Q4526q5684r6474
36152a068711O864N3529J1032o0360r7427l1866J10046J53805K1994r5770m4485
36141a041349K4565m2621q4015N1695J43217k4442k00367n7948K19798K51164
36131g60303R4528M0068L0474j21346k06451K5839K38175k8324m63895l90906
36121a542141P7727J84813j83316l11110J05356M75129L56599J06297Q8692M7437
$$ y = [-1460386, -1426809, -1414215, -1302768, -1003472, -781338, -901363, -1125633, -1079128, -952201, -1215886, -1731306, -1851273, -1439484, -1067741, -1065152, -1083214, -840630, -624715, -719795, -920715, -976543, -1009083, -1135714, -1154326, -969408, -884264, -1088797, -1270133, -1124334, -871067, -850556, -959567, -922270, -823021, -914440, -1114194, -1133778, -971079, -886553, -972237, -1068711, -1061847, -1008318, -997286, -1057646, -1155073, -1186939, -1076893, -923088, -901094, -996864, -1041349, -1016784, -1059405, -1143420, -1091725, -948508, -972950, -1173317, -1231265, -1011467, -760303, -665775, -625707, -595233, -716579, -923030, -897191, -659016, -687340, -1151235, -1542141, -1464414, -1279601, -1462917, -1774027, -1668671, -1193542, -836943, -730646, -641954, -594517]
36111e94517k33405l57331j380M06058L29291p492m5816J64456J27011k02704
36101d15829l54756j43250O7631o746j55964p9194J41330K17973J09217L8324
36091e81264J17717J74563J9836k45602l38394j69322M7335R4243M790o2946n5072
36080i94116n351P6976J59113J33745l5607k05634k19671r9995K3013O1263k6230
36069a132494k08433k76845k940M54068N71554J27299m16446m88794j53390P2350
36059a454071j5847j16416M3026L32925M50839K92902J6037j59281j68390j34906
36049i13182j46048q0294J49712K83792J0265m40870m80591l7595K85359J41678
36039a227774n8187P8204K49351P1580j66969j3493K96771K14181j73539k98795
$$ y = [-594517, -827922, -1185253, -1186633, -780575, -451284, -458776, -504592, -340136, -213125, -415829, -770585, -913835, -846204, -852950, -1008914, -1088108, -946778, -728805, -619588, -581264, -463547, -288984, -269148, -514750, -853144, -1022466, -975131, -880888, -876098, -939044, -994116, -999467, -922491, -763378, -629633, -665240, -870874, -1090545, -1190540, -1167527, -1106264, -1132494, -1340927, -1617772, -1620712, -1166644, -595090, -467791, -884237, -1373031, -1526421, -1454071, -1469918, -1586334, -1543308, -1210383, -759544, -466642, -450605, -609886, -778276, -913182, -1059230, -1139524, -989812, -706020, -695755, -1136625, -1617216, -1654811, -1369452, -1227774, -1285961, -1207757, -958406, -886826, -1053795, -1067288, -770517, -556336, -729875, -1028670]
36029a028670o7191O8825n9048j12483R0513K83275K34742N2124r6375j70985
36019h05273j30447L2679J35380K3378j16776k2892J73685J52019l8451p8425
36009f75123M7549O1136p4604j15642j6988J5952m9071m9548j5302j11372k09604
35998a192617j8860L33804L72898J3670k65314j30450J73266K69560J43612j58
35988c00589n9393m3224K334k3319j61732k42870p7602K12460L13029J38312j18264
35977c60858k91975l37540k08780M9038J90369P0960o8097M2477K26106J52316
35967e35984o4646m7648J75431K11955l2305k47068k64494k07483r1371J95496
35957i08117M67492L32247j70730m95011l07737J08020L05085J79849p8192k38280
$$ y = [-1028670, -1095861, -1027036, -1086084, -1198567, -1108054, -824779, -590037, -537913, -634288, -805273, -935720, -903041, -767661, -744283, -861059, -883951, -710266, -558247, -596698, -675123, -627574, -566438, -641042, -756684, -773672, -757720, -806791, -856339, -871641, -983013, -1192617, -1211477, -877673, -504775, -491105, -756419, -886869, -713603, -444043, -300431, -300589, -359982, -403206, -400872, -424191, -585923, -828793, -906395, -693935, -380906, -242594, -360858, -652833, -990373, -1199153, -1150115, -959746, -888786, -956883, -914406, -688300, -535984, -600630, -648278, -472847, -260892, -293197, -540265, -804759, -1012242, -1103613, -908117, -440625, -108378, -279108, -774119, -1081856, -973836, -668751, -488902, -567094, -805374]
35947h05374j60297O7522J38926o9108k31505l9802K57496K19875o2274j41489
35937h26030K9028J00915M703n091O6564k4446j68092j0554L05818K33116k41143
35926e35212m72659j66938K03057K28519J17719J14296M1306j89832k33887Q2047
35916h11584L38834J67374j48833j60495O5531J90327J67435J33557N0027j33652
35906a41479k28545r8415M2503k9380j54144q3617O1488k002k23103k81047o3297
35895a201038K01187K51894O1746j68455j90199M5837K98035K99568Q1347j29095
35885d49173k35908k65400j60142Q4986K07962J0031k15448o8747K46600J86927
35875f58312k06065l25057r06K45983J32889L9702K03880K32651j31201m18943
$$ y = [-805374, -965671, -898149, -759223, -828331, -1059836, -1099638, -842142, -622267, -684541, -826030, -797002, -696087, -691384, -696475, -629911, -654357, -822449, -833003, -527185, -294069, -535212, -1007871, -1174809, -971752, -743233, -625514, -511218, -469912, -659744, -893631, -811584, -472750, -305376, -454209, -614704, -549173, -358846, -191411, -57854, -7827, -141479, -370024, -468439, -425936, -455316, -609460, -693077, -631589, -633591, -856694, -1137741, -1201038, -999851, -747957, -686211, -854666, -1044865, -999028, -700993, -401425, -320078, -449173, -685081, -950481, -1110623, -1025637, -817675, -807644, -1023092, -1091839, -845239, -658312, -864377, -1189434, -1190340, -944357, -811468, -771766, -567886, -335235, -466436, -885379]
35865h85379j75822K41180K23289j29902k39723K2046K32226J25103j00364j61366
35855h48712k3339J52121J87194O0827j8079J32373L15058J56186k84470m97002
35845f67843k47665R5397J50990J6053o3290r1054j17194k4914J89000K75602
35835d84918J35362L018R987l1405j84157j93091M525P8738q1379j01182J73053
35824f71449K89518k6687l05622j26739R2384j80021n60567k94342M70418Q26248
35814d86859M18152j81821m08351k99569r7180J11251K22061J12208o8768l3514
35804g12390J57084J66737l0365r7551O8051J58241j88j60063j00243J7939l2435
35793e65183j62638j46917J2928J22723Q7066m751l6609K512M3166M5238M9864
$$ y = [-885379, -1061201, -820021, -596732, -726634, -966357, -944311, -712085, -586982, -687346, -848712, -872051, -719930, -532736, -471909, -489988, -357615, -42557, 113629, -170841, -667843, -915508, -820111, -669121, -653068, -716358, -807412, -924606, -949520, -760520, -484918, -349556, -346538, -336551, -367956, -552113, -745204, -740679, -661941, -743320, -844502, -671449, -381931, -408618, -714240, -840979, -748595, -928616, -1489183, -1783525, -1313107, -486859, -68707, -250528, -658879, -958448, -1055628, -944377, -722316, -610108, -678876, -712390, -555306, -388569, -418934, -516485, -448434, -290193, -290381, -450444, -550687, -532748, -565183, -727821, -874738, -861810, -739087, -652021, -656772, -693381, -690869, -647703, -602465, -552601]
35782e52601Q9461Q6743m4741k16128k44478j29230m5252l2830N3808K25463K77396
35771e32389J45028L8171P0679P3507l8098n2228J38275K57202P6387j73242j69640
35760a66348k2356n1495k42280l01249j31303Q3465J80339J42072J3531j03736
35750e99360j01285m9566j29507k67033j57083J91406L49394J52164K1451K48098
35740c41321M37541J54599l15222m20990j96433m1851J7487J83720K72179j5093
35730b65384l81820k69313J96645L59858J04607k5295J60338J92546j36814l31062
35720c95694l0395L46910K48206k04955m78014l47938j1847K55864K80966O4066
35710b72831j38896o6151J29161O1695k11413j90400K18614M18225K4271m67205
$$ y = [-552601, -463140, -376397, -421138, -637266, -881744, -1010974, -1056226, -1089056, -1035248, -809785, -532389, -387361, -349190, -278511, -205004, -243102, -295330, -157055, 100147, 176534, 3292, -166348, -188704, -240199, -482479, -783728, -915031, -831566, -651227, -509155, -495624, -599360, -700645, -750211, -879718, -1146751, -1303834, -1112428, -763034, -610870, -589419, -341321, 96220, 250819, -64403, -485393, -681826, -723677, -706190, -522470, -250291, -265384, -647204, -916517, -719872, -360014, -255407, -280702, -120364, 72182, -64632, -395694, -426089, -79179, 169027, -35928, -513942, -861880, -873727, -617863, -336897, -272831, -411727, -477878, -348717, -287022, -498435, -688835, -470221, -51996, -27725, -494930]
35700d94930m00302O4856K63371L8905j55831n2096J16530J11212J7466l0086
35690e20905p1402j28975q5678R4029K34074J74564j7820j59558j46782P569J92553
35679d28331K17504j6478l02474k84314N7430K85139P0508k98975k84112J20753
35669h63350L46195N8935l63359l87443m8059K08795J96264J09034P6975J5476
35659f50537p0479l2709Q8730N0382j56447k09478L9608L06835L17975J74012
35649a42108N4624q9210k67070k36336P5993K69225K9966k84454j43133K85778
35639d46725L53747o1947l90625k59819L3521J13063N9825R1252J28911J4519
35629c64278j43463j59038r1479r1326r2046O0762K79081L01149O1668k14500
$$ y = [-494930, -895232, -830376, -567005, -528100, -683931, -736027, -619497, -508285, -490819, -520905, -592307, -721282, -806960, -712931, -478857, -304293, -322113, -481671, -628453, -620884, -428331, -210827, -227305, -529779, -814093, -756663, -471524, -401016, -699991, -984103, -863350, -517155, -458220, -821579, -1209022, -1257081, -1048286, -852022, -742988, -666013, -650537, -721016, -753725, -664995, -614613, -771060, -980538, -940930, -634095, -316120, -142108, -87484, -176694, -443764, -680100, -604107, -334882, -304916, -589370, -732503, -446725, -92978, -154925, -545550, -805369, -771848, -658785, -598960, -507708, -378797, -364278, -507741, -666779, -758258, -849584, -941630, -880868, -601787, -300638, -238970, -453470]
35619d53470k97206j84301l2474M2288N7307R1703J48881J28153k4411j84822
35609g08352j71879J3054J76068J70853M9866m0291k5838M9046P8061j034j06006
35598e16452p3630R8811J76024o364k53514k44804P39J51085N8757n1999J6400
35587f44947J22320N1743j07221r8220R2880K00530N4174j93390k71282j11266
35577i04679J10465J94271J05358m4468j29047q7130P1283K52495K91542R4049
35567d5861j95945k85188p4264J81029J66175r9511k99929k20130K9010J86794
35557f57820J22079q7586k55152k26781m741K33906K97660J82405N7007L5109
35547c03914M4854k2501j13312p4263R4745J79684K5078k18589k60169n7617J27738
$$ y = [-453470, -750676, -934977, -967451, -925163, -867856, -776153, -627272, -499119, -523530, -708352, -880231, -867177, -691109, -520256, -470390, -510681, -536519, -487473, -409412, -410446, -516452, -590082, -491271, -315247, -321611, -575125, -819929, -819190, -668105, -609348, -661347, -644947, -522627, -470884, -578105, -676325, -583445, -382915, -328741, -522131, -793413, -904679, -794214, -599943, -494585, -539053, -668100, -755230, -683947, -431452, -139910, -45861, -241806, -526994, -601258, -420229, -254054, -353565, -653494, -873624, -844614, -657820, -535741, -623327, -878479, -1105260, -1110001, -876095, -578435, -396030, -339023, -303914, -259060, -281561, -394873, -469136, -374391, -194707, -169629, -388218, -648387, -706004, -578266]
35536e78266J07393O360J0931O3377J3219p0370r901J29055J01460j02559k14318
35525e43619j16375j1393m6059o0178J05721L01932K96984J25269l0092j51366
35515a29176l21897m40265k80239J47602N09362N01347J79684j26138j77693n5007
35505a92420r971j22005j96513o9875J11405R2460r3013j73328o6487K2650j8901
35494g15998k5670J28020K73091J87724p3905k55658j97308L1548J98296R9151
35484c50709j75638k34263J15012M51543K29416l57966n37775r4284K68537J1115
35474f75012l98637k52754K63275L91565l918k92437q7395K57320K87102N1490
35464d59401j42007j83522j31336p02J85242K92973K10620R566j25813q9271N2785
$$ y = [-578266, -470873, -464513, -453582, -390205, -376986, -447356, -457257, -328202, -226742, -329301, -543619, -659994, -671387, -717446, -777624, -671903, -369971, -72987, 52282, 22190, -129176, -451073, -891338, -1171577, -1023975, -514613, -13266, 166418, 40280, -137413, -192420, -202391, -324396, -520909, -590784, -479379, -386919, -479932, -653260, -719747, -697097, -715998, -741668, -613648, -340557, -152833, -226738, -482396, -679704, -648156, -449860, -350709, -526347, -760610, -645598, -194055, 35361, -322605, -860380, -954664, -686127, -675012, -1073649, -1326403, -1063128, -671563, -675481, -967918, -1055313, -797993, -510891, -459401, -601408, -784930, -916266, -916968, -731726, -438753, -228133, -218567, -344380, -433651, -380866]
35453c80866J20657M304j74192j72452L0354J50598l834k12661j37726J67863
35443f07955L12085J09287j81361k34788q7246m2735k21895l61058j53756K71159
35433a198263M19899Q2759l14307k66040Q9663K03047k9713j51264O2201K45541
35423h56477J00777j06128m5294J13065M9749j27002j05080P3623J19538j972
35413g85201p3530j8504N3635R7205J29818Q6520o3779j71718j05792L9425J23785
35402f88136J61886J64109L0799j86811k11298L3368K28185J49269O123Q925m724
35391c08305j67260k29604k6926J27713j5726j41226O3763K78246J08996j44460
35381d54789p550K66391J30802k16209j37359K75940K98445j88362m86730k26115
$$ y = [-380866, -260209, -255905, -430097, -602549, -572195, -421597, -425431, -638092, -775818, -607955, -295870, -186583, -367944, -602732, -689978, -732713, -954608, -1315666, -1469422, -1198263, -778364, -695605, -1009912, -1275952, -1186289, -983242, -1012955, -1164219, -1102018, -856477, -755700, -861828, -907122, -794057, -744308, -871310, -976390, -902767, -783229, -785201, -858731, -877235, -823600, -726395, -596577, -510057, -573836, -745554, -851346, -811921, -688136, -526250, -362141, -331342, -518153, -729451, -696083, -467898, -318629, -312506, -303581, -308305, -475565, -705169, -732095, -604382, -620108, -761334, -697571, -419325, -310329, -454789, -462339, -195948, -65146, -281355, -418714, -142774, 155671, -32691, -519421, -745536]
35371g45536J42548J86910N4841k6449j10585j60869L2900L44578L30911l6710
35361A2539k60169j16462M8126J2215J4109J56470J30972j65208l46297j85211
35351f98916K3954M7788Q3356K37132K20831p5900k65267r3741J22614O7618p6207
35340d06738p1337o4114j93063k45147q6153M6099L5797J46672M12655L73702
35330e1627j13625m26400j17834K85762J23474k95435k32496K34836L83798L7193
35320a72354k65342k05106k3823P7352J88727K82606J58362j14043k10700q4188
35310c68509j4851r4335j14899j2654K7751l5408k8630O4482O4832k2164L880
35299e30505J17219N5239j86155k63983l0704K12929J75750l4531j52936j18803
$$ y = [-745536, -602988, -416078, -361237, -387686, -498271, -659140, -626240, -281662, 49249, 12539, -247630, -364092, -315966, -303751, -289642, -133172, -2200, -167408, -513705, -698916, -674962, -627174, -543818, -306686, -85855, -161755, -427022, -520763, -398149, -330531, -406738, -478075, -542189, -735252, -980399, -1066552, -1020453, -984656, -837984, -425329, -51627, -165252, -591652, -709486, -423724, -300250, -595685, -828181, -593345, -209547, -172354, -437696, -642802, -666625, -589273, -400546, -117940, 40422, -73621, -284321, -368509, -383360, -477695, -592594, -605248, -577497, -612905, -641535, -577053, -512221, -534385, -530505, -413286, -358047, -544202, -808185, -838889, -625960, -450210, -484741, -637677, -756480]
35289g56480l3664K3006O668q0768j21774j2302J26561J02319P977J13947L73950
35278b50560M05822P8130k49994k59809j04426o7623j01023j6799R8294L1482
35268d36506j29571r2001J59633L15330K01404r780j22715j74218k37572k13206
35258g39202j2151K13120K40422R2680k4126m0720o5771j29153j24571m7976m9085
35247f86533j44600j19071J20004L05727J72341j11627j66936L2949J51170K5951
35237d20625j23641j07736n3809j10609j32159Q5314M06007M70806J78605j70042
35227B2111k46814o0305J18535R9699m5772j26498p4803m657m5791j77506k51714
35216g93515j52298Q1371K65167K23514p865j63047l5746K34626L15255J11875
$$ y = [-756480, -790144, -767138, -760470, -841238, -963012, -975314, -848753, -746434, -738457, -624510, -250560, 155262, 233392, -16602, -276411, -380837, -448460, -549483, -566282, -467988, -436506, -566077, -658078, -498445, -183115, 18289, 8509, -114206, -288424, -525996, -739202, -751353, -538233, -297811, -205131, -229257, -269977, -335748, -464901, -589472, -637448, -686533, -831133, -950204, -830200, -524473, -352132, -463759, -630695, -597746, -446576, -420625, -544266, -652002, -705811, -816420, -948579, -863265, -457258, 13548, 192153, 22111, -224703, -285008, -166473, -66774, -112546, -239044, -313847, -318504, -364295, -541801, -793515, -945813, -864442, -599275, -375761, -383626, -546673, -582419, -347793, -32538, 79337]
35206G9337j41523k39428k10236j09475R9576L23811L00587r430k59908j86462
35196c53151K5564R2997O1181O7323j2259k75916m33732k04142J44370J56953
35186g30812p7927j08497J03353J76786K2171n1303N1419Q3805l288K4778J55385
35175c54130R2691j46638j97100k8241l3439k61254k36853J72650M02276J02171
35165d87867k31227n6842L17386K50854k12108m72978k93065N330J39201J70329
35155h70987K28204K90307K59064O7342k30059l80559j52891K66166L89592R5087
35145c8734j71756o0544J92860K05990J0975j45558k23700k61891j39817J61807
35135d70368L42319J86348o9717j21751p0811j45527k34443j08158J28571K16897
$$ y = [79337, -62186, -301614, -511850, -621325, -521749, -197938, 102649, 93219, -166689, -353151, -327587, -234590, -173409, -106086, -118345, -394261, -827993, -1032135, -887765, -730812, -808739, -917236, -813883, -637097, -614926, -666229, -614810, -531005, -534293, -509515, -354130, -261439, -408077, -605177, -633418, -666857, -928111, -1164964, -992314, -590038, -487867, -719094, -775936, -458550, -207696, -419804, -892782, -1185847, -1180517, -1041316, -870987, -642783, -352476, -93412, -26070, -256129, -636688, -789579, -523413, -133821, -38734, -210490, -271034, -78174, 127816, 138791, -6767, -230467, -492358, -632175, -470368, -128049, 58299, -11418, -133169, -203980, -349507, -583950, -692108, -563537, -346640]
35125c46640J66980J16371m542k58153l84331j51798J71057J68144o0988p9532
35115f63432J56959K60025P5021r3646J66J84131J52745j21881l59177k57357
35105f66446J57758M50772K41943k10726k59180J74610L88449l5707n05629k97583
35095e61739K99386M27881l7760m12859l14030q0251k9302M603J94845L44009
35085a65217K38454l657j42419j00417O1943K08268J52520j12426k69328p4944
35075b07223J91119P2388l41368m97670j88272J92735K60734P6934j21375k26906
35065g88904j84500L6543K77819L01608J29437j8284j09445k65675l62207j20588
35055a104196L32672M77698J34868k39453k01042J07547K62879J30925j06239
$$ y = [-346640, -179660, -63289, -67831, -325984, -710315, -862113, -691056, -522912, -583900, -663432, -506473, -246448, -171427, -265073, -264907, -80776, 71969, -49912, -409089, -666446, -508688, -57916, 184027, -26699, -285879, -111269, 277180, 241473, -264156, -561739, -262353, 165528, 127768, -285091, -599121, -679372, -708674, -704071, -509226, -165217, 73237, 69580, -72839, -173256, -111313, 96955, 249475, 137049, -132279, -207223, -16104, 56284, -285084, -782754, -971026, -778291, -517557, -440623, -561998, -788904, -973404, -936861, -659042, -357434, -227997, -246281, -355726, -621401, -983608, -1104196, -771524, -293826, -158958, -398411, -599453, -491906, -229027, -98102, -204341]
35046b04341k53126k25125n6005Q4477N6447j8443P1203K19279J14169j91597
35036d03062k52880O6108L00645P4104l10651l39748n0663J04994j9563j34068
35026i64784m5797R1762J24030J33522J87143J30852j30908l36002j51057K85715
35016f75524M38498R9495k71323j89240J34323J31369k09823l28055k5958J95667
35006g00571l592k05667M6214M19306K97428k05151m13800j27150J82721J78973
34996e31289M9440J9003K7904K3939R6340J81323O4488j95641k59503m8327J12061
34985d60262K2964j15911j16516q0594r1814k3613J37483J46987q4710k70301
34975i36287j80631O573M4691J4964J07209K48743K45902J21403M4566M8833M0164
$$ y = [-204341, -457467, -682592, -738597, -654120, -597673, -616116, -544913, -325634, -211465, -403062, -655942, -589834, -289189, -215085, -525736, -865484, -916147, -811153, -830716, -964784, -1010581, -918819, -794789, -661267, -474124, -343272, -474180, -810182, -961239, -675524, -237026, -137531, -408854, -598094, -463771, -332402, -542225, -870280, -896238, -700571, -704163, -909830, -863616, -444310, -146882, -352033, -765833, -892983, -710262, -531289, -481849, -462846, -434942, -411003, -314663, -133340, -68852, -264493, -523996, -572323, -460262, -437298, -553209, -669725, -750319, -842133, -865746, -728263, -581276, -665986, -936287, -1116918, -1110345, -1065654, -1050690, -943481, -694738, -448836, -327433, -282867, -234034, -193870]
34964a93870o194l1278n852M7931P5128m814j88934k96748j65734P3328J40367
34953e56670J1281p8901j8985R0237K02443L21380K56131j66379o12263m97248
34943a048974J27759N06257K31405j96307k12235j4507m8406j74558r138K61955
34933e76749J52838k12849k22208J98621M12592R5806k40224q6449K60407K18939
34923G24j29361k00248J29031L15074J0879l79247l13594P2705K07029l6627k04795
34912e28430m2308J25432J4225r7605J19388L86985K23832k11604l10744J2746
34902c08083J94447m2523k63424q6452K02685J75493o0158j43460p5929r3374
34892e00778j68711r8196O8109R8295j0677n7316p18K6783J1235N1610J10492
$$ y = [-193870, -200064, -231342, -237194, -189263, -114135, -118949, -307883, -604631, -770365, -697037, -556670, -545389, -624290, -643275, -553038, -350595, -29215, 226916, 60537, -551726, -1048974, -921215, -414958, -183553, -379860, -592095, -606602, -655008, -829566, -838704, -576749, -423911, -636760, -858968, -660347, -247755, -151949, -392173, -478622, -218215, 724, -128637, -328885, -199854, 115220, 126099, -253148, -566742, -494037, -287008, -323635, -528430, -570738, -445306, -431081, -528686, -409298, -22313, 201519, -10085, -320829, -308083, -113636, -156159, -419583, -506035, -303350, -127857, -188015, -331475, -407404, -500778, -669489, -767685, -699576, -601281, -611958, -669274, -669992, -643209, -631974, -580364, -469872]
34881d69872O2356m5599n3538K6769M9695J5568M5975J18472J03088L5099O1671
34870e0316J31343N0606j32488j40939N7576J34302q6738l12627k11131R2495
34860d67917K29578J25429J2418P10l2086j18635r2067R4587K11467R6551n5025
34849E010J3223J85084J34547j41351k93530j64811j4060n3963j01475N8067K47001
34838a26258J84315j0380j4865J18829N1760k03966k42548L4323J77537j01005
34828a32258m23444l15809N9423J90837K0488m3734J46772K47658J9267k61656
34818d92456k19859P0287K32371J28639k6776m6519J237l716j4768N9076J43179
34807a69305Q8775p2450j48090p5797j6787q6348j55773n7131J34946J95785O5673
$$ y = [-469872, -407516, -453115, -506653, -479884, -430189, -414621, -368646, -250174, -147086, -111987, -50316, 81027, 131633, -855, -141794, -84218, 50084, -36654, -349281, -560412, -467917, -238339, -112910, -100492, -99782, -131868, -250503, -342570, -247983, -36516, 60035, 5010, 18233, 203317, 337864, 196513, -97017, -261828, -275888, -329851, -431326, -373259, -126258, 58057, 47677, 32812, 151641, 203401, -565, -243113, -208790, -31253, -132258, -555702, -871511, -812088, -621251, -600763, -644497, -497725, -250067, -230800, -492456, -712315, -642028, -409657, -281018, -307794, -354313, -353076, -356792, -371560, -312484, -169305, -80530, -152980, -301070, -376867, -393654, -480002, -635775, -692906, -557960, -362175, -296502]
34796b96502r0197j18219l3640N8954Q7167M3060k1179k7894L9656J08561J10551
34785a39682M5314p6187k36167l14721j64058J25422K37736O5352q9917L0811
34775e16097K20460J44394r5943j34159M3660R7947o4454j38082M8390K49051
34765a44833K06334J7474p9352l8370K7853K4372q5450k42950k62599m0433K12595
34754d05359K02853k771q9582l3445j10059l16470k73221J15503L85867J96484
34744c30200j30989j25540J22372J91511K0815q6618j3161N0148j2902r7875j18401
34733e30840j01052m0319R2197J98365J41593j9709r6713n8563m5003r1320o3258
34722f14622Q9167K13105J73447M0455m3143p1196j31853k14943j92892j3509
$$ y = [-296502, -386699, -504918, -538558, -479604, -392437, -349377, -370556, -398450, -358794, -250233, -139682, -94368, -170555, -406722, -721443, -885501, -760079, -522343, -456991, -546908, -516097, -295637, -151243, -247186, -381345, -337685, -239738, -304192, -442274, -393884, -144833, 61501, 78975, -377, -38747, -10894, 13478, -71972, -314922, -577521, -617954, -405359, -202506, -205277, -294859, -328304, -438363, -754833, -1028054, -912551, -526684, -330200, -461189, -586729, -464357, -272846, -252031, -338649, -351810, -301662, -314564, -412439, -530840, -631892, -672211, -580014, -381649, -240056, -259765, -356478, -415041, -460044, -551364, -614622, -525455, -312350, -138903, -98448, -141591, -212787, -344640, -559583, -752475, -765984]
34712g65984J86552K31646J15506k9149j24251j76824j45776J8231J73569Q7731
34702d28749j60787j81344J32568L35526P8073k92970k34484J39257K62333L2943
34692c17634j08835J567K5541j74109k51075k9238J52689M7522q7331j5450N3533
34681g02820n9084r6301J24708K66263M0082j99579j1937L35384K77887r0013
34671a15410j70976J36161K96177L6494k55671k06973k606j228j81736k50172
34661g15940q0819J63723K46489Q5979j58333k26031n7878J16741J00413n773
34651e31429k2063L300m6763o5056R5953K75192J95502o8190j77314m9544P6514
34640c13898Q3039R1534J10062l1152k89282l42905q5396J57524J10553n3883
$$ y = [-765984, -579432, -347786, -232280, -261429, -385680, -562504, -708280, -690049, -516480, -428749, -589536, -770880, -638312, -302786, -224713, -517683, -752167, -612910, -350577, -317634, -426469, -424902, -399361, -573470, -824545, -853783, -701094, -653572, -740903, -756353, -702820, -761904, -858205, -733497, -467234, -427152, -626731, -638668, -303284, -25397, -115410, -286386, -150225, 145952, 182446, -73225, -280198, -282804, -284032, -465768, -715940, -796759, -633036, -386547, -300568, -458901, -684932, -742810, -626069, -525656, -531429, -553492, -550192, -596955, -662011, -566058, -290866, -95364, -163554, -340868, -390412, -313898, -230859, -139325, -29263, -60415, -349697, -692602, -777998, -620474, -509921, -563804]
34630e63804m7541O6551M2549r0651p6453J24353K42650R7726j47025k23612j01825
34619f77082L1942N6830L9713P5603J30026J17279O3943P5634J50029J47049j1462
34608A99504k12317k85978j97991m6714O2095Q0968K7874j4551L0728J18699J12293
34597a25390j9488j23235n7566J07668J78625P8315p9481j38040o6567J9206k004
34586b27957r7666j16330j3733N7871j9669j29531j04840K940M9793P9328K00420
34575c19374K72441O4837k82113l40999j3784L02375K88469R6758J2085M5715
34565A26410O2724L5054k7293j51954k47053j22505J78223L34871J89530m8284
34555C29723j69465k19563k41898j32014O6778J05094k7586j2686K07473K21101
$$ y = [-563804, -611345, -544794, -502245, -592896, -669349, -544996, -302346, -204620, -351645, -575257, -677082, -645140, -588310, -548597, -472994, -342968, -225689, -161746, -86112, 63917, 210966, 199504, -12813, -298791, -496782, -543496, -481401, -400433, -372559, -387110, -356382, -237683, -125390, -144878, -268113, -325679, -218011, -39386, 38929, -40552, -178592, -245159, -225953, -227957, -325623, -441953, -455686, -397815, -417484, -547015, -651855, -648915, -599122, -519794, -319374, -46933, 17904, -264209, -605208, -618992, -316617, -28148, 68610, 80695, 126410, 189134, 224188, 196895, 44941, -202112, -324617, -146394, 188477, 378007, 329723, 160258, -59305, -301203, -433217, -366439, -261345, -288931, -301617, -94144, 126957]
34545A26957j52549m48390k64458Q2860J19585k341J23391L66211L06039J6841
34535B74146p4676N5252P2117m0412r504R9695m2431l46027l58376m7587J21394
34524b96409j5566r4463N6771J12144r9096k27740j7652K21606J26810j36734
34514c70329j86562j1205J19269J14534J02820J34669J13363k5450k10850k84763
34504e04504j38210J18384J97002Q258j39570J3840K00670R1m20876m72271n2416
34493a189602K82533J86862j3395L7789J73679J33412N8236J42669J88451l4985
34483c4351k98928k58815m4730k0801j34533k2735L11832M45193J97377r7667
34473D1842j17005K2012L8644q5242j73884j72150j70019j90996j39863L7425
$$ y = [126957, -25592, -473982, -738440, -655580, -535995, -538336, -414945, -48734, 257305, 274146, 199470, 254722, 326839, 286427, 276923, 376618, 334187, -11840, -370216, -417803, -296409, -311975, -406438, -349667, -237523, -336619, -564359, -582011, -360405, -233595, -370329, -556891, -568096, -448827, -334293, -231473, -96804, 16559, -8891, -219741, -504504, -642714, -524330, -327328, -319070, -458640, -444800, -244130, -244039, -664915, -1137186, -1189602, -907069, -720207, -733602, -695813, -522134, -388722, -330486, -187817, 634, -34351, -333279, -592094, -636824, -657625, -792158, -814893, -503061, -57868, 139509, 41842, -75163, -53151, -14507, -99749, -273633, -445783, -615802, -806798, -946661, -909236]
34463i09236K52140L55668K76455P0922j24420j88413j00922M3250J20572R2872
34453a11112J9227m6802j12522j61051j02539P3364J70057L32k82026k97542M9190
34442h01424M01660M06316J23077j56838k84132k62382j00393J16297J82117L6859
34432c38843q5828n898R6102r030j82112j51052P890J8725q4827k9102J76296
34421e87679K26131M1326j15285r3498l0781p552P9116K01437J46676q8651k09073
34410d37833p9912N6546p994j37248j36177n5406j0525M1201J39927J69198N8204
34399d00019o3663q1831o5319p4360k1745J19078J98747J48756J11509J38449
34389I602L4336k59500m05073j23518K96767L39138P02k11964l2696K14388J47252
$$ y = [-909236, -657096, -301428, -24973, 45949, -78471, -266884, -367806, -324556, -203984, -111112, -91885, -138687, -251209, -412260, -514799, -441435, -271378, -271046, -553072, -850614, -801424, -399764, 6552, 129629, -27209, -311341, -573723, -674116, -557819, -375702, -338843, -424671, -430569, -334467, -343497, -525609, -676661, -668771, -650046, -734873, -763975, -587679, -361548, -320222, -435507, -529005, -559786, -567338, -488222, -286785, -140109, -228760, -437833, -517745, -461199, -469193, -606441, -742618, -798024, -808549, -767348, -627421, -458223, -400019, -463682, -545513, -610832, -685192, -706937, -587859, -389112, -240356, -128847, 9602, 43938, -215562, -620635, -744153, -447386, -108248, -107546, -319510, -352206, -137818, 9434]
34378I434j16612j83165K4714J94304J12892m8775m8411N0305K8239q2508l4206
34367i3789J91268K83176O8641k01385k32060j07817p7440j21744n4458Q6606
34357b59002R7720j2121m1089L2987K8573q2971j13552L201R4588L5799q8024
34346c03891j62513j70958j04270M9784K01309K26424J37827K4402j08359k42451
34336d52696k18131L0111K36927J32529j09641j22260O6628J21826j691l6504
34326c52902M6563j0103k03788k07921L7786J91132J02035K9034R5174O3729j20228
34315c29489j13404J93967L50769L4802l83664l94482q1368J33562J47834J32259
34305c09214R9455l1869j44303r8921l0766j09830j97729r5076P1281P8303K6403
$$ y = [9434, -107178, -290343, -265629, -71325, 41567, -7208, -55619, -5314, 22925, -59583, -93789, 97479, 380655, 449296, 247911, 15851, -91966, -169406, -291150, -345608, -259002, -161282, -173403, -214492, -181505, -152932, -235903, -349455, -346254, -251666, -215867, -303891, -466404, -637362, -741632, -691848, -490539, -264115, -126288, -101886, -210245, -452696, -670827, -640716, -403789, -271260, -380901, -503161, -436533, -314707, -316398, -352902, -306339, -316442, -520230, -728151, -690365, -499233, -397198, -368164, -272990, -209261, -329489, -442893, -248926, 101843, 136645, -247019, -641501, -722869, -589307, -441473, -309214, -209759, -241628, -385931, -484852, -515618, -625448, -823177, -918253, -846972, -768669, -742266]
34294g42266J33313K82684K00927m2080j33363l3889J9721k1589K8371J74091
34284a34080J72713n1782k67716k89561j84928n8427R2412K16672J70049l6633
34274c71281j66194p7060N7710J2926j40110j38842O9879K32474J43025n6812
$$ y = [-742266, -608953, -326269, -125342, -167422, -300785, -334674, -314953, -336542, -308171, -134080, 38633, -13149, -280865, -570426, -755354, -813781, -721369, -504697, -334648, -371281, -537475, -614535, -556825, -543899, -684009, -822851, -752972, -520498, -377473, -434285]
$$ [...]
##END NTUPLES=NMR SPECTRUM
##END=
