##TITLE=31Pdec_81-2021
 CDCl3, 24 sc
 23.08.2021
##JCAMPDX= 6.0         $$ Bruker NMR JCAMP-DX V2.0
##DATA TYPE= NMR SPECTRUM
##DATA CLASS= NTUPLES
##ORIGIN= UXNMR, Bruker Analytische Messtechnik GmbH
##OWNER= root
$$ XWIN-NMR		Version 3.5
$$ Mon Aug 23 10:28:57 2021 Russian Standard Time (UT+4h)  she@DPX200
##.OBSERVE FREQUENCY= 81.013821
##.OBSERVE NUCLEUS= ^31P
##.ACQUISITION MODE= SIMULTANEOUS
##.ACQUISITION SCHEME= undefined
##.AVERAGES= 24
##.DIGITISER RES= 16
##SPECTROMETER/DATA SYSTEM= spect
##.PULSE SEQUENCE= zgpg30
##.SOLVENT NAME= CDCl3
##.SHIFT REFERENCE= (INTERNAL, CDCl3, 0, 248.564)
##AUDIT TRAIL= $$ (NUMBER, WHEN, WHO, WHERE, WHAT)
$$ ##TITLE= Audit trail, XWIN-NMR		Version 3.5
$$ ##JCAMPDX= 5.01
$$ ##ORIGIN= Bruker BioSpin GmbH
$$ ##OWNER= she
$$ F:/spectra/data/she/nmr/P31/1/pdata/1/auditp.txt
$$ ##AUDIT TRAIL=  $$ (NUMBER, WHEN, WHO, WHERE, WHAT)
(   1,<2021-08-23 10:28:00.04 +0400>,<she>,<DPX200>,
      <created by zg, POWCHK disabled, PULCHK disabled
       configuration hash MD5:
       00 E9 B6 7A A2 85 ED C7 34 08 36 98 17 FE 4E 26
       data hash MD5: 32K
       61 21 71 9F B3 20 20 77 69 CC 3B C7 D7 81 9E 17>)
(   2,<2021-08-23 10:28:03.20 +0400>,<she>,<DPX200>,
      <Start of raw data processing
       efp BC_mod = 2 LB = 1 FT_mod = 6 PKNL = 1 PHC0 = -7496.69 PHC1 = 353.0746 SI = 64K 
       data hash MD5: 64K
       5A E9 51 C5 C1 42 98 6E F9 F6 F4 DC 2E 6F 92 B4>)
$$ ##END=
$$ 
$$ hash MD5
$$ EF 61 FD 0A DA C9 D6 AC AA F1 6C 23 9E BD 8E 33
##$RELAX= 
##$RELAX= 
##$RELAX= 
##$RELAX= 
##$RELAX= 
##$RELAX= 
##$RELAX= 
##$RELAX= 
$$ Bruker specific parameters
$$ --------------------------
##$DU= <F:/spectra>
##$EXPNO= 1
##$NAME= <P31>
##$PROCNO= 1
##$TYPE= <nmr>
##$USER= <she>
##$AMP= (0..31)
100 100 100 100 100 100 100 100 100 100 100 100 100 100 100 100 100 100 
100 100 100 100 100 100 100 100 100 100 100 100 100 100 
##$AQSEQ= 0
##$AQ_mod= 1
##$AUNM= <au_zg>
##$AUTOPOS= <>
##$BF1= 81.014009
##$BF2= 200.13
##$BF3= 200.13
##$BF4= 200.13
##$BF5= 200.13
##$BF6= 200.13
##$BF7= 200.13
##$BF8= 200.13
##$BYTORDA= 1
##$CFDGTYP= 0
##$CFRGTYP= 5
##$CHEMSTR= <none>
##$CNST= (0..31)
1 1 145 1 1 1 1 1 1 1 1 1 1 1 1 1 1 1 1 1 1 1 1 1 1 1 1 1 1 1 1 1 
##$CPDPRG= <waltz16>
##$CPDPRG1= <>
##$CPDPRG2= <waltz16>
##$CPDPRG3= <>
##$CPDPRG4= <mlev>
##$CPDPRG5= <mlev>
##$CPDPRG6= <mlev>
##$CPDPRG7= <mlev>
##$CPDPRG8= <mlev>
##$CPDPRGB= <>
##$CPDPRGT= <>
##$D= (0..31)
0 1 0 0 0 0 0 0 0 0 0 0.03 2e-05 3e-06 0 0 0 0 0 0 0 0 0 0 0 0 0 0 0 0 
0 0 
##$DATE= 1629700079
##$DBL= (0..7)
120 120 120 11 120 120 24 19 
##$DBP= (0..7)
150 150 150 150 150 150 150 150 
##$DBP07= 0
##$DBPNAM0= <>
##$DBPNAM1= <>
##$DBPNAM2= <>
##$DBPNAM3= <>
##$DBPNAM4= <>
##$DBPNAM5= <>
##$DBPNAM6= <>
##$DBPNAM7= <>
##$DBPOAL= (0..7)
0.5 0.5 0.5 0.5 0.5 0.5 0.5 0.5 
##$DBPOFFS= (0..7)
0 0 0 0 0 0 0 0 
##$DE= 6
##$DECBNUC= <off>
##$DECIM= 3
##$DECNUC= <off>
##$DECSTAT= 4
##$DIGMOD= 1
##$DIGTYP= 9
##$DL= (0..7)
0 0 52 120 120 21 21 25 
##$DP= (0..7)
$$ [...]
##$SUBNAM2= <"">
##$SUBNAM3= <"">
##$SUBNAM4= <"">
##$SUBNAM5= <"">
##$SUBNAM6= <"">
##$SUBNAM7= <"">
##$SUBNAM8= <"">
##$SUBNAM9= <"">
##$SW= 501.771253377433
##$SWIBOX= (0..15)
0 1 3 0 0 0 0 0 0 0 0 0 0 0 0 0 
##$SW_h= 40650.406504065
##$TD= 32768
##$TD0= 1
##$TE= 0
##$TE2= 300
##$TE3= 300
##$TEG= 300
##$TL= (0..7)
0 120 53 12 22 120 120 120 
##$TP= (0..7)
150 150 150 150 150 150 150 150 
##$TP07= 0
##$TPNAME0= <>
##$TPNAME1= <>
##$TPNAME2= <>
##$TPNAME3= <>
##$TPNAME4= <>
##$TPNAME5= <>
##$TPNAME6= <>
##$TPNAME7= <>
##$TPOAL= (0..7)
0.5 0.5 0.5 0.5 0.5 0.5 0.5 0.5 
##$TPOFFS= (0..7)
0 0 0 0 0 0 0 0 
##$TUNHIN= 0
##$TUNHOUT= 0
##$TUNXOUT= 0
##$USERA1= <user>
##$USERA2= <user>
##$USERA3= <user>
##$USERA4= <user>
##$USERA5= <user>
##$V9= 5
##$VALIST= <valist>
##$VCLIST= <CCCCCCCCCCCCCCC>
##$VD= 0
##$VDLIST= <DDDDDDDDDDDDDDD>
##$VPLIST= <PPPPPPPPPPPPPPP>
##$VTLIST= <TTTTTTTTTTTTTTT>
##$WBST= 1024
##$WBSW= 4
##$XGAIN= (0..3)
0 0 0 0 
##$XL= 0
##$YL= 0
##$YMAX_a= 1126
##$YMIN_a= -1154
##$ZGOPTNS= <>
##$ZL1= 120
##$ZL2= 120
##$ZL3= 120
##$ZL4= 120
##$ABSF1= 0
##$ABSF2= 0
##$ABSG= 0
##$ABSL= 0
##$ALPHA= 0
##$AQORDER= 0
##$ASSFAC= 0
##$ASSFACI= 0
##$ASSFACX= 0
##$ASSWID= 0
##$AUNMP= <proc_1d>
##$AZFE= 0.1
##$AZFW= 0.5
##$BCFW= 0
##$BC_mod= 2
##$BYTORDP= 0
##$COROFFS= 0
##$CY= -3
##$DATMOD= 1
##$DC= 0
##$DFILT= <>
##$DTYPP= 0
##$F1P= 0
##$F2P= 0
##$FCOR= 1
##$FTSIZE= 65536
##$FT_mod= 6
##$GAMMA= 0
##$GB= 0
##$INTBC= 1
##$INTSCL= 5.30512e-09
##$ISEN= 30
##$LB= 1
##$LEV0= 0
##$LPBIN= 0
##$MAXI= 10000
##$MC2= 0
##$MEAN= 0
##$ME_mod= 0
##$MI= 50
##$NCOEF= 0
##$NC_proc= -8
##$NLEV= 6
##$NOISF1= 182.463
##$NOISF2= 159.3651
##$NSP= 0
##$NTH_PI= 0
##$NZP= 0
##$OFFSET= 248.5645
##$PC= 4
##$PHC0= -7496.69
##$PHC1= 353.0746
##$PH_mod= 1
##$PKNL= yes
##$PPARMOD= 0
##$PSCAL= 0
##$PSIGN= 0
##$REVERSE= no
##$SF= 81.014009
##$SI= 65536
##$SIGF1= 159.3651
##$SIGF2= -187.1042
##$SINO= 113.3802
##$SIOLD= 16384
##$SREGLST= <1H.CDCl3>
##$SSB= 0
##$STSI= 65536
##$STSR= 0
##$SW_p= 40650.406504065
##$SYMM= 0
##$S_DEV= 0
##$TDeff= 32768
##$TDoff= 0
##$TI= <>
##$TILT= no
##$TM1= 0
##$TM2= 0
##$TOPLEV= 0
##$USERP1= <user>
##$USERP2= <user>
##$USERP3= <user>
##$USERP4= <user>
##$USERP5= <user>
##$WDW= 1
##$XDIM= 65536
##$YMAX_p= 384673041
##$YMIN_p= -112762857
$$ End of Bruker specific parameters
$$ ---------------------------------
##NTUPLES= NMR SPECTRUM
##VAR_NAME=  FREQUENCY,     SPECTRUM/REAL,   SPECTRUM/IMAG
##SYMBOL=    X,             R,               I
##VAR_TYPE=  INDEPENDENT,   DEPENDENT,       DEPENDENT
##VAR_FORM=  AFFN,          ASDF,            ASDF
##VAR_DIM=   65536,         65536,           65536
##UNITS=     HZ,            ARBITRARY UNITS, ARBITRARY UNITS
##FACTOR=    0.620285442955139, 1,           1
##FIRST=     20137.2065510759, 0,            0
##LAST=      -20513.1999529892, 0,           0
##MIN=       -20513.1999529892, -112762857,  0
##MAX=       20137.2065510759, 384673041,    0
$$ Real data points
##PAGE= N=1
##DATA TABLE= (X++(R..R)), XYDATA
$$ [...]
15120 -1160611 6410237 9713475 7801004 6061748 6257089 4354532 -817367 -3845463
15112 -3845463 -1189108 2393971 832141 -4049033 -5841138 -3276447 -973177 -1938279
15104 -1938279 -4539799 -6430574 -7123224 -6868667 -6461394 -7589851 -10315293 -11455759 -8792505
15095 -8792505 -5204484 -4756435 -6479070 -6565554 -5090611 -5262775 -7054128 -7272359 -5610380
15086 -5610380 -4856521 -5035153 -3369655 -656805 -1260451 -5213430 -6733420 -3171890 593520
15077 593520 111930 -1858346 -870495 1556958 959053 -2474837 -4304988 -2148444 2389698
15068 2389698 6694955 8672211 6661389 1125219 -4365803 -6441303 -5527622 -4267581
15060 -4267581 -3631567 -2724363 -1394735 -898291 -2278307 -5098761 -7250193 -6161902 -1961958
15051 -1961958 967911 -1382226 -6427179 -7342512 -2423597 2528043 2919665 1454248
15043 1454248 2492353 5108327 5915729 4886882 3858263 2618879 1072593 1941674
15035 1941674 6162723 8696752 4806983 -1971842 -4465376 -2475090 -1775574 -3726066
15027 -3726066 -3761580 -633096 973045 -620952 23044 6519299 13474298 13266901 6070416
15018 6070416 -1678795 -5939755 -7473679 -7464153 -5551265 -2200424 450546 920087 -159054
15009 -159054 -1166590 -1056834 49390 1165961 1603640 1827512 2325210 2095265 56478
15000 56478 -2327134 -2382033 -444498 195329 -1602066 -2974763 -1816044 -62914 136884
14991 136884 409676 2947770 5726373 5046713 1646156 -12242 1442996 2152947 -1171226
14982 -1171226 -6426537 -8885670 -6786037 -2409201 1080409 2127175 863091 -1436061
14974 -1436061 -2686262 -1142546 2678767 5582558 4496403 185110 -3055929 -2576089
14966 -2576089 -995689 -2514890 -6461246 -7813466 -4473183 -178235 1495966 2099934
14958 2099934 4180039 5823649 4043037 1070019 1370454 3413231 1113435 -5637788
14950 -5637788 -8741425 -3237946 5016562 7523980 4260827 1174503 320618 -848740
14942 -848740 -2398053 -1387917 1510392 1697030 -1525590 -2901592 456587 4223682
14934 4223682 3946433 2190344 3805319 7406363 7068763 1153100 -5444588 -7734744
14926 -7734744 -5533649 -1743565 1104341 2057962 1744666 1562430 1671121 629951 -1593435
14917 -1593435 -2151826 690833 4075795 4377561 2759362 2870475 4495936 4499694 3389294
14908 3389294 5120373 9636848 11410094 7426135 1492704 -1959830 -3524939 -5102564
14900 -5102564 -5133581 -1768857 2585166 4152351 2751507 276492 -3014023 -6760874
14892 -6760874 -7885062 -4451214 -110143 225632 -2360257 -2894496 -748961 -216991 -2976084
14883 -2976084 -5532174 -5142942 -3247686 -1414256 1450110 5511944 7685355 5904302
14875 5904302 2749310 1710147 1972978 80661 -4394182 -7725079 -6469016 -1220027
14867 -1220027 4115653 5807600 3319294 -396985 -1789411 -119233 2406549 3599117
14859 3599117 3162647 1615330 -905003 -3796903 -5164427 -3258078 1334922 5720792
14851 5720792 7265980 6116052 4889671 5530132 6948364 6833857 5249876 4275196 4015528
14842 4015528 2081453 -1695479 -3508982 -1199531 1537846 308551 -3222758 -4282050
14834 -4282050 -2645377 -1868615 -1971099 792419 6370311 9440504 7452949 4495398
14826 4495398 4279999 4333734 944108 -4186378 -6523372 -5113434 -2402545 198795 2787256
14817 2787256 4621531 4784681 4066574 3424245 2039079 -341426 -948238 2648205 7900772
14808 7900772 9627797 6627370 2833549 1951562 3698242 5554669 5906271 4967005 4076829
14799 4076829 4238336 4608594 3223385 -88773 -3146487 -4732293 -5987342 -6823981 -4253765
14790 -4253765 2434843 7862836 6606344 1124933 -1582532 -117647 431630 -2211487
14782 -2211487 -3795587 -1102933 2604625 3175438 2004014 2590250 3984654 2455250
14774 2455250 -2066811 -5725246 -6322261 -5298473 -4191013 -2745196 -1338534 -2117491
14766 -2117491 -5844679 -9373354 -8320471 -2041909 5135002 7905954 5047354 411297
14758 411297 -1290298 420994 1642998 -710964 -4790791 -6195603 -3842089 -1541529
14750 -1541529 -3161104 -7692152 -10504992 -8928160 -4947299 -2000776 -704686 701268
14742 701268 2557330 2961618 1372928 577179 3050740 6999854 8717738 8022201 8142499
14733 8142499 10205966 11511280 10549488 10074057 12394988 14463826 11609630 4809324
14725 4809324 -61258 -278057 516041 -1666259 -5606690 -7699746 -7518581 -7382792 -7900738
14716 -7900738 -7369657 -5398482 -4091672 -4912088 -6674394 -7720619 -8262648 -9205443 -9998829
14707 -9998829 -9283390 -7000608 -4420350 -2407741 -970354 -387098 -1393588 -3813719
14699 -3813719 -5966316 -6100699 -4104403 -1575675 -578128 -2276758 -5937354 -8817947
14691 -8817947 -7880539 -2693342 3423842 6017125 3608226 -1178800 -4588650 -5066061
14683 -5066061 -3335314 -351540 3326485 6387350 6882168 4516391 1785096 1580657
14675 1580657 4028795 6452830 5882010 944564 -7379935 -15202381 -17131317 -11144237
14667 -11144237 -2189536 1873633 -1146793 -5691151 -6024742 -3063825 -1450968 -2331945
14659 -2331945 -2567195 -284559 2232597 1827487 -1537656 -4822127 -4722091 -291414 6101216
14650 6101216 10403358 10338581 6965716 2351492 -2794301 -7740381 -9919790 -7446517
14642 -7446517 -2686769 -243556 -1365828 -3062398 -2806794 -1215485 333429 1714410
14634 1714410 2747113 2623083 1864627 2447987 4697945 6240092 5242717 2620258 67901
14625 67901 -1671462 -1642160 1090446 4318476 3154501 -3508150 -9706770 -9106530 -3135096
14616 -3135096 1266037 757157 -1550230 -2015396 -1088533 -902402 -1453398 -1157620 486892
14607 486892 2527008 4110834 5233099 6121691 6578730 6256672 5667191 6368122 9035204
14598 9035204 11431746 10102112 4878773 -85423 -1106419 848745 2342920 2058650
14590 2058650 1010188 -242994 -1709266 -2250170 -951532 112127 -2119882 -6487118
14582 -6487118 -7824534 -3813410 1309290 2100636 -1127611 -3358767 -1758632 1317306
14574 1317306 2268145 780927 -667868 -403298 840400 1497478 1052303 29143 -1062152
14565 -1062152 -2153819 -3328956 -4537990 -5363373 -4917550 -2686506 124883 1208321
14557 1208321 132438 -531687 1124390 2606121 -251061 -6872807 -11469522 -10182054
14549 -10182054 -5987954 -4448201 -6469047 -7718079 -4432016 2196497 7341302 7268019
14541 7268019 3076252 82175 2472177 8234584 10924804 7062531 -61098 -4892322
14533 -4892322 -5844810 -5363180 -5446967 -5359403 -3423904 279991 3261406 2977759 522208
14524 522208 560868 5226828 9579264 7348976 514148 -2577232 618455 3357138 1023432
14515 1023432 -1237164 2427122 8267496 8976363 5415638 4043222 5549049 4814713
14507 4814713 1042857 -718076 1405763 3391026 2854606 2261461 3026354 3031229 1902872
14498 1902872 2500264 5065094 5865181 3717558 1840661 1200994 -1336504 -5567506 -5857688
14489 -5857688 -524055 3546663 883288 -3945703 -3574138 1416062 5250246 6071074
14481 6071074 5688087 3843568 -351711 -3837431 -3139157 -553356 -529558 -1796327 303336
14472 303336 5106386 7267025 5518144 3896305 4083224 3263293 431556 -1638529 -2116428
14463 -2116428 -3643329 -6314245 -6121029 -1865420 2008081 2506093 2759118 5973861 9453810
14454 9453810 8998695 5537607 2899038 1917655 1165854 1020708 2327220 2857268 -36331
14445 -36331 -4177056 -4701299 -1328017 931429 -953502 -3921468 -3420069 818100 5243842
14436 5243842 6701284 4817327 1765467 704985 3117790 6920427 8456603 6744630
14428 6744630 4174024 2718889 1710409 302595 -267450 1286570 3819295 5339108
14420 5339108 5657061 5486888 4470892 2543030 1758171 3665464 6013340 5793078 4797953
14411 4797953 7436356 12691020 13741394 7705897 495231 -1612021 -471667 -1312642
14403 -1312642 -3680108 -3644118 -2334898 -4584142 -9657570 -11192679 -7614676 -5083491
14395 -5083491 -7309235 -9582569 -7347000 -4346281 -6074342 -9813987 -8517023 -2178091
14387 -2178091 2013325 516165 -2066752 -381510 5059196 10355871 13113657 12818242
14379 12818242 9569613 4678125 556199 -1477467 -1849024 -788351 2038886 5354549
14371 5354549 6336729 4270117 2126751 3000450 6441542 9569595 10419580 8949740 6057099
14362 6057099 3081541 1494203 1744542 2712152 3085369 2959699 3524985 5480642 8151402
14353 8151402 9989753 9849905 7908323 5186287 2238170 -865642 -3133416 -2831024
14345 -2831024 -40866 2636642 3485165 4005481 5697527 6468703 3563530 -1288377 -3759729
14336 -3759729 -3395125 -3541569 -4575183 -2655244 2825454 5991634 2584260 -2913444
14328 -2913444 -3289891 981772 2926793 -518974 -4937659 -5657679 -3418613 -1176014
14320 -1176014 470405 2096545 2836087 1862063 480900 98476 -314093 -2046274 -3311376
14311 -3311376 -1346025 2621409 3999742 1143899 -2130534 -2009536 -18583 -308483
14303 -308483 -3297239 -5175334 -3285302 1025422 5192329 8127114 9172495 7301328
14295 7301328 3317417 504135 539485 582578 -2546161 -6643189 -6371087 -942507 4517504
14286 4517504 6163507 5916633 6586166 6234551 1392013 -5947556 -9036074 -4490033 3510811
14277 3510811 8228957 7305737 3454359 125627 -1506220 -1820701 -984606 1057139 3178029
14268 3178029 2827903 -1491525 -7276262 -9047480 -3895897 4514397 9183049 7109306
14260 7109306 1843306 -1572986 -2306494 -3124148 -5526117 -7600514 -6736959 -2913103 1423509
14251 1423509 4052816 4903390 5414041 6380953 6758429 4880165 798413 -3206556 -4884508
14242 -4884508 -4408928 -3976078 -5190147 -7334643 -8168723 -6090258 -1698850 2376273 3444110
14233 3444110 1151571 -2051122 -3180227 -1340770 2082275 5160718 6542994 5456008
14225 5456008 2129765 -1427689 -2292845 775975 5809455 9065314 8003747 3168586
14217 3168586 -2330168 -5391200 -5551717 -4834432 -4698936 -4254695 -2515746 -827638 -724447
14208 -724447 -589362 2080247 5337795 4000934 -2499077 -7640799 -5857957 255871
14200 255871 4024098 3230150 842995 -677735 -1521870 -1932038 -1388421 -199576 949514
14191 949514 2273969 3141725 931692 -4724338 -8654446 -6030593 -55816 1930933
14183 1930933 -930504 -2939565 -2172714 -3003227 -6649495 -7568156 -3156945 656236 -962390
14174 -962390 -3366423 -592708 3859017 2853027 -1739905 -1667564 3997727 7129732 3190685
14165 3190685 -2737946 -4658858 -3185365 -1340783 947956 4134213 5548806 3068517
14157 3068517 -686733 -1709208 -161071 657053 -620872 -2292964 -2658102 -1853658 -897736
14148 -897736 -331587 259932 1624385 3072358 1992345 -2767963 -7419171 -6416886 39821
14139 39821 5133804 3907316 -563666 -2169908 -154198 1267541 -8160 -1724305
14131 -1724305 -2170282 -3152516 -6292271 -9284350 -8538105 -4219627 -27792 1746060 2358714
14122 2358714 3191356 2797279 -451819 -4332759 -4467751 -47487 4915301 6721941 5816215
14113 5816215 4489548 3522600 2858588 3116135 4224151 4708339 4456110 5550337 7696601
14104 7696601 6171644 -1318160 -8607101 -7860314 -985165 2506303 -761421 -3603693
14096 -3603693 205166 6728668 8377738 4468332 162938 -1645937 -2127200 -2293433
14088 -2293433 -2007795 -2271041 -4212038 -6217325 -5752908 -3705642 -3358273 -5177289 -6226789
14079 -6226789 -5089826 -3779110 -3809472 -3796035 -2636889 -2086277 -3779457 -6025932 -6508104
14070 -6508104 -6602340 -9411767 -13810952 -14415991 -9029250 -2891628 -2566324 -7444963 -10886710
14061 -10886710 -9142905 -5181011 -2926838 -1790176 586430 3240364 3268411 958046
14053 958046 -16265 2508254 6667513 9109365 8105251 4198485 -438552 -3296695
14045 -3296695 -3575267 -2678584 -1781692 -205885 2348425 3830205 2464886 -307060 -2193862
14036 -2193862 -3559536 -5372544 -5640749 -2140605 2716020 4576000 3888686 4758144 7391205
14027 7391205 7478649 3789014 550834 647941 1871298 2042449 2695128 5057001 6990365
14018 6990365 6537514 4287194 279179 -6316527 -12152587 -10533481 -1259064 6087161
14010 6087161 3707695 -4413320 -9331865 -9206011 -8323515 -8059863 -5957810 -1675858 2556871
14001 2556871 5992440 8504672 7783704 3075708 -619831 1365866 4974628 2378354
13993 2378354 -5738592 -10758842 -9189962 -6914413 -8411060 -9492700 -4766638 3540852
13985 3540852 8884073 8669179 5109367 681606 -3297897 -5159861 -3460578 849394
13977 849394 4436567 4106598 -390451 -5407512 -6224441 -2236231 1968185 2445729 747591
13968 747591 339986 937930 590860 899558 4450573 8465792 7441423 1872672 -2153190
13959 -2153190 -2377463 -2434802 -3481475 -1494694 4334140 8029317 5923226 2674798 3078507
13950 3078507 3949128 470592 -4463625 -4719685 -1357084 -724059 -3697005 -4577651 -968523
13941 -968523 2335887 1242944 -1550268 -1355900 1578030 3294105 2067787 109708
13933 109708 101540 2165445 4329112 4841203 3750048 2709043 3524822 6600383 10177574
13924 10177574 11156037 7896888 2852008 782026 2925383 4836229 2377997 -2263334
13916 -2263334 -4211681 -3567007 -4120987 -5355130 -2505407 4279502 7881623 4342333
13908 4342333 -1286745 -3239935 -3181759 -4906144 -6468496 -4277168 -908628 -1571152 -5468221
13899 -5468221 -7748817 -7900720 -8817611 -9067161 -4244793 3996874 8293639 6212411 3216261
13890 3216261 3225912 3573959 2160370 2332097 6133998 8830253 5831941 719100 418247
13881 418247 5134081 8709990 7525257 3952569 1410531 316893 -524130 -1541412
13873 -1541412 -2205641 -1721050 94901 1875289 1708285 -147644 -1343726 -1140705 -1342282
13864 -1342282 -1990991 254889 6232032 10177295 6491142 -1366556 -4433317 -293773
13856 -293773 4172700 3015079 -1491882 -4238956 -4850871 -5703992 -6027732 -3320762 768162
13847 768162 1268508 -2803655 -6220934 -4362374 870975 4246456 4041416 2805926 2370662
13838 2370662 1258579 -2366855 -7365192 -10448222 -9398575 -4836985 389511 3269472
13830 3269472 3175060 2761681 5112846 9586375 12156369 10672611 7711130 6593622 6666871
13821 6666871 5142967 2103203 350359 871693 1866581 2361531 3382542 4921593 5116180
13812 5116180 3584924 2399224 2370827 1644005 -320746 -960857 711075 1352991 -1150356
13803 -1150356 -2650009 1898177 10068717 14309306 11902391 7379827 4915437 3600590
13795 3600590 1561060 -89251 189171 1463110 2374137 3140409 3444023 1351895 -3235607
13786 -3235607 -6853284 -6895797 -5302806 -4996060 -5111750 -3260202 -527554 -82782 -1752790
13777 -1752790 -2154710 -233833 1183456 86298 -1896295 -2705698 -3011343 -4219031 -5324595
13768 -5324595 -4036680 -290431 3171976 3846166 2187727 1016697 2474888 5882081
13760 5882081 8864360 10194135 10380548 9426480 5962861 -136186 -5974874 -8463920
13752 -8463920 -7887603 -6691333 -5737630 -4103458 -1851750 -355066 -105877 -683387 -2574039
13743 -2574039 -6150372 -8884552 -6983099 -752285 4651226 5193621 2177757 -795234
13735 -795234 -2409735 -3377585 -3984557 -4193846 -4582229 -5105886 -4304131 -1690035 364468
13726 364468 -687285 -3771656 -5100329 -2628628 1772397 4350680 2830216 -1627454
13718 -1627454 -5040969 -4025741 598634 4361933 3727781 -851737 -6317647 -9396789
13710 -9396789 -7461943 -134639 8397383 11559991 7438603 1613920 419104 3221727
13702 3221727 4301540 882949 -4087948 -6595227 -5802165 -3385825 -985429 1063880
13694 1063880 3572546 6976345 9529878 8519361 4376254 1429185 2510649 4938540
13686 4938540 4590076 1984135 801557 1734507 1811498 -520930 -3299057 -4147563 -2448529
13677 -2448529 1438236 5999398 7819772 4494627 -1400170 -4493305 -3179537 -890731
13669 -890731 -553277 -1279753 -1306661 -683699 246362 1897200 3529230 3153337 840109
13660 840109 -514567 779323 2928438 3875038 4176097 4841242 4720430 2402899 -809020
13651 -809020 -1970232 153821 3972407 6563649 5852272 2558900 225099 1672551
13643 1672551 5235546 6389666 3265281 -1609211 -5102135 -6350925 -5536020 -2882760
13635 -2882760 41183 751304 -1086519 -3050644 -3123371 -1315166 1892834 5668838 7210786
13626 7210786 3900435 -1908836 -4218658 -1063485 2983085 3767358 2942300 3944847
13618 3944847 6491658 8160218 8166819 6494747 2366192 -3189810 -6120785 -4076463 39036
13609 39036 2124211 1809464 589224 -1552983 -4089298 -3972394 -154336 2845328 778574
13600 778574 -3369533 -3551594 132919 2219198 871928 -45154 1695926 3021321 1033502
13591 1033502 -2306863 -3459757 -2322860 -1521067 -2268615 -3004619 -1960545 -11631 -12385
13582 -12385 -2708548 -4719271 -3106336 -838577 -3161411 -8375322 -8392314 -794005 6322800
13573 6322800 5976910 2314958 2577884 4893227 2759726 -2199043 -2023104 4202090 8400364
13564 8400364 5745395 399297 -2552036 -3213414 -2785834 -404936 3124566 4330988
13556 4330988 2472172 907628 1220477 1120060 -276041 -627693 531797 623403 -407701
13547 -407701 534496 2968150 2277196 -1598099 -2148937 3327013 8315664 6702171 1459527
13538 1459527 -1363403 -1376474 -997044 484235 3658136 4677858 929014 -2900412 -1060267
13529 -1060267 4333283 7098839 6431842 5691468 4766303 1319657 -2230166 -917301 4026734
13520 4026734 5961736 2801445 -422734 90280 2055395 2215955 1237512 1503938 3648615
13511 3648615 6521215 7765251 4506939 -3126721 -9692629 -9740891 -5148498 -2737195
13503 -2737195 -4695994 -6333873 -4023640 -320145 633809 -1305933 -3393941 -3647454
13495 -3647454 -1753780 1167032 2706316 1491344 -219590 1015765 4685796 6880799
13487 6880799 6189984 5322631 6089474 6529377 4461834 783372 -2174764 -2999162 -1140271
13478 -1140271 2609307 4967484 2849142 -1752806 -2914096 1761101 7840609 9722348
13470 9722348 6826817 2642154 116802 -487310 -1124724 -4201819 -9349626 -12075952
13462 -12075952 -8557699 -1606042 1988118 381525 -1425658 475621 3878209 5178039
13454 5178039 4375979 2758667 -51574 -3571594 -4821287 -2615513 -174166 -182603 -579881
13445 -579881 1212686 3158135 1796884 -2050755 -4844035 -5392750 -4546629 -2062599 2109552
13436 2109552 5244403 4616994 1486577 -1139796 -2871943 -4566379 -4990075 -3058789
13428 -3058789 -1086029 -1140850 -614571 3026051 5374345 -11104 -10729835 -17057950
13420 -17057950 -14850875 -9539699 -5918673 -2010115 3508169 5578637 548532 -5756646
13412 -5756646 -4821075 2505122 7315832 4913481 -134667 -1566094 824141 2703640
13404 2703640 1512297 -745046 -284245 3480166 6015244 2199118 -6652190 -12731814
13396 -12731814 -10625970 -3906878 -22141 -663108 -1132500 1735874 5587011 7047281
13388 7047281 6159927 4608755 2589416 -296809 -3027494 -4226173 -4035123 -3161257 -1126444
13379 -1126444 2646233 6582948 7677244 4684084 -479897 -4695652 -6319638 -5965369
13371 -5965369 -5358657 -5644714 -6570366 -7276531 -7661674 -8162463 -7966922 -4770716 2286219
13362 2286219 10005636 13244173 10109988 3862582 -873557 -2553575 -2559019 -2084119 -1169644
13353 -1169644 -331398 -639847 -1342067 364681 5204631 8955101 6673369 -246583 -4358554
13344 -4358554 -924482 6130299 9369369 7029807 3722561 2896412 2943794 1831551 1344070
13335 1344070 3633632 6439418 5860411 2610596 1256436 3286440 5060018 3560753
13327 3560753 335556 -1958128 -3306310 -4261127 -3553951 -1135960 -714220 -4983926 -10291363
13318 -10291363 -10892930 -7508628 -6233341 -8702439 -9135293 -3366522 4105859 5762008
13310 5762008 676033 -5152764 -6341620 -3062748 360887 -357815 -5481939 -10086871
13302 -10086871 -8899277 -3480474 -1265312 -5311360 -9262501 -6508317 -169007 2109752
13294 2109752 225922 573947 3909764 3357794 -3273437 -7783348 -3370038 4292171
13286 4292171 4474182 -4054246 -12841997 -16017719 -15669801 -15131822 -13687145 -10245024 -7373254
13277 -7373254 -8171661 -11564185 -13566859 -12043799 -8165385 -3980360 -410204 2434155
13269 2434155 4292545 4743823 3959784 3018201 2860224 2883425 1594506 -747665 -1461904
13260 -1461904 1150458 4727919 5098646 1095657 -4850115 -10374509 -14740289 -16708090
13252 -16708090 -14321785 -8473309 -3799465 -3382328 -4515505 -2727643 1493032 3761611
13244 3761611 3006526 3068412 5932654 7916177 5743258 2797758 4467798 9137179 9686293
13235 9686293 4299412 -257946 1227048 4362385 2053726 -4178231 -6083229 -722781
13227 -722781 5764223 7343757 5232267 3391232 1911614 -1035947 -4056553 -4184600
13219 -4184600 -2227299 -1997923 -4368049 -5810855 -3465333 1323725 5483251 7873745
13211 7873745 9227919 10037189 9779784 7569442 3060193 -2658934 -7086661 -8261254
13203 -8261254 -6794639 -4980337 -3952497 -2984803 -1618030 -841861 -1464950 -2596647 -2817432
13194 -2817432 -2190209 -2070662 -2996423 -3496585 -1514144 2839677 6374929 5616541 813344
13185 813344 -3838156 -4669607 -2288023 -13409 171382 -1342005 -3558410 -5399545 -5010598
13176 -5010598 -1237317 3773423 5806855 3416708 -231140 -1291349 676802 3631024
13168 3631024 6228072 8272684 9155847 7980897 5119387 2163866 283980 -386480
13160 -386480 -50743 752758 592455 -1768458 -5157622 -6292747 -3432250 1163562 3705291
13151 3705291 3168703 1512607 -17832 -2440822 -6083597 -8397305 -6781693 -2289304
13143 -2289304 1640263 3201129 2747384 415481 -3603401 -6823403 -6218912 -2802572
13135 -2802572 -854190 -1627207 -1714258 848824 3349176 3901464 5452461 9982377 12785782
13126 12785782 8333208 -716876 -6575553 -6987972 -6476978 -7516650 -7401348 -4914538
13118 -4914538 -3371224 -4446410 -4708236 -1649501 1648890 1715412 547076 1990124 5222616
13109 5222616 6263590 4146446 1508941 41146 -1039770 -2286807 -2783517 -1955430
13101 -1955430 -782364 -827852 -2720512 -5290300 -6172700 -4371633 -1955646 -1281299 -1000124
13092 -1000124 1994754 6580749 7694795 4122056 1544970 4859854 11077794 13470185
13084 13470185 10073506 4503915 538843 -575958 773429 2779305 2907597 1111599
13076 1111599 631375 3117744 5374876 3923220 171487 -2424917 -3647012 -4936711
13068 -4936711 -5244462 -3218947 -1290275 -2358017 -4280641 -3323334 -1505425 -3900044
13060 -3900044 -9074723 -9387693 -2194578 5583911 6508056 1109105 -5149566 -8827213
13052 -8827213 -9618244 -8328103 -6742974 -6940877 -8633128 -9430723 -8760501 -8497746 -8816229
13043 -8816229 -7195780 -3099511 191631 476548 -149314 830635 2635235 3683178 4520067
13034 4520067 5647935 5484072 3274834 1341931 1711703 3076314 3697474 4530470 6529335
13025 6529335 7687639 6304384 4786993 6219742 8826285 7942052 2688302 -2959389
13017 -2959389 -5349285 -4212287 -901381 3225260 6389981 6987776 5266079 2904497
13009 2904497 942830 -550207 -1295547 -934841 41455 928629 1875630 3034815 3384638
13000 3384638 1834559 -1089414 -3833694 -5346493 -5156036 -3294752 -1365781 -2047552
12992 -2047552 -5761886 -9197926 -9022849 -5815611 -2433001 112572 2712554 5046141
12984 5046141 5136906 2258457 -1349209 -2053963 2047590 8579691 11425456 6258792 -3411667
12975 -3411667 -8596903 -5111379 1545312 4148308 2954816 2645277 3225397 406760
12967 406760 -5656920 -8718182 -5281103 188361 1700838 -584673 -2365340 -1854337
12959 -1854337 -609602 679236 3194183 6555887 7621599 4407304 -422833 -2123991
12951 -2123991 278344 2769162 1851435 -769416 -1251854 167017 -267997 -3177031 -4350009
12942 -4350009 -1254276 2915358 4340522 3907670 3894592 2892961 -1211764 -5752422 -6150209
12933 -6150209 -2897359 -443106 9700 1178287 3457451 3642308 600453 -2870300
12925 -2870300 -4775853 -5658196 -4831145 -418005 5259681 6083146 702966 -4403466 -3704321
12916 -3704321 251132 2157828 1953554 2942405 5435456 7170386 7778487 8469529 9057785
12907 9057785 8992877 9336109 10191694 8629836 3150105 -2299817 -3302572 -1642525 -1960515
12898 -1960515 -3937508 -3821745 -2302494 -3882113 -8215296 -9050610 -3544679 3546158
12890 3546158 7447965 9422363 11894922 12690117 8779008 2438505 -936686 608935
12882 608935 4687363 8551882 10887815 11113274 9769694 8520946 7748429 5853620 2729097
12873 2729097 1149425 2051000 1647083 -2752283 -6865181 -4580008 2786185 8164453
12865 8164453 8927962 9069030 10600143 9516973 3060146 -4676956 -8358444 -8355406 -7851816
12856 -7851816 -6599029 -2632092 1978411 2505688 -1566069 -5304253 -4416674 422257
12848 422257 5461059 7436329 5255305 579686 -3223198 -4539538 -5096374 -6126553
12840 -6126553 -5050858 260399 5807899 5645979 1383635 990532 6620210 10455101
12832 10455101 6366817 -591042 -2141128 706154 675644 -3016833 -3640041 1195637
12824 1195637 5144749 3428986 346117 1639072 4769582 3175452 -2727437 -5648087
12816 -5648087 -2112437 3067210 4332348 2208427 6706 -1981478 -4891113 -6523573
12808 -6523573 -3240609 3597965 7597107 5210478 336735 -1149645 1108716 2869567
12800 2869567 2073924 1033881 1829267 2924948 1781823 -1491107 -4901102 -7441909
12792 -7441909 -9257941 -9889685 -8453647 -5446416 -2637777 -913330 338122 1286195
12784 1286195 713274 -1721674 -3324404 -586643 5968417 10878918 9248753 2537510
12776 2537510 -2782930 -2287518 2322226 6302462 6832636 3971189 -877491 -5191629
12768 -5191629 -5748827 -1758021 3075942 4283142 1997974 -25537 -156898 -222015 -1054491
12759 -1054491 -690226 1725624 3791631 3505328 2017709 757440 -1054537 -3493538
12751 -3493538 -3644039 316881 5030934 5680599 2259402 -1398144 -3360772 -4461547
12743 -4461547 -4616852 -2921519 -1301121 -3305412 -8133011 -10064837 -5823269 891417
12735 891417 4511336 4383207 3636637 3374527 1434549 -3395223 -8553611 -9868701 -5686338
12726 -5686338 1195105 5356458 3319248 -2869923 -7298367 -6309424 -2189010 296545
12718 296545 -57901 -353992 1323480 3141611 3133339 3095181 5939612 10128478 10385096
12709 10385096 4802158 -2033410 -5049513 -5061664 -6152099 -8863125 -10008288 -8209171
12701 -8209171 -5235147 -1950579 2508657 6857757 7730269 5223618 3774376 5294406
12693 5294406 6126084 3794029 1850166 3669579 5945128 4019356 159413 -102025
12685 -102025 2405395 1771527 -2821117 -5503865 -3121728 469417 1383615 1002490 1626865
12676 1626865 2033359 713877 -550809 190261 1511943 1309041 366721 367076 728617
12667 728617 164101 -789630 -1413624 -2908685 -6193592 -9408863 -10215875 -8986115 -7244743
12658 -7244743 -4632392 -224607 4421544 6515231 5733448 4203054 3296993 2712368 2233299
12649 2233299 2071483 1657442 305249 -912295 -69716 2583081 4510458 4315467 3311486
12640 3311486 2789209 1750182 -796543 -2761327 -1068390 3228984 5069633 2161362
12632 2161362 -1094093 628416 5808561 8176825 5808820 3105644 2940687 2391582
12624 2391582 -1027047 -4126186 -3334103 -874559 -450562 -486324 2168724 4908622 3116600
12615 3116600 -689290 277342 5496594 7175406 2978705 -220452 1821082 3877547
12607 3877547 1007110 -2708296 -1621130 1500913 369241 -4205311 -6025901 -3236246
12599 -3236246 485733 2793531 4447868 5148354 3267386 -508066 -3807860 -6167861
12591 -6167861 -7863851 -6676949 -874167 5649126 6790586 2716771 -342585 945064
12583 945064 3488604 3961215 3208281 2783613 1877913 126819 -401674 1394055 3377250
12574 3377250 3614661 3204395 3420746 2992123 924365 -685702 83184 1153836 -218305
12565 -218305 -1816655 1113352 7748294 10856294 6082858 -1877189 -5639415 -4611310
12557 -4611310 -3581362 -3730602 -1292098 4074264 6243587 1790543 -3179177 -1202069
12549 -1202069 5227743 7647520 4873109 3892507 7320454 8949798 4855741 634243
12541 634243 2092150 5373389 3440952 -2172096 -3905150 -105672 3165372 1764201
12533 1764201 -1797501 -3915036 -4481428 -4447018 -3378534 -1358152 -46767 -255812 -843791
12524 -843791 -955134 -1152172 -1679687 -1676928 -727823 400281 811069 118635 -1442430 -2373661
12514 -2373661 -711546 2819407 4228566 1290931 -2627356 -2884233 -139736 1111252
12506 1111252 -400406 -1238195 1148887 4997516 6910896 5156843 122107 -5873734
12498 -5873734 -9208718 -7963331 -4272066 -1528413 17085 2315829 5211106 6297574
12490 6297574 4590499 1379462 -1886033 -3611370 -1244692 5567025 11628807 10272209
12482 10272209 1144072 -9337784 -15114818 -14909878 -10509444 -4879586 -1750741 -2935145
12474 -2935145 -5915311 -7350414 -7715033 -8280601 -5777193 3199525 13334650 14286230
12466 14286230 4737960 -4909286 -6652433 -4291913 -4648006 -6447679 -4222589 1531926
12458 1531926 4958532 3369182 -390720 -2943567 -3428836 -2401950 -1087264 -1059041 -2353724
12449 -2353724 -3062960 -2419328 -2144131 -2951987 -2575135 230545 2588677 1519128 -1398468
12440 -1398468 -2665040 -2064414 -1872460 -2668816 -3363823 -4023215 -5364618 -6461192 -5965954
12431 -5965954 -4754707 -4553415 -4747333 -3311564 -369873 1757602 1883466 1246310 1479959
12422 1479959 2706635 3542426 2325566 -1001611 -4049344 -4498515 -3543460 -4415159 -7005957
12413 -7005957 -7151563 -2684599 2960014 5250361 3930037 1846570 1177074 2897968
12405 2897968 6934308 10301027 8245686 375151 -7115865 -8562848 -5541287 -3197824
12397 -3197824 -2842212 -2322205 -1296895 -1315517 -1901161 -952314 1484898 3270274 3217960
12388 3217960 1299769 -2544012 -6655531 -6857008 -1342776 5412548 7736016 5999004
12380 5999004 4526483 4361946 3292311 1380917 564383 -279547 -3616063 -7133197 -6210773
12371 -6210773 -2767334 -3945445 -10089444 -12000206 -4285098 5532876 7113167 1300310
12363 1300310 -2747722 -1053553 1928948 2412592 2345220 3911516 4726286 1818946 -2915082
12354 -2915082 -4871588 -3031968 -907607 -1132564 -1865338 -34122 3689793 5738067
12346 5738067 4990147 4240507 5397350 6246056 4344224 1699767 2054975 4751380 5217564
12337 5217564 1560107 -2923585 -4471342 -2883842 175606 3831232 7279364 8854416
12329 8854416 7811526 5629610 4140659 3512439 2896919 1679165 -539013 -3564655
12321 -3564655 -5708397 -5219573 -3189410 -2628369 -3790815 -3333182 180929 3008665 1386433
12312 1386433 -2407865 -3024960 17916 1648297 -979969 -3923352 -1858708 4416941
12304 4416941 8867448 7868290 4189605 2699784 4318673 6072255 5987313 5301856 5398408
12295 5398408 5007519 2288960 -1692703 -3834169 -2985927 -1105835 -318761 -585092 -783439
12286 -783439 -669654 -937647 -2072631 -3663835 -4559013 -3899465 -2520598 -2630472 -4971065
12277 -4971065 -7018911 -5754729 -1929524 458472 -796637 -3563426 -4590274 -3526646
12269 -3526646 -2561701 -3236749 -4939542 -6111248 -5981399 -5113824 -4650734 -5126945 -6052238
12260 -6052238 -6435265 -5173250 -1332683 4338517 8052759 5759272 -1211986 -5925935
12252 -5925935 -3870296 1154904 2628243 518806 3139 2285692 2958412 251399
12244 251399 -1524099 416801 1903519 -1620464 -7248305 -8547792 -4884060 -1595807
12236 -1595807 -1966783 -3841257 -4210026 -3005611 -1555267 -438941 56731 -500697 -1979996
12227 -1979996 -4024231 -6952898 -10578732 -12617551 -10638558 -5608613 -1293659 18111
12219 18111 -733385 -1677680 -1750663 -324553 2094222 2539596 -1911469 -9280800 -13336898
12210 -13336898 -10862013 -5809852 -4127046 -6437761 -8211027 -5710312 578344 7290775
12202 7290775 10561572 7988136 905834 -5504540 -6746735 -3762682 -1271582 -1694053
12194 -1694053 -3185531 -3596976 -3131708 -2074084 695602 4538895 5289874 366067 -5808958
12185 -5808958 -5791322 1254293 7889173 7745839 2957948 -236178 -224477 -359092 -2100556
12176 -2100556 -2689608 -479819 1558212 86132 -3573510 -5576191 -5068035 -4443205 -4872944
12167 -4872944 -4814883 -3159298 -898990 1107942 3289230 5056759 4145509 331539 -2582339
12158 -2582339 -1336406 1895306 2366463 -626658 -3591732 -4737933 -5813562 -7499957
12150 -7499957 -7390177 -4522814 -2106581 -2861337 -4662075 -4074402 -1747288 -651102 -889754
12141 -889754 -238474 1485532 2680018 3640249 5695546 7287033 5643016 2335714 2025296
12132 2025296 4940162 6119576 3851290 3022087 6833408 10638729 8757954 3098375
12124 3098375 -519753 -1302298 -2596493 -4328403 -3118306 689048 2776834 2322243
12116 2322243 3469794 7608692 9982241 6904247 1495738 -1326256 -1567689 -1855147
12108 -1855147 -1750070 844543 4549738 5689000 4051154 3160891 4573302 5716417
12100 5716417 4229961 1103146 -1771682 -4199369 -6108200 -6008466 -3473313 -1357826
12092 -1357826 -2704260 -6236284 -7699560 -5626617 -3114654 -3188370 -4804481 -4957473 -3000614
12083 -3000614 -905277 -155621 -340835 -476040 31503 1608892 3991604 5406985 4106990
12074 4106990 1112183 -489481 158250 59674 -3288086 -7484665 -7697446 -3225044 1036380
12065 1036380 761710 -2057194 -1690999 3435476 7917286 5820774 -1666704 -7584774
12057 -7584774 -7822350 -5208225 -3912299 -3264518 -358809 3547150 3874196 -280638 -4332754
12048 -4332754 -4438642 -1906301 219203 1788554 4465798 8143214 10652509 10037887
12040 10037887 6222230 1743229 669356 4077684 6744182 2477359 -6495753 -10699781
12032 -10699781 -6213489 -523838 -1395088 -5523081 -4809172 274339 1965574 -1789995
12024 -1789995 -4409561 -1728597 1966860 1951111 616372 2622051 6869632 8080295
12016 8080295 4248431 -1214389 -3831044 -2162776 1724687 4477616 4781307 4701621 6330814
12007 6330814 7716912 5173909 -309150 -3062023 -638586 2260778 484138 -4244870
11999 -4244870 -6236564 -3885987 -1005867 -1070379 -3524094 -5719681 -5827164 -3536515 22276
11990 22276 2519647 2054958 -829602 -3483268 -3793103 -2221508 -1299674 -3105542 -6723530
11981 -6723530 -8339009 -4975734 1646716 6292852 5797086 2263350 110764 1299961
11973 1299961 4354653 6701879 6622820 3924455 348933 -1063946 1364912 5558939
11965 5558939 6977424 3080636 -3732389 -8353258 -8396010 -6678090 -7365871 -10329114 -11321715
11956 -11321715 -7959896 -2948961 -4508 964634 2330692 4493432 6068940 6815089
11948 6815089 7223617 6392290 3649908 1218631 1485366 2486962 425315 -3793104 -5444186
11939 -5444186 -3621061 -2613025 -4532433 -6169671 -5365687 -4873256 -6481248 -6618404 -2529965
11930 -2529965 1557337 121687 -4907377 -7131059 -5371388 -3988900 -4418526 -3261402
11922 -3261402 211745 1260433 -2510838 -5610543 -1443564 8173135 14843811 13923196
11914 13923196 8950969 5577911 4823572 4202398 2910506 2663468 3818305 3788776 759455
11905 759455 -2978180 -3670755 -1385495 -219822 -2741880 -6206029 -5761709 -594875 4688683
11896 4688683 5167377 1235541 -1964095 -968787 1570343 644134 -3782172 -6375406 -4103749
11887 -4103749 -696954 -939469 -3498468 -3220695 1127529 5437859 5923312 2701680 -1798256
11878 -1798256 -4759459 -3955113 -177490 2075144 -130924 -3403272 -2839922 -219288
11870 -219288 -1603686 -7181619 -10231402 -7378464 -3163368 -1961120 -1743226 561096
11862 561096 3181505 3360566 2509856 3092304 4127301 3820090 3035017 2406077 33537
11853 33537 -3825756 -4173855 1494321 7350064 6534489 1072668 -1872815 -1081626 -1580738
11844 -1580738 -5177653 -7866591 -6969463 -4549654 -2638180 -545495 1581605 1400142
11836 1400142 -1409058 -3491190 -2581714 -934775 -1899152 -5218318 -7617244 -6838371 -3826750
11827 -3826750 -1437792 -1380498 -2318897 -1659013 653692 1878351 694955 -794958 -688183
11818 -688183 -73818 -173929 151569 1211504 127731 -4424809 -8089478 -6298853 -1779227
11809 -1779227 -1218333 -5429429 -8195330 -5077734 1251554 5251887 4500523 738515
11801 738515 -2351545 -2141913 221789 821001 -1643087 -3591996 -2151044 71737 -395216
11792 -395216 -1598561 412068 4354616 5757908 4490697 4034718 4338515 1911837 -3207513
11783 -3207513 -6846852 -7147417 -5671488 -2343255 3991571 9776866 9059160 3098527
11775 3098527 288679 3962029 7305741 3936352 -2859627 -5930807 -4203920 -2002731
11767 -2002731 -1966112 -2992083 -3119349 -1493138 982328 1786035 -231055 -2160855 -880192
11758 -880192 1195330 -582902 -4604459 -4682843 -697869 458868 -3454906 -5902392 -2590173
11749 -2590173 1744740 2247522 1486611 2397744 1831273 -1749709 -1901902 5655626 13071766
11740 13071766 10487662 1091792 -4379450 -4144971 -5014935 -8077609 -7083690 -1175096
11732 -1175096 2568735 1288621 357153 2313441 2135354 -2027723 -3160158 3241771
11724 3241771 10236330 9519180 4216078 3155592 6561589 6502043 67538 -6422175 -7219174
11715 -7219174 -4090734 -1170500 1419123 5093817 7762400 5858148 207895 -4027333
11707 -4027333 -3677926 -1048555 -132425 -1694225 -3763846 -4999420 -4924608 -2156194 3929009
11698 3929009 9746963 9802765 3939770 -1442549 -1830304 -582503 -2771123 -6274588 -4549635
11689 -4549635 2902102 8762767 7542561 2021395 -2003310 -3286309 -4333688 -5748753
11681 -5748753 -5129788 -1144248 3859108 5929084 3445816 -1092666 -3181870 -790007
11673 -790007 3358233 4929348 3225388 1720676 3056522 5341000 4721897 504185
11665 504185 -4062385 -6111489 -6741287 -9011387 -12777156 -13595990 -8392070 -814983 2151943
11656 2151943 -973289 -4376258 -3558387 -1903364 -5092547 -11751189 -14662095 -10638034
11648 -10638034 -4415617 -1931024 -3612463 -5742754 -5316644 -1856969 3079454 6421039
11640 6421039 5491601 1015790 -3084128 -3837196 -1756249 1188914 3860240 5189994
11632 5189994 3611278 -745075 -4884788 -5982637 -4612803 -3427160 -3676937 -4654559
11624 -4654559 -5607261 -6261439 -5796971 -3159372 1120852 4421678 4074092 46051 -4465253
11615 -4465253 -5658628 -2958313 324160 1059965 98392 237978 1367051 663520 -2278185
11606 -2278185 -4115920 -2960921 -1570472 -2962971 -5634509 -6207124 -4747825 -4004837
11598 -4004837 -4760482 -5574012 -6316389 -8112259 -9827052 -8440706 -3738517 617003 1803304
11589 1803304 824081 -246137 -1064161 -1657601 -1203111 -139028 -837500 -3742884 -5199732
11580 -5199732 -2117070 2938375 4622074 1825951 -1460712 -1954470 -541263 419808
11572 419808 435558 512685 1334500 2692120 3629819 3063358 1390543 893264 2817204
11563 2817204 4913227 4368573 2388830 2424519 3990617 2548296 -3193591 -8125785 -7572051
11554 -7572051 -3923075 -2976726 -5827309 -8024804 -5820957 -181781 5049233 6658750
11546 6658750 4042745 -461069 -3394223 -3335585 -1542837 819955 3913862 6801382
11538 6801382 6896219 3993895 1899878 3156333 4867054 3174565 -603069 -2158785
11530 -2158785 -355877 2746034 5764112 7586776 5634062 -278497 -4717282 -3277670
11522 -3277670 -150643 -1828881 -5276734 -1663638 8253619 13034715 7391420 -234403
11514 -234403 -1646752 -577838 -3414141 -6989025 -4970383 -220552 -501992 -5424194
11506 -5424194 -7596385 -4954670 -2504317 -2329744 -974649 2319243 3102739 -412038
11498 -412038 -4028834 -4690134 -4773548 -6391871 -6879740 -3400043 2193021 6241690 7524212
11489 7524212 6075247 1505409 -4562733 -7758765 -6019920 -2861897 -2508365 -4000132
11481 -4000132 -3409511 -210443 2071932 1033965 -1680470 -2917562 -1637805 528473
11473 528473 1536571 1298220 1485632 2665842 2721128 -227776 -4184831 -5196922 -2805212
11464 -2805212 -598513 -801158 -1554580 -929690 -383110 -1740292 -3141874 -1092394 4450996
11455 4450996 9576505 10710623 7736853 3227846 41039 -489420 903786 2420846
11447 2420846 2769488 1495401 -1432120 -4802805 -5515131 -1307345 5479856 9440915
11439 9440915 8242929 4748073 2161943 150287 -2506103 -4504385 -4006015 -1811916
11431 -1811916 151729 1634902 2791861 2258407 -350582 -1919159 503565 4789234
11423 4789234 6237798 4031294 1248686 -793700 -3661082 -7154180 -8243483 -5850925
11415 -5850925 -2695054 -936984 351268 1977055 2757485 2630382 3621896 5406767 4093662
11406 4093662 -1358963 -5541360 -3609212 1483432 3624360 2591433 2816918 5065966
11398 5065966 5733918 3875915 2473016 2073602 -500053 -5348647 -7286707 -3166880
11390 -3166880 3552893 8345294 10837180 11457541 8294884 1882343 -1703820 1600475
11382 1600475 6734744 6297609 1816333 1243654 6509328 10892049 9128545 3321539
11374 3321539 -2551421 -7564331 -10930904 -10096795 -5279250 -1323279 -1313786 -2097613 104857
11365 104857 3123091 2366246 -1450773 -2945142 340083 5074458 7040394 5739955
11357 5739955 3454597 1932630 970658 -655595 -3269631 -5170251 -4030708 266128
11349 266128 5078570 7548911 6622923 2744979 -2362733 -5348551 -3416302 1834024
11341 1834024 5144213 3789082 846911 543488 2615431 3678516 2409382 586372
11333 586372 -225088 -652574 -2184668 -5023753 -7133192 -5520305 151375 5556822 5947575
11324 5947575 2525750 1054606 3346197 4632225 1509370 -2381460 -2403385 -369115
11316 -369115 -891940 -3456917 -3808778 -1251665 1224904 2955090 5864674 9056052 8994717
11307 8994717 5740838 3463565 3376419 1417885 -4707442 -10700714 -10997371 -5760626 355867
11298 355867 4001018 4997644 4456689 3885226 5070116 8341666 11293667 11059466 7859124
11289 7859124 4969344 4834198 6033590 5009931 937982 -2368029 -989878 3499020
11281 3499020 5898058 4850420 4209368 5380065 3627622 -3651493 -9765476 -6807954
11273 -6807954 1677497 4231290 -2499320 -9359992 -8023793 -1053027 4704163 7711276
11265 7711276 9627679 9229005 4887926 -129024 -950869 1984278 4237378 3883794 1852346
11256 1852346 -2422713 -9765001 -16257141 -15834178 -9078019 -3752629 -4303001 -5983915
11248 -5983915 -2922753 2416104 2891461 -2660546 -7954375 -8070900 -4897056 -2865760
11240 -2865760 -3323420 -4825862 -5770929 -4707379 -824840 3606629 3967252 -793125 -5486159
11231 -5486159 -5282675 -2573448 -2937793 -6248000 -7358981 -4925609 -3166911 -3863120 -2954885
11222 -2954885 2223575 7821770 9144264 6985298 4695288 3066805 1941314 2822407
11214 2822407 5559537 6171487 2556380 -1244878 -1291780 -323436 -2396386 -4833931 -2573595
11205 -2573595 2383596 3699026 1081954 -110128 1311830 1339032 -479766 104749 3312257
11196 3312257 3964844 941712 -217875 2972665 5637828 4537501 3408323 4647649
11188 4647649 3441836 -3538933 -10226815 -9345161 -3564503 -817668 -2083083 -1710663
11180 -1710663 2136907 5064516 4129565 1401583 -797575 -2960763 -5672512 -7857713
11172 -7857713 -8783501 -8942578 -8506679 -7179896 -5377345 -3469824 -673751 3045592 5119192
11163 5119192 3102284 -1630687 -5440543 -6712401 -6174784 -4271367 -1208104 1283308
11155 1283308 1342278 -115902 -364119 1573271 4273367 6031834 5748219 3062468 -72600
11146 -72600 450821 6104358 12162511 12183333 5606984 -1888470 -5019730 -3149077 1192066
11137 1192066 4600714 3868383 -1707497 -8388371 -11021284 -8607564 -4817413 -3075264
11129 -3075264 -3599304 -5138320 -6611355 -6604401 -4249928 -1478023 -1587152 -4488757 -6208776
11120 -6208776 -4647193 -2917618 -4441145 -7076219 -5725113 48047 4773725 4267775
11112 4267775 990475 190432 2724181 4645389 3412597 1334384 1680658 3762476
11104 3762476 4062620 1126917 -2799980 -4588076 -2947660 1194537 5184427 5781810
11096 5781810 1882499 -3570054 -5971370 -3732849 460852 2897381 2236355 144456
11088 144456 -295555 2443006 5945471 6049522 2763615 1245974 4276363 7169062 4656241
11079 4656241 -384677 -1437311 750268 -120697 -3951841 -3461660 2877208 6786449
11071 6786449 3199468 -1761336 -1795874 -924526 -4870537 -9098412 -5691366 2366089 4859251
11062 4859251 503604 -1421713 3795257 9591712 9367014 5949398 5344115 7196460
11054 7196460 6631209 2031633 -3346773 -5742459 -4177969 -771054 749579 -1662131
11046 -1662131 -5830701 -7814832 -6849330 -5335139 -4130337 -1452328 2755414 5063862
11038 5063862 3079140 -909346 -2747814 -1133591 1843505 3363219 2146151 -640553
11030 -640553 -2458276 -2676208 -3940920 -7767172 -9941861 -4793883 5603952 11643460
11022 11643460 7826199 -320428 -4250586 -3263392 -2781452 -4792896 -5868005 -3834065
11014 -3834065 -709501 1765678 4438019 6848896 5797189 806942 -2962598 -1370193
11006 -1370193 2138144 1497353 -2537793 -3803538 -790615 1507657 914309 1997036
10998 1997036 7237210 11009644 7992473 2174185 468553 1506815 -870834 -5511493
10990 -5511493 -4867541 2080305 7186191 5346646 946117 -728605 -589723 -605967 767968
10981 767968 3237935 1768339 -5282487 -11271388 -10578618 -7065954 -6586944 -6656378 -1764103
10972 -1764103 5243582 6261691 378252 -5334903 -6689784 -6213826 -6295826 -6010336 -5518554
10963 -5518554 -6918684 -9463677 -9684437 -7306794 -5648402 -5381063 -3613506 -315154
10955 -315154 320767 -2895522 -4961383 -1771922 3761993 5860063 3168160 -832566
10947 -832566 -2576636 -1431994 586224 910074 -656222 -1204829 1329266 4391257 3952851
10938 3952851 772277 -361338 2143546 4266066 2421832 -1509794 -3004661 -399840
10930 -399840 3894047 6091043 4183539 -273431 -3491918 -3807047 -3747910 -5937322 -8673594
10921 -8673594 -8738515 -7055711 -7240683 -9088061 -8357546 -3819104 48058 -646428 -3709535
10912 -3709535 -4172922 -937472 2208173 1261621 -3804829 -9215596 -11124070 -9201218
10904 -9201218 -6364411 -5157756 -5482175 -5783142 -4658872 -1372290 2633914 2959460 -3003636
10895 -3003636 -10215193 -10282037 -3129297 1951103 -290739 -3917927 -2766744 -679312
10887 -679312 -3414691 -7403080 -6245603 -3165682 -5939047 -12594181 -13725304 -7916903
10879 -7916903 -3603154 -5161851 -7743561 -7321825 -5953954 -4978085 -2274293 1188170
10871 1188170 750079 -3303691 -4628944 -925770 2703027 2884584 2478377 3466981 3431098
10862 3431098 1820470 1776141 3133322 1756335 -1856223 -2190996 726916 414950 -3432349
10853 -3432349 -2668328 4317993 7244430 360253 -7198722 -5974406 -506492 753818
10845 753818 52589 3388804 7192785 4624138 -787354 -463980 4499828 6096570 3643606
10836 3643606 3297483 5573266 5202028 2454837 3211520 7524147 8578850 4017172 -982913
10827 -982913 -2733416 -2414309 -70314 5528086 10087061 6390780 -4108334 -11082338
10819 -11082338 -9373432 -4960323 -3944383 -4006993 -1175736 2384144 2809041 1215268
10811 1215268 804492 1622476 2608655 4862615 8551894 10106078 6929478 2292935 1436914
10802 1436914 4576555 7159533 5789658 1346102 -2617056 -2843111 792226 4272586
10794 4272586 3326562 -757829 -2117855 1480583 4980961 3195848 -1672649 -3511393
10786 -3511393 -1106551 1027671 8861 -1625097 -493885 2649437 4505783 3741533
10778 3741533 1757052 69866 -865480 -629285 1021284 2530381 1375758 -2171307
10770 -2171307 -4261815 -2619598 -603352 -2836435 -7784231 -8850223 -3393553 3349556
10762 3349556 5006783 1428445 -2757546 -4101595 -2452683 551179 2597790 1977884
10754 1977884 -249521 -1039303 172058 131064 -3248096 -7302895 -8528690 -7346196 -5867015
10745 -5867015 -3501253 1187128 5947847 6571565 2737330 -1523895 -3090855 -2268068
10737 -2268068 -223476 2623008 5044812 4893995 1891366 -1411719 -2673637 -2483409
10729 -2483409 -3000187 -4663098 -5404913 -3447361 -318151 253218 -2722790 -5179234 -2879129
10720 -2879129 2341030 4490266 1543799 -2145988 -2453801 -473041 996222 2014295
10712 2014295 3568713 4332439 3047983 1894593 3643612 6793268 7151709 3685157
10704 3685157 -332954 -1907091 -1489335 -1309990 -2422087 -3910276 -4139641 -2611324 -765597
10695 -765597 -547114 -2299332 -4847372 -7117007 -8327754 -7382347 -4118993 -592077 1074472
10686 1074472 1367755 1676917 1374065 -352688 -1589364 -661225 -109639 -2701040 -5391808
10677 -5391808 -3538071 470996 422167 -2707386 -1949359 2844767 3356877 -3464325 -9953398
10668 -9953398 -10136207 -8003946 -8101634 -7329595 -3033616 -487891 -3819533 -6786597 -1993781
10659 -1993781 6303523 8148208 2577362 -2739648 -3629714 -2677490 -2373062 -2602258 -3562052
10650 -3562052 -4909258 -3800349 810996 4606342 3884314 1577201 1730581 2288984 -82893
10641 -82893 -2464395 -670042 2060690 -222114 -5618173 -7063746 -3616175 -725151
10633 -725151 -511200 150606 2328239 3246679 2006737 977254 1457679 2876359 5368693
10624 5368693 8571451 9555066 6453635 1976564 -707042 -2271359 -3461684 -1913320
10616 -1913320 2217595 3137069 -1770263 -5856999 -3136229 1766475 1719159 -1109530 -917615
10607 -917615 339749 -2059194 -4554945 -955870 5082305 5201762 489220 -1538743
10599 -1538743 -784921 -2793170 -5994395 -4117569 534431 -153877 -5155098 -5799528 -1652402
10590 -1652402 -801126 -4079695 -3527055 1967991 3889777 -487742 -3758398 -2615776
10582 -2615776 -2909451 -6741349 -7846328 -4437264 -3799620 -8709355 -11439682 -7334604
10574 -7334604 -3139767 -5421500 -10720626 -13281664 -13241242 -11632429 -6560806 146557
10566 146557 1585187 -3399707 -6742149 -3789486 -569857 -2774229 -6146575 -4447765
10558 -4447765 287457 2056879 -123752 -2962912 -4118145 -2981804 -452873 306233
10550 306233 -2299011 -3671251 1331140 8721516 9492179 3201344 -1575509 -712162 950052
10541 950052 -687688 -4043607 -7405666 -10511442 -10574697 -5754175 -1557146 -4141531 -9376179
10532 -9376179 -9362278 -6599211 -8873383 -13674299 -12804637 -9386050 -13038871 -20009987 -16979680
10523 -16979680 -4670737 1662417 -3246047 -8694315 -8447144 -8131256 -10061479 -9574195
10515 -9574195 -8360295 -12704379 -18043163 -15029686 -9456436 -13872338 -22329738 -19411812
10507 -19411812 -10859083 -14875422 -26100255 -23388412 -11505802 -14669466 -28530035 -24918028
10499 -24918028 -7564806 -10204128 -31611383 -32887666 -13139519 -18470527 -52575005
10492 -52575005 -58836322 -30090981 -42861576 -112762857 -109950440 68759231 307191963
10485 307191963 384673041 260143095 107549530 65096970 85288664 70399532 28755772
10478 28755772 20592399 40356519 41821727 26289616 27019928 39768904 35520794 18756368
10470 18756368 16117182 25086784 23292130 13535458 15101038 23373591 18921603 5815563
10462 5815563 3648173 11057707 11501403 6335444 9720102 18541575 17950570 9958787
10454 9958787 8305965 11753359 9159575 3932703 7401227 14828398 13259116 6196332
10446 6196332 5780059 8064963 1567757 -6889317 -1572143 12526352 16176681 8153478
10438 8153478 4801481 10133075 12388307 9191476 10424422 15422609 12115778 1235150
10430 1235150 -1919544 6583517 13064938 9875554 5307725 5704694 6409602 5023347
10422 5023347 6375797 10001048 8701876 3195966 2830636 8821247 11938384 9192087
10414 9192087 7435991 8331510 5676077 62018 -172528 4388351 3207867 -4744775
10406 -4744775 -7182046 764729 8154528 6826112 3165174 4236069 6353268 5319720
10398 5319720 5257946 9045393 11144565 7761907 4155752 4823103 5906226 3835069 2246468
10389 2246468 4009997 5296111 3706784 3749983 8252428 12451379 12290392 10755454 10692926
10380 10692926 9258016 4868387 1959246 3331458 4920002 3271020 1202728 1197449
10372 1197449 319656 -3196646 -5104709 -2094800 2475736 4454758 4709705 5009173 4012924
10363 4012924 1285059 -356733 176022 615012 1088701 4779423 10422538 11794169 7766342
10354 7766342 4973336 6937516 8768018 6847919 5318134 7688706 10034937 8588838
10346 8588838 6939444 9349985 13164843 13966048 12616137 11548238 9635485 6138526
10338 6138526 4169412 5022539 4809631 1842546 1106540 5764595 10648571 10524592 8473600
10329 8473600 8920788 8458340 2076074 -6157872 -7619885 -1639416 4401571 5533660
10321 5533660 2907779 -970881 -4114495 -3807500 350451 3557183 1486237 -2870321
10313 -2870321 -3530496 -747893 185427 -1881507 -2304053 1675988 6888657 8773201 6280786
10304 6280786 1787741 -1225089 -675566 1860561 2447299 8434 -1959147 -908690
10296 -908690 593292 -789163 -3662311 -4353056 -2398509 -129110 974912 554411 -1238985
10287 -1238985 -1858768 2363993 9615829 11759878 4885838 -3681686 -4890326 -503252
10279 -503252 1082098 -1581998 -2330601 653743 1351690 -3790005 -9625565 -9707160 -4513739
10270 -4513739 999926 3946530 4399907 2759662 -695143 -5002799 -8867116 -10833262
10262 -10833262 -9251423 -4295856 225828 235235 -3048894 -4250090 -1449998 858600
10254 858600 -1710925 -7037917 -9372078 -6750686 -2636831 -803616 -1135775 -1007950 773319
10245 773319 2571902 2220016 -196844 -2554301 -3415580 -3389952 -3347674 -2556813 159863
10236 159863 4117794 7079808 7791912 7041515 6023287 4660383 2171512 -1104551 -3274292
10227 -3274292 -2826192 -751173 263381 -849440 -2078374 -954567 2556710 6852991
10219 6852991 10800606 13210986 11914659 6324761 35726 -2382112 -879100 868551
10211 868551 1212004 1650235 2353676 1281117 -1144511 -1184637 2215087 4750126 2915644
10202 2915644 -705424 -1506226 722583 2808790 3324533 3308552 3475426 3681304 3982980
10193 3982980 3977334 2555615 212026 -481032 1137745 1815483 -853743 -4093009 -3839275
10184 -3839275 -1022295 47608 -1568979 -2499859 -825587 1019096 90318 -3012601
10176 -3012601 -5245825 -4801403 -2758145 -1698684 -3032355 -5638525 -7539980 -8528838
10168 -8528838 -9634202 -10160568 -7776657 -2331812 2965648 5388011 5239475 3496569
10160 3496569 149696 -3235788 -2920021 1912357 6368213 5732400 1777879 -455238
10152 -455238 161627 1184868 2114547 4280558 5895167 2829036 -4529370 -9822274 -8303953
10143 -8303953 -2627717 1226202 1386052 850059 2092514 3691387 2985855 612079 598598
10134 598598 5271492 11347531 13122796 9286526 4029037 948285 -938340 -3426441
10126 -3426441 -4692430 -2031699 2836262 4974157 2374580 -2014952 -4372671 -3683118
10118 -3683118 -1260056 1194008 2527953 2661813 2738764 4013259 6433057 8653868 9187564
10109 9187564 7475303 4505187 2255608 1586114 1212410 163899 38814 2237877 4349502
10100 4349502 3355022 1507502 3487055 7567191 6474772 -945080 -6296241 -3913882
10092 -3913882 521693 -401451 -3968278 -2956497 1639564 2708664 -602551 -1958702
10084 -1958702 1116589 3958002 3573724 2940327 4413610 5640451 4799720 4197878 5538597
10075 5538597 6295043 3990792 446890 -1191902 -913419 -875071 -2017942 -3345183 -3084911
10066 -3084911 -8403 4809085 8032422 8067934 7691765 9460084 10424494 6492625 846028
10057 846028 1395653 9097642 15413634 13727477 7418594 3374247 2713745 2213975 1057487
10048 1057487 1383400 3968215 7017256 8451938 7439611 4814046 3005736 3746194
10040 3746194 5245525 4128130 621099 -1420685 -446892 496115 -1296228 -4613774
10032 -4613774 -7240491 -8748934 -8659784 -5641322 -714124 2356542 2199241 1978712 4187519
10023 4187519 6832414 7209914 5920706 4526728 2694442 327299 -941344 -979403 -2113998
10014 -2113998 -4222845 -3321073 1509266 4515439 1224431 -4240249 -5183499 -2055408
10006 -2055408 -149582 -547006 -45395 1652558 1574656 -168589 -97481 2169336 2989299
9997 2989299 1123746 -380711 -200084 -1451669 -5954848 -9952683 -8721194 -2890877
9989 -2890877 2622651 4491042 3520611 2115615 1125098 -342635 -2665280 -4391442 -4195521
9980 -4195521 -3311030 -3604114 -3384358 1126334 8901241 13078183 9818376 4135446 2641598
9971 2641598 4097267 2767537 -1382941 -2559935 1362082 5568855 5536145 2516985 526883
9962 526883 1797268 6040894 10652566 11406021 6804379 1707194 2224209 6907300 8101196
9953 8101196 2818746 -3215744 -4189608 -1554402 117268 43759 298449 1255338 1790115
9944 1790115 2138561 3505158 5928322 8497715 10665112 12242618 13320709 14484304
9936 14484304 15378921 13521013 7464193 840245 -656299 3222496 6807616 6271877
9928 6271877 3523134 1344113 -438049 -2015013 -1685067 450047 1183014 -672819 -2033550
9919 -2033550 -1096506 -531176 -1881705 -1672776 2544514 6626484 5466646 806587 -1855135
9910 -1855135 -1525938 -1668681 -3842555 -6355367 -7960740 -8630144 -7785118 -5279553 -2675821
9901 -2675821 -667508 2381614 6483913 8111630 5855331 3920693 5414619 6557718
9893 6557718 3316844 -636016 252258 3373763 1950667 -3555452 -6632116 -5565772
9885 -5565772 -4329882 -3760279 -804052 3964917 6887751 8492883 11024406 10482194 2654273
9876 2654273 -4650956 -881709 4704751 -10816828 -47464531 -71149936 -54444162 -14505256
9868 -14505256 8500821 1892428 -11217199 -10059223 -284985 3943653 2526647 3639988
9860 3639988 7485001 7433021 1852320 -4149308 -6440123 -5474441 -3728440 -3353659 -5054402
9851 -5054402 -7008314 -6475517 -3623388 -1489225 -1493417 -1892172 -1207904 211731 2565357
9842 2565357 6554607 10180743 10010143 6919528 5815435 7707082 7216215 1157168 -5292357
9833 -5292357 -5539770 -955492 1973624 1410513 1344089 3848419 5865003 4762105 2491311
9824 2491311 1946698 2415105 1470839 -641075 -1751066 -2026662 -3815579 -6578355 -5907991
9815 -5907991 -367458 4040946 1181233 -5206991 -5397502 2001364 7241891 3998635
9807 3998635 -1247700 -479335 2549476 -371541 -6460898 -5677257 1866862 4886413 -1098116
9798 -1098116 -6896578 -4895237 9973 858304 -112695 1407961 2225750 -1195494 -3057877
9789 -3057877 3370807 12636878 13925981 8066128 5847546 10328508 12937252 8748972
9781 8748972 4087347 4831879 7072736 5283993 2072622 2990995 6929595 8239166 5079557
9772 5079557 186529 -4040213 -6384780 -5096183 -165151 4088680 3050555 -2129681
9764 -2129681 -5766100 -4337539 610096 5350165 7296079 6185636 3919081 2442526
9756 2442526 826779 -3384378 -8653121 -8925425 -1886135 5527155 4695266 -3385768 -9544086
9747 -9544086 -8509195 -4256993 -2742515 -4436248 -6157879 -6355652 -5696146 -4758177 -3643140
9738 -3643140 -2600494 -1492301 212135 2015657 2434365 1214918 -92428 -401563 -135188
9729 -135188 478329 1887177 3289971 2861226 1026270 689527 2694907 4199575 3704626
9720 3704626 4195435 7862124 10863314 8139481 1588595 -1854057 190174 2974940
9712 2974940 2107865 -1164230 -3291171 -2696552 828923 6925187 12865797 14645830 12000419
9703 12000419 8944949 7514768 5195188 1150838 73292 5310281 12162013 13615329
9695 13615329 9987863 6947904 6044039 3930559 173653 -1373362 153086 676667
9687 676667 -1586782 -3148330 -2135034 -2095314 -5107232 -6677152 -2750873 2542118 2361496
9678 2361496 -2309159 -4049644 158300 5650867 7842099 7524663 6996471 5947205 3855118
9669 3855118 2742627 4246291 6049941 4250835 -1583290 -7783332 -10417964 -8402030
9661 -8402030 -3653734 410394 1257970 -547133 -2173074 -2624191 -4620347 -10245920 -15912657
9652 -15912657 -15310299 -8089745 -1928331 -3360466 -9208746 -10922274 -6078687 -924653
9644 -924653 -1086556 -4571184 -6291903 -5444584 -4617696 -4419850 -3562138 -2797291 -4006321
9635 -4006321 -5745323 -4462751 -736495 359355 -3279566 -7149839 -6379418 -2086184
9627 -2086184 1386580 2626002 3129561 3341643 2574241 1863660 3237240 6105901 7339368
9618 7339368 5483395 2716810 1936289 3493365 5483126 6069763 4781893 2201899 -793760
9609 -793760 -3342309 -4565298 -4095437 -3083263 -3606075 -5780236 -6465124 -2959681 2626798
9600 2626798 5446150 4287612 2650390 2794227 2367248 -1079030 -5274999 -5750400 -1472115
9591 -1472115 4272354 7408894 6126248 2132304 96656 3606686 10232126 13141723
9583 13141723 9329209 3432066 1348395 3202826 5343299 6129407 6212242 5703109 4866156
9574 4866156 5468047 7770213 8409953 5137335 1270378 1032985 2840711 2444651 736144
9565 736144 2140005 6012332 6361612 1091839 -4418157 -4888798 -1477871 1543693 2371267
9556 2371267 1678170 276372 -1119129 -1951668 -2685863 -3608326 -2938619 918725 5582952
9547 5582952 6873335 4726861 2890324 2640805 1453960 -1453896 -3225069 -2402080 -1189125
9538 -1189125 -978657 -162328 1662176 1793204 -1000159 -4191912 -5973049 -7736144 -9850943
9529 -9850943 -9564925 -5917209 -2368534 -1645674 -2326114 -3191614 -5638370 -8294273 -5414942
9520 -5414942 3993903 11138350 8422992 930463 -973599 2915759 3670778 -1729335
9512 -1729335 -5978676 -3348220 2411966 5140120 4592903 3920420 3862698 3518706 3454879
9503 3454879 4409686 5170317 4479819 3158109 2257360 1130347 -650784 -1359319 737890
9494 737890 4579614 7399051 7645545 5681872 2757734 313017 -900654 -1849438 -4064011
9485 -4064011 -6806354 -7142134 -3911196 116046 1530690 301759 -1162700 -1745618 -2272607
9476 -2272607 -2877768 -1982645 1296234 5051582 6232041 4274058 2033754 2405922 4587928
9467 4587928 4959798 1752302 -2718555 -5293736 -5889262 -6562562 -7788912 -7863460 -5753968
9458 -5753968 -2497978 494101 2845427 4565467 5512631 6026561 6899893 8251718 9323179
9449 9323179 9485152 8478961 5942950 2213867 -560385 -123541 2652463 4257439 3128775
9440 3128775 1795977 3115549 6111073 7482381 6200257 4524451 4722100 6492389
9432 6492389 7845626 7413025 5705276 4742982 6209901 9289795 10894307 9055721 5474508
9423 5474508 3315868 3094087 2745733 1549396 1271014 2622930 3421305 2238588 1493550
9414 1493550 3922341 7493970 7498288 3395635 -93536 546571 3360088 4408333 2581957
9405 2581957 -748697 -4157569 -6124223 -4994290 -1452708 892398 -224454 -2725021
9397 -2725021 -3684531 -3466219 -3565024 -3035774 -1001146 -355461 -3976066 -8705214 -8725611
9388 -8725611 -4540126 -2721152 -6018680 -9513889 -8374451 -4112558 -647579 1085036
9380 1085036 1611855 200882 -2955304 -5113832 -4644191 -3581532 -4126395 -5653643 -7312656
9371 -7312656 -9786719 -11910899 -9940615 -3759177 499274 -1509330 -5531103 -4982319
9363 -4982319 -524381 2414721 2813267 4080133 6383735 5747596 956859 -4337583 -7057464
9354 -7057464 -7529040 -6535650 -4093044 -1660086 -1393012 -2688531 -3069549 -2311804 -1876579
9345 -1876579 -1007378 1960018 5030365 4610240 1908423 1479541 3230090 2475189 -891136
9336 -891136 -463084 6598318 14107286 15380746 11594522 7403320 3619023 -605021 -2956133
9327 -2956133 -1317222 1376461 1482696 1122240 4252404 8490042 7662299 1762311 -2447312
9318 -2447312 -1460432 619652 -450534 -2931846 -3463510 -2848954 -3406342 -3768643 -1044726
9309 -1044726 3235235 3975081 -275911 -4705329 -4445351 -781405 1183635 -432190 -2448707
9300 -2448707 -1678687 1004727 2768169 2660628 1366665 -1142916 -4892010 -7543637 -5937348
9291 -5937348 -530777 4325634 5583126 4676420 4180744 3606948 947241 -2835476 -3786431
9282 -3786431 48770 5512550 7552232 4907896 1155953 -253234 -386895 -2364493
9274 -2364493 -5424068 -4986617 191799 4676965 3371327 -955268 -1604705 2283517 5189920
9265 5189920 4024625 1724123 951736 -106862 -2996807 -4905194 -3080960 104365
9257 104365 355812 -2650514 -5843065 -7099958 -6077999 -2960493 533660 1078327 -2045895
9248 -2045895 -4650054 -2844150 1412976 3346241 1814576 -1048226 -4359320 -7965879
9240 -7965879 -9178242 -5510155 -49929 1318715 -1893126 -4590444 -4302639 -3841300 -4754491
9231 -4754491 -4302351 -1402044 200902 -1690606 -3235501 -894656 2048387 653225
9223 653225 -3189095 -3459152 468796 3045817 1036242 -2736531 -4815910 -5267123 -4945749
9214 -4945749 -3124021 -142395 1197548 -399958 -2083776 -829276 2159655 3583418
9206 3583418 2543792 169240 -3321803 -7849621 -11106231 -10706423 -8233507 -7463055 -8548064
9197 -8548064 -7865337 -4353713 -1854713 -3240008 -5941750 -6169378 -4527897 -4002247 -4804036
9188 -4804036 -5267482 -6063446 -8687662 -10438794 -6379362 2515945 8208585 5402198 -1202246
9179 -1202246 -2907841 2276056 8642004 10848564 8914821 5505443 2174635 -484203
9171 -484203 -1699888 -1378531 -746656 -710087 -381443 1553630 4478007 6067209 5043444
9162 5043444 2861108 1989031 2792838 3039235 875628 -2632364 -4972914 -5444089 -5236481
9153 -5236481 -4608175 -2428881 807703 2218518 646868 -689471 1637461 6039406
9145 6039406 8133316 7272313 6936096 8491157 8960897 6645143 4704683 5848803 6800043
9136 6800043 2800043 -4022382 -6235927 -1502920 3641222 2509180 -3231537 -6802727
9128 -6802727 -5077145 -474131 3864545 6645731 6897048 3890854 -881239 -4586098
9120 -4586098 -6301835 -6913498 -6107615 -2936751 542148 514520 -2482266 -3157018 553968
9111 553968 3550362 1156955 -3306707 -3386214 822011 3384750 1681242 -640870 119783
9102 119783 3395501 6939849 9560231 10258204 8200538 4584562 1670256 -326722 -2314109
9093 -2314109 -2770245 517136 5029514 5053148 24534 -3751126 -1920970 2205547 3510530
9084 3510530 1959561 312727 -588388 -354421 2803543 7790241 8498636 1639410 -6401192
9075 -6401192 -6799479 -311561 4444446 3398917 701911 85309 -83161 -1321765 -1208165
9066 -1208165 1657636 3835377 1906320 -2320543 -4677656 -3861078 -1070318 2608436
9058 2608436 5456852 4502954 -807872 -6126839 -6701754 -3138824 88076 436924 -1350551
9049 -1350551 -4228405 -7485625 -8910009 -6006857 356094 6226052 9006036 9378384
9041 9378384 8744917 7472294 6098958 5400982 4405731 1243783 -2891047 -3956833 -1284131
9032 -1284131 -154799 -4666592 -10586387 -9941324 -1790377 6221169 7289063 2152351
9024 2152351 -4414114 -9321151 -11361482 -9746817 -5740744 -3157496 -4052024 -5706518
9016 -5706518 -4496646 -703336 3215287 6652003 9606225 9830418 5943957 1977104
9008 1977104 3482763 9219935 11824111 7502701 336757 -4212199 -5410064 -5144945
9000 -5144945 -4233404 -3355518 -3929656 -5360938 -4535049 -466323 3589458 4920011 4977641
8991 4977641 5766972 6117189 4553129 2545052 1548691 -19991 -3240528 -5247941 -3365515
8982 -3365515 225881 2164751 3170692 4769018 4027196 -2050602 -9044462 -9320338 -3159396
8973 -3159396 1472964 722082 -812010 884233 3058686 2329704 833731 1867325 4065961
8964 4065961 4462998 3663651 3441362 2282537 -1800229 -6218578 -6612052 -3582357 -1824925
8955 -1824925 -2754282 -2496369 2006692 8682490 13455990 14629641 12562661 7782980 1864104
8946 1864104 -1691149 -561088 2683636 2719376 -1901258 -6438810 -5821263 -1157779 1957455
8937 1957455 874601 -1349123 -1071443 1097752 2341717 2086800 1842527 2199096 2811782
8928 2811782 4320470 7194423 9201375 7455028 3269253 1531020 4091915 6922172
8920 6922172 5719163 1658386 -1017088 -1088221 -700017 -484374 1829183 6885595 10890405
8911 10890405 9952642 5834973 4260917 7285229 10326277 8392913 2835240 -842174
8903 -842174 -318920 1945323 3887716 6387780 9619218 10786768 7822941 2638650 -1465358
8894 -1465358 -3249750 -2602987 786706 5187498 6191969 1804618 -3922942 -5659429
8886 -5659429 -3322455 -699428 270151 228673 -502107 -1606262 -1396802 296898 -7768
8877 -7768 -4285636 -8109966 -6288022 -1204584 800834 -296845 1011238 5330138 6953441
8868 6953441 3959330 1555220 2891855 4238781 2829055 2330863 5905655 9969201
8860 9969201 9944877 7061389 4473448 1620719 -2128182 -2930574 2027205 7880355 7433764
8851 7433764 1056285 -4539030 -5635097 -4099250 -2086188 220393 2066658 2199129
8843 2199129 1391131 1120769 497605 -1784120 -3721460 -2498941 424601 1383561 907003
8834 907003 3010493 8029942 11190744 9423422 5316507 2656933 1499848 -383132
8826 -383132 -3538860 -6134518 -6122603 -3397758 -377918 236797 -785720 524780 5440280
8817 5440280 9259421 7202982 1571680 -1313579 -165326 198613 -3172368 -7210060
8809 -7210060 -7772487 -4634875 -70828 4069482 6359099 5934325 4054764 2840994 1620727
8800 1620727 -2155213 -7292656 -8267261 -2759905 3796919 4754437 890741 -1399049 846388
8791 846388 4141454 4643103 3302645 3272612 4875708 5701502 4540192 2588174 741778
8782 741778 -1718512 -4579820 -5170916 -1893863 2054971 1768907 -2674317 -5906522 -4288466
8773 -4288466 108571 3713390 5956651 7333702 6553646 3100645 57327 505539 2772889
8764 2772889 2899264 441822 -1809507 -2617779 -2872374 -2298928 201477 3117369 3177807
8755 3177807 -56311 -3748308 -5919840 -6694715 -5643426 -1831811 2988889 5023655
8747 5023655 3314714 889370 238050 665753 879116 1080966 1398510 922694 -609144
8738 -609144 -2262934 -3385015 -3507247 -1293815 3377027 6848675 5168845 207565 -1955126
8729 -1955126 692141 3858910 3968453 2657262 2430119 2359371 771609 -1484590 -3135217
8720 -3135217 -4677267 -6137386 -5832113 -3696033 -2588430 -3788482 -4417948 -2046004 1259528
8711 1259528 2349058 1538748 882044 776319 1187972 3275856 6621019 7753918 4857499
8702 4857499 1175509 258741 728494 -354585 -1883312 -1049455 1238423 2273022 2784435
8693 2784435 4876952 6368391 3180051 -3177544 -6468633 -4448584 -1158244 271223
8685 271223 1467301 3815082 5058761 3758034 2711886 4519829 7069633 6951623 4858032
8676 4858032 4043894 5067036 5446337 3769908 1286225 -311120 -394208 1154866 3941289
8667 3941289 6291031 6200659 3638944 855220 -63593 801824 1939785 2331398 1992867
8658 1992867 1142323 -137404 -1259894 -1155224 271047 1277421 -12953 -3153666 -5597352
8649 -5597352 -5348324 -2511887 1413531 4339746 3992929 -314217 -5812856 -8213127 -6337049
8640 -6337049 -3036550 -961124 168961 1134006 1066815 -244834 -575701 1519072 3720655
8631 3720655 2941162 -389256 -3660250 -5824309 -6844145 -5420753 -1012615 3357281
8623 3357281 4341564 3240276 3536265 4467123 2113918 -3144491 -5729888 -2772491 1912607
8614 1912607 3773326 3169868 2630265 2269228 907936 -1127463 -3032063 -4845799 -5551355
8605 -5551355 -2889321 2251754 4544062 998756 -3739834 -3333892 1013773 2459393
8597 2459393 -1059499 -3880339 -1257252 3928203 5809838 3537827 1264970 1871208
8589 1871208 4038508 5288039 5160609 4607695 4110198 3759049 4205280 5856401 7197344
8580 7197344 5630126 923472 -3443762 -4017407 -1865667 -1396052 -4601243 -8593133 -9702769
8571 -9702769 -7995305 -5957179 -4129053 -614452 5012555 9509202 8986445 3430085
8563 3430085 -2887854 -5608327 -4251006 -1608872 145782 1395004 2895649 3565923
8555 3565923 2249757 597192 1599683 5170371 7630007 6380534 2997069 539535
8547 539535 -407887 -1603064 -4359456 -8112915 -10725873 -9581996 -4062996 2228589 3938527
8538 3938527 185363 -3886130 -3776400 -1536122 -2121003 -5762715 -7744708 -5063749 289719
8529 289719 4581180 5516188 2189676 -4431489 -10200051 -10530848 -5946280 -1915919 -1692248
8520 -1692248 -2448136 -581728 2402176 2652666 434758 -137373 2721608 5935424 5607348
8511 5607348 1246570 -4419098 -7954276 -7236959 -2765294 2406446 5131573 4843787 3018335
8502 3018335 568689 -2563435 -5482660 -6199288 -4174449 -1446122 -244403 -452215 -161880
8493 -161880 1980026 5422158 8011929 7574145 4151051 561153 -697509 -1002587 -3893266
8484 -3893266 -9260218 -12007398 -8450629 -1753886 2018308 1923045 2527881 6331616 9733380
8475 9733380 8294838 3060888 -1080288 -1662420 -368326 695293 1287023 1215395 -817832
8466 -817832 -4930389 -8536992 -9146497 -7642858 -6781651 -7013284 -5991937 -2330678 2212800
8457 2212800 4934087 4896188 2760981 -349193 -2790588 -2942446 -1336186 -798166 -2780613
8448 -2780613 -4987193 -4696779 -2927089 -2428901 -2668163 -561502 3832956 6382828 4794397
8439 4794397 1888788 1190600 2420050 3524266 4142136 4331590 2685212 -861079 -2635239
8430 -2635239 395024 5384835 6844307 4096883 1296491 712899 744480 617949 1783416
8421 1783416 3370823 1537549 -4008881 -7499297 -4867328 -345671 -772456 -5818352
8413 -5818352 -8919753 -6842885 -3228307 -2170969 -2720612 -1501034 2273150 6386160
8405 6386160 8251839 6347534 755260 -5918503 -9394148 -7487959 -2644655 779577
8397 779577 1404048 1406703 2402536 2955977 1324581 -1133974 -1577452 -60067 356426 -1640415
8387 -1640415 -3383066 -2280394 197742 1007621 279562 508326 2031753 2859150 2723229
8378 2723229 3389201 4336281 2305734 -3051723 -6942871 -5705746 -2261901 -1898509 -4918715
8369 -4918715 -7278593 -7002522 -5902304 -5462889 -4902499 -3651081 -2514685 -1748228 -680617
8360 -680617 217024 -432863 -1959317 -1659788 1170551 3784023 3938294 2923535 2844212
8351 2844212 3022325 1537474 -1018005 -1995879 -484374 1679860 2756338 2860902 2402177
8342 2402177 799639 -1929012 -3729187 -2570582 473723 2086592 919251 -825035
8334 -825035 -849609 8038 -218319 -786623 785949 4068447 5043932 1329144 -4152901
8325 -4152901 -6490474 -4381845 -722176 1376712 1374890 584585 219826 311596 -44507
8316 -44507 -1233041 -2029267 -1020009 940467 1507339 441472 81554 1306308 1904258
8307 1904258 882376 1330862 5604861 9861421 7821297 -543192 -8158777 -9214105
8299 -9214105 -5091240 -1168317 -682962 -3097989 -6245810 -8315537 -8652308 -7577260 -5251392
8290 -5251392 -1332985 3217198 5189765 2237416 -3547316 -7479850 -7509791 -5445061 -3470092
8281 -3470092 -2173266 -1807238 -2359662 -2048673 1050972 5212620 6250462 3669669 2071926
8272 2071926 4344990 6777341 4201126 -2203655 -6012593 -3716087 1666057 5446131
8264 5446131 6765852 7773595 9282171 9663849 7916543 5596974 4351220 2985750
8256 2985750 -604962 -5093496 -6529354 -4345760 -3057362 -5694491 -8828806 -7734878
8248 -7734878 -3883323 -2566769 -4517604 -5196040 -2327373 1083093 2296138 2719154 4502583
8239 4502583 7140125 9278893 10550144 10100327 6878437 3053399 3322154 8504413 13295573
8230 13295573 12935198 8867820 5123695 2493812 -235232 -2154699 -1493919 671589
8222 671589 1762504 1683165 2075455 2427358 400644 -4025475 -7838121 -9071548 -9197558
8213 -9197558 -10204628 -10833773 -7718430 -588913 5370400 4670541 -1158595 -4764092 -2951301
8204 -2951301 -1289151 -5076283 -10075223 -8808906 -3183200 -2113215 -7005104 -9166173
8196 -9166173 -3743978 3109074 4917418 3852799 3626650 1920028 -2889794 -4987132
8188 -4987132 23595 5380670 2099347 -6416470 -8878428 -2913073 2749521 2202168
8180 2202168 -1166422 -2974064 -3952634 -5587029 -6476180 -5367162 -2910852 517139 4269338
8171 4269338 5317267 2085605 -763480 2059531 7080853 6007230 -1126458 -5320202
8163 -5320202 -2224090 2446912 3583682 4025222 7146267 9886524 8487440 5166290
8155 5166290 3865543 4176629 4030728 3905704 4132260 2459491 -1539905 -3961885 -2486844
8146 -2486844 -316991 -52494 1447401 6924598 12010431 10943388 5798536 3504898
8138 3504898 5553874 7004784 5138907 3325440 5384128 10229205 13533328 12518115
8130 12518115 8323388 4629793 3909287 4971677 5213189 4412315 3587884 1184786 -4736542
8121 -4736542 -10440077 -8902438 -224289 6649726 5827480 1922308 1532559 3638667 4082783
8112 4082783 3748742 5198346 5711038 1484611 -4315823 -5484083 -2669073 -1765966 -3798141
8103 -3798141 -4015861 -725054 2186381 2048140 458246 -1074608 -2845279 -3795944 -2059540
8094 -2059540 859706 1535576 339544 458007 1449198 -120283 -3323440 -2863710 2092956
8085 2092956 5438448 2861359 -2408727 -5064479 -3942414 -394606 4618325 9005532
8077 9005532 9528524 6201858 3046157 2369235 2393040 2360203 4724077 9193860 9934598
8068 9934598 3325482 -5486726 -8707350 -5655218 -1706805 75797 1243297 3224714
8060 3224714 5084078 5923063 5933345 4931369 2550156 -165068 -1565717 -1595714 -1427217
8051 -1427217 -1517356 -1750607 -2675512 -4634625 -6239054 -5592211 -2810750 56861 1347848
8042 1347848 1024890 89851 -440187 -524545 -1416689 -3942396 -6256711 -5079555 39233
8033 39233 5388320 7093993 5066135 2108145 564805 692330 974443 -551927 -3917396
8024 -3917396 -6128662 -4428632 -485288 1420647 387537 -416840 568870 1224676 529925
8015 529925 529023 1192993 -1500062 -8476651 -13271232 -10092905 -2695460 682302 -1237424
8006 -1237424 -2723353 -1036775 312374 -1385530 -3967649 -4910435 -4756569 -4127266 -1792818
7997 -1792818 2086787 4679678 4732736 4642252 5980611 6394526 3772402 399074 -444875
7988 -444875 370005 -239049 -2211691 -2905778 -2152050 -2626465 -4901026 -5873668 -3358035
7979 -3358035 765438 3598965 4871389 5518698 4935824 2561675 791743 2769111 7330556
7970 7330556 9514734 6962556 2744440 382013 -774956 -2690995 -4075685 -2565647
7962 -2565647 216600 303184 -2332975 -3717159 -2585897 -2332846 -4516988 -5231567 -1399504
7953 -1399504 2990907 1532348 -5541319 -11349391 -10926161 -6135509 -1994095 -1268616 -3274564
7944 -3274564 -5445940 -5135042 -1519302 3493737 7082867 8164962 7486010 5969834 4412382
7935 4412382 3849333 4235461 3447568 -108398 -4261521 -5014760 -1988522 553451 -914700
7926 -914700 -4688473 -6066095 -2949363 2108042 5109367 4904910 3901054 4708679 6905590
7917 6905590 7987581 6815106 4244692 614251 -4485681 -9120103 -9145535 -3788952 1782432
7908 1782432 2506028 -380463 -2549870 -3430525 -5319329 -7552866 -7106769 -4493081 -3384114
7899 -3384114 -3821907 -1508713 4444057 8453676 6051858 240823 -2978390 -2044285 307639
7890 307639 1628495 1084667 -1149455 -2864067 -850182 3994239 5565536 368875 -6337877
7881 -6337877 -6958402 -2114842 727753 -1572233 -4044897 -2086716 1770618 2490792 62432
7872 62432 -1402528 -247465 636796 -1795137 -6702809 -10489139 -10830211 -8692994 -6515029
7863 -6515029 -5248461 -4147230 -3212502 -3998368 -6900714 -9266925 -8183181 -4199911 -154116
7854 -154116 2905143 5904300 8163582 6983987 1858891 -3755055 -6632313 -7536818 -8796929
7845 -8796929 -10096163 -9371502 -6777951 -4741062 -4102851 -2978710 -247629 2124487 1779465
7836 1779465 -470852 -1549500 46649 2915780 5113661 6343495 7342296 8152706 7848678
7827 7848678 5788144 2838793 1306249 3064932 7011006 9039156 6233601 1064069
7819 1064069 -708767 2990544 8012605 9831903 9228939 9336927 9433145 6201331 429070
7810 429070 -2691381 -1050098 1248424 450888 -1309472 -230552 2914041 4820695 5415973
7801 5415973 6960023 8805782 7860165 4126215 1447551 2045635 3848395 4038824 2141056
7792 2141056 -1114071 -4873560 -7273039 -6525023 -3856867 -2397187 -2388235 -1095222 1387168
7783 1387168 687433 -4816932 -9626480 -7816479 -1267022 3183600 2842144 779577 -481739
7774 -481739 -1867472 -4089729 -5613165 -5575726 -5281133 -5378675 -4457528 -1839966 861927
7765 861927 2407999 3602336 4699175 3752446 -121582 -3870619 -3654387 217286 3888752
7756 3888752 4653643 2732001 -792242 -4834922 -6993178 -4407580 2570355 9447365
7748 9447365 11981044 10414647 7962565 6299209 4730497 3422644 4556876 8718557
7740 8718557 12005322 9504628 1811771 -4135668 -2071563 6676059 14390365 14615067
7732 14615067 7807238 12049 -2910095 66337 5008945 7014249 4604540 283526
7724 283526 -2966008 -4588899 -5320241 -4747816 -2024604 1525772 2891804 1145451 -991920
7715 -991920 -545696 1685735 1776159 -2666950 -9138200 -12018862 -8166597 -736234 3462558
7706 3462558 990402 -4756170 -7884283 -6548776 -3745075 -2858114 -4646550 -7964933
7698 -7964933 -10971273 -11672985 -9561077 -6820558 -5897343 -6135484 -5246542 -3627924 -3844409
7689 -3844409 -5642206 -5381645 -1637718 2325674 3476915 3032949 3458355 4697348 5823221
7680 5823221 7277587 8626270 7126599 1911534 -3022315 -3682723 -1749564 -1642321 -3966783
7671 -3966783 -5956583 -6728556 -7613858 -8283760 -7067189 -4781449 -4032804 -4616683 -3413939
7662 -3413939 807200 5729318 8762193 9109135 6901883 3293358 935895 1341025 2486389
7653 2486389 2015194 1289600 2490408 3592900 1301579 -2379150 -2443160 757169 1745976
7644 1745976 -1227107 -4040608 -4273342 -4221121 -4719733 -2784425 1984667 5075719 4232914
7635 4232914 2825222 2824432 935778 -4092747 -6797727 -3106075 2429763 3538466 1728683
7626 1728683 2567867 6273465 8492619 7707214 5862257 3813602 1480638 334985 905270
7617 905270 423464 -2341813 -3297406 511107 4321916 2093530 -3534066 -4836992 -237514
7608 -237514 5299033 9042556 11931873 12696017 8815217 3070380 1241318 3051344 2964723
7599 2964723 140089 -557007 1749521 1894874 -1598335 -3094295 641952 5048750 5653541
7590 5653541 4518703 4721692 4716084 2710063 1054280 1546358 1255148 -2307500 -6201209
7581 -6201209 -6732379 -5068004 -3794470 -1856678 2280183 5839745 5174526 1642975 -462800
7572 -462800 -58386 535945 -61410 -1188066 -2151820 -2744751 -2937652 -3612179 -5753567
7563 -5753567 -8078055 -8356316 -7690526 -9307965 -12117920 -10842998 -4671808 92189 -723309
7554 -723309 -3161094 -2533807 -855122 -1535379 -2298055 -49465 1800936 -1630059 -7623557
7545 -7623557 -9404317 -6585799 -4685239 -5658369 -6298555 -5577900 -6414609 -9346434 -10461702
7536 -10461702 -7025549 -846245 4561993 6646412 4231072 -994866 -4552277 -4524984
7528 -4524984 -4762742 -8332578 -10925256 -7089597 -164288 2051883 -204239 222540 4057635
7519 4057635 3772387 -2673479 -6624163 -2135335 4347461 4332873 151575 -291229 3473735
7510 3473735 5090214 2249813 -1065507 -2454028 -4027831 -6584602 -6851985 -2948973
7502 -2948973 1471624 1486217 -2784271 -6666487 -6886812 -4823945 -3549421 -3501232 -2809202
7493 -2809202 -1102239 -257948 -723458 -237346 1697445 1340555 -3494169 -7856944 -5282830
7484 -5282830 2195090 5786071 2057567 -2945028 -3442392 -1631881 -2267774 -4751987 -5331787
7475 -5331787 -3760928 -2946598 -3748535 -4131890 -2589819 420790 3532048 5034154 3960797
7466 3960797 2270378 3647149 8087595 10370151 6673137 234252 -2796431 -1035560
7458 -1035560 2028622 3769871 4432571 4491166 3735967 2722039 2262191 1846739 790522
7449 790522 -160081 -704133 -2624536 -6395543 -8229044 -4869966 160747 429639 -3801639
7440 -3801639 -5820352 -3178131 -1788853 -6502167 -13313963 -15453625 -12802004 -9754685
7432 -9754685 -6910786 -1559371 4652980 5566083 -478396 -7079434 -7829241 -3496668 1698373
7423 1698373 6608732 11676536 14321068 11402496 4964262 228731 -1771008 -4381837
7415 -4381837 -7970715 -8168644 -3239568 2232303 3996332 3715409 4260401 3999313 696474
7406 696474 -2538594 -1102263 3488499 5793803 5014102 5308684 7921943 9135037 6870138
7397 6870138 3679760 1622620 -722857 -4140780 -6346616 -6103432 -5702081 -6703843 -6729399
7388 -6729399 -3217241 2479772 7103583 9008559 7904860 4133889 107878 -752718
7380 -752718 1349119 2256034 289868 -666231 2774738 8179294 11445158 12553105 12925069
7371 12925069 10506902 3107139 -5276395 -7497301 -2671484 2437509 2305026 -1192559
7363 -1192559 -2895467 -1259758 1066344 1706562 1295162 1768144 3166235 3373890 1535174
7354 1535174 246125 2072443 4646679 2721648 -4374860 -11020859 -12316010 -9125678
7346 -9125678 -4600372 -117841 2713223 885267 -4859613 -7778600 -3291482 3635761
7338 3635761 4822122 154835 -3413181 -2320515 673024 3175010 5891698 8140252
7330 8140252 7243973 4206065 4203762 8841662 12691161 10434727 3600129 -2606744 -5813001
7321 -5813001 -6938898 -6903280 -5855678 -4066288 -1538195 1848800 4756888 5150611 3715378
7312 3715378 3783486 6290498 7662745 4842309 -263022 -3884607 -5468760 -6573148 -6819048
7303 -6819048 -4885582 -2553143 -3414712 -6942057 -7725910 -2697565 3670507 4455879 -641127
7294 -641127 -4759636 -2853523 2039882 3594181 891834 -1086993 1106980 5241683
7286 5241683 7400721 6841106 5356182 4494800 5084639 7014371 7849386 4552322 -1385445
7277 -1385445 -3945762 -742628 2384206 -662082 -6731314 -7753990 -2947852 38610
7269 38610 -3310885 -8072700 -7626131 -2794688 335988 -1113137 -4008749 -3945756 -519225
7260 -519225 2415258 1404660 -1906100 -2211113 2371220 6998496 6276447 1347073 -2638671
7251 -2638671 -3852842 -4057477 -3395422 -574084 2457063 1960111 -1261890 -2760482 -2035666
7242 -2035666 -2982037 -5894359 -6046127 -2355809 -296580 -2721609 -4659379 -1910307 1435776
7233 1435776 -161573 -4584355 -6254059 -5323027 -5800946 -7447631 -6579304 -3341292 -1541265
7224 -1541265 -1913316 -1586112 -93337 -208841 -2264126 -2707335 594292 5642748 9669381
7215 9669381 11585652 10630921 6374978 961051 -1995817 -1781134 -1191307 -2298549 -4338765
7206 -4338765 -6063347 -7132377 -6690528 -3731535 247556 1951249 774076 -162448 1274333
7197 1274333 3153267 2819689 987099 286546 1200289 1663737 76136 -3194961 -7198875
7188 -7198875 -11505012 -15122425 -15569592 -10957931 -3322289 2160317 2995575 2759182 5812160
7179 5812160 9894304 8435631 490252 -6907302 -8368503 -6876300 -7261426 -7967463 -4813149
7170 -4813149 771191 3845773 4059301 4773601 5396880 2192097 -2989314 -2734149 4681044
7161 4681044 10936000 8406959 -102733 -6468615 -7439294 -5114110 -1220640 3396348
7153 3396348 5755611 2982479 -2613576 -5200497 -2693803 1105670 2305711 1655888
7145 1655888 2016885 3509921 3591209 1368842 -306621 1832494 6843588 9938608 7962614
7136 7962614 2989537 -718273 -1794870 -1867196 -1978305 -1787117 -1658072 -2348152 -2706938
7127 -2706938 -951571 1633038 1858477 -10867 -59056 2997447 5528121 4833206 3065719
7118 3065719 2820876 2995660 2280239 2703801 5562722 7412725 4984990 1126903 458836
7109 458836 1554852 -449166 -5012142 -6602050 -3614573 -259928 1039299 2528305
7101 2528305 4948087 5170191 2677687 2102740 5531549 7996574 5333037 1440488 2026294
7092 2026294 5266715 5264733 1925769 314948 1691586 2404281 1488245 2183737 4849540
7083 4849540 5321755 2654825 2025986 6370568 10801951 9963039 6252959 5280919 6644301
7074 6644301 5418373 929716 -2216458 -1569163 290032 921671 1129716 1610175 923785
7065 923785 -1201196 -2135595 -228900 2301681 2552716 826530 -631281 -915264 -709270
7056 -709270 -907248 -2391385 -5333536 -7479310 -5570294 -249518 3129909 1185827 -2410809
7047 -2410809 -1803412 3008170 6842871 6853744 5035068 3417529 1335695 -1309819 -2136628
7038 -2136628 -24974 2125065 1211709 -1326939 -1501012 1397757 3795875 2799667 -208587
7029 -208587 -1915374 -1483955 -1118038 -2619124 -4771909 -4808421 -1909957 1600884 2622834
7020 2622834 263529 -3585687 -6017500 -5359167 -2508363 -360974 -1096394 -3707279 -5165884
7011 -5165884 -4236819 -2600908 -1667623 -477092 1682328 2852183 1348690 -486157 948054
7002 948054 4555177 5227023 1031954 -3924598 -5156455 -2977624 -67114 3052841 7212579
6993 7212579 11450153 13912721 14690725 14822837 13539204 9759610 5688366 5025707 7046066
6984 7046066 6321668 214142 -6546276 -7661260 -3567977 -457806 -1753094 -4275956
6976 -4275956 -3837859 -1526243 -1792808 -5416326 -7338042 -2744634 6045040 10909765 6892760
6967 6892760 -1578058 -5417145 -1553616 3775372 3526503 -1242938 -3981640 -2180056
6959 -2180056 203852 -302416 -2203842 -3120123 -3780576 -4861946 -3643348 1931594 8405510
6950 8405510 10628268 8854364 7457078 7751561 7118869 4813360 3284914 3198013 2303174
6941 2303174 351778 53118 1639348 1718011 -352397 -374134 3399040 6213358 4037535
6932 4037535 -40651 -1332189 -973166 -2294204 -3622550 -1192938 3256760 4347742
6924 4347742 1146161 -2528040 -4604989 -5644319 -4433980 736524 6764817 8211934
6916 8211934 5333210 3407332 3886219 3060595 230211 -471247 1494772 567797 -5335886
6907 -5335886 -9823525 -7450821 -2127138 -611806 -2701962 -3917291 -3822736 -5118839 -7167697
6898 -7167697 -6827655 -4281892 -2484741 -1871964 -606008 961719 922822 -100397 -427427
6889 -427427 -1921668 -7590552 -14781986 -16683865 -11731872 -6059069 -4546127 -4479394 -1269016
6880 -1269016 3704980 5325335 2569277 -235061 497480 3676630 6052364 5954982 3525347
6871 3525347 -656583 -5307475 -7830215 -6276787 -2283001 -106777 -1628507 -4010114
6863 -4010114 -4051144 -3084390 -4514944 -7531223 -7386644 -2430082 3276106 5866477 6194480
6854 6194480 6170397 4780004 1521017 233477 4260017 9714416 9292471 2594618 -2753332
6845 -2753332 -1486800 2486191 2106515 -3398381 -8277157 -7846062 -3483427 -268306 -1495166
6836 -1495166 -5937575 -9619055 -9650546 -6470643 -3005339 -2188877 -4715650 -8061389 -8147221
6827 -8147221 -3661694 1592921 2993557 1495574 2254440 6256141 7916989 3506077
6819 3506077 -2541545 -3930597 -1586434 -1152905 -3720810 -4954447 -2680738 357004
6811 357004 1687481 2015356 2078153 1152438 -81717 721565 3509282 5043936 3518336
6802 3518336 686125 -1672332 -3865094 -5524989 -4340930 435240 5989775 9176756
6794 9176756 9430920 7547306 4464010 2182099 2547934 3893769 2416204 -1689822 -3388617
6785 -3388617 -93720 4153526 4412697 1068848 -2573153 -5230603 -6705390 -5511300
6777 -5511300 -1650978 1067272 -16353 -1488920 1281745 6236440 7020089 2584643
6769 2584643 -1155595 -8657 2952363 2310183 -2663000 -7802671 -8726800 -4516929 1564565
6760 1564565 4510007 2436752 -934627 -622817 3206328 5928373 5356818 4297888 5262856
6751 5262856 6371205 4867576 1916254 845655 2173716 3332890 2642263 886172
6743 886172 -893241 -2662652 -4020358 -3782018 -1970678 -463581 -265095 419710 3450420
6734 3450420 6998446 7050030 2794122 -1942492 -3485296 -2232625 -490030 1102989 2665442
6725 2665442 2743331 138025 -3100628 -3789580 -1978441 -44832 1455538 3008271 2269736
6716 2269736 -3498932 -10841006 -12129912 -6045870 31 683046 -361616 1300863
6708 1300863 2458473 -1352830 -6136692 -4490481 2365772 6079205 3617934 89847
6700 89847 -818542 -973975 -1122184 1778893 7637384 10756445 8179620 4582537 4675832
6691 4675832 6043680 4218488 269070 -1919582 -2412321 -3956636 -6481636 -7839910
6683 -7839910 -8095883 -8451495 -7669096 -4259086 -803268 -1204718 -4358079 -5243869 -2057006
6674 -2057006 2203017 5149631 7319961 8498875 6567336 1930680 -800241 1759756
6666 1759756 7079941 9803178 7907683 3900256 1143332 800060 1865140 2901271
6658 2901271 3582929 4583632 5778949 5455049 2531316 -1197429 -2849054 -2101466 -1158563
6649 -1158563 -1405145 -2282653 -3385510 -5181334 -7187815 -7717225 -6198595 -3946262 -2153913
6640 -2153913 -901259 -257159 -213466 477142 2753239 4524159 2884797 -527441 -620048
6631 -620048 3273748 5372154 2248521 -1058800 1510099 7201532 8279071 3716589
6623 3716589 123110 957925 1803034 -1399853 -5438838 -5101912 -1096674 1854504 2131808
6614 2131808 1795284 1572457 4114 -2510863 -3084326 -794628 1597280 1913825 1692694
6605 1692694 2933235 4050692 2148330 -1734655 -3141327 -554883 1804705 -469295
6597 -469295 -5612137 -7766304 -4833681 -1068669 -895701 -3003217 -3040229 -472005 689458
6588 689458 -1853250 -4845033 -3637268 1639236 6240204 6575550 3923491 2133099 2919859
6579 2919859 4168818 2526882 -2688087 -8174974 -9527188 -5794869 -758019 1186395
6571 1186395 161658 433820 4399541 8656745 8042387 2847070 -868519 929456 4870159
6562 4870159 4992092 942559 -2297929 -2248261 -2048440 -4503808 -7200003 -6508285 -3413642
6553 -3413642 -1648292 -2030732 -2618211 -3088078 -4572162 -5812293 -4301634 -1489579 -1783500
6544 -1783500 -5143733 -5921129 -1574503 2522116 920469 -3562884 -4567553 -2202063
6536 -2202063 -2128820 -5846664 -8314950 -6101520 -2273741 -914303 -1188809 195 2505095
6527 2505095 3564538 2355069 767890 172874 -20319 -407768 -219959 1255495 3007228
6518 3007228 3160698 1299980 -1029032 -2518777 -3824607 -5863245 -7149738 -5194177
6510 -5194177 -846108 1628104 307490 -1392926 -28328 2277627 1346874 -1832353
6502 -1832353 -2198517 1520154 4837819 3995174 13247 -4661840 -9003089 -11259775 -8627858
6493 -8627858 -1862214 3579441 4014166 1793102 218260 -1771273 -5620269 -7524809
6485 -7524809 -2644386 6710790 12852039 12336218 8710758 5623036 2579608 -1145862
6477 -1145862 -3379159 -2503365 -586030 -245413 -748057 239706 2693376 4328550 3707409
6468 3707409 1611994 -20263 317840 2196920 2894417 125393 -4328277 -5783105 -2458631
6459 -2458631 2092676 3817651 3050419 2326665 1569990 -1019617 -4217241 -3925294 995478
6450 995478 6080073 6282798 1840848 -2759649 -4480935 -4196423 -3740716 -2885455 -507176
6441 -507176 2559311 3782270 2125822 -577382 -2179151 -2899289 -4205830 -5948390 -6552074
6432 -6552074 -5994666 -6404674 -8671615 -10211013 -7996886 -3077504 5522 -1431405 -5106631
6423 -5106631 -6841280 -5487442 -3461277 -2991907 -3567722 -3501343 -2552591 -1753860 -1343617
6414 -1343617 -413786 1277371 2444185 1819964 -292904 -2652626 -4563388 -5990758 -6710955
6405 -6710955 -6275967 -4845876 -3474076 -3289137 -4363752 -5389502 -4807906 -2599817 -398180
6396 -398180 898231 2772755 6796209 11309971 12803927 10795019 8670891 8789813 9491744
6387 9491744 8478996 6304250 4193920 1148628 -3556652 -7158836 -6609032 -3699747
6379 -3699747 -2949625 -5083028 -6817297 -6922856 -7876412 -10607935 -11957530 -9225949 -3908158
6370 -3908158 882570 3735661 4143181 1666921 -1954944 -2861633 156947 3255488 2422842
6361 2422842 -1164028 -3040163 -1027168 3158634 6182101 5188887 -313937 -6772424
6353 -6772424 -9086523 -6882006 -5629711 -8995366 -13170843 -12427454 -7503251 -3846499
6345 -3846499 -3455346 -3594361 -2600852 -1553745 -174083 3492236 8149628 8984642 4503347
6336 4503347 -300027 -161804 4033961 7560344 8253661 8019805 9172075 11265025 11344277
6327 11344277 7034748 99229 -4024188 -2387631 888240 -247138 -4778675 -5840404
6319 -5840404 -1607913 1096245 -2865939 -8567299 -8019230 -1553067 3901788 5603472
6311 5603472 7356614 11250711 13314443 9374084 960270 -6814413 -10370458 -9146955
6303 -9146955 -4807666 -616348 810793 638036 2401854 6208057 7326570 2841964
6295 2841964 -3141097 -4358043 -602455 2832918 3007169 2174687 2351512 1711434 -1188559
6286 -1188559 -3239799 -647790 4903251 7902764 6208116 2881331 896223 31357
6278 31357 -60141 1998906 5635934 6551940 2325927 -2856822 -3344286 -54067 1418060
6269 1418060 -324239 -1045635 1307130 3163720 1807027 158515 1728053 4792439
6261 4792439 5549625 4139036 3517520 4560630 6187137 8463949 11506897 12736578 9443961
6252 9443961 3225050 -2050121 -5702609 -9424494 -11976880 -10000317 -4409778 -682746
6244 -682746 -1406767 -3323348 -3541343 -3828595 -5994622 -7477196 -5344431 -1456401 290391
6235 290391 -487718 -1527138 -2239822 -3314234 -3558755 -1164777 2591723 4472274 3691118
6226 3691118 2062215 313682 -2310763 -4993324 -5520575 -4018871 -3224779 -4139750 -4380802
6217 -4380802 -2100162 977338 1893320 -45141 -3262949 -5771411 -6199911 -4696329 -3451076
6208 -3451076 -4400834 -5895859 -4189832 745356 3819391 1184324 -4631368 -8530018
6200 -8530018 -9485417 -10052878 -10902264 -9970247 -6830081 -3898043 -2346392 -260115 3397103
6191 3397103 5784254 3594946 -2273548 -7906268 -11091232 -12377793 -12171915 -9803328
6183 -9803328 -6024600 -3763824 -4727470 -6783462 -6420748 -2840043 2032766 6646666 10605544
6174 10605544 12587636 10440053 4758502 112763 218264 2887745 2505622 -2410926
6166 -2410926 -6774767 -5209456 1275258 6806693 7644601 5269733 2700809 471182
6158 471182 -2234777 -4307225 -3346753 368562 3048081 1906134 -1125019 -2102093 -349645
6149 -349645 1506378 2279713 3628531 5818125 5607891 1002885 -4432233 -5558488 -2582059
6140 -2582059 -207167 -544794 -1162919 -639579 -1396572 -4798235 -7293549 -4929571 617510
6131 617510 4138649 3781431 2413566 2573060 3356602 2862864 1186257 -85823 75666
6122 75666 1275325 1999879 768295 -2029845 -3721106 -2035999 2019909 5262951 5939197
6113 5939197 4778785 2948638 966581 -368355 -122029 1121898 1512311 495249 -395812
6104 -395812 75090 1165084 1535525 898250 -442034 -2310681 -4086367 -4601032 -3443630
6095 -3443630 -1394673 911341 3527296 5983648 7123972 6874352 6566708 6621896 5652524
6086 5652524 3043534 593716 -100058 -318558 -2196548 -5105036 -6274840 -4522147 -1336899
6077 -1336899 1557198 3877571 5797291 6733314 5806796 3244912 1264463 2984864 8948926
6068 8948926 14729930 14507500 8148231 2044743 990778 2213242 659165 -2658850
6060 -2658850 -2463780 2177420 6729910 8718634 10525170 13122958 12748510 7186136 881889
6051 881889 -557555 1984414 3315361 1670780 -189400 -468043 -470319 -1241311 -1752798
6042 -1752798 -999391 888126 3891029 7747087 10049719 7579186 538092 -6605370
6034 -6605370 -9308150 -6493710 -94519 6541238 9679581 7619360 3183665 1449019
6026 1449019 3946975 7283819 8183413 7047544 5402456 3201885 772853 139586 1437404
6017 1437404 999601 -3231773 -7035953 -5446295 -1175876 -1745968 -8381859 -13723336 -12027096
6008 -12027096 -6180298 -1973022 -299789 1235231 2938085 3764089 4636431 6327952
6000 6327952 6003241 804473 -6250730 -9039369 -6767926 -4669821 -5861724 -7592034
5992 -7592034 -6976844 -5464256 -5016888 -4176753 -1367981 1235768 957203 -710079 -490513
5983 -490513 1423147 2309147 1760496 1701539 2341041 1970611 616389 270719 1290556
5974 1290556 1940363 1882814 2730258 4401888 4348758 1773712 -383757 479222 2817723
5965 2817723 2966454 -668617 -6695563 -12318390 -14758411 -12907700 -8758690 -5707404
5957 -5707404 -4796350 -4481190 -4323849 -5887161 -8887013 -9873639 -7001243 -3335128 -2796721
5948 -2796721 -5051451 -6967783 -7001814 -5486054 -2730440 219543 974830 -876307 -1787877
5939 -1787877 1005603 4753875 5070348 2636766 1432593 1760008 435934 -2561538 -3363937
5930 -3363937 -766047 1886576 2633733 3567775 5807142 6889798 5653013 4970834 6620932
5921 6620932 7812724 6273526 4644269 5751541 7237288 5633306 2787314 3040236
5913 3040236 6083674 7888219 7392689 7027115 7347940 6505585 5044351 5912903 8814921
5904 8814921 9486115 6161711 2352907 1242406 1444084 793419 458198 1905258 2861239
5895 2861239 436643 -3404242 -3681208 567572 4653944 4348011 902353 -1379555 -852584
5886 -852584 -8094 -1577102 -4560419 -5036951 -842400 5470242 9197653 8616282 6337770
5877 6337770 5505704 6150664 6195491 4989467 4388603 6245137 9582873 10804446 7126908
5868 7126908 36605 -5382337 -5552390 -2352998 -555554 -1674017 -2572937 -667619 2110807
5859 2110807 2408409 561275 -140834 1457395 2924563 2188016 318814 -775390 -1296427
5850 -1296427 -2306587 -2969182 -1562205 1031314 1469266 -1416995 -4133263 -2484852 3035448
5841 3035448 7862831 9001078 7889261 7287235 7450754 6672478 4144057 685960 -2558006
5832 -2558006 -4720563 -5098247 -3852029 -2465697 -2222357 -2546206 -2146938 -1424486 -2058564
5823 -2058564 -4122297 -5338753 -3979051 -1361302 -534494 -2944628 -6970612 -9530360
5815 -9530360 -8874256 -5896220 -2695383 -45933 2883793 6062029 7285557 4738947
5807 4738947 36034 -3036805 -2691439 -682273 220097 -940753 -2844884 -3073214 -62623
5798 -62623 4802126 7485298 5272499 101221 -3738075 -4670737 -4399023 -3850382 -1706429
5789 -1706429 2230031 5169515 4765068 2563193 1980710 3693396 4671175 1720971 -4637707
5780 -4637707 -9826340 -9284479 -3807532 154623 -2493491 -8942204 -11758929 -8480809
5772 -8480809 -4356160 -4736889 -8525986 -11145823 -10712882 -8523381 -5875584 -3366894 -1705290
5763 -1705290 -651032 1469775 5042458 7539374 6719466 3671143 555280 -2403932
5755 -2403932 -5025202 -4935454 -1070281 2692539 2011518 -1133644 -1314154 1124467 -397950
5746 -397950 -8498450 -16549103 -16636709 -8967812 -21102 5610509 7651495 6567495 2389284
5737 2389284 -2611443 -3972090 160951 5965266 7595890 3543711 -1943275 -3863497
5729 -3863497 -1734032 804913 705037 -1562657 -3420834 -2704877 1453988 8049998 13347036
5720 13347036 12728737 5559074 -3009625 -7148321 -6353937 -4464555 -4021442 -4434451 -5091211
5711 -5091211 -6878173 -9809043 -11720045 -10744225 -7744158 -5342105 -5294084 -7071017 -8296071
$$ [...]
##END NTUPLES=NMR SPECTRUM
##END=
