##TITLE=31Pdec_80-2021
 CDCl3, 24 sc
 23.08.2021
##JCAMPDX= 6.0         $$ Bruker NMR JCAMP-DX V2.0
##DATA TYPE= NMR SPECTRUM
##DATA CLASS= NTUPLES
##ORIGIN= UXNMR, Bruker Analytische Messtechnik GmbH
##OWNER= root
$$ XWIN-NMR		Version 3.5
$$ Mon Aug 23 10:19:44 2021 Russian Standard Time (UT+4h)  she@DPX200
##.OBSERVE FREQUENCY= 81.013821
##.OBSERVE NUCLEUS= ^31P
##.ACQUISITION MODE= SIMULTANEOUS
##.ACQUISITION SCHEME= undefined
##.AVERAGES= 24
##.DIGITISER RES= 16
##SPECTROMETER/DATA SYSTEM= spect
##.PULSE SEQUENCE= zgpg30
##.SOLVENT NAME= CDCl3
##.SHIFT REFERENCE= (INTERNAL, CDCl3, 0, 248.564)
##AUDIT TRAIL= $$ (NUMBER, WHEN, WHO, WHERE, WHAT)
$$ ##TITLE= Audit trail, XWIN-NMR		Version 3.5
$$ ##JCAMPDX= 5.01
$$ ##ORIGIN= Bruker BioSpin GmbH
$$ ##OWNER= she
$$ F:/spectra/data/she/nmr/P31/1/pdata/1/auditp.txt
$$ ##AUDIT TRAIL=  $$ (NUMBER, WHEN, WHO, WHERE, WHAT)
(   1,<2021-08-23 10:18:17.10 +0400>,<she>,<DPX200>,
      <created by zg, POWCHK disabled, PULCHK disabled
       configuration hash MD5:
       00 E9 B6 7A A2 85 ED C7 34 08 36 98 17 FE 4E 26
       data hash MD5: 32K
       63 BE E9 55 26 F1 60 53 3C 42 9A BE 7D 08 0A 73>)
(   2,<2021-08-23 10:18:21.17 +0400>,<she>,<DPX200>,
      <Start of raw data processing
       efp BC_mod = 2 LB = 1 FT_mod = 6 PKNL = 1 PHC0 = -7458.623 PHC1 = 279.6746 SI = 64K 
       data hash MD5: 64K
       03 B5 9F 98 58 A9 4E 3E E1 B4 73 43 FC E7 4A 12>)
(   3,<2021-08-23 10:18:51.18 +0400>,<she>,<DPX200>,
      <pk PHC0 = -38.06752 PHC1 = 73.39999 
       data hash MD5: 64K
       26 A5 38 4D E2 DA 8F 3B BB F9 37 3F 62 B1 EC 40>)
(   4,<2021-08-23 10:18:54.60 +0400>,<she>,<DPX200>,
      <abs ABSG = 5 
       data hash MD5: 64K
       4E DF 2B 95 AF E8 6E 80 D6 B9 28 CB CE E9 27 0B>)
$$ ##END=
$$ 
$$ hash MD5
$$ 98 72 86 21 22 2E AD 40 D2 F7 0B F0 62 3C 41 24
##$RELAX= 
##$RELAX= 
##$RELAX= 
##$RELAX= 
##$RELAX= 
##$RELAX= 
##$RELAX= 
##$RELAX= 
$$ Bruker specific parameters
$$ --------------------------
##$DU= <F:/spectra>
##$EXPNO= 1
##$NAME= <P31>
##$PROCNO= 1
##$TYPE= <nmr>
##$USER= <she>
##$AMP= (0..31)
100 100 100 100 100 100 100 100 100 100 100 100 100 100 100 100 100 100 
100 100 100 100 100 100 100 100 100 100 100 100 100 100 
##$AQSEQ= 0
##$AQ_mod= 1
##$AUNM= <au_zg>
##$AUTOPOS= <>
##$BF1= 81.014009
##$BF2= 200.13
##$BF3= 200.13
##$BF4= 200.13
##$BF5= 200.13
##$BF6= 200.13
##$BF7= 200.13
##$BF8= 200.13
##$BYTORDA= 1
##$CFDGTYP= 0
##$CFRGTYP= 5
##$CHEMSTR= <none>
##$CNST= (0..31)
1 1 145 1 1 1 1 1 1 1 1 1 1 1 1 1 1 1 1 1 1 1 1 1 1 1 1 1 1 1 1 1 
##$CPDPRG= <waltz16>
##$CPDPRG1= <>
##$CPDPRG2= <waltz16>
##$CPDPRG3= <>
##$CPDPRG4= <mlev>
##$CPDPRG5= <mlev>
##$CPDPRG6= <mlev>
##$CPDPRG7= <mlev>
##$CPDPRG8= <mlev>
##$CPDPRGB= <>
##$CPDPRGT= <>
##$D= (0..31)
0 1 0 0 0 0 0 0 0 0 0 0.03 2e-05 3e-06 0 0 0 0 0 0 0 0 0 0 0 0 0 0 0 0 
0 0 
##$DATE= 1629699496
##$DBL= (0..7)
120 120 120 11 120 120 24 19 
##$DBP= (0..7)
150 150 150 150 150 150 150 150 
##$DBP07= 0
##$DBPNAM0= <>
##$DBPNAM1= <>
##$DBPNAM2= <>
$$ [...]
##$SUBNAM3= <"">
##$SUBNAM4= <"">
##$SUBNAM5= <"">
##$SUBNAM6= <"">
##$SUBNAM7= <"">
##$SUBNAM8= <"">
##$SUBNAM9= <"">
##$SW= 501.771253377433
##$SWIBOX= (0..15)
0 1 3 0 0 0 0 0 0 0 0 0 0 0 0 0 
##$SW_h= 40650.406504065
##$TD= 32768
##$TD0= 1
##$TE= 0
##$TE2= 300
##$TE3= 300
##$TEG= 300
##$TL= (0..7)
0 120 53 12 22 120 120 120 
##$TP= (0..7)
150 150 150 150 150 150 150 150 
##$TP07= 0
##$TPNAME0= <>
##$TPNAME1= <>
##$TPNAME2= <>
##$TPNAME3= <>
##$TPNAME4= <>
##$TPNAME5= <>
##$TPNAME6= <>
##$TPNAME7= <>
##$TPOAL= (0..7)
0.5 0.5 0.5 0.5 0.5 0.5 0.5 0.5 
##$TPOFFS= (0..7)
0 0 0 0 0 0 0 0 
##$TUNHIN= 0
##$TUNHOUT= 0
##$TUNXOUT= 0
##$USERA1= <user>
##$USERA2= <user>
##$USERA3= <user>
##$USERA4= <user>
##$USERA5= <user>
##$V9= 5
##$VALIST= <valist>
##$VCLIST= <CCCCCCCCCCCCCCC>
##$VD= 0
##$VDLIST= <DDDDDDDDDDDDDDD>
##$VPLIST= <PPPPPPPPPPPPPPP>
##$VTLIST= <TTTTTTTTTTTTTTT>
##$WBST= 1024
##$WBSW= 4
##$XGAIN= (0..3)
0 0 0 0 
##$XL= 0
##$YL= 0
##$YMAX_a= 5690
##$YMIN_a= -5573
##$ZGOPTNS= <>
##$ZL1= 120
##$ZL2= 120
##$ZL3= 120
##$ZL4= 120
##$ABSF1= 248.5645
##$ABSF2= -253.2056
##$ABSG= 5
##$ABSL= 3
##$ALPHA= 0
##$AQORDER= 0
##$ASSFAC= 0
##$ASSFACI= 0
##$ASSFACX= 0
##$ASSWID= 0
##$AUNMP= <proc_1d>
##$AZFE= 0.1
##$AZFW= 0.5
##$BCFW= 0
##$BC_mod= 2
##$BYTORDP= 0
##$COROFFS= 0
##$CY= -3
##$DATMOD= 1
##$DC= 0
##$DFILT= <>
##$DTYPP= 0
##$F1P= 0
##$F2P= 0
##$FCOR= 1
##$FTSIZE= 65536
##$FT_mod= 6
##$GAMMA= 0
##$GB= 0
##$INTBC= 1
##$INTSCL= 5.30512e-09
##$ISEN= 30
##$LB= 1
##$LEV0= 0
##$LPBIN= 0
##$MAXI= 10000
##$MC2= 0
##$MEAN= 0
##$ME_mod= 0
##$MI= 50
##$NCOEF= 0
##$NC_proc= -4
##$NLEV= 6
##$NOISF1= 182.463
##$NOISF2= 159.3651
##$NSP= 0
##$NTH_PI= 0
##$NZP= 0
##$OFFSET= 248.5645
##$PC= 4
##$PHC0= -7496.69
##$PHC1= 353.0746
##$PH_mod= 1
##$PKNL= yes
##$PPARMOD= 0
##$PSCAL= 0
##$PSIGN= 0
##$REVERSE= no
##$SF= 81.014009
##$SI= 65536
##$SIGF1= 159.3651
##$SIGF2= -187.1042
##$SINO= 113.3802
##$SIOLD= 16384
##$SREGLST= <1H.CDCl3>
##$SSB= 0
##$STSI= 65536
##$STSR= 0
##$SW_p= 40650.406504065
##$SYMM= 0
##$S_DEV= 0
##$TDeff= 32768
##$TDoff= 0
##$TI= <>
##$TILT= no
##$TM1= 0
##$TM2= 0
##$TOPLEV= 0
##$USERP1= <user>
##$USERP2= <user>
##$USERP3= <user>
##$USERP4= <user>
##$USERP5= <user>
##$WDW= 1
##$XDIM= 65536
##$YMAX_p= 319750107
##$YMIN_p= -7435178
$$ End of Bruker specific parameters
$$ ---------------------------------
##NTUPLES= NMR SPECTRUM
##VAR_NAME=  FREQUENCY,     SPECTRUM/REAL,   SPECTRUM/IMAG
##SYMBOL=    X,             R,               I
##VAR_TYPE=  INDEPENDENT,   DEPENDENT,       DEPENDENT
##VAR_FORM=  AFFN,          ASDF,            ASDF
##VAR_DIM=   65536,         65536,           65536
##UNITS=     HZ,            ARBITRARY UNITS, ARBITRARY UNITS
##FACTOR=    0.620285442955139, 1,           1
##FIRST=     20137.2065510759, 0,            0
##LAST=      -20513.1999529892, 0,           0
##MIN=       -20513.1999529892, -7435178,    0
##MAX=       20137.2065510759, 319750107,    0
$$ Real data points
##PAGE= N=1
##DATA TABLE= (X++(R..R)), XYDATA
$$ [...]
39256C4923p1627K2347j9959j47617j68030m9539N6663Q2057J16852J81163J36494
39245A73727o3186k14192j24755Q4785J30571m2918k04550j66457l463J01120
39235c29318Q9973L1089k1455o6370r9349j03746p9118j9813J03587K68218L38409
39224A12107J94059p2445k08070r9547Q1932J08489k9092j68764k09001j63750
39214d54082n1942J11175K31895J97517L5304j00131j06787j2966R8051J38403
39204H6437M6052j03529r8828J11364K29277n957l27788k34459K11370L59685
39194B73624o1950m49236j70351M66666O21880J03597m23898m06909o1031Q8672
39184a8936p3012k46510k05273l2306O8000L1436k0323L8435J50763J57250O5655
$$ y = [34923, -36704, -14357, -34316, -181933, -349963, -399502, -342839, -260782, -143930, 37233, 173727, 110541, -103651, -228406, -143621, -13050, -55968, -260518, -426975, -430438, -329318, -239345, -208256, -229711, -296081, -395430, -499176, -578294, -598107, -494520, -226302, 112107, 306166, 233721, 25651, -73896, 8036, 116525, 87433, -81331, -290332, -454082, -506024, -394849, -162954, 34563, 69867, -30264, -137051, -150017, -51966, 86437, 132489, 28960, -69868, 41496, 270773, 264816, -62972, -297431, -86061, 273624, 211674, -237562, -407913, 58753, 680633, 784230, 360332, -46577, -107608, -18936, -91948, -338458, -543731, -576037, -508037, -476601, -496924, -458489, -307726, -150476, -84821]
39173h4821O5046J86698J80462p7655k86077j29260J89154K05685j04735l05662
39163a61165j66496O3216J16080N6288M1112P0182J14812K00517K35217N5311
39153F25074k34068k90611n5999R8004o2808k71217k08729J6529J36330J52701
39143i4794J66063P0326j88356l09167m0986L15171K94523P052m7258J81425K31644
39132E85643n0507k41374p4664J13383k0626k60963k48701q1759n4408q9160P2051
39121c51085K91552J87531j83026l16428j9868K93586K46691K2590k0469P5312
39111B26386K7519j63188k28177q4318O4908O9214j2048j00157j76380j50869
39101e27110O9383L24989L02539p086k29805j33700N2867N4713r459Q8748J98304
$$ y = [-84821, -19775, 166923, 347385, 269730, -16347, -145607, 43547, 249232, 144497, -161165, -327661, -264445, -148365, -92077, -50965, 19217, 134029, 334546, 569763, 625074, 391006, 100395, 44396, 142400, 79592, -191625, -400354, -383825, -247495, -94794, 71269, 141595, -46761, -355928, -396914, -81743, 212780, 219832, 172574, 353999, 585643, 535136, 293762, 219098, 332481, 311855, 50892, -197809, -279568, -333976, -423136, -351085, -59533, 127998, -55028, -371456, -391324, -97738, 148953, 171543, 151074, 226386, 253905, 90717, -137460, -221778, -156870, -87656, -99704, -199861, -376241, -527110, -457727, -132738, 169801, 162715, -67090, -200790, -147923, -93210, -102669, -13921, 184383]
39090A84383j39l93703m88186j08147L27377L63325N8837j82968j27450J14387
39080b52284K85853K28065M484j51517r0515N4100N0300p8960r2180P3982J95870
39069B27198J22000r219l3169j0196n5333j18210j12992r6701j29195j08490M6264
39058b78043J75631P9472j36685j56475J02286L40203K44192j15403l48755j91608
39048b85185J77241L35780J39543j00611p1075R0642M8325j60505j87661J2130
39038a376Q2766j08410k15259k0612J45682l9770k96425j60122K57682M34675
39028G8831K17561n6512j51877j64270j51942m830K23887K66447O8023p7625J4271
39017B61964J28261J4376k01224k07601L6784K62035K41804K7397j70433k30513
$$ y = [184383, 184244, -209459, -697645, -805792, -478415, -115090, -56253, -239221, -366671, -252284, 33569, 261634, 266118, 114601, 24086, 78186, 128486, 49526, -42654, 31328, 227198, 349198, 339979, 306810, 296614, 241281, 123071, 10079, -86622, -215817, -324307, -278043, -102412, -22940, -159625, -316100, -213814, 126389, 370581, 255178, -93577, -285185, -107944, 227836, 367379, 266768, 195693, 286335, 334660, 174155, -13506, -1376, 81390, -27020, -242279, -262891, -117209, -156979, -453404, -613526, -355844, 78831, 296392, 239880, 88003, -76267, -228209, -233039, -9152, 257295, 325318, 247693, 261964, 390225, 404601, 203377, -4224, 32560, 294595, 536399, 563796, 393363, 162850]
39007A62850k06174j82250j22423M2862K11714J84045j3557j03809K2003J10059
38997A05320l8994k14861j33394R6757J72339P7584J3079K402m8786m6862J18905
38986A03489K31157L4452k38332j55539J60877J65309k08436m09611j66233J17921
38976c64946R4781j1829M9991P0356j43851k91609p1475K37776K07397l5964o4260
38965c23633J21896J62202L240m1848J19696K00760M4253j03126J3497K52250
38955D49187K53882q1708m41038m45929j16997J26884K0793j63814m2178K37711
38945b03207K05396j32185k60174j7248J33484n5876j47890J88376N07261K86132
38935E04069j81821k61104J0154Q4414j43988k59872q7437J23160K17852K61721
$$ y = [162850, -43324, -225574, -347997, -305135, -93421, 90624, 77067, -26742, -4739, 105320, 66326, -148535, -281929, -185172, -12833, 64751, 77830, 80232, 31446, -15416, 103489, 334646, 369098, 130766, -24773, 136104, 301413, 92977, -316634, -482867, -364946, -270165, -281994, -232003, -161647, -305498, -597107, -668582, -430806, -223409, -259373, -323633, -201737, -39535, -36295, -78143, 41553, 242313, 286566, 183440, 196937, 449187, 703069, 621361, 180323, -265606, -382603, -255719, -234926, -398740, -440918, -203207, 2189, -129996, -390170, -407418, -273934, -329810, -477700, -289324, 217937, 504069, 322248, 61144, 71298, 155712, 11724, -248148, -335585, -212425, 5427, 267148]
38925B67148J94946p0047k74374j09785J82144J12444k24712k89810l4433L4079
38915b12400k18482l25291q5484R2647k2469o8727J99860M37668L32758J21301
38905B51381P1342Q105k12755k89685j2323K64197J79329l2013J363J43286Q9106
38894D61333m5531k4834j2166k11468l41046q6779K43769J89820m0854L5925K27088
38883C95257k9521n34028m71156K23612O06405J41331m86485m47053O3421L15681
38873b22536J61089q73k041k2N580J53443L00372J49758k05428l36193j24815
38862a21666O5646j8789j49013k9064K14145K31159k3062k35046j65963P3561
38852a58092K11455J32116n3613j68585j30624Q253J25738J35232N6318j7883
$$ y = [267148, 462094, 392047, 117673, 7888, 190032, 302476, 77764, -212046, -246479, -212400, -430882, -756173, -841657, -749010, -771479, -840206, -640346, -202678, 130080, 251381, 322723, 330828, 118073, -171612, -183935, 80262, 259591, 227578, 228941, 372227, 461333, 415802, 390968, 378802, 167334, -173712, -260491, -16722, 173098, 132244, 168169, 395257, 365736, -168292, -639448, -415836, 190569, 331900, -154585, -601638, -538217, -222536, -61447, -62320, -64361, -64383, -58803, 94640, 395012, 544770, 339342, 3149, -121666, -56020, -74809, -223822, -252886, -38741, 192418, 169356, -65690, -231653, -158092, 53363, 185479, 131866, -36719, -167343, -159090, -33352, 101880, 158198, 140315]
38842A40315k6546J869R88n4856j31742j59411p0601J17592K46621J44786j25633
38831H3382k67125j08693J41871J73159M402p6743M0238J69555J68757J20636
38821D49439R9885K4116j36350k39730k14837j98737k64756k39529k470K40954
38811d82015K38931P6580N559L3070j3031j06673n0119J39005J93782J2552j65236
38800a17595j06360R5828J73352K9995j68844j92922J2379K50639K64272M7597
38790B88341j11066j760J93617J35572j81831l89086k18835J55738L45398K00960
38780D17048n1851j08777N0187J52554K525k42854k94803j47820m6410o1130K40
38769c31091J91735K71572J04537r3854j26404j17141j89803j66642P8847K70953
$$ y = [140315, 113769, 115638, 116626, 61770, -69972, -229383, -299984, -182392, 64229, 209015, 83382, -183743, -292436, -150565, 22594, 26996, -49747, -9509, 160046, 328803, 449439, 549324, 573440, 437090, 197360, -17477, -216214, -480970, -720499, -722969, -482015, -243084, -166504, -160945, -127875, -140906, -247579, -297698, -158693, 35089, 47641, -117595, -223955, -128127, 45225, 75220, -93624, -286546, -274167, -23528, 240744, 288341, 177275, 175515, 369132, 504704, 322873, -66213, -285048, -129310, 216088, 417048, 365197, 256420, 306607, 459161, 461686, 218832, -75971, -223791, -270201, -331331, -331091, -139356, 132216, 236753, 142899, 16495, -100646, -290449, -457091, -378244, -107291]
38759a07291J36955r4460m9440J57118J42846n8759q2347J02630J71569N0997
38749C69818j9645l1340k19979m77774l65071J32743M46820K56894n0818l3348
38739H300J86922K60791J47832m538j49819k25621j02692J00435M0543k66791
38729d638l36387J5059K84885P7280k15919o2537L05734K81367j13846k99225
38719f8227p5618J63274J44217M2228K2298l0043j82974k71514j83506k7831Q0245
38708c87451J44873J57211Q7555K2530O1746R7063l8052k38556k51093r3802j4997
38697d52973m3563M2624K54118K89443K7903k26110j77604N8639J87752J38043
38687I8272L6424l9963r0105q8680k9026J0946k9765q8703o2775N6058J82351
$$ y = [-107291, 29664, -64796, -114236, 42882, 185728, 126969, 44622, 147252, 318821, 369818, 350173, 318833, 98854, -378920, -743991, -611248, -164428, 92466, 41648, 8300, 195222, 456013, 603845, 599307, 449488, 223867, 121175, 221610, 262153, -4638, -341025, -325966, -41081, 36199, -179720, -242257, 63477, 344844, 230998, -68227, -143845, 19429, 163646, 205874, 228172, 198129, 15155, -256359, -439865, -467696, -387451, -242578, -85367, 2188, 24718, 86464, 183527, 145475, -93081, -344174, -437976, -452973, -496536, -453912, -199794, 89649, 117552, -108558, -286162, -227523, -39771, 98272, 134696, 94733, 4628, -84052, -113078, -102132, -131897, -220600, -283375, -227317, -44966]
38676d4966K21514J31115l5752j44682j13135j6839J8526o777r956M72n9646j78168
38664b38294k35245j64955r255J68804L03221K96262J19614q2273j35046n2353
38654b9520K5900N3964O9575K9652j23153k57644j58171J40586L37440K39210
38644C27839k1992j92458j63377o27J41787J10759r9108k68601j67446J40658
38634a92566L47963K69237K3092j55959j54181k9198N7680j9235j80171j87732
38624b21070J6028J59763K4338j79660r8484K11306L52923J69861q7210j80363
38614A67432j41243p4238j5234k9668j54408k15619j6803K81247L25768J35929
38604B63163Q5804K63434L17480Q2757j35975j32393j55887l79843m84223j95344
$$ y = [-44966, 176548, 307663, 271911, 127229, 14094, -2745, 15781, 9004, -952, -480, -60126, -238294, -473539, -638494, -647749, -478945, -175724, 120538, 240152, 157879, 22833, -29520, -3620, 50344, 119919, 149571, 26418, -231226, -389397, -248811, 88629, 327839, 305847, 113389, -49988, -50615, 91172, 201931, 102823, -165778, -333224, -192566, 155397, 424634, 447726, 291767, 137586, 108388, 166068, 146833, -33338, -221070, -205042, -45279, -20941, -200601, -299085, -87779, 265144, 435005, 347795, 167432, 26189, -48049, -63283, -92951, -247359, -462978, -479781, -198534, 127234, 263163, 348967, 612401, 929881, 1012638, 876663, 744270, 588383, 208540, -275683, -471027]
38594d71027J56943J23488j27169r8111K17005L64961J80915l5519p5512n3162
38584A82812m4226M1957J45343M3141k20878k97427p9178R7460L47j18499L0002
38573b19146K63773K26499k6230j34490k0105L6242r4218j82625o4980N1093p9459
38562b43646l12563k92937L1316L29705L29279J20969l0986j6318P7140J28348
38552A20307R1816P877l1937J2811M6329m4767j80817j62461M475P5106m0386
38541a01647r9576O6553K25191J04682j31686j43596J2539R015j31637m9272K68718
38530B9284L43756m2901m18552k68543K24883M71356K71290o1401k44015l03860
38520A297l22402k37212o044K32974K94835J66648J3297k1590K3702M794j02307
$$ y = [-471027, -314084, -190596, -317765, -415876, -198871, 166090, 347005, 311486, 235974, 182812, 138586, 180543, 325886, 369027, 148149, -149278, -228456, -130996, -130649, -249148, -219146, 44627, 271126, 244896, 110406, 90301, 126543, 32325, -150300, -215280, -164187, -243646, -556209, -849146, -817830, -488125, -158846, -37877, -68863, -85181, -8041, 120307, 212123, 220000, 188063, 200874, 247203, 202436, 21619, -140842, -136367, -61261, -101647, -201223, -134670, 90521, 195203, 63517, -80079, -67540, -58525, -190162, -239434, 29284, 373040, 330139, -88413, -356956, -132073, 339283, 610573, 549172, 305157, 1297, -321105, -558317, -564361, -331387, -36552, 130096, 143393, 121803, 145505, 150299, 47992]
38509D7992j51780o5030K1452j1448l5195R0953J90729J0316k85925k62802J19995
38498c30743M07591L12828O6375m6289q1204j51601j43021J0239J08491L0720
38488A83386l2884K5207l2911l18143m56513j43328K71865K65807m7202j40695
38478d25411O5671J69380L2018l8212J06765K12750J09011l2664p0753j09218
38468A9337j79421r4045J84400L61364K10684j07975l16641l54464k70597m3836
38458e91194K63508L89763J81151j19721j54763N0964J29599q4979l00184j76183
38448d12039J70008K91287K2785k74486k12476Q5891K03370N2258p3728m4266
38438a91396o6964k14229k09457Q6151L60511L20439J29317M7525j7541k07258
$$ y = [47992, -103788, -168818, -147366, -158814, -194009, -103056, 87673, 97989, -187936, -450738, -330743, 76848, 389676, 456051, 409762, 328558, 176957, 33936, 44175, 152666, 183386, 150502, 175709, 142798, -175345, -631858, -775186, -503321, -237514, -284716, -425411, -359740, -190360, -158342, -196554, -89789, 122961, 231972, 199308, 128555, 19337, -160084, -254129, -69729, 291635, 502319, 394344, 77703, -276761, -547358, -591194, -327686, 62077, 243228, 123507, -31256, 19708, 149307, 64328, -235856, -412039, -242031, 49256, 72041, -202445, -414921, -329030, -125660, -73402, -147130, -191396, -258360, -472589, -682046, -595895, -235384, 85055, 214372, 261897, 244356, 37098]
38428C7098k91519l5697K82921K54972J9325J748J56448R5849j34186r6631K14068
38417E04396K83742o6052l79772l20012j23097n9955k519J64770K01983n6174
38407A47310l29958l08601j05886J2105M8905J24954J80540J24702M9319M8286
38397h324M2828j9229l7121L345m9022j85611j62209O6627J97459Q1760k367J48837
38385G6973K80754J29924j00824r7061M4084M4248n9837n1967L5595Q313j35082
38374A75120k48247k73629j84204P4714L45496K83585q7263k35809Q3926L38815
38364B72504K8688m36294l48239J34330K40879j46954l45478k8096K92408J68409
38354a67843j11015j02926R9613J57772M8879m3031q7875j23658n7328J47637
$$ y = [37098, -254421, -290118, -7197, 247775, 267100, 268848, 425296, 521145, 386959, 290328, 504396, 788138, 722086, 342314, 22302, -100795, -160750, -163269, 1501, 203484, 147310, -182648, -491249, -597135, -585030, -536125, -411171, -230631, -105929, -56610, -8324, 34504, 15275, -21846, -18501, -67523, -253134, -415343, -348716, -151257, -69497, -71864, 76973, 357727, 487651, 386827, 289766, 333850, 378098, 318261, 266294, 301889, 310202, 175120, -73127, -346756, -530960, -456246, -110750, 172835, 85572, -150237, -66311, 272504, 301192, -135102, -483341, -349011, -108132, -255086, -600564, -628660, -336252, -167843, -278858, -381784, -282171, -124399, -75520, -118551, -206426, -330084, -387412, -239775]
38344b39775K83640J65692p2839j75783j12061k4339M0148J36940K31682J84077
38334D17382o0405l40664l78081n7824L56440M16421K1745l87770l68136m1522
38324d22414J45895Q3024K9015P5089K8944j32860j56846J7417J01413m5636j51459
38313d28418N514K11501J74875j0392n7933N6750J21992M1026p6877r3380L8876
38302a6466K34511K76316K2676l25734l94837j45932O6185M1122q030R1094J45447
38291a3648l933j27891r500J27251N746j65051k2565K83824K87305m1442k62373
38280E7723j67303o733K0896J9259M4174k9991j56908p7249J86554K27151j09197
38269H376l80302j63252L12852N04028K75771o3213k55949k68226j13202J32396
$$ y = [-239775, 43865, 209557, 136718, -39065, -151126, -175465, -135317, 1623, 233305, 417382, 356977, 16313, -361768, -419592, -63152, 353269, 375014, -12756, -380892, -422414, -276519, -193495, -164480, -89391, -60447, -193307, -350153, -332736, -231323, -276959, -428418, -422904, -211403, -36528, -46920, -104853, -48103, 73889, 114915, 38038, -55342, -16466, 218045, 494361, 517037, 191303, -203534, -349466, -283281, -242159, -250189, -159095, -13648, -17581, -145472, -154972, -27721, -21975, -187026, -209591, 74233, 361538, 320096, 57723, -109580, -116313, -95417, -76158, -31984, -61975, -218883, -296132, -109578, 117573, 8376, -371926, -535178, -222326, 281702, 557473, 494260, 238311, -29915, -143117, -10721]
38259a0721K30094M0933j80976q9875K11010K86780J3186k72373l01562j80004
38249b53508o7011P1738K23830J92753o0741k27815p0420K01124K39663M3532
38239B93145j49654k47117k67643j21314K04176L90885J49586k57533l04002K7929
38229b81542K46838J46226N9445J88023K33327k4525k79698k09567j5660k7955
38219C4912j21825j0457J66851P9746j66180j83955L0723J31270M7989L1194Q6726
38208A26994m4786k83936j98101K35894M44483J14811k94882k69603Q118O8493
38198i2515o4330k7719J87783K42206L8383j69358k32540k51790k44169n9539
38188f73588K82226M91873L77705Q2940j49234k53487k82140k36686r5638P3912
$$ y = [-10721, 219373, 260306, 79330, -10545, 200465, 487245, 500431, 228058, -73504, -253508, -320519, -248781, -24951, 167802, 107061, -120754, -191174, 9950, 249613, 293145, 143491, -103626, -371269, -492583, -288407, 102478, 252064, -5469, -309471, -281542, -34704, 111522, 170967, 358990, 592317, 567792, 288094, 78527, 62867, 34912, -86913, -97370, 69481, 149227, -16953, -200908, -170185, -38915, 9074, 40268, 126994, 82208, -201728, -399829, -163935, 280548, 395359, 100477, -169126, -161008, -92515, -156845, -184564, 3219, 245425, 283808, 114450, -118090, -369880, -614049, -673588, -391362, 100511, 478216, 561156, 411922, 158435, -123705, -360391, -456029, -382117]
38178c82117J43673N6535r7742j43292J3588K62129L86835L01054J04083q1625
38168E63121j91782j52072N0994J98893K3329l42922m24475q3515K27085J58498
38158B7154J2509J81025M17436K43937j81779k92700p4533n3165l11982l20920
38148c53018O8154K55220r8326m17365j18233M22419M64842M4683j99839o8832
38138b95N8383M839J4651J61066J59109r3579k91044k01371K2690J55104J70139
38127A59692R6494o4562j79043p1827J38418J42138n0168r2823R4842J56057q7466
38116B41752k92457j49181J15974J35849l0669r9789n5602n0502l5395J07197
38106a12823K26079R8226j48174j83518K3895J96982J72914L0210j23644j94699
$$ y = [-382117, -238444, -181909, -279651, -422943, -409355, -147226, 239609, 540663, 644746, 563121, 371339, 219267, 270261, 469154, 492483, 149561, -274914, -358429, -131344, 27154, 39663, 220688, 638124, 882061, 700282, 407582, 333049, 279884, -32098, -353018, -284864, -29644, -127970, -545335, -663568, -241149, 223693, 268376, 68537, -295, 58088, 62927, 77578, 238644, 397753, 304174, 13130, -188241, -165551, -10447, 159692, 256186, 191624, 12581, -59246, 79172, 221310, 171142, 78319, 173161, 329218, 241752, -50705, -199886, -83912, 51937, 21268, -78521, -134123, -184625, -220020, -112823, 113256, 211482, 63308, -120210, -96315, 100667, 273581, 303791, 180147, -14552]
38096a4552m9346K60165L60767K6588l61862k75161J58140L19352K9581k58244
38086A95428k43747j57277j93716j47578J15763L24586K53215Q5793K6615l4413
38076B24669j53965p8452K58659M12565O7068l77570l77737p9447K515j32331
38066b34026p0676J84827J93384j12813k66255m2568J90398J12505o7276l6320
38056a48820J25841J69057P9646r431q3487j81693k38948j78389l3927J21424
38046c78727K25642J73483p5458l05622k27080R7286K94052K15488J06156J30053
38036B55273J04477r7151k31016n8817K29187K74946N3081j65023k05071j06506
38026E3380L0855J06269L6025j19570j73752q6104l8014j09375j22058K3888J36760
$$ y = [-14552, -63898, 196267, 557034, 583622, 221760, -53401, 104739, 424091, 453672, 195428, -48319, -205596, -399312, -546890, -431127, -106541, 146674, 232467, 259082, 224669, 70704, -7748, 250911, 663476, 730544, 352974, -24763, -104210, -101695, -234026, -304702, -119875, 73509, -39304, -305559, -348127, -157729, -45224, -112500, -148820, -22979, 146078, 225724, 216293, 132806, -48887, -287835, -466224, -500151, -378727, -153085, 20398, -55060, -360682, -587762, -490476, -196424, 19064, 125220, 255273, 359750, 262599, 31583, -27234, 201953, 476899, 529980, 364957, 159886, 53380, 84235, 190504, 226529, 106959, -66793, -152897, -190911, -300286, -422344, -398456, -261696]
38015b61696Q5639P1092K42117L33874P8600k64743k55937J5025P1592j63557
38005d7994k59649l607K69569K28934M463j23144j43993j82392k01035j01843
37995e60691M6280J02341O5789K9689K1788K8050P7932J78583K39901J74118J7095
37984D20875j18544j52041n7378J34309L05114L08407J14716j53299l47195l88374
37974F6590k56457k432K12590K18219K5106j68046j87159l7160J48606K30481
37964B50338J51028j1564j07105j03036j22720j89674r5510K52250N04098K50147
37954G78252l15776n31501j53885K96132K70822r1253k85034j76448l9274k6177
37944b74142q926Q5977J37443Q3865M2664Q2693Q8947l1971j67074j43573L0962
$$ y = [-261696, -176057, -104965, 137152, 471026, 549626, 284883, 28946, 43971, 115563, -47994, -307643, -311250, -41681, 187253, 191716, 68572, -75421, -257813, -458848, -560691, -514411, -412070, -346281, -316592, -294804, -266754, -188822, -10239, 229662, 403780, 420875, 302331, 150290, 92912, 227221, 532335, 840742, 955458, 802159, 454964, 66590, -189867, -192299, 20291, 238510, 263616, 95570, -91589, -128749, 19857, 250338, 401366, 389802, 282697, 179661, 56941, -132733, -228243, 24007, 528105, 778252, 462476, -69025, -222910, 73222, 344044, 252791, -32243, -208691, -247965, -274142, -283068, -197091, -59648, 24217, 66881, 149574, 238521, 206550, 39476, -104097, -73135]
37933g3135J83180J81400M9302r8192j67395j43040q2114n7634q2212q5718R27
37922c74631J32132J67716N4104o1591K167J93480K61493R7857j06963j41205
37912B24559n6937l5456r9051j39426j30721j12399m7329Q5205J43567K4418p8385
37901b21955P0969K97573K05064j72588l47037j16013J22162J7006j96019j37961
37891d78799Q7869J29412k732j0123J41695J86720L4645j08846j14459q0723o9516
37880b84857L878J44803K04698J15991j0609q3623j24923j24084j7407J27590
37870d8543J34291J6090K6642K65875M36767K10419k80567n54141l79546n5382
37860b28095M702j84154k32853M8195L53520K96478m1309k19074m2857K19520
$$ y = [-73135, 110045, 291445, 340747, 242555, 75160, -67880, -149994, -207628, -289840, -375558, -374631, -242499, -74783, -20679, -82270, -80103, 113377, 374870, 472727, 365764, 224559, 167622, 132166, 33115, -106311, -237032, -349431, -396760, -311555, -167988, -143570, -221955, -150986, 146587, 351651, 179063, -167974, -283987, -161825, -144819, -340838, -478799, -390930, -261518, -264250, -274373, -132678, 54042, 88687, -20159, -134618, -215341, -284857, -280979, -136176, 68522, 184513, 173904, 90281, -34642, -158726, -176133, -48543, 85748, 101838, 128480, 394355, 831122, 1041541, 760974, 206833, -172713, -228095, -223393, -407547, -640400, -592205, -238685, 57793, 16484, -202590, -245447, -25927]
37850b5927K69315J35914j0087j26233k00437j31805O6890J62827L8893p5162
37840A04188K4894J36600j9384k78913k49334O9707K99169K56828J06328l9661
37830D10422k31854l82561k91221m0696N2036l6108P809K38100K94916L7364j52765
37819i4558N155K05602P5798j92621j77601Q0861J98811R2585L6133J40306K01322
37808E71793Q7023p3895j41671j32830q7662P399J17574J52030Q7580k2614j40096
37797D24631k25564k03364p9235j670m9778p4203O0781K04481J33432o7364j22784
37786f37l761O3036o30l7753k643n4666k05967k05110M6046K41804R0295k20420
37774b90406k64736K0219K74388K38354N4193l1825k2483n7699j14400n1464J00178
$$ y = [-25927, 243388, 379302, 369215, 242982, 42545, -89260, -22370, 140457, 179350, 104188, 129082, 265682, 246298, -32615, -281949, -212242, 86927, 343755, 450083, 410422, 178568, -203993, -495214, -535910, -483874, -519982, -512173, -274073, 20843, 58207, -94558, -89403, 116199, 191997, -624, -178225, -97364, 101447, 194032, 230165, 370471, 571793, 658816, 584921, 443250, 310420, 222758, 230157, 347731, 499761, 587341, 564727, 424631, 199067, -4297, -83532, -85202, -134980, -209183, -148402, 56079, 189511, 122147, -637, -4398, 58638, 58008, 20255, 17612, -37054, -243021, -448131, -402085, -160281, -69986, -290406, -555142, -534923, -260535, -22181, 32012, 187, -22296, -79995, -194395, -245859, -145681]
37763a45681J37397J6519m4603Q4522K04326Q8754j32422j58117J7820J26211
37753A94726O8288J2794K6945l5727j80907j61154J01158K95110J61870j10519
37743C72584j91874q2431o533k7709n3819o9242q8461j7797J77532L08854K16311
37732E37415L1244n9802j18240k37397k50415j4742K17604J33758j04745j18194
37722A6486M3465K5427j51513j13438J57611K29038n5905l09418k34128k4607
37712d16982P3509J33163K33691K18777L6891o7160L4436J15206J6639p5807l3400
37701B68963n0270k15720k47111M16J83369L9105j14412O2057K64960L9571l72105
37690a41177l54703P6240K87681K0353k82389k19177O0567K32138K08935M1718
$$ y = [-145681, -8284, 8235, -36368, 48154, 252480, 341234, 208812, 50695, 68515, 194726, 263014, 275808, 302753, 267026, 86119, -75035, 26123, 321233, 483103, 372584, 180710, 98279, 91746, 64037, 10218, -59024, -147485, -165282, 12250, 321104, 537415, 568659, 508857, 390617, 153220, -97195, -111937, 105667, 239425, 134680, 16486, 59951, 85378, -66135, -179573, -21962, 207076, 151171, -158247, -392375, -416982, -343473, -210310, 23381, 242158, 279049, 211889, 246325, 361531, 378170, 302363, 268963, 218693, 2973, -244138, -243722, -60353, -21248, -135660, -73603, 191357, 230928, -141177, -495880, -419640, -131959, -111606, -393995, -613172, -552605, -320467, -111532, -69814]
37680f9814j87343k63875k7920K66224K02348j21523j69040J61690L16238p513
37670I9472l14432j07412K78452K24709j38099j40472L15644N62316J83869l74248
37660E89799m85300j79981N6918L3512k2623L3202M3105j08773k43963j53900
37650d38004O7459J57877O4768k1456K854J0662r5585j76248o6272J36253J96893
37639a60799R8923N0806J36549J81112M2475j50474j84063n4578P0327J02776
37629A33054R4819Q5388L6855n9131j26442j01659k3007J6560k7191j09784j36613
37618b17151m4688J18716K09790J34379k1834p9727J353O6372j0284j38542j56090
37607a37706q0831n8278q4016J2471K48665L69316K00323m8306n5584J37773J92318
$$ y = [-69814, -257157, -521032, -548952, -282728, -80380, -201903, -370943, -209253, 106985, 99472, -214960, -322372, -43920, 180789, 42690, -97782, 217862, 780178, 964047, 589799, 104499, -75482, -18564, 14948, -7675, 25527, 68632, -40141, -284104, -438004, -370545, -212668, -147900, -169356, -166502, -155840, -251425, -427673, -493945, -357692, -160799, -61876, -11070, 125479, 306591, 349066, 198592, 14529, -40049, 30278, 133054, 227873, 313261, 350116, 290985, 164543, 62884, 39877, 56437, 29246, -80538, -217151, -261839, -143123, 66667, 201046, 179212, 99485, 100838, 167210, 156926, 18384, -137706, -218537, -276815, -360831, -348360, -99695, 269621, 469944, 421638, 366054, 503827, 696145]
37596F96145j8728k33364j96529P629J36735J14362K8810n2360j13531j26125
37586B43044q5989n7059p7728q3361p287J03137J49504J04777J3972o2832o6448
37575A73730J8365R9772N9275p5769j61697j56370j41695j09537M2955K36384
37565a4587K06867p1197k44426q1973J55433J34530j8509K3568K00257J81013
37555D70976l1608r7555N8350J12260r2665k83226k31069j01949j03165j22643
37545d22294l86J19256L3179j19818n0137J99155K96425J20846q8764j21042n6899
37534i0479m7516m8961N5917K01906J98815J3601j70109k08417j73208j82809
37524d51260j75767k1525J95340K24821L0768j06802J513J56363Q6053j13965
$$ y = [696145, 677417, 444053, 247524, 255153, 391888, 506250, 535060, 482700, 369169, 243044, 157055, 99996, 22268, -61093, -68380, 34757, 184261, 289038, 303010, 240178, 173730, 192095, 291867, 351142, 275373, 113676, -42694, -184389, -293926, -250971, -14587, 192280, 121083, -123343, -205316, -49883, 84647, 66138, 89706, 289963, 470976, 439368, 341813, 400163, 512423, 419758, 136532, -94537, -196486, -299651, -422294, -422680, -303424, -270245, -390063, -440200, -241045, 55380, 176226, 87462, -33580, -90479, -137995, -186956, -131039, 70867, 269682, 283283, 113174, -95243, -268451, -451260, -627027, -648552, -453212, -228391, -197623, -304425, -302912, -146549, -60496, -174461]
37514a74461j41088K0263R4644j3429q7098r51P1638j519n3116R3549K96822K95598
37502D00852Q6168j24769k30246k64433k18759m9031J59966K37707J41978j7081
37492A22352j44365k00520j17158J29284L57034L08947O887k17702j49625K8255
37482A23389K4478j36123j79861m561J88891K00338P6303j6962k4020q966k7086
37471B15820p8247j29298j21455j8677J07100J27544M1308j3144J0688j3510j23946
37460D183j29710P3329K41670J23452j02380r0400P5530M48l18057m14735j13682
37449f50352J48388J9666k02890q4002K40319L16509R4875p0155j2759Q5177Q1398
37438c3826M6813N0196O2784P8720J08099R4823K7172J7445Q0867K0552k23825
$$ y = [-174461, -315549, -295286, -200642, -214071, -301169, -302120, -230482, -232001, -285117, -191568, 105254, 400852, 487020, 362251, 132005, -132428, -351187, -400218, -240252, -2545, 139433, 122352, -22013, -222533, -339691, -210407, 146627, 455574, 462461, 244759, 95134, 123389, 147867, 11744, -168117, -172678, 16213, 216551, 292854, 275892, 251872, 242906, 215820, 137573, 8275, -113180, -131857, -24757, 102787, 144095, 130951, 141639, 128129, 4183, -125527, -52198, 189472, 312924, 210544, 120144, 195674, 196122, -121935, -536670, -650352, -501964, -482298, -685188, -769190, -528871, -212362, -117487, -187642, -200401, -115224, -33826, 12987, 63183, 125967, 204687, 312786, 407609, 434781, 452226, 533093, 553645, 329820]
37427C29820l44506j09075J94244J53816j25173k30256j18365p4543j19392j1036
37417d54466K16338K73655J66236J69509K53035J09430k08203k90277q9609m576
37407A41072j34913j27860P4273O3054k13095k25485J70919L32865j04801n05423
37397e29394k22688L41989M31348J32970N1514K04427J35996j40475j99220m6887
37387A59580o8646k17793q7288K36378K26079j22256k08489J39460L61420J38741
37377E57186j02654j0067R5989j07490l05494j17459J91945J56249j15805j91001
37367E1399o1014n0299j48926l2125K90354L90044P7993k89839l29456j23484
37357b25353M078j7974J9615K19557L78192K44953j10182l26082j92782O4389
$$ y = [329820, -14686, -123761, 70483, 224299, 99126, -131130, -249495, -324038, -443430, -454466, -238128, 35527, 201763, 371272, 624307, 733737, 525534, 235257, 145648, 141072, 6159, -121701, -47428, 15626, -197469, -422954, -252035, 80830, -23971, -529394, -752082, -410093, 21255, 154225, 205739, 410166, 546162, 405687, 206467, 159580, 90934, -126859, -214147, 22231, 248310, 126054, -82435, 57025, 418445, 557186, 454532, 444465, 540454, 432964, 127470, 10011, 201956, 358205, 242400, 51399, -9615, -59914, -208840, -240965, 49389, 439433, 517426, 227587, -101869, -225353, -221275, -239249, -219634, -77, 378115, 623068, 512886, 186804, -5978, 58411]
37347E8411R8202n2622l0254K54774M22020J71665k34970l20448n2523J52859
37337D67114L4929k05565k45623m7993J64466J87616N364k13030k37328q123K25981
37326A27808J49212j86168l47690q1728K91366K82019p1394k39124L1295L37869
37316B93465K18675j68683l04318p9018J07626J1188j22756k8380J44130J12708
37306A84637q3609k07230k12963k14859j91051l8266J43908J39209j7546n2865
37296e50635J23549K81047K34815J05628Q6404J46278J24056j1566j42768j71794
37286B25014r9707J4447R2141O8726n2048j89283k43091j48588Q2394L11835L32786
37275C94626R3581j77721k11338k8491J16343R2315k268p5924j42075j44845L4733
$$ y = [58411, 156613, 103991, 73737, 328511, 750531, 922196, 687226, 366778, 314255, 467114, 502043, 296478, 50855, 2862, 167328, 354944, 360308, 147278, -90050, -98173, 127808, 277020, 90852, -256838, -338566, -47200, 234819, 163425, -75699, -44404, 293465, 512140, 343457, 39139, -39879, 67747, 78935, -43821, -72201, 71929, 184637, 101028, -106202, -319165, -534024, -725075, -763341, -619433, -480224, -497770, -550635, -427086, -146039, 88776, 194404, 280808, 427086, 551142, 539576, 396808, 225014, 125307, 139754, 231895, 300621, 248573, 59290, -183801, -332389, -249995, 61840, 394626, 488207, 310486, 99148, 70657, 187000, 279315, 277047, 201123, 59048, -85797, -51064]
37264e1064K85394K65785r6084l60686j31998L32303M32082N6370k99864k70078
37254A62160n2972K5715O15N0085R9141p352j37375p0901N5331o1384k90854j60991
37242c88782L42301N79341J55176m20681m15937P9726L27918L2639l10964k26729
37232b45992R1912J76229k9325j80310o0891J67215K12475P486k03684j35012
37222a99897J57404K73261p638l46428k67050J44803L44509J24693j24905o6871
37212C1881J03891N9771j40503k27586j50175l7393N8762J21157O0206j03244
37202b23233j39569N7187K33186J32717j00808j68241q0680o6918j54024j65542
37192f75925n0066Q4536J94240K88337K73671P5973j50077j84058n0726N8031
$$ y = [-51064, 234330, 500115, 404031, 43345, -88653, 243650, 675732, 732102, 432238, 162160, 109188, 134903, 135518, 185603, 284744, 277392, 140017, 69116, 124447, 63063, -227791, -388782, -46481, 532860, 688036, 267355, -148582, -68856, 259062, 291701, -19263, -245992, -154080, 22149, -7176, -187486, -248377, -81162, 131313, 138799, -64885, -199897, -42493, 230768, 223130, -123298, -390348, -245545, 98964, 223657, 98752, 31881, 135772, 195543, 55040, -172546, -322721, -360114, -301352, -180195, -119989, -223233, -362802, -305615, -72429, 60288, -40520, -208761, -289441, -356359, -510383, -675925, -725991, -641455, -447215, -158878, 114793, 190766, 40689, -143369, -194095, -136064]
37182a36064Q2215Q3549M6742n2689q7033M9653K06381J83313O1145L0923K2737
37171D90872j44806l39095k41276J10490L01234J30373j22239j35463K8153Q0198
37161A58441r6837l32201l54621o4008L24644M65935K79949L2589o2656r8476
37151B52759j79698j71375j437Q6178p0391j89756n553K00556M6330k20060p3027
37140c25474L56076M11024l1414l58558j98615Q5605J04257J2532O1826J16814
37130B34073j4759j91673k19283j68811j28410J8862K87815L97495J76377j31357
37120B60329k25753j35782j6190J30058K80441K51786m391k36654k54509j74780
37110a25445j10023M8026L00399L67295J31694r9753q8599m7318j80520k37063
$$ y = [-136064, -53849, 29700, 76442, 23753, -63280, -13627, 192754, 376067, 437212, 468135, 490872, 346066, 6971, -234305, -123815, 177419, 307792, 185553, 50090, 78243, 158441, 61604, -270597, -625218, -689226, -364582, 101353, 381302, 413891, 351235, 252759, 73061, -98314, -99751, -13573, -83964, -273720, -279273, -78717, -32387, -252447, -325474, 30602, 441626, 410212, 51654, -146961, -61356, 42901, 55433, 117259, 234073, 219314, 27641, -191642, -360453, -488863, -470001, -182186, 215309, 391686, 260329, 34576, -101206, -117396, 12662, 293103, 544889, 540498, 303844, 49335, -125445, -235468, -187442, 112957, 480252, 611946, 512193, 423594, 376276, 195756, -41307]
37100d1307L1978L16722J79776k10849l35024j31304J1808k7464J8921K09979
37090B3236K36288j7044k23640j25009Q6185J09042k3566p6852J55M5440l3772
37079D63j15357k1872K23009L52762J53902k09878l39755j26255Q8591J1984j84035
37068a66441j84558l9087j1459q5050j8395J71857K04578L9019k3910J41170K47769
37057B75493P8263j27280m6293J96269K08021p2835k94138k09050J1124P8925
37047I8499j4058o2930J6325R6406N1305p7799j43636m2097J91283L67912K74639
37036G55849p7902l79310l35447l1374J91342J88036J12183P1823p852j08726
37026C78622n3519J25853J07315j98238l96792j97837R5449Q0922q3899j4107
$$ y = [-41307, -9329, 307393, 487169, 276320, -58704, -190008, -178200, -205664, -186743, 23236, 259524, 242480, 18840, -106169, -19984, 89058, 65492, -11360, -11205, 34235, 463, -114894, -136766, 86243, 439005, 592907, 383029, 43274, -82981, 5610, 17594, -166441, -350999, -390086, -401545, -486595, -504990, -333133, -128555, -89536, -113446, 27724, 275493, 353756, 226476, 180183, 376452, 584473, 511638, 217500, 8450, 19574, 98499, 84441, 21511, 37836, 134242, 185547, 107748, -35888, -77985, 113298, 481210, 755849, 677947, 298637, -36810, -68184, 123158, 311194, 423377, 495200, 487348, 378622, 325103, 450956, 558271, 360033, -36759, -234596, -139147, -58225, -142124, -156231]
37016a56231J84877J20262j45145j89577R345O6966o0390N703L04360L62008j6759
37005D85419l89339l65856j26559K0008R8210J98818K05397P6045J290M7077L6983
36994B87493m0508K7078J75917O3853k44796k37362J43651K76346q6372l11297
36984E4003L4788L70246P2659m26182l77059K0157M5030k63574k70785O3978J79419
36973d97320r342p837K70149L43851R6098j6824J41743J23942k23338l99984j07859
36962b86721K34154K10534K7768P052J5217j45297k44557q866L40598L80625Q3581
36951F14088k34480l54633k55940P1K20950J52847j46453k49441O3575M27083
36941B37667L91656N7719j42007r5892n4317j29878j61185o9346L789k4401m6032
$$ y = [-156231, 28646, 148908, 3763, -185814, -176469, -109503, -169893, -164190, 140170, 502178, 485419, 96080, -269776, -396335, -376327, -278117, -79299, 126098, 202143, 203433, 250510, 287493, 246985, 274063, 449980, 513833, 269037, 31675, 175326, 451672, 365300, 54003, 88791, 459037, 531696, 105514, -271545, -251388, -206358, -469932, -740717, -676739, -497320, -506662, -514499, -244350, 99501, 195599, 178775, 320518, 444460, 221122, -178862, -286721, -52567, 157967, 185735, 192787, 208004, 62707, -181850, -190716, 149882, 530507, 614088, 379608, 24975, -230965, -230894, -9944, 142903, -3550, -252991, -189416, 237667, 629323, 687042, 545035, 449143, 394826, 264948, 103763, 34417, 38206, 13805, -32227]
36930c2227k22K990q4720j04499N4505K10355J14567j50034k38760l4467J74343
36919h8169J25690k7751N051J49580P7222k14485l17533k3260L27573L19357J8550
36908C51825j99119j71849l1524P9341R5719m0251k67957l31653q4854K21957
36898c78365K39472K6617m9986J14066K25188P0985j68621k12009n7935P1909
36888a18679M3443p3493j53448j78345k12366k34587r9138K27258M77109L60212
36878C7966J4623j13445R6600K57080P1126k27285k72064r6654L1809N2825O4084
36867h3335M9359j7602R512K01196L08583J06022k03099k72382j26594k6028j916
36856e6284O7449Q7702r0282k64572j16889K17685K98033O7548q5732K0789J34268
$$ y = [-32227, -32449, -29459, -114179, -218678, -164173, 46182, 160749, 10715, -228045, -262512, -88169, 37521, 9770, 14821, 164401, 241623, 27138, -290395, -313655, 13918, 333275, 351825, 152706, -19143, -50667, 28674, 124393, 84142, -183815, -515468, -600322, -378365, -138893, -112276, -162262, -48196, 176992, 247977, 79356, -132653, -190588, -118679, -75236, -148729, -302177, -480522, -692888, -927475, -1026613, -799355, -322246, 37966, 52589, -60856, 35744, 292824, 363950, 136665, -135399, -232053, -200244, -147419, -83335, -33976, -51578, -42066, 159130, 467713, 573735, 370636, 98254, -28340, -54368, -56284, 11165, 98867, 8585, -255987, -372876, -155191, 142842, 210390, 124658, 145447, 279715]
36845B79715O7342k3233J511J5414q5735j70764j20575l3117k5579l5493M5283
36834h5231J79966K22857P1997k09162l67321j75501K23537L83397J28889j78428
36824A95000j78382k2358j7911p4542M3820J73479L009k98254k83112K9619J95961
36813b33671R7911O0829J90095J87863n1362k14746j15435K1316N727j8204P8112
36802H435J45441M9295r0667j25399p9368k1598K5169J0867n7670k859K51297
36791A12943L95381J20439l12001l67046m5593J37294k3038j81863q4943J11227
36781a37200K46147L35227K58158j52047n96196n04773P6692M18765J52744k34070
36771a36553k27769N015R6494Q8345J38582J13984p9030j73212K2817K32061J49520
$$ y = [279715, 347057, 323824, 325335, 340749, 255014, 84250, -36325, -69442, -95021, -130514, -85231, 94735, 317592, 389589, 180427, -186894, -362395, -138858, 244539, 373428, 195000, 16618, -5740, -23651, -98193, -54373, 119106, 122115, -176139, -459251, -429632, -233671, -135760, -74931, 115164, 303027, 251665, 36919, -78516, -57200, -51473, -69677, 8435, 153876, 203171, 112504, -12895, -92263, -113861, -88692, -77825, -135495, -138354, 112943, 508324, 628763, 316762, -50284, -95877, 41417, 18379, -163484, -248427, -137200, 108947, 444174, 702332, 550285, -45911, -550684, -473992, -55227, 97517, -136553, -364322, -359307, -262813, -174468, -35886, 78098, -932, -174144, -151327, 80734, 230254]
36760B30254o5730j11337k6240N172K0014R9485J13773l6968j97962k32910k18335
36749d20784j62705P1775L50475K64187j53335k54778K49815O96314L99738k85796
36739G54906n03688j45962J47405M1005j55599j55039o8187m6457m7424n0614
36729b29654j20082j81974o3389J95217L38304K39763L2134j06372j12670k6296
36719c5019L0496n9424k12054j77941Q6888K83119J79373n6797j49385j06133
36709b16877p7392n1967L0893P4143O148l2631M3260M9637j10241j47845J57009
36698b75863M53076K56456k66378m89331k49233k8777j47315k99095j20022K13497
36688i52985K88808J01315K7114K31406M24726K79570j21216m02534l66114j62115
$$ y = [230254, 164524, 53187, 26947, 32119, 52133, 151618, 265391, 228423, 30461, -202449, -420784, -583489, -511714, -161239, 102948, -50387, -305165, -55350, 640964, 1040702, 754906, 251218, 105256, 252661, 293666, 138067, -16972, -85159, -131616, -179040, -229654, -349736, -531710, -595099, -399882, -61578, 178185, 210319, 103947, -8723, -35019, -4523, -63947, -276001, -453942, -367054, -83935, 95438, 38641, -110744, -216877, -294269, -346236, -315343, -241200, -235052, -267683, -224423, -174786, -285027, -432872, -275863, 177213, 433669, 167291, -322040, -571273, -600050, -747365, -1046460, -1166482, -952985, -664177, -562862, -535748, -304342, 120384, 399954, 278738, -123796, -489910, -652025]
36678f52025M14J09645K19437K51674J27569k2266n612J37438K00205J11576l1248
36667D46807j50676j92340o2655J72085J80761j88737n19499l29329J55467K77004
36657b11112m3249j98324J08840M14826K82912n0498j69782j34988k31594m17599
36647f50568m21094j74423J40628L16725K33531m4062k06604j7844K87928K92430
36637b43353O3253M5495K68609K77789k6739j65486O9214K29466J6879j99252
36627C35875q3995Q3238N894o3919J11728K06074p2758l60280k36559L4155J1667
36616b8880j26893P391K24620J08157j73445j55574Q1552J02072o5424l9895J32757
36605F6438N7105k30821k77962n758J78474J04165N3525J66568J94754j128j69702
$$ y = [-652025, -651611, -541966, -322529, -70855, 56714, 34448, 28836, 166274, 366479, 478055, 446807, 296131, 103791, 41136, 213221, 393982, 205245, -314254, -643583, -488116, -211112, -254361, -452685, -343845, 70981, 353893, 303395, 133613, -1375, -232969, -650568, -1071662, -1246085, -1105457, -788732, -555201, -599263, -805867, -823711, -535783, -243353, -180100, -134605, 134004, 411793, 385054, 219568, 288782, 518248, 535127, 335875, 251880, 335118, 341012, 277093, 388821, 594895, 522137, 161857, -74702, -40547, -28880, -155773, -148382, 76238, 184395, 10950, -144624, -63072, 39000, -26424, -66319, 66438, 123543, -107278, -385240, -390998, -212524, -108359, -54834, 111734, 306488, 305360, 135658]
36594A35658o2744K12501L59972K07216j61597m29229l08896O4291K26074M2543
36584B85789p2081J32398K58264o9703m77753l77181R5714L16510J28564p7561
36574A42960q2977j6379P1710K14199K16162p3579l01650m4845M03399L64598
36564H93598j53084m40330j96715P8556j3477j66191K0058L61981M13394J09275
36554I07065k41362l86739l19704j76586q8806n3810M9450K27556K82666J22001
36544C21731l5841j0060J5897j55687l05313j38636J52900J72752K179M6287K82024
36533C48233K60374j08183l52093j66186J58706K33129Q4369m8671j04494j43245
36523A61939j37108m5002L5120k9635j92498k28335R586L43621L84929J9792l33497
$$ y = [135658, 72914, 285415, 645387, 852603, 691006, 261777, -47119, 17172, 243246, 285789, 213708, 346106, 604370, 534667, 56914, -320267, -224553, 91957, 220521, 142960, 59983, 43604, 115314, 329513, 545675, 472096, 170446, 125601, 529000, 893598, 740514, 300184, 103469, 182025, 168548, 2357, 22415, 384396, 797790, 907065, 665703, 278964, -40740, -217326, -306132, -359942, -310492, -82936, 199730, 321731, 285890, 275830, 291727, 136040, -169273, -307909, -155009, 17743, 19922, 66209, 348233, 608607, 500424, 148331, -17855, 140851, 373980, 458349, 409678, 305184, 161939, 24831, -20171, 14949, -14686, -207184, -435519, -425933, -82312, 302617, 322409, -11088]
36512a1088k23553J68831K75333K2845q5049J25776J74418j92444m56797j55171
36502c56899L26588L74252Q5281m9093j800p3488k08519j28390P2156R1495o949
36491A24634L3274J27847N8237k1208J27133K64914L2161l52984l88786r8024
36481i2802R3785J06610J80789K66539J05659j94611l03059k59600l18442l54384
36471g69516p2266L39451M30383K32117J22023R8786j04057l28949j78155K00743
36461b9440K76665L5747l9210J32389J26893j50961k94422j49075l3792r0797
36451b16003p1216J07552J95480J10966N5795O4899k8071j60880j13813J6303
36441c8988l3939j34207N5255M05754M52345J54089r6612j56436j93480j67390
$$ y = [-11088, -234641, -65810, 209523, 232368, 147319, 273095, 447513, 255069, -201728, -356899, -30311, 343941, 429222, 380129, 378329, 304841, 96322, -32068, 40088, 131583, 124634, 157908, 285755, 343992, 322784, 449917, 714831, 746992, 394008, 5222, -92802, 983, 107593, 288382, 554921, 660580, 465969, 162910, -96690, -415132, -769516, -841782, -502331, -71948, 160169, 282192, 380978, 276921, -52028, -230183, -29440, 247225, 282972, 243762, 376151, 503044, 352083, 57661, -91414, -125206, -216003, -287219, -179667, 15813, 126779, 182574, 247473, 219402, 58522, -55291, -38988, -72927, -207134, -151879, 253875, 706220, 860309, 763697, 607261, 413781, 246391]
36431B46391P5154K80467P5860l04829l15944k9615J1349k07849j72113J79526
36421a61603L44508J91032J32807K59156J55361k29869l71169o5619K10696J08226
36411E73526j13169j54136j08033j01718o5421k7547j18197j95767l99L06364
36401d497L21601Q6256j7082K5378p5384k24189p0161K32678J82950j60655k26229
36390G0666R5956L10738J87434J0390o3444j52581j69163O2052K62821N5598k57824
36379D12643j19662K31533R1859m37247n57366j23065J92550J21580J08502K93292
36369B14619K56667n7099j69999J4682P2877o5736m4907R0891j8361j74579R4903
36358B13958M56756J72701m76205m90669J10966K90678j60031k87944K34653N28357
$$ y = [246391, 321545, 602012, 677872, 373043, 57099, 27484, 38833, -169016, -341129, -161603, 182905, 373937, 506744, 765900, 921261, 691392, 320223, 254604, 465300, 573526, 460357, 306221, 198188, 96470, 31049, 3502, -114695, -310462, -310861, -4497, 317104, 403360, 386278, 411656, 336272, 112083, 41922, 274600, 457550, 296895, 70666, 166622, 477360, 664794, 675184, 611740, 459159, 289996, 352048, 614869, 670467, 412643, 292981, 524514, 616373, 179126, -378240, -501305, -308755, -187175, -78673, 214619, 471286, 414187, 244188, 258870, 331747, 266011, 221104, 311995, 293634, 119055, 213958, 670714, 843415, 367210, -123459, -12493, 278185, 118154, -169790, 64863, 593220]
36348E93220J44434j91169p429J29701j44953k86282K1172K40065P4521J693J92308
36337G67281J12436l06023l58621P8500K07666j75296k31833K82403M22036j95899
36327F02650n52874j2658N06138J45818m38900l34133J21580J89245M2393J52418
36317D21677K85135R5712j14068o8031q1252k42519j1301O63655Q88574K43151
36307B080733m22774l79697j05746j98910l33043j36155l255j90473j88614J94864
36297C16930K69614k18269m15293J28679N36390J41154l09413l6082L92203J86011
36287I91924k60771k32048L8036L0366m8404R7553J22087j71657k60202P7378
36277C84262J95020k03161m03594q08L18781Q1501j31734P7756J50131j94177
$$ y = [593220, 737654, 546485, 539056, 668757, 523804, 237522, 258694, 498759, 573280, 574973, 767281, 879717, 573694, 215073, 293573, 501239, 325943, 94110, 376513, 798549, 602650, 49776, 37118, 543256, 689074, 250174, -83959, 37621, 226866, 269259, 421677, 706812, 802524, 688456, 620425, 539173, 296654, 285353, 949008, 1837582, 2080733, 1657959, 1278262, 1172516, 973606, 640563, 504408, 501153, 310680, 122066, 316930, 586544, 368275, -47018, 81661, 618051, 759205, 449792, 413710, 805913, 991924, 731153, 499105, 537141, 567507, 519103, 616656, 738743, 567086, 306884, 384262, 579282, 376121, -27473, -28281, 290500, 372001, 240267, 318023, 468154, 273977]
36267B73977k93410J08532K68475o5706r3833L84202M26820j80868l45949K15664
36257F97904K78199n18035p39301K30091Q72639K03272m85781q6503L61139j14200
36247F99424m57398K46134P83475M6376p68612l17514M55973K06168l49626m9873
36237D94527M16881M2937m04361J1491M23237q4958n34417L2216N69203P5185
36227A041941l78949J66822N06472l16465q28509J66176J062240K99445o69879
36218A049294j05453P50397J63048p32364k54212M99999m5843o78063J68615J085542
36208A900960L14776p24103j39279P23212J5549q25811K7582R08749j51886j255948
36198G93801j24688J268372L33230j006095L3826J530716M99231j156707k73016
$$ y = [273977, -19433, 89099, 357574, 291868, 198035, 582237, 1009057, 828189, 482240, 697904, 976103, 458068, -281233, -51142, 821497, 1024769, 538988, 452485, 813624, 699424, 242026, 488160, 1271635, 1318011, 549399, 231885, 687858, 894026, 544400, 494527, 911408, 954345, 549984, 561475, 984712, 899754, 365337, 397553, 966756, 1041941, 662992, 829814, 1336286, 1019821, 191312, 357488, 1419728, 1719173, 1049294, 943841, 1694238, 1857286, 1124922, 870710, 1370709, 1324866, 646803, 815418, 1900960, 2215736, 1491633, 1352354, 2075566, 2091115, 1265304, 1292886, 2201635, 2049749, 793801, 669113, 1937485, 2270715, 1264620, 1298446, 2829162, 3328393, 2171686, 1898670]
36189A898670J297784L60660j087843K28942J986180N88540j354862K07887K523037
36180F648995J197742p15257J555147M412523K489513J68687L804037Q081570
36172B7642957N371056K662782J0224563J9330425J6260194J4986254M2237898
36165A38716129Q3562664Q2422125J5049189o5121205q8892558n5327943k0029975
36158I0378426j5089028k0978456j4518457l612723l104252p598744n785204j121314
36150A8570248j797158m548230k715653N57213n16622k957132j522389J040397
36142F110674o7322k259271j004101J301673K91895j872619r29090J275318N98007
36133C445164j476192r81001R81126P21627r76143p67427P77657O58142o93127
$$ y = [1898670, 3196454, 3557114, 2469271, 2698213, 4684393, 5272933, 3918071, 4125958, 6648995, 7846737, 7131480, 8686627, 13099150, 15588663, 15757350, 19561387, 27642957, 33014013, 35676795, 45901358, 65231783, 81491977, 96478231, 138716129, 222278793, 304700918, 319750107, 254628902, 165736344, 110408401, 90378426, 75289398, 54310942, 39792485, 36179762, 33075510, 25476766, 19691562, 18570248, 16773090, 12224860, 9509207, 10066420, 9549798, 6592666, 5070277, 6110674, 6043352, 3784081, 2779980, 4081653, 4373548, 2500929, 1571839, 2847157, 3445164, 1968972, 987971, 1969097, 2690724, 1714581, 947154, 1724811, 2382953, 1689826]
36124A689826o25286M52673J79795r55074o96246N08287N11632l76859k87047
36115D01701M57878K51172m33001j25142N21642O7292o55272j03411P78326K05270
36105A366455r81572p72882L54329M71795k54110k14687M48428L58001k61791
36096E13966j50636L84253J43913m76126k60146L76526K04678l78447j62499M56186
36086F51668K64903l77381k95634J72176p6171o31659l49968L69622L45144j14241
36076d1541O2678M87227R7948n77835k81507N16886L73275m61780m92060L05376
36066a1333N35655o7266l60943K0935K35519k1770j55108l7958j19831k67478
36056b49578M407L66849J70392k42745j39636J59850p4282m31215m8300O47042
$$ y = [1689826, 1064540, 1517213, 1697008, 741934, 45688, 553975, 1065607, 688748, 401701, 859579, 1110751, 677750, 552608, 1074250, 1141542, 486270, 382859, 1161185, 1366455, 384883, -387999, -33670, 438125, 184015, -30672, 417756, 775757, 513966, 363330, 747583, 891496, 415370, 155224, 531750, 736428, 357981, 195482, 651668, 916571, 539190, 243556, 415732, 339561, -292098, -642066, -272444, 72700, -41541, 21137, 508364, 606312, 28477, -253030, 263856, 637131, 175351, -316709, -11333, 524322, 457056, 96113, 117048, 352567, 330797, 175689, 137731, 17900, -249578, -245171, 121678, 292070, 49325, -90311, 69539, -4743, -435958, -484258, 162784]
36046A62784N49880j77859m32133q5760M6343j48047p2916J90408L6752l42301
36036b72849k43961J80961K26548j5877M0742K14181k2799k89561Q4077O30447
36026E31909M35210j80107k16737J89082J41754k10740K5096O51012O00699j15179
36016A851999m11632o6398K1887m02713n51001j46259J15233q0542k03311j7699
36006A09564N8404o1286M0829L13044K10837k30627l79579j40201m6927j95639
35996c21581j38444J40127J89656L1428R8855K85140R6162l07409k89358R6152
35986a19272J89353p4911j23866J36124K19691M9156J2065Q3656r6665l57475
35976h2144k17942J39978J45404p7907L3868L41512K48524r7555m6524K71967
$$ y = [162784, 712664, 534805, 102672, 16912, 63255, -84792, -157708, 32700, 69452, -272849, -516810, -335849, -109301, -125178, -84436, 129745, 106946, -182615, -98538, 531909, 967119, 787012, 570275, 759357, 901111, 690371, 715467, 1366479, 1967178, 1851999, 1440367, 1373969, 1395856, 993143, 442142, 295883, 411116, 330574, 127263, 109564, 167968, 106682, 147511, 460555, 671392, 440765, 61186, -79015, -125942, -321581, -460025, -319898, -130242, -98814, 41, 285181, 381343, 73934, -215424, -119272, 70081, -4830, -128696, 7428, 227119, 276275, 288340, 371996, 275331, -82144, -300086, -160108, -14704, -92611, -58743, 282769, 531293, 433738, 387214, 659181]
35966F59181J58375k85208k95326J03635J29824k68007l15031J04767K30330j28109
35956I4431k53925J00568K77399k9939k76511j51612l6192p6091Q4873L61841
35946I4842J61795m24602n18270Q7206M99732J98932j80750n0872J94792M1293
35936A04098k59461k68201p6912O2180J62615J80541o4394l64265k39166J97491
35926e65474K82326p9968k19483J23579L60677J33938r7478K8224J59589J73j33785
35915g682j3135K1464k27783l50340p2493K14320J54983J2708Q1539J45630o208
35904d6997j21343K427J03814r774o7841J05976J90531m2476k50702q4768K22637
35893A484K63337O4317q6308q7871N0J20057J42531m0899k28702j07439J89913
$$ y = [659181, 817556, 532348, 237022, 340657, 470481, 202474, -112557, -7790, 222540, 94431, -159494, -58926, 218473, 188534, -87977, -239589, -275781, -351872, -266999, 94842, 256637, -167965, -686235, -599029, -99297, 99635, -81115, -131987, 62805, 104098, -155363, -423564, -500476, -438296, -275681, -95140, -159534, -523799, -762965, -565474, -283148, -363116, -582599, -459020, -98343, 35595, -61883, -33659, 125930, 126103, -7682, -20817, 647, -227136, -577476, -649969, -435649, -280666, -267958, -186419, -40789, -46997, -168340, -165913, -62099, -71873, -139714, -33738, 156793, 114317, -136385, -221153, 1484, 264821, 329138, 242830, 154959, 155009, 275066, 417597, 376698, 147996, 40557, 230470]
35882B30470J97541j37297l50259j96810N6535J75983K21979J71497j07636l90263
35872a28260k44355K10307L51555K4994k15311l5668J98248J26788p5024j55887
35862E7387j72663j58321J5004K21453J19229k08658k70634R626J56589J641n5348
35851b84695J39720J92077m9255j68736K0746J30248p091J3782L13283L37499
35841F37578j67043n68489l30770J27874J91768J7723O6896K29010J32863j02117
35831B35293j08503O0492R4133k6225j29284k07717k53758r0101K45222L46231
35821A65783O4475j59953r445J64733p549k28017p6678K07410J45290j40038j73865
35810d7854L8404Q7753r7091j90568n9277J07169J81542J80237N6609j91700l28602
$$ y = [230470, 428011, 290714, -59545, -256355, -199820, -23837, 198142, 369639, 262003, -128260, -372615, -162308, 189247, 214241, -1070, -36738, 161510, 288298, 213274, 57387, -115276, -273597, -258593, -37140, 82089, -126569, -397203, -387577, -230988, -229347, -284695, -144975, 47102, -2153, -170889, -150143, -19895, -26986, -13204, 300079, 637578, 470535, -97954, -428724, -300850, -109082, -91359, -24463, 204547, 337410, 235293, 126790, 187282, 281415, 255190, 125906, -81811, -335569, -425670, -180448, 165783, 230258, 70305, 60860, 225593, 218044, -9973, -86651, 120759, 266049, 126011, -47854, -9450, 78303, -18788, -209356, -268633, -161464, 20078, 200315, 256924, 65224, -263378]
35799b63378j67504Q1047J08382n452K1470J61237J59863J7946k2052Q1684J08571
35788B81814m5297k22042k49367j18204P2903J89388J29035m6287j25552n876
35778a39485J66728K01843Q4970p3697j66155j19527L5222J23108M4111k4870
35768A32248Q6631J63127q9974m34517l31650J74247M03804N0525l54080k72142
35758d71781R4952K69567K20626J78390J19490q4147k78177k32297m4032K8524
35748a98885l2605p5403o7262m1891N2375K00748K19802M3196j02020l1953J01091
35737F7193P4791o6137j54124j56677r3232O5035K24620J67841p9304j67565O3267
35726e4292K90776J87290r4693k05298j15167m2590n9880o6852j6027P2464J91825
$$ y = [-263378, -430882, -349835, -241453, -246905, -225435, -64198, 95665, 113611, 91559, 173243, 281814, 236517, 14475, -234892, -353096, -280193, -90805, 38230, -8057, -133609, -139485, 27243, 229086, 314056, 240359, 74204, -45323, -10101, 113007, 157118, 132248, 218879, 382006, 292032, -142485, -474135, -299888, 103916, 154441, -199639, -471781, -376829, -107262, 113364, 291754, 411244, 327097, 48920, -183377, -227409, -198885, -231490, -306893, -374155, -416046, -363671, -162923, 56879, 100075, -1945, -33898, 67193, 141984, 75847, -78277, -234954, -328186, -263151, -38531, 129310, 50006, -117559, -54292, 236484, 423774, 329081, 123783, 8616, -33974, -93854, -160706, -176733, -104269, 87556]
35715H7556K66878J49319j45519l65355l27333j31902L0491R3493O2177k7748
35705c07943m1469J10727K36039P8888k09569k19473M8685J30514j52189l75273
35695g01063j75697K09676L46905J76638p9014k46956k12019P3826L91894M04733
35685A88923J59752N5544J73233J31896j95738l79483j45487J49415J34849M352
35675B77256M1072N5166j91858m16701k31617J73369L07294J09961q3700j16481
35665g6239r2075m9286L7677P4408n99m7065J0884m707j57784j56751J58555M15287
35653A12305K28715j58320k26465O1091L20562L65343K86948R7108k17567m10811
35643D58909k32810J05608J74199l5417j45821k0545R1682M1167k3318l614k6556
$$ y = [87556, 354434, 503753, 358234, -7121, -334454, -466356, -435865, -342372, -280195, -307943, -349412, -238685, -2646, 76242, -133327, -352800, -304115, -173601, -325790, -701063, -876760, -667084, -320179, -143541, -222555, -469511, -681530, -607704, -215810, 188923, 348675, 404219, 577452, 709348, 513610, 134127, -11360, 138055, 272904, 277256, 318328, 373494, 181636, -235065, -466682, -293313, 13981, 123942, 40242, -76239, -168314, -217600, -179923, -105515, -106114, -153179, -142295, -147002, -304786, -461537, -302982, 112305, 341020, 182700, -43765, 17326, 337888, 703231, 990179, 1087287, 869720, 458909, 226099, 331707, 505906, 470489, 324668, 304123, 395805, 436972, 413654, 410040, 383484]
35632C83484j59369k43977j39868O6455J84306J22555n4625j73810q6541J39647
35622C8257K36873O1797j87179k17644k4826J24899M3849j68214k55834r7784
35612d45806J29340J28736j13570k43058k5021K64136K35876M332l3760Q6016
35602a2779l4425l65016l61479J52955O12721N07635N3761k50593k88385k05719
35592a91324l9971J68491K20643M1852j51156j95841j85935j59118J6798K61725
35582b13836K53159J037n7201J97023K80232q3035m36457l16182K9521J31740
35572b13999K7209j5768m0173j40998r8101J90767L34793O5164k05853l8899K53024
35561A17166J50188j48978j02070J92687J89182j28065k58125q3557O081j16382
$$ y = [383484, 224115, -19862, -159730, -93275, 91031, 213586, 158961, -14849, -101390, 38257, 275130, 336927, 149748, -67896, -92722, 32177, 76026, -92188, -348022, -445806, -316466, -187730, -301300, -544358, -569379, -305243, -69367, -65035, -98795, -12779, -47204, -412220, -773699, -620744, -8023, 499612, 553373, 302780, 14395, -191324, -231295, -62804, 157839, 199691, 48535, -147306, -333241, -492359, -475561, -213836, 39323, 40360, -16841, 180182, 460414, 377379, -59078, -375260, -345739, -213999, -186790, -202558, -242731, -383729, -481830, -291063, 43730, 108894, -96959, -135858, 117166, 267354, 118376, 16306, 208993, 398175, 270110, 11985, -71572, -65491, -181873]
35551a81873j30626P7843K05240R0214l5989J1894J07558Q9743k7204j61419k16350
35540a70969p7464J91098K85710P7247j18885j0744J83179J07516j28126j79198
35530A59364o6736m9689r1910K2536J92973J41739o1420j11245o041K420r3520
35519C8471p5090O4635J33081J07613J00550P4211l4681p6667M2288P9787j38502
35508C15696l05644j08679J70412R1353j71605j24706J82430K53819k1960k76703
35498D413l03053j95471K4108L22131L58609p1105m72911k56967K55023K48591
35488h6632k50914l94174Q4191M43129J80146k03716j16304K01928K06173n9104
35478D723j57948n91J13440O878j78879k16715l6856J99165K40128O3582n0004
$$ y = [-181873, -312499, -234656, -29416, 60798, 24809, 36703, 144261, 234004, 206800, 45381, -170969, -248433, -57335, 228375, 305622, 186737, 175993, 359172, 466688, 338562, 159364, 92628, 42939, -48971, -26435, 166538, 308277, 246857, 135612, 129571, 131991, 38471, -36619, 28016, 161097, 268710, 369260, 443471, 408790, 332123, 374411, 454198, 315696, 10052, -98627, 71785, 163138, -8467, -133173, 49257, 303076, 281116, 4413, -298640, -494111, -470003, -147872, 210737, 139632, -333279, -590246, -335223, -86632, -337546, -731720, -647529, -204400, -24254, -227970, -344274, -142346, 63827, 4723, -153225, -153816, -40376, -33498, -212377, -429092, -465948, -266783, -26655, 36927, -13077]
35467a3077N8189J32823o2358k71250j40286J45190J52095n9076q1961Q6042R0493
35456C6824o8827n5236J09015O6264j45784j10285J63671J98423p4598j58314
35446c8847J03382K31048q173j71457M5627K56013P9406k03178j69225N8538J13145
35435B96279j5669r9893q0792k2131O3646J02581k1546j71168n7188K24100K23350
35424D41569j21737l14723j13414N6100j53973m02802k50377J06458J97573K7918
35414e27408m7205N5699J25853R1845O7962P6710N1292K2553N3129Q5610M7101
35403A03141j2437k5338q464K6691Q4696O4538j25121k97485j49110K51376M79522
35392C92009L33737L4644k16073m47019n87207m09134J2186K48521J48824O5135
$$ y = [-13077, 45112, 177935, 115577, -155673, -295959, -150769, 1326, -57750, -139711, -53669, 36824, -32003, -87239, 21776, 88040, -57744, -168029, -4358, 194065, 119467, -38847, 64535, 295583, 287410, 115953, 161580, 417593, 496999, 293821, 124596, 183134, 296279, 280610, 180717, 99925, 77794, 141440, 244021, 222475, 51307, -5881, 218219, 441569, 319832, 5109, -108305, -52205, -206178, -608980, -859357, -752899, -555326, -527408, -574613, -518914, -393061, -301216, -233254, -156544, -105252, -82699, -29570, 56040, 103141, 90704, 65366, 56902, 83593, 168289, 232827, 107706, -189779, -338889, -87513, 392009, 725746, 760390, 544317, 97298, -489909, -899043, -886857, -638336, -489512, -424377]
35382d24377K12652K96097Q7224j13578n03J81008P2365j52806r9918J38252J29156
35371C25572j58605k81149j5301K93996K24566j51798l74907j77430J98911L23789
35361B07644J26862n7971j9977L9331p4638j56189K8751K49540J52891j09287
35351C86957j32623J7023m8425k62326j74298J89969K79719m3648k56249p7354
35341a21255R5387l5667j42091P9040L35897K69605L4022q3917j50740k72643
35331G638k46447M4518K93276K41340J04868J41787J86458J6710j92722j93419
35321D04007r6926j00133j11121j4418K5877j16142k34603j43938R196P0601J30923
35310a76677J85120L351l46187l63932J01936M68495K66687j36298j78739K5175
$$ y = [-424377, -211725, 84372, 171596, 58018, 57515, 238523, 310888, 158082, 58164, 196416, 325572, 166967, -114182, -129483, 164513, 389079, 237281, -137626, -315056, -116145, 207644, 334506, 276535, 256558, 295889, 221251, 65062, 93813, 343353, 496244, 386957, 254334, 271357, 222932, -39394, -213692, -23723, 255996, 212348, -43901, -121255, -25868, -61535, -203626, -124586, 211311, 480916, 514938, 431021, 280281, 7638, -238809, -194291, 98985, 340325, 445193, 586980, 773438, 790148, 597426, 404007, 307081, 206948, 95827, 81409, 107286, -8856, -243459, -387397, -378201, -307600, -176677, 8443, 11794, -334393, -698325, -596389, -127894, 138793, 2495, -176244, -151069]
35300a51069M4284p2089N001K09313K18952L5186r6667j14672o3370J07345K76368
35289C98582Q9512m10449n78322r6016M24597L63019M7339O9906K14227m5162
35279D77233m40316l21836J35571J86529j96079l20261N380K64971K56026L08857
35269C56075M03161Q6718n23992o58791j29196K81581O8870k32217m6405K85879
35259a08317J94081j27874j25788J67492K83877J31117K1201N5069L1343j02553
35249D19648j66230j01689n2708p4598m7789Q3285J94040J52311j8051j79845
35239B08374k24317j55987n4742L7756J44757K39451K06795J4244j84965k42289
35229a0923j96036j31745j3254J66765K38237R7326n1844K5002K03269J89216
$$ y = [-151069, -106785, -178874, -173873, 35440, 254392, 289578, 192911, 78239, 14869, 122214, 398582, 488094, 77645, -500677, -596693, -172096, 190923, 238262, 308168, 522395, 477233, 36917, -284919, -149348, 37181, -158898, -479159, -473779, -208808, 47218, 356075, 759236, 845954, 321962, -336829, -466025, -184444, -115574, -347791, -394196, -108317, 85764, -42110, -167898, -406, 283471, 414588, 435789, 490858, 522201, 419648, 253418, 151729, 99021, 24423, -23366, 59919, 253959, 406270, 388219, 208374, -15943, -171930, -226672, -188916, -44159, 195292, 402087, 416331, 231366, -10923, -206959, -338704, -351958, -185193, 53044, 150370, 98526, 123528, 326797, 516013]
35219E16013j0275j27798o5689L2509P6053P7138l0407k95553n15097m14906m4810
35208h02822K85589M04699L39050J01864k32790l67824j04177K56046K54545l6589
35198I7591j34052Q3771K32296R2250q9785r7860o5733j19100j23715p34P4445
35187e0626J72n1745L1408P6200n7998k03833j51082K8141J18103N6649n7566
35176b62177j14898n8882O3474R0398m8181j45889J7113K70841K37629q3760k82337
35165c16669j39741J02249J80228J44694J13192M0706q3943j27861p9237j20445
35155b86827k62896k32017P2352L24714K48829N1876O8935K11538J33297j91478
35145A38323m12439l00168j6547J43670R1112k4260j2911J45279K61006J42654
$$ y = [516013, 505738, 377940, 312251, 344760, 420813, 497951, 467544, 171991, -343106, -758012, -802822, -517233, -112534, 226516, 328380, 95590, -272234, -376411, -120365, 134180, 97591, -36461, 47310, 279606, 371856, 282071, 184211, 118478, -622, -124337, -125071, -50626, -50454, -102199, -70791, 5409, -52589, -256422, -407504, -379363, -261260, -204611, -262177, -377075, -435957, -372483, -282085, -330266, -476155, -459042, -188201, 49428, -34332, -316669, -456410, -354161, -173933, -29239, 83953, 124659, 40716, -87145, -166382, -286827, -549723, -781740, -709388, -384674, -135845, -83969, -15034, 196504, 329801, 138323, -274116, -574284, -590831, -447161, -356049, -380309, -393220, -247941, 13065, 155719]
35135A55719j44758l18625k07257O3452K48464K42757J23388L3890O1890J50280
35125D09200J32213n7201k49679k50616j11203k3472j5673K6055Q7414M4137o4322
35114g3147o1589M5799O0617n3178j06893m0624l1118j41682j75235l0023Q9795
35103e17278J4133j00089m1612J05454J32540O1905P1392J65385J68159J1620
35093G1609j68579k25750j48472p001J36554K37953K54288J59353j3936j53486
35083A42533j45831j5909P3380K6098n8260m8035K1919L5378j2792n0652p0394
35072a02565r0836p2794j5480j2898o0293J7702K42410L09195L4093k56329j69307
35061a77102J21969J66093p173O083J86697P2873l70443n44732j40973L37167
$$ y = [155719, 10961, -307664, -514921, -451469, -203005, 39752, 163140, 197030, 258920, 409200, 541413, 484212, 234533, -16083, -127286, -150758, -166431, -140376, -52962, -8825, -73147, -134736, -88937, -28320, -81498, -188391, -229015, -260133, -401815, -577050, -607073, -517278, -503145, -603234, -644846, -539392, -406852, -344947, -273555, -108170, 59989, 71609, -96970, -322720, -471192, -478193, -341639, -103686, 150602, 309955, 296019, 142533, -3298, -19207, 54173, 80271, 22011, -26024, -4105, 31273, 18481, -32171, -102565, -193401, -266195, -281675, -294573, -354866, -337164, -94754, 214441, 248534, -7795, -177102, -55133, 110960, 103787, 109870, 296567, 369440, -1003, -545735, -686708, -349541]
35051c49541L38786L7297r2775l1016m8113j19378k9938J37188J16879m8512q5571
35040a74694J1942q952j64769j61639J03025L13939J72603j72873l10404o7068
35030d58890L05243M22022J75023j70872k84260j22508Q7079J69669J56387J14532
35020C93425J5302j46445k51900j87877J1085K10266K81442J57601r0425k41777
35010A50697j56471J829j6134j41286r6154R6712J07143j09671j55341J52171
35000a66505L97686K08846r9790j2342L16202K60524k72858o39301l82628J29626
34990b60540K68860m072j91926J0662L69866M70830J89516k33912m49411k86678
34980a16805R7563L19442J18010l28814n33006k39718K44036M11474J80427o4974
$$ y = [-349541, -10755, 26542, -66233, -97249, -145362, -264740, -294678, -157490, -40611, -89123, -174694, -162752, -171704, -336473, -498112, -395087, -81148, 91455, -81418, -391822, -458890, -153647, 268375, 443398, 272526, -11734, -134242, -47163, 122506, 278893, 393425, 408727, 262282, 10382, -177495, -166410, 43856, 325298, 482899, 392474, 150697, -5774, -3945, -20079, -161365, -257519, -160807, -53664, -163335, -318676, -166505, 231181, 440027, 340237, 327895, 644097, 904621, 631763, -7538, -390166, -260540, 8320, 4248, -187678, -177016, 192850, 663680, 853196, 619284, 169873, -116805, -19242, 300200, 418210, 89396, -443610, -683328, -439292, -27818, 152609, 87635]
34970H7635n3258M3130k2154j54598j24665J9311N9257Q056O7111K30168K61181
34959D21174Q4634j03636j60601j51146j23255j0883J46704J54068m4652k38564
34949b6157k41577j18675j3299N9607J32883J74899J74359J86848K01569J11589
34939F42046r4017k54603k43696j26315m4159n4372j14500j17546M2243K98995
34929f5924L69320Q2426k98485l45677l5221K38472K14396K2324j34538k18609
34919a71516k08484m1546J80343K22313O6516m1672J3884O8847O654o2934m8722
34908a6317n220O1230J98908K71796Q3003k04557j98169Q3758J80634o0770k34159
34897A60137q6914P0102k4164j06904O4435K02109N516k51091j75660O7143Q1444
$$ y = [87635, 34377, 77507, 55353, -99245, -223910, -204599, -145342, -137286, -70175, 159993, 421174, 505808, 402172, 241571, 90425, -32830, -43713, 102991, 257059, 212407, -26157, -267734, -386409, -399708, -340101, -207218, -32319, 142040, 328888, 530457, 642046, 548029, 293426, 49730, -76585, -120744, -175116, -289616, -407162, -364919, -65924, 303396, 385822, 87337, -258340, -293561, -55089, 159307, 181631, 47093, -171516, -380000, -421546, -241203, -18890, 47626, 5954, 19838, 88685, 95339, 32405, -16317, -21537, 39693, 238601, 510397, 593400, 388843, 190674, 274432, 455066, 394296, 160137, 73223, 143325, 119161, 12257, 76692, 278801, 284317, 33226, -142434, -75291, 6153]
34886F153p5496q2669M3025P9301Q4851K04979K31070o6160l79992k65441Q1815
34875a38564J08437j51802j33045K69348M87392J96568k08566k77478r3188N5053
34865A14155J22228J58516Q7554j01358k23270j64889m7907J846Q100r980p9481
34854a34486j08418K9948K09010J67250n0638j30590j2117K9038r8898j42459
34844b42360m378M7596j11892j88230J9379K27960J38056n7690k6516J26390O8715
34833b970j59337k08081j182J64030J09485O008K8077P2580l0185k10007k31490
34822d63072j8592K19667K27821K9947p2995J05143L41072K67987r9287l39247
34812A98444j83911J27992J98691j3929k17357k02878m8369N3350J6753q6198
$$ y = [6153, -69343, -152012, -108987, -29686, 55165, 260144, 491214, 425054, 45062, -220379, -138564, -30127, -181929, -314974, -45626, 441766, 638334, 429768, 152290, 59102, 114155, 236383, 394899, 482453, 381095, 157825, -7064, -54971, -53125, -45025, -55005, -134486, -242904, -212956, -3946, 163304, 112666, -17924, -30041, -1003, -99901, -242360, -246738, -199142, -311034, -499264, -479885, -251925, -113869, -171559, -198075, -71685, -2970, -162307, -370388, -371570, -207540, -98055, -92047, -63970, 8610, -21575, -231582, -463072, -481664, -261997, -34176, -4229, -77224, 27919, 368991, 636978, 537691, 198444, 14533, 142525, 341216, 327287, 109930, -92948, -141317, -87967, -71214, -157412]
34802a57412j20683m3899K6690k4790r6294K2948K92068L85627J44149j56876
34792B71528j92132o1240r3721k78878k42165J53808N02366L45832k07614n98180
34782d00396m84495p8645K05838K26824J19592N204q6180o9183J49955M23678
34772A2192M12203L5331l26894k94738R966J78930J08668N1928J25063J38964
34762D51613o41p8787N8125K00268Q6957j79643k96511k01844r0206o5730m6209
34751a62608Q926K9554K7215J26656L19596L77400J43483k09686l59293k06926
34741I4317M8517J76336J27253j4897j57292k11656r4442J61139L35939K13838
34731F79052j33159l79802l33313j55426q4146o5253J23725M32969N03428J64692
$$ y = [-157412, -278095, -321994, -295304, -320094, -416388, -393440, -101372, 284255, 428404, 271528, 79396, 18156, -75565, -354443, -596608, -442800, 59566, 405398, 197784, -400396, -884891, -963536, -757698, -530874, -411282, -406078, -492258, -561441, -411486, 12192, 424395, 459726, 132832, -161906, -151940, 26990, 135658, 187586, 312649, 451613, 450972, 372185, 430310, 630578, 717535, 537892, 241381, 39537, -50669, -116399, -162608, -153682, -124128, -96913, 29743, 349339, 726739, 870222, 660536, 301243, 94317, 142834, 319170, 446423, 431526, 274234, 62578, -31864, 129275, 465214, 679052, 545893, 166091, -167222, -322648, -406794, -472047, -348322, 84647, 588075, 752767]
34721G52767k62521l49905j00270J18547R4692k9105p8970j01174j74054j87905
34711c17898j8224J98352J91112o1006k72977k18039J2515J74415J56487K0734
34701a34529j24673j89186j22270K5123J20498J10434R0756J41392J87308J27420
34691B32273K519r5061j79373k76125k66672m3540K27943K49295P233j77958q3803
34680d03269J37209K02289N3906j32527j74214k7662J94720K96166J68193p9618
34670B35193k41524k46409j57738r029J76182K54888J02567j26030j39637O3002
34660h8535J86238R0381n8828j48435k63353l59562j95728J97193L72026R4260
34650a74343k32712j40397K01389K87168O8372l7924J55653L62309K98512L7975
$$ y = [752767, 490246, 140341, 40071, 158618, 253310, 224205, 145235, 44061, -129993, -317898, -336122, -137770, 53342, -7664, -280641, -498680, -486165, -311750, -155263, -134529, -259202, -448388, -570658, -545535, -425037, -314603, -223847, -82455, 104853, 232273, 234792, 139731, -39642, -315767, -582439, -625979, -398036, -148741, -141508, -319466, -403269, -266060, -63771, -9865, -142392, -316606, -344268, -149548, 146618, 314811, 235193, -6331, -252740, -410478, -419507, -243325, 11563, 114130, -11900, -151537, -88535, 97703, 188084, 129256, -19179, -282532, -642094, -837822, -640629, -268603, -174343, -407055, -547452, -346063, -58895, 9477, -28447, 127206, 489515, 788027, 826002]
34640H26002j85506k62379k30555j96396k43550k94150j47715J93858M03464K52205
34630A15278k5237p6487L7247J9321j00359k8604K15836K64523L259k16774j18325
34619H9678J10363J52681J3014p9701l4658K0284n9396k43271l09219p1897K95779
34608a16343L37208q8689m78567k93207K53041M51519R1706l02909k88254m3077
34598d77572P5863O2268P5531R4288N4630N5733J45068J35332q9229k90623j84464
34587c43175J26144K92324J83929k6840j61734j95623j60352o8650O0031J80840
34577a13106K19516R9095j29720k25001j6213K78610K57417r8953l55686k24493
34567c08534O4455J55211M5276m7738n4804l7529J1733J00331J07062m5440k03048
$$ y = [826002, 640496, 378117, 147562, -48834, -292384, -586534, -734249, -540391, -136927, 115278, 90041, 13554, 50801, 70122, -30237, -58841, 156995, 421518, 424777, 208003, 89678, 200041, 352722, 365736, 286035, 251377, 271661, 212265, -31006, -340225, -412122, -116343, 220865, 132176, -346391, -639598, -386557, 64962, 156668, -146241, -434495, -477572, -401709, -339441, -263910, -169622, -114992, -59259, 85809, 221141, 131912, -158711, -343175, -217031, 75293, 259222, 232382, 70648, -124975, -285327, -353977, -293946, -113106, 106410, 205505, 75785, -149216, -165429, 113181, 370598, 271645, -84041, -308534, -244079, -88868, -43592, -91330, -146134, -183663, -171930, -71599, 35463, -9977, -213025]
34556b13025j67699K5985J90760K35317J81429N3009j02680j91749j85995j42291
34546c16939n7832J00525J86411n563l15400k89143J37323M33158K38532q0405
34536C0667m2650J74555J02735j82240k18122J5922Q2018j38659k73500j26009
34526e75283N7442J06409J74217L01685K43026m9489k26031q0894J14343Q2729
34516A48154m0498m7518m2108j53773j99736P07K44288K44458Q5982K1569L1740
34505B93265l6544r3238J7675J21996n5754l56719l38220N1290L75105L27696
34495C06552O6425j34922j98223j26692O9034K24937J32188r9640j18409J13930
34485B35180K03820n5606l16527j97018J38698K47211L1055k32676l31968k73069
$$ y = [-213025, -380724, -354739, -163979, 71338, 252767, 305776, 203096, 11347, -174648, -316939, -374771, -274246, -87835, -93398, -408798, -697941, -560618, -127460, 111072, 30667, -11983, 162572, 265307, 83067, -135055, -119133, -37115, -175774, -449274, -575283, -517841, -411432, -237215, 64470, 307496, 258007, 31976, -48918, 65425, 148154, 107656, 60138, 18030, -135743, -335479, -334772, -90484, 153974, 239956, 261525, 293265, 256721, 163483, 181158, 303154, 247400, -109319, -447539, -396249, -21144, 306552, 372977, 238055, 39832, -86860, -17826, 207111, 339299, 239659, 121250, 235180, 439000, 383394, 66867, -130151, 8547, 255758, 286813, 54137, -277831, -550900]
34475e50900j05203J11051K27325J51537R897l8798m3695r9276r1778J01941K87145
34464d0754J72179j42263k60667q3890O1138m6164j97320j07460J71270L54388
34454a19543K76447K2497j72483j14335J36438K66178Q5468j72053j66746K5349
34444F7217M5873j42989k08598l6128Q4840j1782r8305q657N9149m7589j17971
34433d14940K6437J71983Q5344p2475n6697L4107J3553L466J63365K84384J06083
34422C44610j74691j85189O205M4483q0517p7232O0684N3402r7281q2329J23335
34411f4520J74563k3713j18939P5523K31536M1111k66236k55396R6509L94081
34401B84519L17807n7137l66052l02542O7477L55168L05387Q5879m5846j49894
$$ y = [-550900, -656103, -545052, -317727, -166190, -156293, -195091, -238786, -338062, -429840, -327899, -40754, 131425, -10838, -271505, -355395, -294257, -340421, -537741, -645201, -473931, -119543, 156904, 179401, 6918, -107417, 29021, 295199, 380667, 208614, 41868, 67217, 113090, -29899, -238497, -274625, -189785, -201567, -299872, -308529, -249380, -296969, -414940, -388503, -216520, -131176, -203651, -260348, -226241, -212688, -209222, -45857, 238527, 344610, 169919, -15270, -9065, 35418, -45099, -122331, -61647, -8245, -105526, -187855, -64520, 110043, 86330, -32609, 42914, 274450, 315561, 49325, -206071, -109562, 284519, 602326, 545189, 179137, -123405, -55928, 299240, 604627, 690506, 644660, 494766]
34391D94766l55222m24408o6967M23179M37995j3427k68574m5135J38967j27891
34381A93283m40551k41631K68481M38948J12947k55174k94886r5716O9883P6334
34371a68082m091l614J40211K30441M3826k47278k21632J14922K40394o2650k85637
34360b23190J1134M39301L69645o8837k29931R695J45986n7931k49026j63287
34350a6441k6702o5485j15229Q032J41451P7597o4529o4929J8116k6414j98196
34339c32729k92067j91903K6060K28874L26006K79297J28857j1948n3605m711
34329A02131O4046Q1844J3840q8928r9653K1461J12822R827j70068j46300R7964
34318a014K48445J19583n9984j5911J18745J1790l00741m03778j16761K07240
$$ y = [494766, 139544, -284864, -351831, 71348, 509343, 495916, 227342, 182207, 321174, 193283, -247268, -488899, -220418, 218530, 331477, 76303, -218583, -314299, -244416, -168082, -172173, -175787, -35576, 194865, 238691, -8587, -230219, -115297, 125097, 62447, -223190, -212056, 227245, 596890, 528053, 298122, 307817, 453803, 395872, 146846, -16441, -43143, -108628, -223857, -215825, -74374, 3223, -61306, -126235, -108119, -134533, -332729, -624796, -816699, -790639, -561765, -235759, 43538, 172395, 160447, 106842, 102131, 166177, 248021, 261861, 172933, 73280, 94741, 207563, 217390, 47322, -98978, -1014, 247431, 367014, 307030, 291119, 409864, 421654, 120913, -282865, -399626, -192386]
34308a92386J88161k8606l1221J89882K26209p0906l04895j31723J90182J82842
34298B17539j31653k96448j19237J09705J23784J0584p2481j52283k31326j38787
34288f80603J72355M17347L21428M275j97773j54172P702J31289J25454l0109
34278A17193j98803j56789Q5776K21600R1836m0680P7104K33346R2536k06180
34268C16939k44284j9277N0780j63584k88715q6339J47613Q0293j25217j11392
34258d43183Q3028J10041j10779k56852p8400K53595L85658K16778k8855j02917
34248B8114M600J18750J19772N3496J2020J458j4514j8028J7707L5966l0111j12318
34236B16912p3527O1636Q6296j03620l21571l10644q7318Q4648O5440K0751J36068
$$ y = [-192386, -4225, -32831, -64052, 125830, 352039, 281133, -23762, -155485, 34697, 217539, 85886, -210562, -329799, -220094, -96310, -85726, -158207, -310490, -541816, -680603, -508248, -90901, 230527, 234802, 37029, -117143, -109441, 21848, 147302, 117193, -81610, -238399, -152623, 68977, 160813, 120133, 197237, 430583, 523119, 316939, 72655, 53378, 104158, -59426, -348141, -434480, -286867, -206574, -331791, -443183, -360155, -250114, -360893, -617745, -696145, -442550, -56892, 159886, 131031, 28114, 32714, 151464, 271236, 324732, 336752, 338210, 323696, 305668, 323375, 359341, 329230, 216912, 143385, 205021, 291317, 187697, -133874, -444518, -531836, -447188, -381748, -360997, -224929]
34225b24929K82403J70100j86123m00442k23381R7170J67663J129o9535N1180
34215c34765J03745m4316j52861j1220K03232K07089M6923j3402Q1798J31799
34205B18022J2555j61871k13697q7649J27079K51048J37133j45873l11666j66900
34195c41819J32732K72533J73340M2560N4644J40614J28385k2749j89400k40210
34185A50630j76209r8754n0754L1336J46046J23991j26325l50853k03264K22757
34175c31399M26577J72642j77181j90201N6778J84799Q1742m8267p8021q7676
34165I793j35306j51608q3789K1944R5500J05190O9920N6291Q8364N5083j34337
34154b955l05758j90585J17078K15078K0519o5158J60500L00498J0037l66568
$$ y = [-224929, 57474, 227574, 41451, -358991, -582372, -485202, -317539, -316410, -385945, -334765, -231020, -275336, -428197, -439417, -236185, -29096, 17827, 4425, 86223, 218022, 230577, 68706, -144991, -232640, -105561, 145487, 282620, 136747, -174919, -341819, -209087, 63446, 236786, 279346, 333990, 474604, 602989, 580240, 390840, 150630, -25579, -124333, -175087, -143751, 2295, 126286, -39, -350892, -554156, -331399, 95178, 267820, 90639, -99562, -42784, 142015, 223757, 175490, 97469, 9793, -125513, -277121, -360910, -338966, -243466, -138276, -68356, -12065, 76299, 131382, -2955, -308713, -499298, -382220, -167142, -146623, -211781, -51281, 249217, 259254, -107314]
34144a07314l14213J9305R7070j08972j33726J45529L27892J92101J170k4769
34134I4073l0087j42586k08978j09367K2879O9956J04405J60420J38863N2893
34124A52471N4222J16925K9685j95799k66591q2650R3172P9428K1259L6375N580
34113D4077r3389m6868J60673J81387j23961l40977j08733K67406K55184j03908
34103I0891l09607j66320L9760P4819L8739P4238J37202J39937Q9690K4064l4144
34092A99269n0761k8980l2337n3320J8018J62803J57920o8053k18455n5306J63907
34081A94705N9263k17951j82428J81677L43509M7372l01133k93375j01377p1209
34071c40947j17209L7891K69724J97882j59313l42215j04323K76606M36559L40791
$$ y = [-107314, -421527, -402222, -305152, -414124, -547850, -402321, -74429, 117672, 118842, 94073, 63986, -78600, -287578, -396945, -374066, -304110, -199705, -39285, 99578, 152471, 206693, 323618, 353303, 157504, -109087, -191737, -98565, -19137, 2122, 38497, 44077, -49312, -96180, 64493, 245880, 121919, -219058, -327791, -60385, 194799, 90891, -218716, -385036, -345276, -270457, -231718, -157480, -20278, 119659, 209349, 233413, 199269, 148508, 119528, 87191, 33871, 51889, 214692, 372612, 304559, 86104, 30798, 194705, 253968, 36017, -146411, 35266, 378775, 426147, 125014, -168361, -269738, -340947, -458156, -420265, -150541, 47341, -111972, -454187, -558510, -281904, 154655, 495446]
34061D95446J34385j10998l13156l00435m9436J76816J44970l9112j31167r9355
34051i2042n5604J330J10640J55092L4500q3791o097J11571L815j86889r5251
34040a02726J96389K09539j31534l23355j01153J39464M9757r5313M1077K16239
34030I8384O9625j79229j08877J29710P3229k20584k73796j7521J47661R1926
34020a89472R9439K34378K10780p33o1213Q9208Q3523j73760k72571k9384J46868
34009A37063l1240k17995o5461J53515O4250j15731P220K37708R9103k94492l50945
33998c77005N0037L48708J58396k01803k43566J9534K11920J55472R113m4393
33988H6413k2439m0576j11306j17416J5344J74296J70908n140j52017j15874K7311
$$ y = [495446, 629831, 518833, 205677, -94758, -144194, 32622, 177592, 138480, 7313, -92042, -147646, -146316, -35676, 119416, 153916, 70125, 64028, 175599, 179414, -7475, -102726, 93663, 303202, 171668, -151687, -252840, -113376, -63619, -158932, -117855, 98384, 168009, -11220, -120097, 9613, 82842, -137742, -411538, -429059, -281398, -189472, -90033, 144345, 355125, 354392, 293179, 382387, 465910, 292150, 19579, -9805, 137063, 105823, -112172, -177633, -24118, 40132, -75599, -68379, 169329, 268432, -26060, -377005, -326968, 21740, 180136, -21667, -265233, -245699, -33779, 121693, 130806, 86413, 63974, 23398, -87908, -205324, -189980, -15684, 155224, 150084, -1933, -117807, -90496]
33977i0496J15206J14682J03523J21236J33361R9374J8894n5636m9307L0374N5085
33966E96296m9872j50823r1867K5574j4876j57068j29419Q4179J76022K7387o4967
33955B50566J21021L36793K43359n7378j99222j03213j9947r1646j82754j62080
33945A35499j03027j22003j72090j03555J10507K84014K12215m1616j70591k5668
33935C685J53540R2222r0471r4280M6239M5850r4635r9862J6296p2358l41836
33924d35610l01725J98816N96300M22220l55j26313j9148o7681k26983j65488
33914a25967N6242R0355l3286L2021K62118K50939n6684k15197k2164J29338r0665
33903B77050l84248k78645J47710L76078J65244j67709k04338N1876K19465M2726
$$ y = [-90496, 24710, 139392, 242915, 364151, 497512, 596886, 615780, 560144, 510837, 541211, 596296, 546424, 395601, 303734, 329308, 314432, 157364, 27945, 112124, 288146, 315533, 250566, 371587, 708380, 951739, 894361, 695139, 591926, 571979, 480333, 297579, 135499, 32472, -89531, -261621, -365176, -254669, 29345, 241560, 199944, 29353, 3685, 157225, 249447, 158976, 64696, 110935, 156785, 62150, -37712, -21416, -93774, -435610, -737335, -538519, 57781, 480001, 479646, 353333, 334185, 266504, 39521, -125967, -69725, 20630, -12656, 19365, 281483, 532422, 475738, 260541, 238377, 367715, 277050, -107198, -385843, -238133, 137945, 303189, 135480, -68858, -16982, 202483, 245209]
33893B45209k76617l43250r8160J15813O0944o8551Q563K09559K43506Q0019l1627
33882A45408L5536J30846Q9097n2176j39032q4972M8242J05328J7418p3505m244
33871B17946J13287L1191j83573j90334L7920J01946j42802k74794j6485K32845
33861g2853N7745k28121j14352J97054J48430j55742j08338L07878M29263J797
33851D62761m17007l53520l3237J50926J73389J09221r6270l02258j55389K98650
33841a62734N03345K02421j57199j68578o4315j60589k44546m0458J78875L9919
33831g3859k41262k29852l3050n0074j94634m8726L34293M67983K53287R9841
33821B83947J66610J27185j47265k84205o4048J52343J2168k41416j92205N4719
$$ y = [245209, -31408, -374658, -472818, -357005, -296061, -364612, -356049, -146490, 97016, 177035, 145408, 180944, 311790, 400887, 348711, 209679, 124707, 172949, 278277, 295695, 222190, 217946, 331233, 362424, 178851, -11483, 26437, 128383, -14419, -289213, -305698, -72853, -15108, -243229, -357581, -160527, -12097, -167839, -276177, 31701, 460964, 462761, 45754, -307766, -341003, -190077, -16688, 92533, -3737, -305995, -461384, -162734, 340611, 543032, 385833, 217255, 152940, -7649, -252195, -292653, -113778, -73859, -315121, -544973, -578023, -628097, -822731, -871457, -537164, -69181, 184106, 283947, 450557, 577742, 430477, 146272, 82224, 234567, 246735, 5319, -186886, -132167]
33811a32167P0757j77847k76405l195L69736M89297L30622P9043j53194l27483
33801B69164l62530k15443j3326O4301J8062K169O7478Q8721n835r4731o4928
33790b46898j6079r2687k01882j18282J42956K88903J52405o6742q8254P1611
33780a74949J68163Q5985l6241k4130J09199J83286M7595k40425m27017l04061
33770f12595L9752K82898K25452P58j17971l4102J26741K07739J55000R209j33557
33759A49324j71979r1587P012L1024R561J3297J1587p3668j89964j73792Q214
33748d70971J67147J35582O953l565J17535J71884P0741l1337j3810k499j19678
33737B7982j88813K0429L27826K85338j57468m93991l44317K7515J54901N4589
$$ y = [-132167, -61410, -239257, -515662, -518857, -149121, 340176, 670798, 749841, 596647, 269164, -93366, -308809, -322135, -257834, -239772, -237603, -170125, -81404, -87239, -181970, -246898, -262977, -355664, -557546, -675828, -532872, -243969, -91564, -158306, -246560, -174949, -6786, 79199, 42958, 18828, 128027, 311313, 358908, 118483, -308534, -612595, -572843, -289945, -64493, -63735, -181706, -215808, -89067, 118672, 273672, 282881, 149324, -22655, -114242, -107230, -76206, -66645, -53348, -41761, -115429, -305393, -479185, -470971, -303824, -168242, -161289, -164854, -47319, 124565, 195306, 163969, 150159, 147660, 27982, -160831, -140402, 187424, 472762, 315294, -178697, -523014, -495499, -340598, -286009]
33727b86009R1569L15112L65892N5703l33605m37854k30335N7902K30981K34963
33717F4319J27963L0800N693k8012j41275k13535r6847R0438R3943o5454j11603
33706b43570K0679P3966p2244j73105l5750J46990J28136O074L026O5490J5457
33695f4851o6180K7831K10328J91818k5380j23215N606P7188r2498k53556j23935
33684b36844J33614J58028l3816q0381J31931K70350P2384k37121k76776o0937
33674a59568O7227l2700j41480p2495O8260J16003R4470P5970K145j59041k41986
33663c83195r9679J19852J54683J8913l5606P8184J70546R7855l0719n3834O880
33652D3880J7244o8587j63471j56152l4549P3528K1450j45853j93532q259K06067
$$ y = [-286009, -194440, 120672, 486564, 542267, 208662, -229192, -459527, -401625, -170644, 64319, 192282, 223082, 228775, 200763, 59488, -154047, -250894, -160456, -66513, -131967, -243570, -222891, -148925, -221169, -394274, -430024, -283034, -154898, -148824, -145798, -80308, -64851, -131031, -103200, 107128, 298946, 273566, 150351, 155957, 233145, 140647, -112909, -236844, -103230, 54798, 20982, -59399, 72532, 342882, 415266, 178145, -98631, -159568, -92341, -125041, -266521, -339016, -270756, -154753, -60283, 15687, 17832, -141209, -383195, -482874, -363022, -208339, -189426, -225032, -146848, 23698, 121553, 90834, 37000, 43880, 61124, -7463, -170934, -327086, -361635, -288107, -266657, -412510, -606042, -614301, -408234]
33641d08234K04107O1924M2394J66572J84521k0650k50584k72325q3446J56184
33631b19537K83562J90011r6099l40376k94057m313K26403K20669R4151J9125
33621G9539J6338L7692O9532P3437k3386j98737l08228k38936j4332K39356L48382
33610H0657J96129r5435k09113l8008J12451j9426j91531l8288K50058J48610
33600A96104l30762n60025k08185K96429M27809K12463l5039j85209k02326J6797
33590c71944L67684M45765Q8132k86173k31530R8177K38860Q5263j05076j71605
33580A57553j42049k9067J21082J30906m3949j32214N2585K41155J06972j74215
33570B88759j99344q746Q639j99639k71124o1051J25289N0340j09664j07592J477
$$ y = [-408234, -204127, -142203, -99809, 66763, 251284, 230634, -19950, -292275, -375721, -219537, 64025, 254036, 157937, -182439, -476496, -480809, -254406, -33737, 60414, 79539, 95877, 133569, 203101, 276538, 253152, 54415, -253813, -492749, -507081, -267725, 80657, 276786, 181351, -27762, -65770, 46681, 27255, -164276, -202564, 47494, 196104, -134658, -694683, -902868, -606439, -178630, 33833, -1206, -186415, -388741, -371944, -4260, 441505, 529637, 243464, 11934, 110111, 348971, 434234, 329158, 157553, 15504, -13563, 107519, 238425, 194476, 62262, 114847, 356002, 462974, 288759, 89415, 80669, 89308, -110331, -381455, -442506, -317217, -266877, -376541, -484133, -482656]
33559d82656K3014o1227j15432n2522J01736K50448K68571R4400j75829l41673
33549d91170k65549J6594K96576L22831O5536j59677n1495J99679J33584k21232
33539a54323k83580J59510M95246J87379l34176l07948J67813L23359m8868l37471
33529a33059j48941J37160Q2702j50738j87274k3046J09810J30780P2558o9827
33519a79875k04371j10838K18662M31399K40026j75758l95766k52270O1906K59257
33509a07628K07916J0297j00418k2904P4812R296j15350q0662O2467Q4544j3283
33498I087l5378O94r8485k52620j55434J56384K68119O1527p3036R1396K40864
33487B13118J12549k8450R6022K24770J4383k94411k26547J28777K44620r615
$$ y = [-482656, -459642, -520869, -636301, -688823, -587087, -336639, -68068, 26332, -149497, -491170, -756719, -740125, -443549, -120718, -55182, -214859, -266354, -66675, 66909, -154323, -437903, -278393, 216853, 404232, 70056, -237892, -70079, 253280, 204412, -133059, -282000, -144840, -62138, -212876, -400150, -423196, -313386, -182606, -110048, -179875, -384246, -495084, -276422, 154977, 395003, 219245, -176521, -428791, -366885, -107628, 100288, 110585, 10167, -12737, 62075, 71371, -43979, -124641, -62174, 22370, 9087, -26291, -25597, -124082, -376702, -532136, -375752, -107633, -46106, -119142, -27746, 213118, 325667, 297217, 393239, 618009, 632392, 337981, 111434, 240211, 484831, 475216]
33477D75216k13822j05948N3314k8825k10529j67503J13608L15151J89409j51237
33467B68834l54581k14933R3864K36274J30714n484j8525R057N806M9526J21268
33456C21820J6943k81192m29977k05288J00304J01476q0685n2421J77957K31161
33446i9902J9856j01176O4547K28525Q3277k18481k90978m0678K50818K91273
33436A87081P8443j43449j59501j3146N8678o2755k15624j80962L2888K43450
33426a74897L27125K59808M2650k26042l07070p5306K39114K90900O8106j21413
33416C22975r2491K0174K8229n5157q6578J3068J65336J69430r8108m34862m28435
33405d76419P344M06401L21313o9754k66696j76644r1871o2252J47504M55199
$$ y = [475216, 261394, 155446, 208760, 179935, -30594, -198097, -84489, 230662, 420071, 268834, -85747, -300680, -206816, 29458, 160172, 154688, 136163, 145220, 151026, 200552, 321820, 338763, 57571, -372406, -577694, -477390, -375914, -456599, -509020, -331063, -99902, -80046, -181222, -116675, 111850, 195127, -23354, -314332, -355010, -104192, 187081, 265524, 122075, -37426, -50572, 8106, -54649, -270273, -451235, -418347, -174897, 152228, 412036, 454686, 228644, -78426, -153732, 85382, 376282, 444388, 322975, 230484, 250658, 278887, 223730, 137152, 150220, 315556, 484986, 386878, -47984, -476419, -469075, -62674, 258639, 188885, -77811, -254455, -346326, -408578, -261074, 194125]
33395A94125M18883k2488l24628j47696J08896k8566l32358k52969K05807N05745
33385C24751L39481o9547l75354m37098k65122K4799J99788J23238l3047j7905
33375a86016J24750J61727O2660j1349m1771j43550k55701j94745k6273j7255
33365e27523j62826j38913J55512L82771K84908P7808O6072J49398M2426k03050
33355A26583k60604n0071J37745Q0316p0767l9400J72208K77088P7915k54155
33345A96858l54719j15895J58583J45865o8565j56412n5653j1305r7549o6331
33335d25123J82071L36907J51661j19651j07707Q3866Q6254r5306j19257O3212
33325C6927J07602j20422l00717j90031P782M2592L4613J81656L33606K26873
$$ y = [194125, 613008, 590520, 265892, 118196, 227092, 198526, -133832, -386801, -180994, 324751, 664232, 594685, 219331, -217767, -482889, -458090, -258302, -135064, -168111, -186016, -61266, 100461, 163121, 151772, 110001, -33549, -289250, -483995, -510268, -527523, -690349, -829262, -673750, -290979, -6071, 71737, 137809, 287207, 329633, 126583, -134021, -184092, -46347, 33969, -36798, -76198, 96010, 373098, 451013, 196858, -157861, -273756, -115173, 30692, -37873, -194285, -249938, -261243, -358792, -425123, -243052, 93855, 245516, 125865, 18158, 102024, 188278, 92972, -26285, 36927, 144529, 24107, -276610, -466641, -458859, -416267, -381654, -199998, 133608, 360481]
33315C60481l6985j26141k007N8046n6315j34376l6047P3366J3578j25431j55315
33304a67146p5868j6315o603K1569P6178J07827J30849J85506J95163L2031k38329
33293B44862l48492j71684O0117M1713j80723k74057r5867J27137J79259J78570
33283b39165L25465N02333M05676K2560l09025l47698k05122q3154J024R5956
33273A68850J35280O0521k3196j199M9251r813j35634j77631j19361o2030k5369
33262a40331L9308Q1863J4280p8425k2395J26390R9388j58895l26639j38006K07201
33251b96261K96215O0267j70793j48070J1003Q1557N5462N4046O6783r503j20647
33240a19941p1182J58687L05117J56405j32768k24756l1984J98065K16140L6415
$$ y = [360481, 323496, 197355, 195348, 253394, 197079, 62703, 26656, 100022, 113600, -11831, -167146, -243014, -259329, -265932, -244363, -168185, -60358, 70491, 255997, 451160, 483191, 244862, -103630, -275314, -215197, -173484, -354207, -628264, -724131, -596994, -417735, -239165, 86300, 588633, 994309, 1016869, 707844, 360146, 155024, 71870, 72894, 168850, 304130, 364651, 341455, 340256, 389507, 379694, 244060, 66429, -52932, -114962, -140331, -101023, -19160, -4880, -83305, -105700, 20690, 120078, -38817, -365456, -503462, -296261, -46, 60221, -110572, -258642, -247639, -166082, -110620, -56574, 10209, 706, -119941, -191123, -32436, 272681, 429086, 296318, 71562, 39578, 237643, 453783, 490198]
33230D90198j56973k39497k21053j64781r0492M3221K44291L81607K83091j669
33220E67943j83568j07558J5807n3738j93172j48617q885n3453k08617j27936
33210e01794J66289K39733l0868k22618p7625Q6120l401p7404J02168J88832j42305
33199b72873m64239j89338M02986N19689Q7438j93514k6398R6121j44896l49627
33189e34651j62507J03851N5769j17537n7040J21289J05455j2921O7231K73386
33179a57675K55992l3423k64727j89557J18692M31306N33248L13029r3935l43105
33169E69845k52402k2940P1673M1865L5388L5778m4392j39626j55380j60567k14373
33158b35131j79285K6871J85610R5963m8276L9653K23140J46867j45527k54726
$$ y = [490198, 333225, 93728, -127325, -292106, -382598, -339377, -95086, 286521, 569612, 567943, 384375, 276817, 292624, 238886, 45714, -102903, -111788, -165241, -373858, -501794, -335505, -95772, -126640, -349258, -426883, -340763, -344164, -421568, -319400, -130568, -272873, -737112, -926450, -523464, -3775, 83663, -109851, -136249, -40128, -185024, -534651, -697158, -593307, -537538, -655075, -712115, -590826, -485371, -498292, -431061, -157675, 98317, 64894, -199833, -389390, -270698, 160608, 693856, 1006885, 912950, 569845, 317443, 294503, 366176, 408041, 443429, 479207, 434815, 295189, 139809, -20758, -235131, -414416, -387545, -201935, -105972, -154248, -114595, 108545, 255412, 109885, -144841]
33148a44841o4287J21369J22540J14449J91837J42509j26288l07077j28227J98508
33138A20492K74845P6990q7732p4744m2559j15281j82150j12006K6606Q0862L7342
33127B665J767Q191j2519o1515j1260J87390L36671J92135j84547m34466l08379
33116b83867N5624L10572K54330l1595k88070k87294m2172J74709J35717l9277
33106d1323n6143J09421J93001P7817n5717q5761j16641j64892m3067K43600L53211
33095D13506J27073j03725n0952N2521r8072l01240k11199J4677m499j65142p2320
33084c99372J94992J81674j07397j57059J73888L76833J15797k56875k97819j01447
33074b76785q285o7905j07439n1314P2471K05353J94641n9520l09848j85655J99747
$$ y = [-144841, -209128, -87759, 34781, 149230, 341067, 483576, 357288, 50211, -78016, 120492, 395337, 472327, 384595, 309851, 267292, 152011, -30139, -142145, -115539, -34677, 2665, 4432, 12623, 104, -61411, -72671, 114719, 451390, 643525, 458978, 24512, -283867, -228243, 82329, 336659, 305064, 16994, -270300, -312472, -137763, -2046, -41323, -97466, 11955, 204956, 282773, 227056, 141295, 24654, -140238, -183305, 60295, 413506, 540579, 436854, 385902, 438423, 340351, 39111, -172088, -157411, -161910, -327052, -399372, -204380, -22706, -130103, -287162, -113274, 263559, 379356, 122481, -175338, -276785, -285070, -352975, -460414, -511728, -439257, -233904, -39263, -98783, -408631, -594286, -394539]
$$ [...]
##END NTUPLES=NMR SPECTRUM
##END=
