##TITLE=31Pdec_79-2022
 CDCl3, 24 sc
 26.9.2022
##JCAMPDX= 6.0         $$ Bruker NMR JCAMP-DX V2.0
##DATA TYPE= NMR SPECTRUM
##DATA CLASS= NTUPLES
##ORIGIN= UXNMR, Bruker Analytische Messtechnik GmbH
##OWNER= root
$$ XWIN-NMR		Version 3.5
$$ Mon Sep 26 14:06:56 2022 Russian Standard Time (UT+4h)  she@DPX200
##.OBSERVE FREQUENCY= 81.013821
##.OBSERVE NUCLEUS= ^31P
##.ACQUISITION MODE= SIMULTANEOUS
##.ACQUISITION SCHEME= undefined
##.AVERAGES= 24
##.DIGITISER RES= 16
##SPECTROMETER/DATA SYSTEM= spect
##.PULSE SEQUENCE= zgpg30
##.SOLVENT NAME= CDCl3
##.SHIFT REFERENCE= (INTERNAL, CDCl3, 0, 248.564)
##AUDIT TRAIL= $$ (NUMBER, WHEN, WHO, WHERE, WHAT)
$$ ##TITLE= Audit trail, XWIN-NMR		Version 3.5
$$ ##JCAMPDX= 5.01
$$ ##ORIGIN= Bruker BioSpin GmbH
$$ ##OWNER= she
$$ F:/spectra/data/she/nmr/P31/1/pdata/1/auditp.txt
$$ ##AUDIT TRAIL=  $$ (NUMBER, WHEN, WHO, WHERE, WHAT)
(   1,<2022-09-26 14:05:55.68 +0400>,<she>,<DPX200>,
      <created by zg, POWCHK disabled, PULCHK disabled
       configuration hash MD5:
       00 E9 B6 7A A2 85 ED C7 34 08 36 98 17 FE 4E 26
       data hash MD5: 32K
       64 7D 50 6B 39 E1 35 77 CA 5D 14 E2 89 31 94 5B>)
(   2,<2022-09-26 14:06:05.60 +0400>,<she>,<DPX200>,
      <Start of raw data processing
       efp BC_mod = 2 LB = 1 FT_mod = 6 PKNL = 1 PHC0 = -10235.07 PHC1 = 39.25659 SI = 64K 
       data hash MD5: 64K
       96 F2 70 CF B8 F9 B8 6F 12 41 74 30 37 87 3F 35>)
(   3,<2022-09-26 14:06:20.87 +0400>,<she>,<DPX200>,
      <pk PHC0 = -0.3528868 PHC1 = 0 
       data hash MD5: 64K
       FC 39 62 8B 3E 28 E6 60 0C 48 C3 A4 45 87 A8 C8>)
(   4,<2022-09-26 14:06:28.26 +0400>,<she>,<DPX200>,
      <abs ABSG = 5 
       data hash MD5: 64K
       82 12 AB F6 38 26 C5 80 36 D7 22 6D C0 6C 12 6F>)
$$ ##END=
$$ 
$$ hash MD5
$$ 63 18 B4 C0 7F 85 15 02 8D C6 1F 04 CB 64 94 BB
##$RELAX= 
##$RELAX= 
##$RELAX= 
##$RELAX= 
##$RELAX= 
##$RELAX= 
##$RELAX= 
##$RELAX= 
##$RELAX= 
$$ Bruker specific parameters
$$ --------------------------
##$DU= <F:/spectra>
##$EXPNO= 1
##$NAME= <P31>
##$PROCNO= 1
##$TYPE= <nmr>
##$USER= <she>
##$AMP= (0..31)
100 100 100 100 100 100 100 100 100 100 100 100 100 100 100 100 100 100 
100 100 100 100 100 100 100 100 100 100 100 100 100 100 
##$AQSEQ= 0
##$AQ_mod= 1
##$AUNM= <au_zg>
##$AUTOPOS= <>
##$BF1= 81.014009
##$BF2= 200.13
##$BF3= 200.13
##$BF4= 200.13
##$BF5= 200.13
##$BF6= 200.13
##$BF7= 200.13
##$BF8= 200.13
##$BYTORDA= 1
##$CFDGTYP= 0
##$CFRGTYP= 5
##$CHEMSTR= <none>
##$CNST= (0..31)
1 1 145 1 1 1 1 1 1 1 1 1 1 1 1 1 1 1 1 1 1 1 1 1 1 1 1 1 1 1 1 1 
##$CPDPRG= <waltz16>
##$CPDPRG1= <>
##$CPDPRG2= <waltz16>
##$CPDPRG3= <>
##$CPDPRG4= <mlev>
##$CPDPRG5= <mlev>
##$CPDPRG6= <mlev>
##$CPDPRG7= <mlev>
##$CPDPRG8= <mlev>
##$CPDPRGB= <>
##$CPDPRGT= <>
##$D= (0..31)
0 1 0 0 0 0 0 0 0 0 0 0.03 2e-05 3e-06 0 0 0 0 0 0 0 0 0 0 0 0 0 0 0 0 
0 0 
##$DATE= 1664186755
##$DBL= (0..7)
120 120 120 11 120 120 24 19 
##$DBP= (0..7)
150 150 150 150 150 150 150 150 
##$DBP07= 0
##$DBPNAM0= <>
##$DBPNAM1= <>
$$ [...]
##$SUBNAM3= <"">
##$SUBNAM4= <"">
##$SUBNAM5= <"">
##$SUBNAM6= <"">
##$SUBNAM7= <"">
##$SUBNAM8= <"">
##$SUBNAM9= <"">
##$SW= 501.771253377433
##$SWIBOX= (0..15)
0 1 3 0 0 0 0 0 0 0 0 0 0 0 0 0 
##$SW_h= 40650.406504065
##$TD= 32768
##$TD0= 1
##$TE= 0
##$TE2= 300
##$TE3= 300
##$TEG= 300
##$TL= (0..7)
0 120 53 12 22 120 120 120 
##$TP= (0..7)
150 150 150 150 150 150 150 150 
##$TP07= 0
##$TPNAME0= <>
##$TPNAME1= <>
##$TPNAME2= <>
##$TPNAME3= <>
##$TPNAME4= <>
##$TPNAME5= <>
##$TPNAME6= <>
##$TPNAME7= <>
##$TPOAL= (0..7)
0.5 0.5 0.5 0.5 0.5 0.5 0.5 0.5 
##$TPOFFS= (0..7)
0 0 0 0 0 0 0 0 
##$TUNHIN= 0
##$TUNHOUT= 0
##$TUNXOUT= 0
##$USERA1= <user>
##$USERA2= <user>
##$USERA3= <user>
##$USERA4= <user>
##$USERA5= <user>
##$V9= 5
##$VALIST= <valist>
##$VCLIST= <CCCCCCCCCCCCCCC>
##$VD= 0
##$VDLIST= <DDDDDDDDDDDDDDD>
##$VPLIST= <PPPPPPPPPPPPPPP>
##$VTLIST= <TTTTTTTTTTTTTTT>
##$WBST= 1024
##$WBSW= 4
##$XGAIN= (0..3)
0 0 0 0 
##$XL= 0
##$YL= 0
##$YMAX_a= 9243
##$YMIN_a= -9719
##$ZGOPTNS= <>
##$ZL1= 120
##$ZL2= 120
##$ZL3= 120
##$ZL4= 120
##$ABSF1= 248.5645
##$ABSF2= -253.2056
##$ABSG= 5
##$ABSL= 3
##$ALPHA= 0
##$AQORDER= 0
##$ASSFAC= 0
##$ASSFACI= 0
##$ASSFACX= 0
##$ASSWID= 0
##$AUNMP= <proc_1d>
##$AZFE= 0.1
##$AZFW= 0.5
##$BCFW= 0
##$BC_mod= 2
##$BYTORDP= 0
##$COROFFS= 0
##$CY= -3
##$DATMOD= 1
##$DC= 0
##$DFILT= <>
##$DTYPP= 0
##$F1P= 0
##$F2P= 0
##$FCOR= 1
##$FTSIZE= 65536
##$FT_mod= 6
##$GAMMA= 0
##$GB= 0
##$INTBC= 1
##$INTSCL= 6.834604e-11
##$ISEN= 30
##$LB= 1
##$LEV0= 0
##$LPBIN= 0
##$MAXI= 10000
##$MC2= 0
##$MEAN= 0
##$ME_mod= 0
##$MI= 50
##$NCOEF= 0
##$NC_proc= -4
##$NLEV= 6
##$NOISF1= 182.463
##$NOISF2= 159.3651
##$NSP= 0
##$NTH_PI= 0
##$NZP= 0
##$OFFSET= 248.5645
##$PC= 4
##$PHC0= -10235.42
##$PHC1= 39.25659
##$PH_mod= 1
##$PKNL= yes
##$PPARMOD= 0
##$PSCAL= 0
##$PSIGN= 0
##$REVERSE= no
##$SF= 81.0140089999694
##$SI= 65536
##$SIGF1= 159.3651
##$SIGF2= -187.1042
##$SINO= 113.3802
##$SIOLD= 16384
##$SREGLST= <1H.CDCl3>
##$SSB= 0
##$STSI= 65536
##$STSR= 0
##$SW_p= 40650.406504065
##$SYMM= 0
##$S_DEV= 0
##$TDeff= 32768
##$TDoff= 0
##$TI= <>
##$TILT= no
##$TM1= 0
##$TM2= 0
##$TOPLEV= 0
##$USERP1= <user>
##$USERP2= <user>
##$USERP3= <user>
##$USERP4= <user>
##$USERP5= <user>
##$WDW= 1
##$XDIM= 65536
##$YMAX_p= 509166739
##$YMIN_p= -4536483
$$ End of Bruker specific parameters
$$ ---------------------------------
##NTUPLES= NMR SPECTRUM
##VAR_NAME=  FREQUENCY,     SPECTRUM/REAL,   SPECTRUM/IMAG
##SYMBOL=    X,             R,               I
##VAR_TYPE=  INDEPENDENT,   DEPENDENT,       DEPENDENT
##VAR_FORM=  AFFN,          ASDF,            ASDF
##VAR_DIM=   65536,         65536,           65536
##UNITS=     HZ,            ARBITRARY UNITS, ARBITRARY UNITS
##FACTOR=    0.620285442955139, 1,           1
##FIRST=     20137.2065510682, 0,            0
##LAST=      -20513.1999529968, 0,           0
##MIN=       -20513.1999529968, -4536483,    0
##MAX=       20137.2065510682, 509166739,    0
$$ Real data points
##PAGE= N=1
##DATA TABLE= (X++(R..R)), XYDATA
$$ [...]
39847f0879q2672J87513L01150N2635l15560m28401k17643O8685K06715J93785
39837i4672J13974j3680j49548j41619Q5906L19252K62704l4996k02627n5683
39827H9011J63705J75963N0835J2839N7404M972j76698l34304l53380k42852n7939
39816f10444J11262J54729Q4270N7087J29782J43593J4469o2864O8589K12812
39806C03285J25578n0724l1111Q1350l7300l01385k65745J35200M06853K26221
39796E92222j02950j76972o8547n4336j02731k2037J06897M9148j51345k21616
39786a52267r2004L6439L7133j0412l4148n4783l9573Q2957K22305J76489m6533
39775A25603j77776o1575J12335Q6517j09856k43108k01163p1793L7395R2107
$$ y = [-60879, -143551, 43962, 345112, 397747, 82187, -346214, -563857, -495172, -288457, -94672, 19302, 5622, -143926, -285545, -199639, 119613, 382317, 347321, 144694, 89011, 252716, 428679, 479514, 492353, 549757, 554729, 378031, 43727, -309653, -552505, -610444, -499182, -344453, -260183, -203096, -73314, 70279, 84748, 21884, 90473, 303285, 428863, 378139, 347028, 428378, 391078, 89693, -176052, -40852, 366001, 592222, 489272, 312300, 243753, 189417, 86686, 64649, 171546, 220694, 69349, -152267, -244271, -207832, -170699, -181111, -215259, -270042, -309615, -226658, -4353, 172136, 125603, -52173, -113748, -1413, 85104, -24752, -267860, -469023, -540816, -503421, -411314]
39765d11314P3838j4248p9905k0391J08381J33960J8127p1902j4047Q6581Q5070
39754a05850M1713J01834K06208J45576q6304k16419o0776K02875K61523M9897
39744E40277k26710l67692l34209j83986J974J25310J16995J1418p9443p4958
39734d71024J7680J29210J75539J17478J3754k7122J7608N6382K9163J311M6595
39723A06574J16706J14717L4882n9091j34407j76281j38038j1806R8632Q5333
39713C7221j5411p7316m9786K0707Q5119J06745L6191j10695j97293j18235L0618
39702b52135P1515L847q907R9022K08873K10595J27153Q420j40954k55160j79610
39691a07341J16504L85401L15260r1915m65940m47864p4645K79641L28928J47691
$$ y = [-411314, -337476, -351724, -431629, -452020, -343639, -209679, -191552, -263454, -277501, -190920, -105850, -64137, 37697, 243905, 389481, 303177, 86758, 25982, 228857, 490380, 540277, 313567, -54125, -388334, -572320, -570346, -445036, -328041, -316623, -396066, -471024, -453344, -324134, -148595, -31117, -17363, -44485, -26877, 29505, 58668, 59979, 106574, 223280, 337997, 372879, 313788, 179381, 3100, -134938, -146744, -48112, 37221, 21810, -55506, -105292, -84585, 534, 107279, 143470, 32775, -164518, -282753, -252135, -180620, -176773, -185680, -86658, 122215, 332810, 459963, 468383, 327429, 72269, -107341, 9163, 394564, 709824, 617909, 151969, -295895, -370540, -90899, 238029, 385720]
39681C85720j8643r0262j48384j70871k6308K15385K34059r6519m23150l36124
39671d75097M6193K26069L0105j68637k4272K82994L32145N8772j96219j75792
39661f3739R073J31744J67918K09749K02020J648l03060l78496p7513K98180L58745
39650E56269J21116q6766j19535j16073j35945m4473J49723J75078r6829l83197
39640A9368l47515l4793K50401L26262K03589m1371k49273k06799P3598K57696
39630B51163J06698j66877k11616m4729M6580j7986n7356J6069R1199Q4087K2078
39619A19310o2028j18447n3250Q9990P9240j37136k27479L2957L07454J69243
39609A99854j79871k01664J02403K27253M2532m1530J21357J39011j52187l05870
$$ y = [385720, 367077, 276815, 128431, -42440, -68748, 146637, 380696, 284177, -138973, -475097, -428904, -202835, -172730, -341367, -365639, -82645, 249500, 308272, 112053, -63739, -54666, 77078, 244996, 454745, 656765, 658413, 355353, -23143, -100656, 197524, 556269, 677385, 590619, 471084, 355011, 219066, 174593, 324316, 499394, 402565, 19368, -328147, -362940, -112539, 213723, 417312, 375941, 126668, -80131, -6533, 251163, 357861, 190984, -20632, -65361, -18781, -36767, -94123, -78054, 13145, 97232, 119310, 57282, -61165, -114415, -24425, 54815, -82321, -309800, -276843, 30611, 199854, 19983, -181681, -79278, 147975, 190507, 148977, 270334, 409345, 257158, -48712]
39599d8712k1413K91124J61088j93360k70872p6844K0692m0686k3258R9580J27189
39588B4528L9402l301j836p7406j48972k7089K01439K39777L2286j68530j91369
39577h1071j09214j2941Q9661J41328Q3286M3348J84964L52589J96168k70556
39567F17562n65449l57957P5503K33361L2410j73252j06673J41793L17862K89983
39557E05143Q7171j90504l99244l85707j28874J72096K78632J95950J37447J68661
39547D40771R0520j82669l58310j67871J33455P9960k48660k82450J33002M19306
39537E7054J33297l27785l23745Q7489L30483K03135K0131l2728j10416k42546
39527b05631j94353N8944J77246j2594k04470p5797K37333L80714K62939N1057
$$ y = [-48712, -70125, 220999, 382087, 188727, -82145, -158989, -138297, -178983, -202241, -102661, 24528, 63930, 60629, 58793, -18613, -167585, -194674, 6765, 246542, 278828, 110298, -81071, -190285, -203226, -113565, 27763, 111049, 154397, 339361, 691950, 888118, 617562, 52113, -305844, -230341, 3020, 35430, -137822, -244495, -102702, 215160, 505143, 592314, 401810, 2566, -383141, -512015, -339919, -61287, 134663, 272110, 440771, 531291, 348622, -9688, -177559, -44104, 35856, -212804, -495254, -362252, 57054, 190351, -137434, -461179, -373690, -43207, 159928, 180059, 147331, 36915, -205631, -399984, -341040, -163794, -176388, -380858, -456655, -219322, 161392, 424331, 475388]
39517D75388j25212k27984k14397j01875k0818k8518P467J73633L02698K04574
39507D44956j9577j24883r4445j14809k24614k46048q7626J11284J97139J75897
39497A7274J01821l2429j94450k43748r1876J51955K97255K69196J14504r7200
39487B92302k71026k72657o7437J63439J98918O5087n671Q2469J57478N6566j28623
39476B70845k00269j19624J1184J22239J74016Q3425j48975l02822j60943J44399
39466a26525K49686N6253j40267r5022O4350J03466L7237J6158L4042j4223r7048
39455H8107r9704m0229j8438j0380P4620J84342J92170J35491J51550K00390J09803
39444I67722r7953k02663j55243j57709k77714k86863n6533J63329J02672j13666
$$ y = [475388, 350176, 122192, -92205, -194080, -214898, -243416, -235949, -62316, 240382, 444956, 425379, 300496, 206051, 91242, -133372, -379420, -467046, -355762, -158623, 17274, 119095, 86666, -107784, -351532, -443408, -291453, 5802, 274998, 389502, 292302, 21276, -251381, -318818, -155379, 43539, 108626, 102955, 185424, 342902, 399468, 270845, 70576, -49048, -37864, 84375, 258391, 341816, 192841, -109981, -270924, -126525, 123161, 179414, 39147, -55875, 8475, 111941, 149178, 165336, 199378, 185155, 88107, -11597, -51826, -70264, -80644, -6024, 178318, 370488, 505979, 657529, 857919, 967722, 869769, 667106, 511863, 354154, 76440, -210423, -266956, -103627, -955, -114621]
39434a14621j85213r1249j6595L8659K07391L69058K17719k17256m84768l01447
39424e78322P1722K31617J47627M1147j6709q8372j09479K2187J73097J18523
39414A3038o1686o7864J12051J43753q9096k31961p416L00142K49709q1943k35697
39403D3030p8445N9641k1087r4409L0754J33374m6543l19345k84745O4238L27094
39392a86443K65083O1352m1909o2539r6358p5096P3325J95856J01050j16674j96351
39381g8704j12008q0426j55067j18162J14081K79500J73293Q227P8102K53958
39371C62794J85655r5992k01973k0297J09989j6136j37721j9841J08770l4858
39361B40390k40146j09936K56308L66249Q0265k12531k26235j42329j72177j55068
$$ y = [-114621, -299834, -391083, -407678, -369019, -161628, 207430, 425149, 207893, -276875, -578322, -506600, -274983, -127356, -86209, -102918, -191290, -300769, -278582, -105485, 13038, -48648, -116512, -4461, 139292, 50196, -181765, -189181, 110961, 360670, 278727, 43030, -35415, 24226, 3139, -91270, -60516, 72858, 26315, -293030, -577775, -513537, -186443, 78640, 139992, 98083, 35544, -60814, -135910, -62585, 133271, 234321, 117647, -78704, -190712, -271138, -426205, -544367, -430286, -150786, 22507, 30734, 108836, 362794, 548449, 452457, 250484, 230187, 340176, 324040, 186319, 166478, 275248, 240390, 244, -109692, 146616, 512865, 593130, 380599, 154364, 12035, -160142, -315210]
39351c15210J09264M03951L40345n2081l27451k26623J3181N6523n2948k2738
39341g3787J86556K57337j4964l66099l84995q3293J31732N8077l8237J01523
39331b26150K87028J93868p3108r6150K18747M70495L06898j25521m04633l27646
39321B23828n3758J36112J09248m2142j32073r1384k2094k1493m6652l0413j3388
39310A5791l5627k3934N0910M4640j20448k28432n9048K11116K28029J1602q3040
39299A1559N5829J51640L2234j22374j45033j28071j41507n0569J72737K62969
39289I9414M3708k41817k46232P567K05537J69762O037q3677O703J98405K60473
39278D25880N7054k16856k45943n1344M5953m0429l0646J87636K94896N8459k40217
$$ y = [-315210, -205946, 198005, 538350, 486269, 158818, -67805, -54624, 1899, -51049, -73787, 112769, 370106, 355142, -10957, -395952, -479245, -347513, -289436, -327673, -226150, 60878, 254746, 181638, 85488, 304235, 774730, 1081628, 956107, 551474, 223828, 170070, 306182, 415430, 373288, 241215, 149831, 127737, 106244, 59592, 29179, 15791, -19836, -43770, 7140, 51780, -68668, -297100, -356148, -145032, 82997, 94599, 11559, 67388, 219028, 251262, 128888, -16145, -144216, -285723, -336292, -163555, 99414, 143122, -98695, -344927, -337360, -131823, 37939, 43976, -39701, -32998, 165407, 425880, 482934, 266078, 20135, -31209, 14744, -25685, -56331, 131305, 426201, 484660, 244443]
39267B44443k22575K1444J32399L1917p2238p4161l9526j148M0480J8149p6742
39256B442j07256k6682q442j27987j58961M5628K29174J19216j03542j02977N5822
39245a83565O0593j04824j94283j44948p7522J9963J93063K50598M5474j27253
39235b62704O9951L58145J91443l08231m61950j23074R5816j14080k28760J74797
39225f08647O26648M78248p6623l32233j16901J24515J33525J09834J89636J90230
39215G18232q199k27884k86309k27262j36844P857J72450J85902p31j60943r0471
39204e4202P7792P1163r4949j35102N7826K33395J53401o7768j60108q0592Q790
39193I646L4077L9707o78j30773k04813m0387K17327K20691m7823k38592k03715
$$ y = [244443, 21868, 43312, 175711, 207628, 135390, 61229, 21703, 20555, 61035, 79184, 2442, -104814, -131496, -139938, -267925, -426886, -381258, -152084, -32868, -136410, -239387, -183565, -122972, -227796, -422079, -567027, -644549, -624586, -431523, -180925, -135451, -262704, -192753, 165392, 356835, 48604, -413346, -536420, -440604, -554684, -783444, -608647, 18001, 496249, 419626, 87393, -29508, 95007, 228532, 338366, 528002, 718232, 710033, 482149, 195840, -31422, -168266, -160409, 12041, 197943, 197212, 36269, -54202, 23590, 94753, -196, -135298, -77472, 155923, 309324, 241556, 81448, 856, 9646, 43723, 83430, 82752, -48021, -252834, -293221, -75894, 144797, 96974, -141618, -345333]
39182c45333j65882j82090L3447M69115N61562M9221m25325j85307M12225N09309
39172G30942N9924k16554n6694N7251j27254k39278p4429J9181j41322j91810
39162a80043N9951J98061o6377l24487j48950J81433J93690N36k2083N9763j4667
39151f3173q0699J47252L99467J97596k63800l23534P4400K54165j17233n16859
39141b92418m03879M511J75392N1723k9843N2052J04216K6543l4118M7265J85772
39130a12784K24999J34741J6026l3819k0865k1003o4794r8923q1800n4400o2009
39119a74631o8643k5084L1951L1518k2744o3724l4242R4291K90329M01273K55643
39108G15937q4124l14606k59867r6887n8083p6013M4761K30219K06811n8230k64211
$$ y = [-345333, -511215, -693305, -659858, -190743, 370819, 420040, -5285, -190592, 221633, 730942, 790866, 574312, 517618, 574869, 447615, 208337, 133908, 153089, 11767, -180043, -120092, 77969, 11592, -312895, -461845, -280412, -86722, -86186, -108269, -48506, -63173, -143872, 3380, 402847, 600443, 336643, 13109, 87509, 341674, 224441, -292418, -696297, -691786, -516394, -464671, -494514, -442462, -338246, -311703, -345821, -298556, -112784, 112215, 246956, 262982, 229163, 208298, 187295, 122501, 23578, -58222, -112622, -174631, -243274, -268358, -236407, -204889, -227633, -291357, -325599, -231308, 59021, 460294, 715937, 631813, 317207, 57340, -39547, -97630, -173643, -128882, 101337, 308148, 249918, -14293]
39097a4293j76860Q7389K45832J67232n1897k12438j72786K9151J95321J73073
39087B69724K5269o3982q333J17441J66793K3671k75485m69644k94452J32253
39077c76745L63804K08101m700M0721J43151k3910k90011k46905L1413Q7723j39200
39066b06558k17480K1416K08169R7407m9305j4828l6351k82296l79542L8657O28542
39055a92169P12266J96162l57617m82961k19508J50627L68711K41821j88395n16102
39045b87165l64828Q1337K81536P5476j55731j04721Q5635J75166J73214J49411
39035A09330L4422j62243k18573l5268J33579N0772j08430k7554K35488L25274
39025C36797J15849j34582j59629J6067J77866J51395p1460k99115k69700M1474
$$ y = [-14293, -191153, -103764, 142068, 309300, 257403, 44965, -127821, -98670, 96651, 269724, 294993, 231011, 222678, 340119, 506912, 530583, 255098, -214546, -508998, -376745, -12941, 195160, 190460, 231181, 374332, 350422, 60411, -186494, -155081, -67358, -206558, -424038, -402622, -194453, -97046, -146351, -161179, -197530, -479826, -859368, -820711, -192169, 520097, 716259, 358642, -124319, -343827, -193200, 175511, 417332, 228937, -287165, -651993, -570656, -289120, -213644, -369375, -474096, -388461, -213295, -40081, 109330, 143752, -18491, -237064, -272332, -138753, -87981, -196411, -223965, 11523, 336797, 452646, 318064, 158435, 174502, 352368, 503763, 432303, 133188, -136512, -95038]
39015i5038L11778K46305j9516j24270j6155K2033j19850k02202p4588M6385n3714
39004g8832k16503j79248p414M7786j4579J4711J43264J52633O170n2023R4524
38993h9511K24063J35894k9705m0454N6263N6589m5069r3621q1278j31518k01697
38982b40044j01597J47106K63090J26005k9219m468L5357j25448l27111k46930
38972e03259P2738K57569J47148k3852m1386M878k7105o9964q388R9388J34489
38961D2256J01101N7212P609j6371O0467J74699J23326j11035k58373j65253n0759
38950c5121j19251j82389K660K52242K24472N01n9614O1263N3968j11562j22699
38939c5530P3095J19542j45434m04779l65794j25098J45034M29997N94764L61757
$$ y = [-95038, 216740, 463045, 443529, 319259, 303104, 325137, 205287, 3085, -71503, -25118, -78832, -295335, -474583, -481997, -434211, -448790, -434079, -290815, -138182, -132012, -184035, -89511, 134552, 270446, 240741, 200287, 256550, 313139, 268070, 174449, 93171, -38347, -240044, -341641, -194535, 68555, 194560, 165341, 160873, 196230, 70782, -256329, -503259, -430521, -172952, -25804, -49656, -91042, -86164, -113269, -183233, -191621, -92233, 42256, 143357, 200569, 208178, 191807, 252274, 426973, 550299, 439264, 180891, 15638, -35121, -154372, -336761, -334101, -81859, 142613, 143114, 83500, 144763, 198731, 87169, -35530, 37565, 157107, 11673, -393106, -758900, -883998, -738964, -308967, 285797, 647554]
38929F47554j56244l88535j12236J63730K3958j69785L3350L04842Q9339l43849
38919I2124k71455K30220L31800j90146n44696j61976M45518N03881N5780k98982
38909A92068l05451j69806o2047N441k6883j74720k29910k1895K47462K55809
38899b89932M9274m8333N2225J19187J4905j20858j51471j29560j10273j1733
38889f26569K00404L54205K60923j1276j92439j28416N7067J44012Q6146K1841
38879A65898L5547K9223r2599k13738j42383Q1012K04519J19518q718m7366j15234
38868A5679l18912m49032k18459K49549M65198J83304k57666l60972q3424J78584
38858e96151J45400l7358r1684L382P0260N0787N3365J13482J20642L0468l6406
$$ y = [647554, 491310, 102775, -9461, 154269, 178227, 8442, 41792, 346634, 435973, 92124, -179331, 50889, 382689, 192543, -352153, -514129, -68611, 435270, 491050, 192068, -113383, -283189, -345236, -339795, -366678, -541398, -771308, -793203, -545741, -289932, -240658, -288991, -236766, -117579, -102674, -223532, -375003, -504563, -614836, -626569, -426165, -71960, 188963, 177687, -14752, -143168, -86101, 57911, 144057, 165898, 201445, 230668, 138069, -75669, -218052, -137040, 67479, 186997, 178279, 130913, 15679, -303233, -752265, -970724, -721175, -255977, -72673, -330339, -691311, -774735, -596151, -450751, -488109, -579793, -576411, -506151, -455364, -401999, -288517, -167875, -137407, -173813]
38847a73813L182N4341K3339q048O0824J38883P5937o8435q8467N4784J66537
38836B39064Q6224j18987k61028k27420n0119J38110K03172J24465M931o3204
38826G5208q6938r2883o3360j8761l5544q9347l7740J09324R7662j75598l62356
38815f80333q0936M66609O63167K81332k16977k88599M9008L30671K22881j54109
38805E92714m05440k85741L7797J79444J6474j70212j36643l0919q0473j56571
38795d39570r724K27992K16628J38n6186R3406J13452o8582j05272J14733K05071
38784B92086m0075k24120k038K91072J62892k20465l04152l0880J23809n2736
38774d607k30416j28126R0751J85191K11667K90756K86742K4644l22093l74498
$$ y = [-173813, -170631, -116290, -92951, -100999, -40175, 98708, 174645, 106210, 17743, 72527, 239064, 325288, 206301, -54727, -282147, -332266, -194156, 9016, 133481, 138412, 75208, -11730, -104613, -167973, -186734, -222278, -311625, -349365, -240041, -142379, -317977, -680333, -761269, -294660, 368507, 649839, 432862, 144263, 193271, 523942, 746823, 592714, 187274, -98467, -60670, 118774, 135248, -34964, -171607, -202526, -282999, -439570, -449294, -221302, -4674, -4536, -60722, 32684, 146136, 77554, -27718, 87015, 292086, 252011, 27891, 25853, 316925, 479817, 259352, -44800, -75680, 48129, -4607, -235023, -363149, -272398, -87207, 124460, 415216, 701958, 726602, 404509, 30011]
38764C0011p5037J88667R0832j90912k32849L4018K45702J56699k4080k1684M6721
38753B48088q5186l03763k37615J19695L26871J32034j74619k17292l7469P7249
38743a52007K8242o9633j35070j63904j20946K5526K02822K79160J84187l6527
38733D1850k20798j84454N2559K06094Q5781q8111o447J98356J44417j27655j80137
38722g8545O1274J30514j92904m63881k60128J82535M01108L52498K24122j751
38712C54842l29031m48133j68122J43786P7643j36718k7935K84372L01664K5162
38702G7530q2080M2922k5348l45861l94087N9001M86587L76385m2523k33418j18633
38691a99525n668l2716q4425q6263n4588K7846J40268J56802N2460R700J13835
$$ y = [30011, -45026, 143641, 234473, 43561, -189288, -155270, 90432, 247131, 223051, 201367, 248088, 162902, -140861, -378476, -258781, 68090, 200124, 25505, -191787, -229256, -152007, -123765, -193398, -328468, -492372, -613318, -587792, -384970, -105810, 78377, 41850, -178948, -363402, -310843, -104749, -18968, -107079, -113526, 84830, 229247, 101592, -78545, -17271, 113243, -79661, -543542, -803670, -621135, -220027, 132471, 356593, 354842, 25811, -422322, -590444, -446658, -369015, -505733, -533668, -249296, 52368, 77530, -4550, 38372, 13024, -332837, -726924, -667923, -181336, 195049, 152526, -80892, -199525, -205193, -237909, -322334, -408597, -463185, -435339, -295071, -138269, -85809, -76109, 37726]
38680C7726J44101p1644k92763j91565R7571J47647q8159j94101M0568K73324
38670i7295J39666j81652k45333M12J77365N8406j40135j28470M3498J04772l7935
38659c06701j85981j09528J67069L56411K01613j83896l51355l4868M36425M87204
38649D76393M6168l65198l63794j57592q4657q6102L8350J76596J22267N705O2846
38638a29018J67295O4051j01235j4149J78610O3107k78198l34087k0776J85707
38628b18693P5100o852J27235J73207j8823j14337N8072J47607n2520j84004K694
38617a1314J49166m4403k32551o5914J33956k2113k29172n1076K13508L9782l12614
38606d32745j86519L05411M23624L2307k20857j9078J80572J1518k38984k07381
$$ y = [37726, 181827, 110183, -182580, -374145, -276574, -128927, -217086, -411187, -370619, -97295, 42371, -139281, -384614, -384202, -206837, -148431, -288566, -417036, -373538, -268766, -306701, -492682, -602210, -435141, -78730, 122883, -61013, -412368, -447236, -10811, 476393, 522561, 157363, -206431, -364023, -448680, -534782, -496432, -319836, -197569, -191864, -129018, 38277, 102328, 1093, -13056, 165554, 228661, -49537, -383624, -404400, -218693, -143593, -150445, -23210, 149997, 131174, 16837, 74909, 222516, 169996, -14008, -11314, 137852, 93449, -139102, -205016, -71060, -93173, -322345, -373421, -159913, -120131, -432745, -619264, -313853, 109771, 142078, -78779, -97857, 82715, 94233, -144751, -352132]
38596c52132Q979J70749K53392K44209L4330k64749l10685m1237J86204J43305
38586G2365L5061P0551J11284k0646k02183k18457p9897N8493J07508M9730q5657
38575a01848j79873j32241k7922k151K2540K01137M11693L58368L4657k35596
38565C48764k51481j32942m1285O733J9208o465P922J03794J29597l0270j76305
38554b2730p2153J20955Q1796j11655j13948P8792J49391N0268M7784J69704J47030
38543E25234m2587j08770J033K0920q2609m2444J23344O3206k13305k31830J19090
38532A31282L05966K8208k51135q7832J99648R9137k43342l23198j00961M8678
38522a93549K370k3906O2641J27771J09812P3903K3812o4254j01911j9165O8927
$$ y = [-352132, -343153, -172404, 80988, 325197, 359527, 94778, -215907, -257144, -70940, 72365, 107426, 177977, 289261, 268615, 66432, -152025, -231922, -173429, -65921, -16191, -101848, -281721, -413962, -441884, -444035, -421495, -220358, 191335, 549703, 584360, 348764, 97283, -35659, -76944, -70211, -51003, -57468, -49546, 54248, 183845, 153575, -22730, -94883, 26072, 107868, -3787, -117735, -38943, 110448, 160716, 208500, 378204, 525234, 482647, 373877, 374910, 395830, 313221, 270777, 394121, 457327, 244022, 12192, 131282, 437248, 465456, 214321, 126489, 326137, 425274, 181932, -141266, -242227, -193549, -191179, -215085, -152444, -24673, 85139, 159042, 182854, 118600, 16689, -2476, 66451]
38511F6451L6860l3871j0114N4983L0188p8824j87523k63444k58374p9759K24332
38500d99095M20416L63237J54142n6257k17230k64992j24887Q2575J16626j3296
38490c8761n6865K1977k4227k23684k44657M4201L00388K49282R1674Q6789J34160
38479C40277R0418R4278K06409J31151k62687n20009k18088K93827L46586n7038
38469D45124k95445q8409J72972J03762j55714k42378n7676J88626K25892l8240
38459B58514l83768m26587o2763L25043L05559m8526k72533j10494K23280L63792
38449A71517J92901r0118j91496k8933J65277J31657o0132j35753o2694o6745
38439B5481j79157j48666Q4564K30762J41142M9038J05838J06007n5140j00459
$$ y = [66451, 103311, 69440, 59326, 114309, 144497, 65673, -121850, -385294, -643668, -723427, -499095, -78679, 284558, 438700, 382443, 165213, -99779, -224666, -142091, -25465, -38761, -95626, -73649, -97876, -321560, -566217, -522016, -221628, 27654, 119328, 206117, 340277, 430695, 524973, 731382, 862533, 599846, 79837, -138251, 155576, 502162, 445124, 149679, 61270, 234242, 338004, 182290, -60088, -117764, 70862, 296754, 258514, -125254, -551841, -614604, -289561, 15998, -32528, -305061, -415555, -192275, 171517, 364418, 274300, 82804, 53871, 219148, 350805, 290673, 154920, 92226, 25481, -153676, -302342, -217778, 12984, 154126, 203164, 309002, 415009, 359869, 259410]
38429B59410J09235K25657J732k07376l2539K22209P1219k97571l13705L8575
38419G6846K33835N1797k03677k83408k27378n4852K39029M01208J68202k15756
38409A85846k56756K1997J26608p7345j79234L0654K20296J14651q9311j40854
38399d3448j11781j13267n0053R7882J26205j9622p8359P5418J65440k6847k60370
38388b38802j99323Q3334K73148K69042J78951M8775j08974j58289K168K10225
38378C60255K11069n049k30763l34332l37203k64869j12531O1622J61481J70941
38368c19379J51082J43028J47973J63163J70011J28553L3956o9198j51580k01589
38358A96020j56271L9813K64476K61763m2376l89673m70426k61983J3917J64753
$$ y = [259410, 368645, 594302, 596034, 388658, 356119, 578328, 649547, 351976, 38271, 76846, 310681, 362478, 158801, -124607, -351985, -406837, -167808, 233400, 401602, 185846, -70910, -48913, 77695, 350, -178884, -148230, 72066, 186717, 97406, -43448, -155229, -268496, -318549, -220667, -94462, -114084, -192443, -117025, 48415, 21568, -238802, -438125, -354791, -81643, 187399, 366350, 415125, 306151, 147862, 150030, 360255, 571324, 566275, 335512, 1180, -336023, -600892, -713423, -651801, -490320, -319379, -168297, -25269, 122704, 285867, 455878, 584431, 618387, 549189, 397609, 196020, 39749, 79562, 344038, 605801, 563425, 173752, -296674, -558657, -544740, -379987]
38348c79987J38094k4568j76340r7254K51837N49629M26837k4112l05643j66003
38338A92490P3548K1394k10651k39097l6244P6622J0598L3883K31473K89959L3052
38327D77027k34930k16669q0854o8954r879K89113M86560J62714l66072l92581
38317D5475P9692L24517N9079j52953Q7278L45726J25809l17376m58720l11726
38307a73199k01940j17904J36947M18271M16594J78351j6590j19956k26059k24493
38297G0022l563J85008M5873k26298k13603N4534J86822Q1453p904J3496L772
38286A89612j6646J08960K52524J06804k52912l98670k06331j2362k9074p1519
38276c29614O540N7778n825j4148J15628J96889J19898M0044M8871K479j38614
$$ y = [-379987, -241893, -266461, -442801, -540055, -288218, 261411, 688248, 664136, 358493, 192490, 266038, 287432, 76781, -162316, -198560, -121938, -111340, -77457, 154016, 443975, 477027, 242097, 25428, -55426, -124380, -134259, 154854, 641414, 804128, 438056, 45475, 125167, 449684, 508763, 355810, 443088, 788814, 914623, 597247, 138527, -173199, -375139, -493043, -356096, 62175, 478769, 657120, 640530, 520574, 294515, 70022, 66459, 251467, 297340, 71042, -142561, -88027, 98795, 180248, 172344, 185840, 189612, 172966, 281926, 534450, 641254, 388342, -10328, -216659, -229021, -258095, -329614, -323074, -265296, -271121, -285269, -169641, 27248, 147146, 187190, 236061, 238540, 99926]
38265I9926j52710L8816J52561o525j85338p8578J74667K24648M7108r7873j15871
38254A00831j45838k27897k15900n0871J17028J43630O7062J0640J9292M3766
38244a38257K7933j7000j0089J02213K32252K07883m568k15159k34827j12176
38234a61795k7169q560O6783J91282J63909p1792k24002k3666L11435L00073j07429
38223D09069m06877k42701J12874K26378J27250J03988J35191r190k43473k48778
38213c6269l5989O8178j750P034J15475N5675j48799j35515J06409J23905j80734
38202f2380k79199P6943L49573J11000j86509J8789M00210K84478j99613l46514
38192A66778k9096J92005M2160j47438j33178r2537j47579j30269K8179J40990
$$ y = [99926, -52784, -13968, 138593, 132068, -53270, -131848, 42819, 267467, 314575, 216702, 100831, -45007, -272904, -488804, -539675, -422647, -279017, -211955, -201315, -182023, -138257, -110324, -127324, -137413, -35200, 197052, 404935, 400367, 185208, -49619, -161795, -188964, -197524, -130741, 60541, 224450, 152658, -71344, -95010, 216425, 516498, 409069, 2192, -240509, -127635, 98743, 225993, 329981, 465172, 455982, 212509, -36269, -72258, -4080, -5830, 1204, 116679, 172354, 23555, -111960, -5551, 118354, -62380, -341579, -264636, 84937, 195937, 9428, 28217, 428427, 712905, 513292, 166778, 137682, 329687, 371847, 224409, 91231, -1306, -148885, -279154, -250975, -109985]
38182a09985J22806J09328J45141J14807K1731j1318j9529j29013k46279j70630
38172a72941L4144J35904J17423R7896J0123k19244l30908q0180K22940R8734
38162h6109k81849l03930J00209L54654J91009k976N8702J28372j651j05613j4979
38151C5839K7984j56306l08464j64118J09623K16736J50584N3990l9275j06977
38141a80384o7099K8124J3902o4730J1047J99507K11037M6068L8858K19247J68461
38130F24038k42567n09706k43058K15747L33363J37743r715n0000j51514k47205
38120a42874j34113R9558J73102O3702m075L4461K2023q4569j13833L1081K01916
38109A46379K12349Q4534r661m579k4460j49362k02348J8738L17915K47706j93836
$$ y = [-109985, 12821, 122149, 267290, 382097, 403828, 392510, 372981, 243968, -2311, -172941, -138797, -2893, 114530, 212426, 222549, 3305, -327603, -407783, -184843, -86109, -367958, -671888, -571679, -217025, -26016, -28992, 29710, 158082, 156431, 50818, 35839, 63823, -92483, -400947, -565065, -455442, -238706, -88122, -34132, -73407, -180384, -247483, -219359, -205457, -270187, -259140, -59633, 151404, 197472, 236330, 455577, 624038, 381471, -128235, -371293, -155546, 177817, 315560, 305845, 255845, 104331, -142874, -276987, -177429, -4327, 59375, 55300, 89761, 111784, 27215, -86618, -55537, 146379, 358728, 443262, 433601, 429022, 404562, 255200, 52852, 71590, 389505, 637211, 443375]
38098D43375m15219p3291L49340K65518r6392j15306J65796J68134j67314k80946
38088B43695N883K03250L4268j52590r3219j5996n6623L9043K95042K73849j41648
38077F34954l97784j54669J18531m3560k98240j19702K81709L39130N0108j37320
38067B73157q2797j284K4434M6996k0563k06676k41226L1047K68362J39316q4700
38056A46066K2822K88519K32286j05834k63676j37369l7284m9842L7923K00128
38046C33739J52541r6974k22526j50341j32364j96044o1597K75584M08586J56962
38036D67566j29217j35303k9831p1528j40705j549K36198K75041R5178n8987p8133
38025D28730q7480j65273k15933j72966j25652j44200j26273L9620K41788K50796
$$ y = [443375, 28156, -45135, 304205, 569723, 473331, 358025, 523821, 691955, 524641, 243695, 249578, 452828, 487096, 334506, 241287, 225291, 168668, 207711, 502753, 776602, 634954, 237170, 82501, 201032, 157472, -140768, -260470, 21239, 360369, 410477, 273157, 190360, 189076, 213510, 260506, 239943, 33267, -207959, -176912, 91450, 230766, 146066, 168888, 457407, 689693, 583859, 320183, 182814, 145530, 95688, 133611, 333739, 486280, 389306, 166780, 16439, -115925, -311969, -373566, -97982, 310604, 467566, 338349, 203046, 173215, 101687, -39018, -40567, 195631, 470672, 565850, 506863, 428730, 341250, 175977, -39956, -212922, -338574, -482774, -609047, -569427, -327639, -76843]
38015g6843N0451j11055n5794R9303J49078P7262r905q3827j53083j44162j5041
38004b73616J14737J32281J09227J24989Q1894p0709j34126J9126J47302L1622
37994B82727q0177J03244K91958K5761m53060m60584K9855L19053R9199j44545
37984A3431n1458P5031l3268j01584P9811J91152j4423k26315j57004n1579j41046
37973d17252j41071J74121M20258K04839j81270k60826j28992j17827j21476R7112
37963d72384K94268J19328j98161k03315M454J3657j18903k6787K15339K15128
37953a57376K1884N5673L21217L72487Q4888j69337j85471j81320k78160k58707
37943c74222p132K40755K55818J01468m9499j17670q2339K3583P6611J7231j7602
$$ y = [-76843, -26392, -137447, -193241, -93938, 55140, 132402, 122497, 38670, -114413, -258575, -273616, -158879, -26598, 82629, 207618, 289512, 218803, 84677, 103803, 251105, 282727, 202550, 305794, 597752, 623513, 170453, -290131, -260276, 58777, 157976, 13431, -38027, 37004, 3736, -97848, -18037, 173115, 158692, -67623, -224627, -276206, -417252, -558323, -384202, 36056, 240895, 59625, -201201, -330193, -448020, -569496, -472384, -178116, -58788, -256949, -460264, -455810, -442153, -561056, -587843, -372504, -157376, -135492, -79819, 241398, 613885, 698773, 529436, 343965, 162645, -115515, -374222, -381354, -140599, 115219, 216687, 167188, 49518, -32821, -9238, 67373, 84604, 67002]
37932F7002R5281K39422K35725Q8052j20289l41474m03641q5170M08447M68536
37922F51891o6480n33909l57164J26872K70978P7853o2345j35247k76076k02425
37912e06052K93109O43298K32737m52773m32407J83809L46274j99265n25547j04584
37902e21401L82941K72328p3191p3917J00452N2438n2568P7405J88186n0329l34650
37891c2306j86003K03061K61944k7673j52838O4752K32623O8799j86712k06928
37881C8719o8015p1043k47842k83518M1653M77596N41212J36132k82423l00848
37871a8377p3343L375q2015m8714R6988O6562j38263j61896R3378K56833P1119
37860F5647k16612k63616r2833Q1536J96676K72456K39298O8559r6697j26460
$$ y = [67002, 162283, 401705, 637430, 725482, 605193, 263719, -139922, -225092, 183355, 651891, 585411, 51502, -305662, -178790, 92188, 170041, 107696, -27551, -303627, -506052, -212943, 430355, 663092, 210319, -222088, -38279, 307995, 108730, -416817, -521401, -138460, 133868, 60677, -13240, 87212, 139650, 87082, 164487, 352673, 302344, -32306, -218309, -15248, 246696, 219023, 66185, 130937, 363560, 432359, 245647, 38719, -29296, -100339, -348181, -631699, -590046, -112450, 428762, 564894, 282471, -18377, -91720, -88345, -170360, -219074, -122086, -55524, -193787, -355683, -262305, -5472, 65647, -150965, -414581, -507414, -425878, -229202, 43254, 282552, 351111, 254414, 127954]
37850A27954p6787m7086j8817M4157Q0111K7239p1543j30915j04243O07Q8988
37839h0335K3941j58410j85312R7496M22452M11419R3904j69406j90861p7529
37829A87359N8276J66403J13412j58606l78886k34886J26261K72492J21173k2519
37819B50479l0087q3396k20557k27668o7465K7855j3183j313R8227Q2284o6423
37808b51247j11113j4434p550j03752l3008J97662J99796j27194l29864q5990
37798f66694K98361L87870K09983L1509q3010j58792r0950J24870K23450M4289
37788C20886j77089j69476k3050L8993K5674M2454L6387m9433r0428o845L9056
37777a2871q6571k32218k00236l5407J21411K34603K49474N3411k28111k19569
$$ y = [127954, 51167, 4081, -14736, 29421, 109532, 136771, 65228, -65687, -169930, -169323, -80335, -56394, -214804, -400116, -302620, 119832, 531251, 625155, 455749, 264888, 187359, 245635, 412038, 525450, 366844, -12042, -246928, -120667, 151825, 272998, 250479, 220392, 136996, -83561, -311229, -378694, -350839, -364022, -365335, -267108, -184824, -251247, -362360, -376794, -384344, -488096, -521104, -323442, -123646, -250840, -580704, -666694, -368333, 19537, 229520, 261029, 178019, 19227, -71723, 53147, 276597, 320886, 143797, -25679, -48729, -9736, 15938, 58392, 94779, 45346, -45082, -51927, -12871, -99442, -331660, -531896, -567303, -445892, -211289, 38185, 91596, -136515, -356084]
37767c56084J48333L93510J34581l00385l19448R2731M06532K93587o2693l39301
37757I1363l87117j90291J51806L69837K30385j39927l38776j48092K41294M85948
37747C66430M29592J61974j33338l25210l79467l14144j55311L1465J29590R7959
37737i0460O8546J76214L14291K31919j11954m55811n23451k72552J27174M08259
37727a27825L41211l9864l69120l12286L0921K92068L20819K37428R4286j50988
37717C16650l60737l19441j31872j06422j96707k2860M35002O59420L41368j43051
37707D71350l03136j95909j62754k13754q3899K57598N08105L99349l0685m68650
37697A77615n45220j80617K32246K22007j30937k75803P904K97191K10180k8376
$$ y = [-356084, -207751, 185759, 320340, 19955, -299493, -206762, 199770, 493357, 430664, 91363, -295754, -486045, -334239, 35598, 265983, 126056, -212720, -360812, -119518, 366430, 796022, 957996, 824658, 499448, 119981, -194163, -349474, -318009, -188419, -90460, -21914, 154300, 468591, 700510, 588556, 132745, -390706, -663258, -536084, -127825, 213386, 173522, -195598, -507884, -476963, -184895, 135924, 373352, 467638, 316650, -44087, -363528, -495400, -601822, -798529, -821389, -386387, 273033, 614401, 471350, 168214, -27695, -190449, -404203, -488102, -230504, 277601, 676950, 646265, 177615, -367605, -548222, -315976, -93969, -224906, -500709, -492805, -195614, 14566, -13810]
37687a3810l6690Q9790L4046j21287k5356L06567M55280K00137k06304m14447
37677B67926l47037j42459L6817P4592m0999j64707j24065N4854J55462M9633
37667a79983j15161q7425J46071K87824R1962k59308l39624p3104J26678k4076
37657d26146k21896n7407K99969L51174N5659j47027o7508K2147l2956k5313J25504
37646a23800J55864l5478j35732L9440J80156j252k57401j92130J23556L05703
37636E8926K23599N7619n9808j39861j67251r6798L1245J35509J77043J15056
37626C35279p0246k44727k18561m3472M0681J2287Q7678K43555J41707k64884
37616A9297m88314j95818K38089K77542J4516o0418J33616K09532P131j43667
$$ y = [-13810, -50500, 39290, 73336, -47951, -73307, 233260, 688540, 888677, 682373, 267926, -79111, -221570, -184753, -110161, -151160, -315867, -439932, -385078, -229616, -179983, -295144, -382569, -236498, 51326, 143288, -116020, -455644, -528748, -402070, -426146, -648042, -705449, -405480, -54306, 1353, -145674, -213182, -191035, -223991, -249304, -123800, 32064, -3414, -139146, -99706, 80450, 79198, -178203, -370333, -246777, 58926, 282525, 340144, 280336, 140475, -26776, -123574, -92329, 43180, 220223, 335279, 265033, 20306, -198255, -241727, -201046, -188759, -101081, 142474, 284181, 19297, -469017, -664835, -426746, -149204, -134688, -195106, -61490, 148042, 155173, 11506]
37606A1506L8533L37369L18672j06665n55459n79560j39607L58701N13764L34211
37596E31465J04600k9927j24468j70792r2874k60r7304k84394k13101J52402L99700
37585A75047K60945j1465p3648K8981N6477k9637j24488k05443k63214k11338
37575c97783o6981j0042p6369l3251K29203M29065K71794r6271k75832j26645
37565a53112J27892K16029P6160j29023j73059j7837J10004L6768o1634N2270
37555H4458K06767M7858l07944l49176L9872L81960L35743J01675q2465l02171
37545A56577n51419m96301k7147M01218L71926P2725r0465o7614k869J11567K43369
37534A21567J57426j65256l14394n9882J98406L1128l28534l78977j20744P6814
$$ y = [11506, 50039, 387408, 706080, 599415, 43956, -535604, -675211, -316510, 197254, 531465, 636065, 606138, 481670, 310878, 218004, 217744, 120440, -163954, -377055, -224653, 175047, 435992, 424527, 350879, 379860, 436337, 406700, 282212, 76769, -186445, -397783, -464764, -474806, -551175, -584426, -355223, 73842, 345636, 249365, -26467, -153112, -25220, 190809, 266969, 137946, -35113, -52950, 57054, 93822, 32188, 84458, 291225, 339083, 31139, -318037, -278165, 103795, 439538, 541213, 458748, 156577, -394842, -891143, -918290, -517072, -145146, -72421, -162886, -230500, -233369, -121802, 121567, 278993, 113737, -200657, -260539, -62133, -31005, -359539, -738516, -859260, -782446]
37524g82446J14974J56117J85762Q3244l4218R943R1477K0689n7185P2674K38783
37513I9814J57277l6341k4949R7515P572k02471j35721J90601L07628M1225k14045
37502B88105j11854J69190K50500N7992j70651j96836M624K19417J68981j66459
37492E13009m48102l51354K3509K73979J72862j20752k73875r6467K81528M88930
37482D63267K86491j15000k92626j64676k5169j3674N2312K10679J77388j35687
37472D43305l57768k16896K8885N1978k6312M5309J54978P4659q3067p8145K1307
37461E8233J3301m8230j6005K2175m5468m5163J83482L92526K44172j47002l82610
37450B29411l37771j87007l7906R5928J11659l2032j17496M4097K65500K38981
$$ y = [-782446, -667472, -511355, -325593, -242349, -276567, -266624, -175147, -154458, -211643, -138969, 99814, 257091, 220750, 195801, 293316, 300888, 98417, -37304, 153297, 460925, 502150, 288105, 176251, 345441, 595941, 653933, 483282, 286446, 291070, 510487, 679468, 513009, 64907, -286447, -262938, 11041, 183903, 63151, -210724, -307191, -25663, 463267, 749758, 634758, 342132, 177456, 152287, 138613, 190925, 401604, 578992, 443305, 85537, -131359, -102474, -50496, -76808, -31499, 123479, 198138, 115071, 36926, 58233, 71534, 23304, 7299, 29474, -15994, -61157, 122325, 514851, 759023, 612021, 229411, -108360, -295367, -333273, -237345, -125686, -157718, -275214, -231117, 34383, 273364]
37440B73364l060j80682j74598o8482O0477J44772R1259m4953n6578P3820J06430
37429B21769j7992m3922R2334P3600j95785k92838L1559L46464J96994j75392
37419B36791k86235j76179j67550k13615q0068J18138J35079Q9346J97149K75611
37409A28467O3087k21421j98778K4174P4962m6852q5248m3283n5683k941K11792
37398a51724K84428j9670l11694j19270K93386L12529m8173k49809j33015k9030
37388a72042p7180q2780Q004N8721Q3465J49645J13185q0054j11017J74860L18705
37377C83512m0076m19795k18714K24341J79219k08587k06349J80584K56430p4031
37367E6534j64022J61586L14547M4549j63147m6195Q383j90507k32745Q0038K95114
$$ y = [273364, 270304, 89622, -84976, -153458, -92981, 51791, 143050, 98097, 41519, 115339, 221769, 203777, 159855, 252189, 325789, 130004, -162834, -131275, 215189, 412183, 236791, -49444, -225623, -393173, -606788, -686856, -568718, -433639, -344293, -147144, 128467, 191554, -29867, -228645, -204471, -129509, -176361, -261609, -304892, -360575, -363516, -151724, 132704, 113034, -198660, -317930, -24544, 287985, 239812, -9997, -143012, -172042, -249222, -332002, -323998, -265277, -181812, -32167, 81018, 964, -110053, 64807, 383512, 343436, -76359, -295073, -70732, 108487, -100100, -306449, -125865, 130565, 56534, -107488, 54098, 368645, 413194, 250047, 203852, 212235, 21728, -211017, -130979, 164135]
37356A64135R0945j78400j26146O8116Q3676k5487p6986q4530p6254J0295Q6691
37345f3945j6533j53271r263L04176L43710P5204o7337N9557J11708p1935k29477
37334B82594k35912k71414k99639m1877L67197L90186l1570k97004j02840J11413
37324a28866o612j34546O7983L26240K53782J256p0805J2846Q45j28576k25842
37313c2295k47078k12658j06141K1214P1605R3361J79666J95613k2729k48738
37303c08180j19738K17978K65724j7454j62496l999R9006j9618n5474J24170J93803
37292B13722j4897j86136q0299J01009J55098J74934J86128J0773k82217l16864
37282c8749l0910J59646L2045j36614j39050j47200k22724j10475K02049L03060
$$ y = [164135, 255080, 76680, -49466, 18650, 102326, 76839, -147, -84677, -160931, -150636, -63945, -80478, -233749, -243012, 61164, 404874, 480078, 412741, 472298, 584006, 512071, 282594, 46682, -224732, -524371, -566248, -199051, 191135, 159565, -137439, -240279, -128866, -135478, -270024, -202041, 124199, 377981, 379237, 308432, 321278, 322123, 193547, -32295, -279373, -492031, -598172, -576958, -505353, -411992, -232326, -36713, -59442, -308180, -427918, -209940, 55784, 38330, -124166, -128165, -29159, -48777, -104251, 19919, 213722, 198825, 12689, -67610, 33399, 188497, 363431, 549559, 560332, 278115, -38749, -69659, 89987, 122032, -14582, -153632, -300832, -523556, -634031, -431982, -128922]
37272a28922M3679j59759l4501J04447k4564j63689l6679J40119J01949K8382
37262a29538J50420K75776J46457p8761j09438N607M5160j7870j00266j79565
37252G982j65968O7510L46079K82046j06347l15159j14722J05831L0478p2176
37242F5554R6740K86440J28539k31209l92946l01583j67219l9842J38382K55244
37232a61900J65904k7616j12029n5205L2687Q4178P6307J2736n266J11436K17731
37221C38963P9876k27403l72614k47748o8559K6326J11335J82326J21029o817
37211f3286p147O5886o866j60111j30587K8307K7335p9582K9346K74698K17320
37200A95313j48612l02384m8203J89520J22721J3833Q5659J28971j0235j13798
$$ y = [-128922, -85243, -245002, -279503, -175056, -199620, -363309, -399988, -259869, -157920, -129538, 20882, 296658, 443115, 364354, 254916, 260523, 305683, 287813, 187547, 7982, -157986, -90476, 255603, 537649, 431302, 116143, 1421, 107252, 137730, 65554, 162294, 448734, 577273, 346064, -46882, -348465, -515684, -555526, -417144, -161900, 4004, -23612, -135641, -190846, -158159, -73981, 2326, 15062, 9796, 121232, 338963, 418839, 191436, -181178, -428926, -497485, -471159, -359824, -177498, -56469, -63286, -70433, -4547, -11413, -171524, -302111, -273804, -246469, -326051, -296705, -22007, 195313, 46701, -255683, -303886, -114366, 8355, 22188, 107847, 236818, 226583, 112785]
37190A12785n9554q0757k62945k84889L3627L82037M38483K78868P7683j64918
37180D70420l81132l56946j09924N4390J9440j7008J3596m8981j65918q5257J47907
37169d59413J94161K2772l2166J06944J60166P6710J06882K17461R0568k07069
37159B77016k37059K9377J49794L0528N6435K77619K62421o5209k46877j44490
37149C89555j53713l52780l00697N5201J59844j37295k39261J42600M55948K69193
37139B88595n4098j01935n7134j34409j21162P0028J10430p2161o3102K18866
37129H3918K60549r2234k61676K8909K09323j21895m66383k97046J01218K52627
37119c02690K46228L02461K55673Q485j33923n5499j04272l69884m01571m0614
$$ y = [112785, 53231, -27526, -290471, -575360, -541733, -159696, 278787, 557655, 635338, 470420, 89288, -267658, -377582, -323192, -303752, -320760, -307164, -356145, -522063, -607320, -459413, -265252, -242480, -274646, -167702, -7536, 69174, 176056, 393517, 484085, 277016, 39957, 69334, 219128, 249656, 306091, 583710, 846131, 780922, 534045, 389555, 235842, -116938, -417635, -362434, -202590, -339885, -579146, -436546, 19402, 288595, 234497, 132562, 75428, -58981, -180143, -110115, 315, -71846, -134948, 83918, 344467, 252233, -9443, 19466, 228789, 106894, -359489, -656535, -555317, -302690, -56462, 245999, 501672, 510157, 376234, 320735, 216463, -153421, -554992, -595606]
37109e95606K30607J55644J02686K24743J24977k32361k52695J80778L51631k0273
37099B70131k32831Q5158K54402j51893m40297p4665K97621M9112k59451L6237
37089a66476M32012K00340k58344j81722J79872J24306j96812j66223J32275J84872
37079B84100J7171m5494j04818l18684l39233N4491L49040J28599j38347L4199
37069g8976K26449m4287l16937k8004L59177J48555l05778k28480K12039K77295
37059B21053n5538k30903j46223r1383l8639J51742K32067L1276q8874P1975O7507
37048A24060k84678l39456K12992N59226J09552l49203R395N31144K20327m77643
37038C15716m89762K2846J35619j09387Q355L42068J66964l22740k97377J72403
$$ y = [-595606, -364999, -209355, -106669, 118074, 243051, 10690, -242005, -61227, 290404, 270131, 37300, 122458, 376860, 224967, -215330, -289995, 7626, 56738, -202713, -166476, 265536, 465876, 207532, 25810, 205682, 329988, 133176, -33047, 99228, 284100, 301271, 255777, 150959, -167725, -506958, -452467, -103427, 25172, -113175, -78976, 147473, 103186, -213751, -241755, 117422, 265977, -39801, -268281, -56242, 221053, 165515, -65388, -211611, -302994, -341633, -189891, 42176, 73452, -15422, 56553, 124060, -160618, -500074, -287082, 272144, 381696, 32493, 41888, 573032, 793359, 315716, -174046, -151200, -15581, -124968, -116613, 225455, 392419, 69679, -227698, -55295]
37028e5295K79127k3756n3583K29845K03096j71024l03979j10105m4034j30755
37018a80463k5754J34641j7516k20987q971L08035J51758j77181J55M30968L24174
37007G18859k18153l77062k6323K02252J03172M7650J06052L6323m9681N7902
36997F00991N9810k88543m67695l6715L85217R6846l48408o1618N27914L77798
36987H45597l01566m24292O8839K38021j25495k96328m4857J24021R0862J90897
36977C65699K82134j6893l46458j03565L32082J53485l85362l93198L8218P2212
36967a646k61094j84219K61964K75815j64966k85198J0440O6303j52658k8218
36957d63477L81425L61885r0661k52051k3616p970k47633j69096K24783L42039
$$ y = [-55295, 223832, 200076, 146493, 376338, 579434, 408410, 104431, -5674, -49708, -180463, -206217, -71576, -89092, -310079, -319050, -11015, 140743, -36438, -36283, 394685, 718859, 500706, 123644, 97321, 299573, 402745, 450395, 556447, 592770, 543089, 600991, 660801, 372258, -95437, -132152, 253065, 349911, 1503, -60115, 467799, 845597, 544031, 119739, 188578, 426599, 301104, 4776, -40081, 83940, 174802, 365699, 647833, 630940, 284482, 180917, 512999, 666484, 281122, -112076, -73858, -1646, -262740, -446959, -184995, 90820, -74146, -359344, -348904, -282601, -435259, -463477, -82052, 279833, 189172, -62879, -86495, -94465, -342098, -511194, -286411, 55628]
36947E5628J44367J21364K32409M8870k22537n2224K97751J75170k19926k11443
36937C69429P1741L7451j54739j3936J30313k29806n34158l5651O46787M54257
36927G41688k09603k08846K60203J64005l28360k36468K37013R6360m30301k89502
36917b03811L11336K82692j90159p306N97894M00428m13061m75673K16322L24353
36907H43015k72380l16539L17603L57513l70696n45558J70008N31990N2023k50589
36897E16390Q1459K11179j66651k61565J03071J35305k11695p6763M81357M27390
36887A239477k50539m40506J9275J52885j62349p1489L39701J41250m13329j91052
36877C63324N13302L40681m94228m57175L95906M53793l71970m18410N72890R23094
$$ y = [55628, 199995, 321359, 553768, 602638, 380101, 327877, 625628, 800798, 580872, 369429, 441170, 478621, 323882, 309946, 440259, 210453, -323705, -359356, 287431, 741688, 532085, 323239, 583442, 747447, 419087, 182619, 419632, 515992, 85691, -203811, 107525, 390217, 200058, 192752, 790646, 1191074, 778013, 302340, 518662, 843015, 570635, 254096, 571699, 929212, 558516, 12958, 182966, 714956, 766979, 516390, 597849, 809028, 642377, 380812, 483883, 619188, 407493, 330730, 812087, 1239477, 988938, 548432, 567707, 720592, 558243, 486754, 826455, 967705, 554376, 363324, 876626, 1217307, 723079, 265904, 661810, 1115603, 743633, 325223, 898113, 1821207]
36867A821207J16248l69855R1668L34887q0223q5628N31087O03316J6019O5102
36857C043828Q67340J020215K83823o2769J26933l36035j250993j070073M5794
36848B668063L06705l12908m7541J025831Q76076n38392r30651J09387L82209
36839C538779o97810j042030K4818N25949k63872n50594K54763M22810m14278
36830A798535m15422O05512N51314p13388p71136O54706R27911m54168p88521
36821A395343N97573R98878l49762p49177N73929Q63251o23166r44572P31360
36812B493657J310963k06802p28041P66610J139307n30788q72491J030494J513693
36803E916602m46424r56640J093064J606343m86247p14235J962453K495433k95015
$$ y = [1821207, 1937455, 1567600, 1659268, 1994155, 1913932, 1828304, 2359391, 2962707, 2978726, 3043828, 3911168, 4931383, 5215206, 5152437, 5279370, 4943335, 3692342, 2622269, 2668063, 2974768, 2661860, 2614319, 3640150, 4516226, 3977834, 3047183, 3156570, 3538779, 2840969, 1798939, 1823757, 2349706, 2085834, 1535240, 1790003, 2212813, 1798535, 1383113, 1988625, 2539939, 1826551, 1055415, 1710121, 2638032, 2183864, 1395343, 1992916, 2991794, 2642032, 1892855, 2466784, 3330035, 2706869, 1762297, 2493657, 3804620, 3597818, 2869777, 3636387, 4775694, 4244906, 3372415, 4402909, 5916602, 5470178, 4513538, 5606602, 7212945, 6726698, 6012463, 7974916, 10470349, 10175334]
36794A0175334p03101K780803L876541P93696N46852N359755P548165M688067
36786C5066112N518198J2452208J4551229Q553706Q354394J9743258K7644277
36779A31883382K8367077M8591721R8571692J27544460P4208407m1459096j25567507
36772C42140136j20533381o5448554k9136519k4988218k2657904j0674194n158149
36765F3543217j0975598j3402909o910403k688331n565515o724782k294133K38686
36757A5220232k384194l610040n93541Q81557j596178k661226o1290J253940q92568
36748E556692j989596M1195J092294p69558j719008J10573J161423m26180j434444
36739A623391p9077P65728m85750j145374K25217J040446j24242q99080N9938
$$ y = [10175334, 9472233, 12253036, 16129577, 16923273, 17470125, 22829880, 30378045, 35066112, 40584310, 53036518, 67587747, 76141453, 84495847, 104239105, 131883382, 160250459, 208842180, 307413872, 434958332, 509166739, 467707643, 342140136, 221606755, 156158201, 127021682, 102033464, 79375560, 68701366, 63543217, 52567619, 39164710, 32254307, 29565976, 24000461, 17275679, 14981546, 15220232, 12836038, 9225998, 8632457, 9514014, 7917836, 5256610, 5195320, 6449260, 5556692, 3567096, 3608291, 4700585, 3931027, 2212019, 2322592, 3484015, 3057835, 1623391, 1544314, 2310042, 1824292, 678918, 904135, 1944581, 1820339, 921259, 981197]
36730I81197O18501l57270q06007K58554P68236k51229q07570P8311N95550j08607
36720I69666l62607M34807N40320m91943p22051L67567P58715k04390n68011L88064
36710A110137Q11864O074k27409P47361J044850q6062p96225j87472J33064n83964
36700A972218p34406L47970R48666K93911N1518R88973J323015L1078j218106
36691D004837j087214o50927q67491p86937J06789M90532k39560o14252J39358
36682D95135N64589k15850p49761O005O99747J19651o26549k93514L00318P2216
36672C71987l09888J6847L63821j6494l83145r747L77988R1366j91815R3161K11513
36661F15594l06305n55461L0708M94576J16759k72106L2047K69876j83778n15650
$$ y = [981197, 1599698, 1242428, 436421, 694975, 1463211, 1211982, 404412, 482723, 1078273, 969666, 607059, 1041866, 1582186, 1090243, 368192, 735759, 1494474, 1290084, 722073, 1110137, 1922001, 1928075, 1700666, 2448027, 3492877, 3406815, 2610590, 2423118, 2556182, 1972218, 1237812, 1585782, 2534448, 2828359, 2879877, 3868850, 5191865, 5222943, 4004837, 2917623, 2266696, 1399205, 612268, 719057, 1209589, 970029, 355777, 495135, 1059724, 843874, 94113, 100118, 799865, 919516, 292967, -547, 299771, 371987, 62099, 78946, 442767, 426273, 43128, 33381, 411369, 502735, 310920, 404081, 615594, 309289, -246172, -215464, 279112, 395871, 123765, 155812, 425688, 241910, -273740]
36651b73740o3345L59496K5617l30659J1252L74332N7840l13586p2472K15857
36641i408k6829k27333J08240L20258r6616m20666o2818L07274Q9721j23190J54669
36630A3302K53265k69357n69965l7949M82653K14724j50950J40368M28305n2342
36620D52054o18085l52576K24851J74992j63043M2112M92758L74714j27323k84639
36610B15815j66505k68603l84987n0714M01756L39973o4013k06401p9591n0703
36600c13973q2193K2316O8384j16080k14386J1847K41052K13693J92839L10380
36590C33879J99766k17659l97678j36486R294k18685k67381J19374L20030R083
36580b46463j64600J94021M13098J881l67896o7526L23856Q7543l32216j82095
$$ y = [-273740, -337085, 22411, 48028, -282631, -271379, 102953, 160793, -152793, -225265, -9408, -36237, -263570, -155330, 164928, 68312, -352354, -415172, -107898, -18177, -141367, 13302, 266567, -2790, -572755, -610704, -128051, 86673, -64277, 76091, 504396, 452054, -166031, -518607, -293756, -118764, -281807, -239695, 253063, 627777, 500454, 215815, 49310, -219293, -604280, -654994, -253238, 86735, 22722, -183679, -263270, -313973, -396166, -373850, -305466, -421546, -635932, -624085, -383033, -169340, 23499, 333879, 533645, 315986, -81692, -218178, -208884, -427569, -694950, -575576, -255546, -246463, -411063, -217042, 196056, 197937, -169959, -237485, 86371, 173914, -158302, -340397]
36570c40397K50988K39632j15299k55321k03100k62303k40437J14229M21442K58610
36560a31956n9336m4362J48549J57106Q3650Q3966p2197l99294l74956J31264
36550d77566M03722N4308k17912J56081N40980J97600l84521l39605J04334J54694
36540A92115j24104q9049K02281J35117k92255m70392k09956R3117J98477J95838
36530a68811R2389j30495k25725n090K62055K54782J14748J09215J35470N247
36520D43785j51941j79361j82116j80756K9266L48347L07285j12607k85865J5106
36510E1143J55148k62274o24253k98833L22960M97974K27069k1113j21530j63307
36500b37016l7793K31052K60998n0729k30605m2031P6860j32861k37550Q357J22067
$$ y = [-340397, -89409, 150223, 34924, -220397, -423497, -685800, -926237, -812008, -390566, -131956, -191292, -235654, -87105, 70001, 153651, 237617, 165420, -233874, -608830, -477566, -73844, -19536, -237448, -81367, 459613, 657213, 272692, -66913, 37421, 192115, 68011, -21038, 181243, 316360, 24105, -446287, -656243, -563126, -364649, -168811, -76422, -206917, -432642, -437732, -175677, 79105, 193853, 303068, 438538, 443785, 291844, 112483, -69633, -250389, -221123, 127224, 434509, 321902, 36037, 51143, 206291, -55983, -680236, -979069, -656109, -158135, 68934, 47821, -73709, -237016, -274809, -43757, 217241, 166512, -64093, -106124, -29264, -162125, -399675, -391318, -269251]
36489b69251j43582k02583K69916N79587J98577k16432L2704M06157R5368n08648
36479B41813n13215m9858J13186m4298k488J53466p800k37538k1090L08421N9836
36468D35m78078m01150K69278O09105L00990l4104n0922j09781l37660k89995
36458e21882J66454M89390L02457p0709j90234p2934L9784N1061j1071o5600k100
36447A14616J18922K9648l00118m46115j25790K97716L40675J02249l1008l4323
36437F6472o7791j580K89286M66838J84510k65805l62196j51380m3995p4948R874
36426D9285J56052J09204o0814j06818q1912j50882j67500L3479J97398N2631
36416C0123j37273q58K53057J81855j24577k42000j36296q6502j14151p1818o0800
$$ y = [-269251, -412833, -615416, -345500, 234087, 432664, 216232, 248936, 655093, 750461, 241813, -271402, -321260, -208074, -252372, -254860, -101394, -109194, -346732, -367822, -59401, 435, -477643, -878793, -609515, -410, 300580, 266476, 215554, 105773, -231887, -521882, -355428, 133962, 436419, 365710, 175476, 102542, 142326, 193387, 182316, 116716, 114616, 233538, 263186, -36932, -483047, -608837, -311121, 29554, 131803, 100795, 66472, -1319, -2899, 286387, 753225, 937735, 671930, 309734, 158354, 114359, 39411, 49285, 205337, 314541, 253727, 146909, 64997, -85885, -253385, -219906, -22508, 30123, -107150, -108008, 145049, 326904, 202327, -39673, -175969, -262471, -376622, -448440, -509240]
36405e09240j91649j98664J25532M09048K30578j36201j63079N5488P7402j9768
36395c20553J63143M71919L43239k26452o02971m38293m3848J92584K14162R6370
36385a50700q2766j64611p3521J9182J218O7141L09026L78583J7765l85540l00870
36374c65093J40260L66561J77642j44523l15271k19363J29914M31313K51884k95634
36364A57690n04799j08545K37592K2228k61267k0360L57868K17806j64990r9564
36354a66341K62845K43355j23252k23226j2965Q560j69299p9824K48480K91362
36344B79695j5272k01023j22777p2454p7484Q5367K53230Q1390k08818j28697
36334a26843J50889O7684k56538j88145K28813K92143j08789l08386o3788R0557
$$ y = [-509240, -700889, -899553, -774021, -364973, -134395, -270596, -433675, -378187, -300785, -320553, -157410, 314509, 657748, 431296, -171675, -609968, -653816, -461232, -247070, -150700, -233466, -398077, -471598, -452416, -451198, -384057, -75031, 303552, 321317, -64223, -365093, -224833, 141728, 319370, 174847, -140424, -359787, -229873, 201440, 453324, 157690, -347109, -455654, -218062, -195834, -457101, -477461, -119593, 98213, -66777, -166341, 96504, 339859, 216607, -6619, -19584, -11024, -180323, -260147, -11667, 279695, 264423, 63400, -59377, -131831, -209315, -123948, 129282, 210672, 1854, -126843, 24046, 91730, -164808, -352953, -124140, 168003, 59214, -249172, -312960, -222403]
36324b22403r1189j41962J58951L23824M7121k45867j50768J05397J81065J39120
36314A03289J25385P7263P053O0601J32902l4590k87608k02688J39217K09553
36304C30377n7286j60680L6939Q4204j56723k13265R2243K43848p3087m06831
36294b80261l00396K5568J74133J67484J39910Q89k03998j45318J92104L08717
36284G8832k0988l08931j28947K01088J88234o2656j50312n0676Q318J6783P0198
36273a59057P2296m2854p1258J04353K14214L8402j56398l2454K35847K42545
36263D45636M291j29426q3648j06709k49955k42195L4277K94389K41233k4020
36253A83873j78576j37398j08139j89678j65377J29810M21746L03208j22999l09685
$$ y = [-222403, -313592, -455554, -296603, 27221, 74342, -171525, -322293, -216896, -35831, 103289, 228674, 305937, 312990, 373591, 506493, 471903, 184295, -18393, 120824, 330377, 273091, 112411, 149350, 233554, 76831, -136434, -44191, 199657, 126570, -280261, -580657, -555089, -380956, -213472, -73562, -72673, -276671, -421989, -229885, 78832, 57844, -251087, -380034, -178946, 9288, -53368, -203680, -254356, -246038, -229255, -159057, -86761, -129615, -200873, -96520, 117694, 156096, -302, -32756, 203091, 445636, 449927, 320501, 236853, 130144, -119811, -362006, -327729, -33340, 207893, 183873, 5297, -132101, -240240, -429918, -595295, -465485, -43739, 259469, 136470, -173215]
36243a73215n8278J86760M4922k32972k32152j5000J17667J67730K77676L14320
36233C97458J08982j25181j10222q045j03557k30927q0502J51500M9882k56305
36223b06917k79132m180J36767N7367R0743K75589K52945n0151k61131j93298
36213a81398p7880o8494k9203R9985J91002K18266K40534J53280r7524k11273
36203B37295L2827K52822J1363l51289k04688K51222K60564j92118l57480k8133
36193h7615J64613o8929k25280k7804Q3255j36329k52106j9809J31056m3979j01818
36182e84745K11595L94749Q2132k60910j62866M8575o3911k19631q502K83916
36172b79598J99429n3118m2676N7854j22144l19786n1677M33527M65824M7239
$$ y = [-173215, -231493, -44733, 189, -232783, -464935, -479935, -362268, -194538, 83138, 397458, 506440, 381259, 271037, 262992, 159435, -71492, -151994, -494, 49388, -206917, -486049, -490229, -353462, -296095, -205352, 70237, 323182, 273031, 11900, -181398, -259278, -327772, -356975, -256990, -65988, 152278, 392812, 546092, 448568, 237295, 270122, 522944, 534307, 183018, -21670, 229552, 490116, 297998, -59482, -87615, 76998, 8069, -217211, -245015, -161760, -298089, -550195, -570004, -438948, -482927, -584745, -373150, 21599, 103731, -157179, -320045, -271470, -335381, -555012, -563514, -279598, -80169, -133287, -175963, -118109, -240253, -560039, -611716, -178189, 287635, 334874]
36162C34874j87221l0750P0059j03572j88474M1454K34336M4009k96680l25423
36152d07388n564K71776K24770r485j08813J3436J17290j0184k20495j92046Q7101
36141b39602K66364J18675j53126k11613l179K42461K99267J36406q5722j72889
36131A97042j13145p5547j11378l4890K14525L31779Q3136k45433k48947m7986
36121e0844l8312j71606p5320K10803K68093N4940l8100O1042j2962l10397l87735
36110d90398q1595J94571J65150P4744J05276M4773j73249k27510l0789K1367
36100c97660k23736l16924K7417M03559L90125J82728R1114k2458k82287l33070
36090d81192N8528M12107J98560k81826l51759M482K23099R0113o0284l383R4912
$$ y = [334874, 147653, 116903, 186962, 83390, -105084, -63630, 170706, 214715, -81965, -407388, -412952, -141176, 83594, 74109, -34704, -21268, 96022, 85838, -134657, -326703, -239602, 26762, 145437, -7689, -219302, -222481, 19980, 319247, 455653, 369931, 197042, 83897, 8350, -103028, -137918, 76607, 408386, 491522, 246089, -2858, -50844, -89156, -260762, -336082, -125279, 142814, 197754, 159654, 220696, 207734, -102663, -490398, -571993, -377422, -212272, -137528, -32252, 12521, -160728, -388238, -419027, -397660, -621396, -938320, -910903, -507344, -117219, 65509, 156623, 134165, -148122, -481192, -422664, -10557, 188003, -93823, -445582, -441100, -218001, -127888, -188172, -191555, -96643]
36079i6643Q0216M0906O3775P1615k3889j81505k61294j41132J18156K46341R4689
36068A1235p4380N1938K69029J18549l06540m15005n8178K33599J37656j7160
36058d9257L2975K2281k14008l12820m7832J90068O8634j07291l050J31304K710
36047b86286j23709M4346K19792P7248j05109J2140J42728p8698l33247j46736
36037e77531K28661K30666o6244j84266j02822j19456j49249N5287K54312Q1576
36027c49066j93975p0655K62534K43054m8104p9461J04631R080k71534j56798
36017e50294K75336K99152j69738l41811J10593M82521K24866j94933j61591J14588
36007H8689J03940j50832k61006j74735p9985L4790K30363L06587Q7583k03761
$$ y = [-96643, -16427, 24479, 88254, 159869, 135980, -45525, -306819, -447951, -329795, -83454, 11235, -63145, -11207, 257822, 376371, 69831, -345174, -403352, -169753, -32097, -49257, -16282, 5999, -208009, -520829, -568661, -378593, -309959, -417250, -420300, -288996, -286286, -409995, -365649, -145857, -68609, -173718, -161578, -18850, -97548, -430795, -577531, -348870, -118204, -184448, -368714, -471536, -590992, -740241, -684954, -430642, -349066, -543041, -613696, -351162, -108108, -156212, -235673, -131042, -121962, -393496, -550294, -274958, 24194, -145544, -487355, -376762, 105759, 330625, 135692, -25899, 88689, 192629, 41797, -219209, -393944, -473929, -439139, -208776, 97811, 185394, -18367]
35997a8367k38859o1581N0853K0358l5138p0178j07701j05175m2417m208n997
35986f18410Q7542L01755M05758K23634p7133k04466j10751K9896Q5490M7653
35976A70968l9735r8293o1895J928n1312j83241j49205J34634L81887K88183l1990
35965C61929j82368q255K32202K42194M6201j20066j54542j64263k21010k20282
35955a88260p2386J02201J26966L6966K583L7560J3318n1889M839J56256J54649
35944C22803m9502j58821J8444K37357J73017j04958k65344j68380M0319J68392
35934B13327J25571n0223j79924r7866Q8157R4563r9440j93572n9690N8636J5513
35923h4948K9012K10292K45543p3455l78161k41456J39157K69633J19769L4169
$$ y = [-18367, -257226, -318807, -267954, -247596, -282734, -352912, -460613, -565788, -608205, -612413, -618410, -530868, -229113, 176645, 400279, 323146, 118680, 7929, 37825, 123315, 170968, 131233, 32940, -28955, -27027, -78339, -261580, -410785, -276151, 105736, 393919, 361929, 179561, 171306, 403508, 645702, 691903, 571837, 417295, 253032, 32022, -188260, -260646, -158445, -31479, 5487, 8070, 45630, 58948, 7059, 11898, 168154, 322803, 273301, 114480, 132924, 370281, 543298, 438340, 172996, 4616, 44935, 213327, 338898, 288675, 108751, 10885, 99042, 193605, 94165, -99407, -159097, -100461, -84948, -55936, 154356, 399899, 326444, -51717, -293173, -154016, 115617, 235386, 269555]
35913B69555P9979L5330q7327n4602Q8922M3460k07749l33901j72288P8021K07516
35902e3084J98565P8672r8078j46807M3910K44967J50855j47505k89047j70835
35892a88387m836P1654Q3832R155j47698j75860M9109K22450J1673l27594k65369
35881f61871J50304L38643R0714j67973j13569N0285P1722L9852Q0763J02162
35871a8968M8742L4893O2813k0710j67754j35838L9384L5416j53897j16795K54280
35860a38434M61832J53356k94168l41177n0122J54767J74575K01825K17639K6140
35850E66233k88215l86363j80949L9543N8865R504Q0033J72393N2348k38505l38688
35839d53801l2053L76232L76018m9740l32429q5209L25604K96858j35830l77988
$$ y = [269555, 349534, 384864, 297537, 242935, 331857, 375317, 167568, -166333, -338621, -260600, -53084, 145481, 224153, 126075, -20732, 23178, 268145, 419000, 271495, -17552, -188387, -193223, -121569, -37737, -28582, -176280, -352140, -303031, -80581, -68908, -396502, -661871, -511567, -172924, -82210, -250183, -363752, -313467, -241745, -201893, -121130, -18968, 29774, 64667, 127480, 106770, -60984, -196822, -157438, -122022, -275919, -392714, -138434, 323398, 476754, 182586, -158591, -208713, -53946, 120629, 322454, 540093, 566233, 278018, -108345, -289294, -249751, -190886, -181382, -101349, 71044, 123392, -115113, -453801, -485854, -109622, 266396, 216656, -115773, -200982, 124622, 421480, 285650, -92338]
35829i2338j58253J45471J35036q1099j68527m8247J11407J61642O0224j41954
35819g6638k82047k00106N0555K43726K55093J47111K947j29863j58918k7056
35809a75196J51853K34329K44602K20330L3407l24373m88005j94721J72099P1214
35799e4461k99032k67344J87426L69054M0430j75808J12433L94149J67757k05304
35789B69300j92794k0303j65506m05051j96358K86596L48702j01594m08136j84704
35779g69848K05083L12532J80677P8572R7588J79824K25891R1883k29268m28356
35769e5422k21938J56944K12233p8110k32223k4574K02380J27849r5924j90164
35759a98949j53812q3514O2381K59856K84111N5200j37789l6342J80392J65682
$$ y = [-92338, -250591, -105120, 29916, -51183, -219710, -267957, -156550, 5092, 65316, -76638, -358685, -558791, -508236, -264510, -9417, 137694, 140641, 10778, -148140, -175196, -23343, 210986, 455588, 675918, 709325, 384952, -103053, -297774, -125675, -54461, -353493, -620837, -433411, -64357, -23927, -199735, -87302, 306847, 474604, 269300, 76506, 56203, -109303, -514354, -710712, -424116, -75414, -177008, -585144, -769848, -564765, -252233, -71556, 7016, 104604, 284428, 510319, 602202, 372934, -55422, -277360, -120416, 91817, 13707, -218516, -243090, -40710, 87139, -8785, -198949, -352761, -436275, -373894, -114038, 170073, 225273, 87484, 51142, 231534, 397216]
35749C97216r1449k96360k50913o352K60268L45437J47338j47948k01159P025
35739A63103J00104j00863k43192j4950K89360K19735q8683j61736J7064N4949
35729B34891j02495j18145L5713m195k56519k56603J17461L42473J11958j27374
35719b2835N5136L39564K32460j02785j96355o5649l2724o9157L2386J04067j07294
35708A66814l23577j18333K60606K08749k03092l17198Q400K15083M8258q2698
35698a36988N8983J39458k8339j16610L6060Q0848j36909k17965L2878J67083
35688a21501j07451l37025r3560K56506J82228j19531j27955J12012J69506r281
35678a96052j30640j01288k2238J11057K48458J45460j78724k48694J25254L94610
$$ y = [397216, 305767, 9407, -241506, -247858, 12410, 357847, 505185, 357237, 156078, 163103, 263207, 162344, -80848, -95798, 193562, 413297, 324614, 162878, 179942, 234891, 132396, 14251, 49964, 45769, -210750, -467353, -349892, -7419, 104539, -22835, 32301, 371865, 604325, 501540, 305185, 239536, 206812, 137655, 170041, 274108, 166814, -156763, -275096, -14490, 194259, -8833, -326031, -317631, -102548, -54290, -136988, -78005, 61453, 33114, -83496, -47436, 33412, -103497, -321462, -288584, -121501, -228952, -565977, -659537, -403031, -220803, -340334, -468289, -356277, -186771, -196052, -326692, -427980, -450218, -339161, -90703, 54757, -123967, -372661, -247407, 147203]
35668A47203J26625k22545q5071K02756J8077l74233k58518K35304L33124m7645
35658G5077k31191j3428R6999o4209n5978J99785J90219j81959l15615K0441K37002
35647d2857l6355l01800q3406K81055K89283P5255L828J7168o9335j02391N4043
35636H4488J31594p6857k65948j14358J48044J49485n226j5168M3686o5150k15436
35625b00846j21670J23032J85579L8942m9318J9586R0081O7526J6913j0998k8748
35614A30079l5290l1139k8791J2718J12026J20430r4370l27745k55134J7400O6609
35603c13207j27152j17058K04608L53001Q1572j59729k418K02965M4896j99705
35593c2227r6565J29182J7327k39769j08275L00587L49948o9839l57900j53403
$$ y = [147203, 273828, 51283, -33788, 168968, 187045, -187188, -445706, -210402, 122722, 75077, -156114, -169542, -72543, -136752, -192730, 7055, 197274, 15315, -300300, -279859, -42857, -79212, -381012, -464418, -183363, 105920, 181175, 185003, 202171, 132836, 30445, 84488, 216082, 139225, -126723, -241081, -93037, 56448, 51222, 36054, 79740, 14590, -200846, -322516, -199484, -13905, 25037, -24281, -4695, 85386, 152912, 169825, 158827, 130079, 94789, 63650, 34859, 47577, 159603, 280033, 185663, -142082, -397216, -379816, -313207, -440359, -557417, -352809, 192, 81764, -77965, -80383, 122582, 167478, -32227, -128792, 390, 17717, -222052, -330327, -29740, 320208, 250369, -107531, -260934]
35583b60934J89813K47370Q5197m4947j14701j71701j27573N8216K17418J93643
35573B71801N8771k4875k2168j2597o7562j86790k71252j74038J14100L66519
35563E1909L33340K6505l02400m16652k55040N6125K62076J78251p5480j83666
35553c25032n1386R5487J09538J30615K39341K36205J8118j51102o7862K8439
35543B62361j12809k44896l2761K80311J95081j95935l11014j2939J94732J5762
35533C7893j97962q8532J50917J88898J04837J43760K29217J23211j18584k30326
35523C43329j68603j18102j15375m19K24948K94775O6301k09305j97578N1947
35513A71918J66989k6590k59717k01924P3815K04752M8562j54962j62536m0107
$$ y = [-260934, -71121, 176249, 261446, 216499, 101798, -69903, -197476, -139260, 78158, 271801, 330572, 305697, 283529, 270932, 203370, 16580, -254672, -428710, -314610, 51909, 385249, 411754, 109354, -307298, -562338, -506213, -244137, -65886, -141366, -325032, -376418, -280931, -171393, -40778, 198563, 434768, 452886, 301784, 233922, 262361, 149552, -95344, -128105, 152206, 347287, 151352, -159662, -172601, 22131, 37893, -160069, -248601, -97684, 91214, 196051, 339811, 569028, 692239, 573655, 343329, 174726, 56624, -58751, -59170, 165778, 460553, 526854, 317549, 119971, 171918, 338907, 312317, 52600, -149324, -75509, 129243, 177805, 22843, -139693, -179800]
35503a79800J7526m418J6333R9123J39940Q2627k6737j25202j70273j31648l2783
35492c15312M7228Q2583J36233K13814J91477N521j87948j95795o2116N355n1033
35481a29993p3190M2214J62176R7445j10130j95162M594K99445L34364L3501k82199
35470A83065l07756j28180r215L0407J53862L00016K08409j13717l10764j88609
35460a82482J9635O0988K3148P1307J13331O047j29305r7407L0981O1405K3440
35449A088P6194J64479Q5514j30658k06611k7166J76087J41985p5782j93046o7159
35438e5075J07398L2926k63291l71051j8086M74203N46196J71067j12787j3381
35428D98119J11847j04425m13342l46497N5505L46418L26825J70277J5718j42263
$$ y = [-179800, -162274, -166692, -150359, -51236, 88704, 171331, 144594, 19392, -150881, -282529, -315312, -268084, -185501, -49268, 164546, 356023, 361544, 173596, -22199, -84315, -78960, -129993, -203183, -160969, 1207, 98652, -11478, -206640, -202046, 97399, 431763, 465264, 183065, -124691, -252871, -262086, -231679, -77817, 222199, 430608, 316891, 6127, -182482, -162847, -101859, -78711, -7404, 105927, 111974, -17331, -114738, -83757, -22352, 1088, 77282, 241761, 327275, 196617, -9994, -37160, 138927, 280912, 205130, 12084, -55075, 52323, 85249, -178042, -549093, -567179, -92976, 453220, 624287, 511500, 498119, 609966, 505541, 92199, -254298, -198793, 147625, 474450, 644727, 660445, 518182]
35418E18182k11950o9130J28277P4493j86680k61345M775K73819K03397r1411
35408C82427k47100j19260J36565L02749K60468K8830k14251k41865l8713J26296
35398C76146J9137k35791l11599j31536L0176l5692j49019j5656K90244L92740
35388B29150J68494o7717n6876K1108j00726k95567k57394k4601J06552R3651
35378a83926J46722K56488J89422j2853j8053J97096K22457j11668m05428l05424
35368b5167k1625R1097P4193J19339J31531m3032k27354j76481j4557l768o9540
35357a65364L2425K35949K68140J17993O033j9449p3443j08085J1884J62504Q3859
35346E52446j61910k35630n4883P1636p7151l22671l66889j64205R1866K05859
$$ y = [518182, 306232, 237102, 365379, 439872, 253192, -8153, -3378, 270441, 473838, 382427, 135327, 16067, 152632, 455381, 715849, 744679, 530428, 288563, 249850, 376146, 395283, 159492, -152107, -283643, -253467, -289159, -438178, -453834, -163590, 229150, 397644, 329927, 273051, 294159, 193433, -102134, -359528, -384129, -277577, -183926, -37204, 219284, 408706, 395853, 377800, 574896, 797353, 685685, 280257, -25167, -46792, 44305, 118498, 237837, 369368, 326336, 98982, -77499, -92056, -95824, -165364, -132939, 103010, 371150, 489143, 495176, 475727, 402284, 294199, 306083, 468587, 552446, 390536, 154906, 100023, 171659, 94508, -228163, -595052, -759257, -667391, -461532]
35336d61532J34280m146m9063K5120J01979J16007J16958R7009l5343k08721j67143
35325c34595J39735L94579L44505J51587Q5883J15064N6090r3074k29413l28627
35315C01734l27791j03104K01492J80327j97697l67799J1596M41247L07585j57389
35305B90201k78892n696J36494k1376j32397m2646K8138J4407Q0803J61525L4444
35294B65005j43379n524L05634K60593j57997l74564j63364L2595p7853j87818
35284b46672m1686J15619O5956R452Q9347P4833j34671k20069j7893J34761P014
35273a64009r7210P0916K14730O5896o5192J32121L07215Q414m63821m60123J744
35262d49319L10539K10641J7554n3519j32503k31079j22319J85448L35023J42801
$$ y = [-461532, -327252, -331398, -380461, -355341, -253362, -137355, -20397, 76612, 41269, -167452, -334595, -194860, 199719, 544224, 695811, 781694, 896758, 952848, 859774, 630361, 301734, -26057, -129161, 72331, 252658, 54961, -312838, -301242, 140005, 447590, 290201, 11309, 5613, 142107, 120731, -11666, -54312, -26174, -11767, 69036, 230561, 265005, 121626, 116102, 421736, 682329, 524332, 149768, -13596, 18999, -58854, -246672, -288358, -172739, -106783, -97331, -7984, 66849, -67822, -287891, -305784, -171023, -164009, -261219, -190303, 24427, 90323, 25131, 157252, 464467, 472881, 9060, -451063, -449319, -138780, 71861, 89415, 35896, -96607, -327686, -450005, -264557, 70466, 213267]
35252B13267j39179k16841r1304R4810K43827K49848N1769j78733j82581j0054
35242C4829K8921j22958j60355M9693J94915J9289k31331j97204J0366J9163j47770
35231e02442r2523K62120M63554K10081j45859j08103K11336K78378l3166k69972
35221B73404j22903J24351R1232j14653j34356O1041J90684J34466K9374m4109
35211D88531j37249k05302j19097O2628J12705j9116j27318p1152N5880J28241
35201A68751J39415J02927J6251l7042L5109J27885M7295j53350k10922o9201
35191A67118L1210m4366j30273q2083k134o26n295K9503j4303j68303k37625j02016
35179e59193P3904J22170J27596J94247J98691L0540j34841q9163N4055N0657
$$ y = [213267, 74088, -142753, -234057, -139247, 104580, 354428, 406197, 227464, 44883, 34829, 63750, -59208, -219563, -169870, 25045, 44334, -186997, -384201, -373835, -354672, -502442, -594965, -332845, 130709, 340790, 194931, 86828, 298164, 576542, 543376, 273404, 150501, 274852, 366084, 251431, 117075, 178116, 368800, 503266, 532640, 488531, 351282, 145980, 26883, 89511, 202216, 183100, 55782, -15370, 40510, 168751, 308166, 411093, 427344, 390302, 425411, 553296, 600591, 447241, 236319, 167118, 198328, 153962, 23689, -58394, -60528, -61154, -66449, -36946, -51249, -219552, -457177, -559193, -485289, -363119, -235523, -41276, 157415, 187955, 53114, -36049, 18006, 68663]
35169F8663o7381q1049J9595M2440m7723p7781J5716Q1387J8266o5195l2991Q4436
35157d1617J48553Q1748n5129j12604m502J57040J59680k2482j64240j02334L7813
35146H1926O9407L6324P2653J13289J5254j21523o8777J11967R8935j75657l63611
35135a29813k03529R4463J80784N9637r219N9586J34282J54049J57987P8465j67323
35124D09369l79341k32631J84800L74554J40065r7679K3756K11638L0058l19812
35114C44777l08205K7666J56492k8258o9462J75800K47975o5871k94970r9560
35104H6384J19046n7861l08156j62037J37292Q7525j47176n9611K31334J91238
35094A17978j06961p3435K95537L22278j86562n48084k84347J69394K34470J3067
$$ y = [68663, 1282, -79767, -60172, -17732, -65455, -143236, -127520, -46133, -27867, -93062, -126053, -41617, 106936, 188684, 133555, 20951, 16449, 173489, 333169, 310687, 146447, 44113, 81926, 151333, 187657, 260310, 373599, 388853, 267330, 198553, 310520, 409455, 233798, -129813, -333342, -238879, -58095, 1542, -7677, 51909, 186191, 340240, 498227, 576692, 409369, 30028, -202603, -17803, 356751, 496816, 399137, 422893, 634531, 664589, 344777, 36572, 64238, 220730, 192472, 123010, 298810, 546785, 480914, 185944, 86384, 205430, 147569, -160587, -322624, -185332, -97807, -244983, -304594, -73260, 117978, 11017, -62418, 233119, 555397, 368835, -179249, -463596, -294202, -59732, -46665]
35084d6665j00526q0576p7894k0696J45307J98169K6302p9536J03609L21505K72811
35073F61810Q9465O117p9084k90072l83123j52612R5397l335k19798r6907K49456
35062a22686L01840n187k18080j34160m5153j31193j61486J8512J63796M7118
35052b86679j41276q3099J96567L85180K88985J5880j78038j34743N6563J38579
35042B57919q376j81695j21957Q5925J04627j40317l00215r7562K34319K49722
35032H2390o5774k44191J492L28207K22244k33800m23920q0539L03631K09546
35022I9286j18364q2091K83235L45325r0526m26780j95538K28468K46007o4482
35012B24540j75625K5936J59179L7751p9181J9003J67459J35498l2812j52027
$$ y = [-46665, -147191, -227767, -305661, -326357, -181050, 17119, 43421, -36115, 67494, 388999, 661810, 751275, 757392, 678308, 388236, 5113, -147499, -52102, -55437, -275235, -372142, -122686, 179154, 173967, -44113, -178273, -223426, -354619, -516105, -497593, -333797, -286679, -427955, -511054, -314487, 70693, 359678, 375558, 197520, 62777, 119340, 257919, 249543, 67848, -54109, 31816, 136443, -3874, -304089, -401651, -167332, 82390, 16616, -227575, -226083, 102124, 324368, 90568, -333352, -413891, -110260, 99286, -19078, -101169, 182066, 527391, 436865, 10085, -185453, 43015, 289022, 224540, 48915, 74851, 234030, 271781, 192600, 211603, 379062, 514560, 481748, 329721]
35002C29721j75493j84506k03292j57073M084K03329K85305J82747R802p6800
34992B17824q3072j25728j93221j41339L9173J57169J07630K5654M8276J18511
34982A70877J43588J38705P9346j48500m64847n17200j51019K60042K80069L6812
34972a72127n102J98928K04419j65088m39246j48583M39053O03498J15570m63766
34962A67556n22826j44197J31069Q9602J4691Q7317P2439j84668l49243p9256
34952g17516L47108L66981l0932l03769j63265J04850J84406J19533M3132n4711
34942a04183j36579p8913M4172J0909j20675n8668J60561J60425q6482j30349
34932c39782J65820L22496P2103j32480Q6023L09531J8739m63426m34302Q5206
$$ y = [329721, 154228, -30278, -233570, -390643, -386559, -183230, 102075, 284822, 294624, 217824, 134752, 9024, -184197, -325536, -286363, -129194, -21564, 4090, 52366, 170877, 314465, 453170, 532516, 384016, -80831, -598031, -749050, -489008, -208939, -172127, -177229, 21699, 226118, 61030, -378216, -526799, -87746, 515752, 631322, 167556, -355270, -499467, -368398, -278796, -264105, -176788, -104349, -289017, -638260, -717516, -370408, -3427, -34359, -338128, -501393, -396543, -212137, -92604, -49472, -104183, -240762, -319675, -275503, -264594, -385269, -443937, -283376, -122951, -209433, -339782, -173962, 148534, 220637, 88157, 174180, 483711, 502450, 39024, -395278, -310072]
34922c10072M18543K46469q7771k15292j32889J4844R9754J611k14034k40062
34912d18899L1789K54128J62261L1629J44739K02274j25295m41134j81705L53366
34902A3153L98133k3969j80697P9717J26428k41147l97208k5440K98734J29389
34892A77093r9704P4119K96722R1182k29591j19606J99784J16444k95790l99139
34882a88486n9144J87313M6398j50437j11429k3426r4585j53543q530J57018Q0244
34871c18607j24965j32515R6439K68557J85359j7440r6415m794R9302N8542j26315
34860a12852k91202k36618O7396L77883L84154Q2107j73668j05457J26724J80942
34850B99409K7805q5739r4286j67008k74955j36030K36953L64000q019m02812
$$ y = [-310072, 108471, 354940, 267169, 51877, -81012, -66168, 33586, 35197, -178837, -418899, -387110, -132982, 29279, 60908, 205647, 407921, 282626, -158508, -340213, 13153, 411286, 387317, 206620, 286337, 412765, 171618, -225590, -251030, 47704, 177093, 77389, 151508, 448230, 539412, 309821, 190215, 389999, 506443, 210653, -188486, -247630, -60317, -13919, -164356, -275785, -299211, -393796, -547339, -555869, -398851, -318607, -443572, -576087, -479648, -211091, -25732, -43172, -139587, -144381, -45079, 13463, -112852, -404054, -640672, -573276, -195393, 188761, 270868, 97200, -8257, 118467, 299409, 327214, 241475, 147189, -19819, -294774, -430804, -193851, 170149, 162130, -240682]
34840b40682k38356L01801N20886K03563j67465j99303q9726j78016l85775l67265
34830h40338j7111L91652N10794K56716j19312k88514j99353r9592j52383j96519
34820g53960l5347K15009K94760J82793O4216K9304N1038J42312K69715K37738
34810F97578m2932k94763k14222L6604N1922j86448l12876j83631m2745m0719
34800e32232j3915J39582K38001J29802o5211j74764j88843j40648l435J84284
34790d27379K84903K36717J08410l4715j48397j31738N1697K21154J84711L7261
34780C82624m895K3426n8283j86659j40365L2503O2735p8681j57168j09264j01196
34769c35223j43720o1178J24251J86326J06295Q3991J22935L8239j17165j11780
$$ y = [-240682, -479038, -177237, 343649, 547212, 379747, 180444, 90718, -87298, -473073, -840338, -857449, -465797, 44997, 301713, 182401, -106113, -305466, -405058, -557441, -753960, -789307, -574298, -279538, -96745, -32529, -3225, 47813, 190125, 459840, 697578, 654646, 359883, 145661, 182265, 234187, 47739, -265137, -448768, -491513, -532232, -546147, -406565, -168564, -38762, -103973, -278737, -467580, -608228, -611663, -427379, -142476, 94241, 202651, 167936, 19539, -112199, -60502, 160652, 345363, 382624, 377729, 401155, 342872, 156213, 15848, 48351, 111086, 32405, -124763, -234027, -335223, -478943, -540121, -415870, -229544, -123249, -39258, 83677, 121916, 4751, -107029]
34759a07029k3529j31128l03464j25190K89649L22184j14138l10312J18292N73350
34749A88685M19660n8240k33776j24347j33206k28484q7551K09631K99234J75555
34739D27161J16252J04943r0986l56139l12224M0568K76436J75948l3897j17456
34729B30606j07960p8900P322J26796J47568L5642j01650j97101k47601j81957
34719c67235N9569L19994L39888J08640r9974q6646M3721O5198p3607k05398j64321
34708f0171r375M0516n9908n9663J87149L58270O8433m34214m71019Q3965N48641
34697A92624L83738r9562l04984j65946J0460J20363K23122K29670P8402l7765
34687F30122k1412j40667n18999p13612l41732K03780K95736N1229N3178K97776
$$ y = [-107029, -130558, -261686, -565150, -690340, -400691, -78507, -192645, -502957, -384665, 188685, 608345, 550105, 316329, 191982, 58776, -169708, -257259, -47628, 251606, 427161, 543413, 648356, 557370, 201231, -110993, -70425, 206011, 381959, 348062, 230606, 122646, 43746, 51068, 177864, 325432, 361074, 259424, 62323, -185278, -367235, -307666, 12328, 352216, 460856, 360882, 274236, 317957, 383155, 309548, 104150, -60171, -69546, -29030, -88938, -148601, 38548, 396818, 465251, 31037, -439982, -356017, 192624, 576362, 476800, 171816, 5870, 16330, 136693, 359815, 589485, 667887, 630122, 608710, 468043, -50956, -764568, -1106300, -902520, -606784, -555555, -502377, -204601]
34677b04601K39623j61465k95899N8534L53792J94221p2003m8562M9489j09049
34667D080l17328j88836J67411L22937J71389k9451j15439j45392j54486q8889
34657c74004L7188J29019J28419K3812j63185k99650j99391J06638L12349K07100
34647i1705l4934j02340M2489J79875J63278M7634o0368j14978j06908m9631p13
34636a28301k6067j30818k42139k51946j05256J06207J93138J00735K0227J28556
34626c35664K92452K40417o922j33323J5154K20687K22409K6092k12270l87136
34616e8104m04084j64750K34742M72755L60518R1647m1404l3126o0140j23931
34606B74123o8896Q6156J08447r9626l21093l01678p1318J30618J71071J31896
$$ y = [-204601, 35022, -126443, -422342, -363808, -10016, 184205, 112202, 63640, 113129, 4080, -313248, -502084, -334673, -11736, 159653, 130202, 14763, -130629, -285115, -374004, -336816, -207797, -79378, -55566, -218751, -518401, -717792, -611154, -298805, -91705, -126639, -228979, -186490, -6615, 156663, 204297, 143929, 28951, -77957, -127588, -128301, -154368, -285186, -527325, -779271, -884527, -778320, -585182, -484447, -464220, -335664, -43212, 197205, 190283, 56960, 72114, 292801, 515210, 541302, 329032, -58104, -462188, -626938, -392196, 80559, 441077, 532724, 491320, 458194, 398054, 274123, 205227, 291383, 399830, 300204, -20889, -322567, -393885, -263267, -92196, 39700]
34596C9700J17028Q3761n5241k30496k45640l4144K19214K84100J38328o0472
34586B56138j79845j85313p9263Q9736J87441J10524n6487j26996n4571L4207
34576d429M1790m307n8797j09836j04437J7926J74792J78848n772j78304j49563
34565b02089K9628J54156R2044j16371l02614k95850r6580Q7465R1665K7868R2072
34554d38606K09727J49881l2034l3448J42681R9692k83347n23359k26621K57086
34544f78348L41053Q0857j4994J25515R8248j45423j39826K35837M16652M0999
34534C60570m00281l13236O3733R7643j86964k11051J37939L37354J46630j6875
34524A5462J45152K90535P0535k32182j83938O1466M9018j92560k21921N6131
$$ y = [39700, 156728, 240489, 185248, -45248, -290888, -325032, -105818, 178282, 316610, 256138, 76293, -109020, -188283, -98547, 88894, 199418, 142931, 15935, -38636, -4429, 37361, 33054, -25743, -135579, -240016, -222090, -47298, 131550, 125778, -52526, -202089, -172461, -18305, 73739, -42632, -345246, -641096, -737676, -650211, -558546, -530678, -438606, -228879, -78998, -111032, -144480, -1799, 97893, -185454, -708813, -935434, -678348, -337295, -256438, -271432, -145917, -47669, -193092, -332918, -97081, 319571, 360570, -39711, -352947, -289214, -191571, -378535, -589586, -451647, -114293, 32337, 15462, 160614, 451149, 521684, 289502, 105564, 167030, 216048, 23488, -198433, -142302]
34514a42302K54957J56818l620k6614o2745k25206k71500J4847L80679L91065
34504D66379M4322k23614j40620P4938Q0647j02050j56282L8082K03453O3172
34494C48427k17380k29470O8720K45417J9886l02304k73728M7467K42364J77273
34484A26672R8927J31880J11366k3662p8362K0950O0967o9749j59263n4542M5203
34473B10387n8578j88646q4463J33001J32002j05931k56906j18021J61715L17063
34463A41623K38958J3182j66604j46134J8536R6716j3048j26999n5498R6009R2878
34452A89619o5862j65175j00555J6606O3049M1186J1163J3781N3690P0579k5562
34441A02519k05802k91178j72777L2418J57623J97752K01688R2940j84141m24116
$$ y = [-142302, 112655, 269473, 265853, 239239, 176494, -48712, -320212, -305365, 75314, 466379, 510701, 287087, 146467, 221405, 302052, 200002, 43720, 81802, 285255, 348427, 131047, -98423, -29703, 215714, 235600, -66704, -340432, -292965, -50601, 126672, 225599, 357479, 468845, 445183, 366821, 387771, 448738, 378989, 219726, 165184, 210387, 151809, -36837, -121300, 11701, 143703, 37772, -219134, -337155, -175440, 141623, 380581, 393763, 227159, 81025, 99561, 196277, 183229, 56230, 732, 96741, 189619, 123757, -41418, -141973, -125367, -62318, -21132, -9969, 3812, 57502, 128081, 102519, -103283, -394461, -567238, -534820, -377197, -179445, 22243, 115183, -68958, -493074]
34431d93074l21487J14021N04583N22944K31419m8818j11216m2508n5654j92115
34421A08095k53395p7523J97652K88504J36219o3307j74130k32384k43502j44225
34411d57996p648J1931q440J48329L61894K27508k46567m87576j97829J46315
34401e10079M6870k29586j52227J80335K78611J09691K9584O0135o1764k20078
34391d68508l8209L44958L50887r6124m07367k66387l6229q990N7552L21661M24233
34380A77477J13713k34673k01481K2918M5881o3259j9175J01841M6686j07308
34370a17380j19143m2573n8324o5761Q7806J91255J347k08890j9464L57541L23630
34359C30044j15270l05949m529K30696k2581l69598k89347K4545O6989j09268
$$ y = [-493074, -814561, -700540, -195957, 326987, 558406, 509588, 398372, 355864, 300210, 108095, -145300, -222823, -25171, 263333, 399552, 336245, 162115, -70269, -313771, -457996, -465644, -453713, -462153, -313824, 48070, 275578, 29011, -458565, -656394, -510079, -463209, -692795, -845022, -664687, -386076, -276385, -246801, -186666, -248430, -468508, -506717, -161759, 189128, 93004, -314363, -580750, -616979, -625969, -568417, -246756, 177477, 291190, 56517, -144964, -122046, -76165, -139424, -158599, -56758, -10072, -117380, -236523, -279096, -337420, -403181, -315375, -124120, -122773, -331663, -351127, 6414, 330044, 214774, -91175, -95704, 134992, 112411, -257187, -546534, -521989, -455000, -564268]
34349e64268n3035K51102L45477Q1532j44309n6204J09985R7061O2448K05127
34339C34916L11561Q5056k90312l58445p4026J53372J01337j45N3509R5776o2841
34328C49758k53718k04589K1134J25984J1419j39057j49395k0661J45024K28231
34318A14130J50795j6646p9508L0444J38516Q3319n6884j41307j89876k37593
34308b04610j66747O1373K00019M9519j76292j64395j9275n1515j82643o0222
34298g14788K71075L51800M0780k43614j74881N0991J40988J33887J54311J19840
34288A30389k3358r4066J4321J01060N71j16879n5733O1892M8552n667N6361J33865
34276B51308O3767n8809n9201L074o690j6885O8084R9670o4731k21728r4787J98293
$$ y = [-564268, -617303, -366201, -20724, 60808, -83501, -139705, -29720, 67341, 129789, 334916, 646477, 731533, 441221, 82776, 8750, 162122, 263459, 263314, 316823, 412599, 349758, 96040, -108549, -87415, 38569, 49988, -89069, -238464, -259125, -114101, 114130, 264925, 248279, 168771, 199215, 337731, 421050, 364166, 222859, 32983, -204610, -371357, -309984, -109965, -60446, -236738, -401133, -420408, -471923, -654566, -714788, -443713, -91913, -51133, -294747, -469628, -418637, -277649, -143762, 10549, 130389, 107031, 12965, 27286, 128346, 128917, 12038, -43695, 18197, 66749, 61082, 117443, 251308, 315075, 256266, 197065, 200139, 193449, 176564, 244648, 344318, 279587, 57859, -36928, 161365]
34264A61365L22029K40756J69571J14231j04163l98038m30158j40049J31738J41220
34254B08502K5242k4479n7951j73072k67499j77645O0894K31922J70946o0715
34244f3855k01655m4863K71578L56783P0785k39725k07278M5727J45138M2970
34234A75605o528N8432M4202q8712j46807o5542M453Q659M7339R9008L6584o0497
34222A06196J1570J62890R2589j65910k48800r6780o7000k51258k43376J34381
34212e65498M17734K08144j75262k11839M0576J70966R7800J7302o8365k49122
34202c17564l32570q9826K63559L18495Q9252p5737p0799n2832j8056J36009K36130
34191H6061N5737j71261k6493L48190L86371o453l12147k37647p6032q8155j23014
$$ y = [161365, 483394, 724150, 893721, 1007952, 903789, 505751, 75593, -64456, 67282, 208502, 233744, 209265, 151314, -21758, -289257, -466902, -406008, -174086, -3140, -63855, -265510, -310373, -38795, 317988, 388773, 149048, -58230, -12503, 132635, 175605, 169077, 227509, 271711, 182999, 36192, -29350, -24897, -16238, 31101, 130109, 166693, 106196, 117766, 280656, 373245, 207335, -41465, -138245, -205245, -456503, -699879, -565498, -147764, 60380, -114882, -326721, -286145, -115179, -17379, -77, -68442, -317564, -650134, -739960, -476401, -157906, -68654, -144391, -215190, -268022, -286078, -150069, 86061, 141798, -29463, -55956, 292234, 678605, 672152, 360005, 122358, 46326, -41829, -164843]
34180a64843m9310p010k7595N6371J52969m2849l70264k62793K59510M37702K311
34169a5801k81735J22175N44089K01584m39545m00513K19841M85294J63509q6544
34159E12354K6041O2253j66568k59499p7171l6382k80179l66024r2935J17659
34149e60451R873o1878J37110K40491j8535k60985j18815J28694J02277j2006
34139d14225R3405K07041J3776k36160j14099K20978K76477L7298q9494K474M6435
34128D3906j9974K8117K00089K09804k9074k39566k05057l6186O1011L3756m5996
34117H30p1441L1998J89420K07797N4818n3049L023L4126j08508k33536j34833
34106g9355L9528O6161L9528J20188J46784o6674k69791j06719K48948L09064
$$ y = [-164843, -214153, -221163, -248758, -192387, -39418, -82267, -452531, -715324, -455814, -18112, -15801, -297536, -175361, 368728, 570312, 130767, -269746, -49905, 435389, 598898, 512354, 538395, 600648, 434080, 174581, 97410, 61028, -219151, -585175, -678110, -560451, -550578, -612456, -475346, -234855, -253390, -514375, -633190, -504496, -402219, -414225, -320820, -113779, -100003, -336163, -450262, -229284, 47193, 84491, -5003, -2529, 43906, 23932, 52049, 252138, 461942, 432868, 193302, -11755, -47941, 13070, 46826, 830, -70611, -38613, 150807, 358604, 413422, 360373, 363396, 397522, 289014, 55478, -79355, -39827, 26334, 65862, 186050, 332834, 266160, -3631, -110350, 138598, 447662]
34096D47662L1852j49703l1258J32839J29617N3878Q261n6968j30731j14936n4725
34085B65788q3258j46340r7106n737k4921m0332J34678L13143J61458j90559k90160
34074c346r2620N804j08620j08726J03902J78914l7223k05254r6902L1912l5861
34063c68020p4418J25189L27892K60169P7752N3627J05281L514j88795k32210
34053H9981r3012O1012J01203l215j84302k23015M0961L54873K65328j81950l88309
34042a60445p0761K82976J67530j73619j90863J08476K63201J11185p5234j06989
34032A55457p5625o1637k6296J995n8268j38699q9034O0480J29090O3789q312
34021d7060Q636P5712J07204M5804j06397k50645k60861j43948k0017Q0196K23545
$$ y = [447662, 479514, 329811, 298553, 431392, 561009, 614887, 623148, 566180, 435449, 320513, 265788, 182530, 36190, -60916, -66653, -91574, -131906, 2772, 315915, 477373, 286814, -3346, -95966, -90162, -198782, -307508, -203606, -24692, -61915, -267169, -364071, -332159, -368020, -442438, -317249, 10643, 270812, 348564, 402191, 507472, 510986, 322191, 89981, -3031, 57981, 159184, 155969, -28333, -251348, -210387, 144486, 409814, 227864, -160445, -231206, 51770, 219300, 45681, -145182, -36706, 226495, 337680, 262446, 155457, 79832, 18195, -8101, -6106, -64374, -203073, -292107, -231627, -102537, -38748, -47060, -38424, 37288, 144492, 190296, 83899, -166746, -427607, -571555, -591572, -511376, -287831]
34010b87831L55152L05224P6347j23703j96543k22367j72503Q0105L72768L14252
34000E00901q3705k94021n4427K09691R2405j31931k5393K40785K01385r8996
33990E56694k20131p6558J3404n0458l8276R9898J22162m0785j43674m6984P4698
33979B49990M0409j02261k14407k11496o5525J28889J45071q8495k85537j56488
33969e59850J44059K40572J03287K4313R2753R7524m0447j31037p1724P084L2848
33958f0618J04547K19428J90490l1156k06742j31647Q4467J92693J16984k3047
33948D55399j06431j34912j84190k53203k00672N9216L19701K72558p310q4837
33938A35319J67459K96266l7777m59399m18707m0190J17290l5532o9777J55359
$$ y = [-287831, 67321, 372545, 448892, 325189, 128646, -93721, -266224, -186119, 186649, 500901, 417196, 123175, 68748, 278439, 370844, 238913, 213520, 454305, 655690, 556694, 336563, 260005, 273409, 222951, 184675, 284573, 406735, 365950, 222276, 175292, 249990, 290399, 188138, -26269, -237765, -303290, -174401, -29330, -117825, -403362, -559850, -415791, -175219, -71932, -47619, 45134, 142658, 102211, -28826, -100550, -93466, -60618, 43929, 263357, 453847, 422691, 215949, 84302, 168769, 361462, 478446, 455399, 348968, 214056, 29866, -223337, -424009, -364793, -45092, 227466, 220156, 135319, 302778, 599044, 561267, 101868, -316839, -357029, -239739, -275271, -345048, -189689]
33928a89689K65762N2572j76126j17355R8791K09924J82217Q3329p8594k23894
33918A06937k12735j18083j66402k92254j37807L23437N74472K60887k40705l33067
33908b35320k1731J90657Q6364m2714L7166J26679k9980k75435k37076J01511
33898b99879L29810J75695j24454k08076j09952q7497r4089J07293L51134J77048
33888B17033l36763m91541m2002L05566o471m20888j53780M69382N28787M2600
33878A11923j15480K48475L61257q6689l71124l2529L02407L7623l59131k31961
33868a35229J03487p718l37471j95658K82692L22434j48567l66913k3555K71702
33858b34796Q5998j32853R2966M07723K21818k75860l74698Q0631M82320L37118
$$ y = [-189689, 76073, 128645, -47481, -164836, -66045, 143879, 326096, 409425, 330831, 106937, -105798, -223881, -390283, -682537, -820344, -496907, 77565, 338452, 97747, -235320, -257051, -66394, 19970, -22744, 14422, 141101, 111121, -164314, -401390, -299879, 29931, 205626, 81172, -126904, -236856, -324353, -418442, -311149, 39985, 217033, -119730, -611271, -653273, -347707, -354178, -775066, -928846, -459464, 69323, 111923, -3557, 244918, 606175, 519486, 148362, 115833, 418240, 455863, 96732, -135229, -31742, -39460, -376931, -572589, -289897, 32537, -116030, -482943, -506498, -234796, -148798, -281651, -188685, 219038, 440856, 164996, -209702, -129071, 353249, 690367]
33848F90367j40485m37800l69018r3876K06470M07759L63267M4304k80135k76359
33838A14494N729J63496Q65j98291j15714J20554J54775o0669k44949k24362r8062
33827c82134M165O2537O6308J0667r380P8335J43193L3838j24453j03643K4594
33816a95973R837j04627m6077J54827J65761m9544j40297q417m71k34116k90361
33805g39458O8424L92262K22036j61736k08913K8188R0160o3697o0352J61292
33795b71794K40806L1823j73430j29366P6121K76322L88632K99277k8999l14974
33785C94418k26798Q2293J36005j23033k38968r495J73715j862k36545j23216
33775a73486J88881K58761L2925j60390j48825o5964l9792n2636o8398m7729R0511
$$ y = [690367, 549882, 112082, -256936, -350812, -144342, 263417, 626684, 670988, 390853, 114494, 120223, 283719, 284584, 86293, -29421, 91133, 245908, 185239, -59710, -284072, -382134, -377969, -315432, -249124, -238457, -247837, -169502, -26309, 7529, -116924, -220567, -195973, -186136, -290763, -336840, -182013, -16252, -65796, -206093, -214510, -214981, -449097, -739458, -671034, -278772, -56736, -218472, -427385, -399197, -309037, -372734, -433086, -271794, -30988, 835, -172595, -301961, -225840, 50482, 439114, 738391, 709392, 394418, 167620, 249913, 385918, 262885, 23917, 14422, 188137, 186275, -50270, -173486, 15395, 274156, 307081, 146691, -2134, -68098, -107890, -160526, -228924, -276653, -186142]
33764a86142K95680L04549R548k45391r7440K28847J95916k06020m08499j43241
33754b52193J63066J03974r5273m7458J30487R0521j02313j14707M8302J01994
33744B6400M0206J03844K33164J04475k46151l91523k14503p9693j33579k9688
33734e87048L62313N74325K93846m4044L9487K41894J1602m57076n10457j12827
33724a87985J37530J2460q4590P0873J74736L8498o5957L6141Q8704p9358k14148
33713g3096j22522k1290o7861r600K98625M58198R8215m39851n15740r3175K69970
33702b18127K31246O908p2993L6104J82875K31364J40280J340l3637J3614p2528
33691D46446l22945l99923o9692L35483L03586j11614l44596j22196J89551J60001
$$ y = [-186142, 109538, 414087, 423635, 178244, 80804, 309651, 505567, 299547, -108952, -252193, -89127, 14847, -80426, -127884, 2603, 93124, -9189, -123896, -75594, 26400, 66606, 170450, 403614, 508089, 261938, -129585, -344088, -423781, -557360, -587048, -224735, 349590, 643436, 599392, 638879, 880773, 892375, 435299, -75158, -187985, -50455, -37995, -122585, -51712, 123024, 161522, 95565, 131706, 220410, 141052, -73096, -195618, -216908, -284769, -294369, 4256, 462454, 560669, 120818, -394922, -488097, -218127, 13119, 20027, -52966, -16862, 166013, 397377, 537657, 538997, 505360, 518974, 446446, 123501, -276422, -346114, -10631, 292955, 181341, -163255, -285451, -95900, 64101]
$$ [...]
##END NTUPLES=NMR SPECTRUM
##END=
