##TITLE=31Pdec_78-2025-Bay
 CDCl3, 64 sc
 3.7.2025
##JCAMPDX= 6.0         $$ Bruker NMR JCAMP-DX V2.0
##DATA TYPE= NMR SPECTRUM
##DATA CLASS= NTUPLES
##ORIGIN= UXNMR, Bruker Analytische Messtechnik GmbH
##OWNER= root
$$ XWIN-NMR		Version 3.5
$$ Fri Jul  4 16:38:29 2025 Russian Standard Time (UT+4h)  she@DPX200
##.OBSERVE FREQUENCY= 81.013821
##.OBSERVE NUCLEUS= ^31P
##.ACQUISITION MODE= SIMULTANEOUS
##.ACQUISITION SCHEME= undefined
##.AVERAGES= 24
##.DIGITISER RES= 17
##SPECTROMETER/DATA SYSTEM= spect
##.PULSE SEQUENCE= zgpg30
##.SOLVENT NAME= CDCl3
##.SHIFT REFERENCE= (INTERNAL, CDCl3, 0, 198.062)
##AUDIT TRAIL= $$ (NUMBER, WHEN, WHO, WHERE, WHAT)
$$ ##TITLE= Audit trail, XWIN-NMR		Version 3.5
$$ ##JCAMPDX= 5.01
$$ ##ORIGIN= Bruker BioSpin GmbH
$$ ##OWNER= she
$$ F:/spectra/data/she/nmr/P31/2/pdata/1/auditp.txt
$$ ##AUDIT TRAIL=  $$ (NUMBER, WHEN, WHO, WHERE, WHAT)
(   1,<2025-07-04 16:37:13.84 +0400>,<she>,<DPX200>,
      <created by zg, POWCHK disabled, PULCHK disabled
       configuration hash MD5:
       00 E9 B6 7A A2 85 ED C7 34 08 36 98 17 FE 4E 26
       data hash MD5: 32K
       BB 53 5F 86 58 5B 51 32 6C AB 92 E5 BC 73 AB B3>)
(   2,<2025-07-04 16:37:16.09 +0400>,<she>,<DPX200>,
      <Start of raw data processing
       efp BC_mod = 2 LB = 1.5 FT_mod = 6 PKNL = 1 PHC0 = 1297.644 PHC1 = 351.894 SI = 64K 
       data hash MD5: 64K
       3C 42 F8 BD FB C3 67 5D 0A 4C 71 65 D4 B7 31 4F>)
(   3,<2025-07-04 16:37:41.45 +0400>,<she>,<DPX200>,
      <pk PHC0 = 115.5888 PHC1 = -293.4001 
       data hash MD5: 64K
       53 28 92 0B BB BD CB CB 91 5F C5 89 C7 DE 33 5B>)
(   4,<2025-07-04 16:37:45.62 +0400>,<she>,<DPX200>,
      <abs ABSG = 5 
       data hash MD5: 64K
       BD 9B 85 57 A2 D6 9D 66 26 B3 ED D2 E4 69 70 14>)
$$ ##END=
$$ 
$$ hash MD5
$$ 7D B4 B3 14 1D 92 CF FD 11 7F D1 75 0F 7D B3 4D
##$RELAX= 
##$RELAX= 
##$RELAX= 
##$RELAX= 
##$RELAX= 
##$RELAX= 
##$RELAX= 
##$RELAX= 
$$ Bruker specific parameters
$$ --------------------------
##$DU= <F:/spectra>
##$EXPNO= 2
##$NAME= <P31>
##$PROCNO= 1
##$TYPE= <nmr>
##$USER= <she>
##$AMP= (0..31)
100 100 100 100 100 100 100 100 100 100 100 100 100 100 100 100 100 100 
100 100 100 100 100 100 100 100 100 100 100 100 100 100 
##$AQSEQ= 0
##$AQ_mod= 1
##$AUNM= <au_zg>
##$AUTOPOS= <>
##$BF1= 81.014009
##$BF2= 200.13
##$BF3= 200.13
##$BF4= 200.13
##$BF5= 200.13
##$BF6= 200.13
##$BF7= 200.13
##$BF8= 200.13
##$BYTORDA= 1
##$CFDGTYP= 0
##$CFRGTYP= 5
##$CHEMSTR= <none>
##$CNST= (0..31)
1 1 145 1 1 1 1 1 1 1 1 1 1 1 1 1 1 1 1 1 1 1 1 1 1 1 1 1 1 1 1 1 
##$CPDPRG= <waltz16>
##$CPDPRG1= <>
##$CPDPRG2= <waltz16>
##$CPDPRG3= <>
##$CPDPRG4= <mlev>
##$CPDPRG5= <mlev>
##$CPDPRG6= <mlev>
##$CPDPRG7= <mlev>
##$CPDPRG8= <mlev>
##$CPDPRGB= <>
##$CPDPRGT= <>
##$D= (0..31)
0 1 0 0 0 0 0 0 0 0.06 0 0.03 2e-05 3e-06 0 0 0.0002 0 0 0 0 0 0 0 0 0 
0 0 0 0 0 0 
##$DATE= 1751632633
##$DBL= (0..7)
120 120 120 11 120 120 24 19 
##$DBP= (0..7)
150 150 150 150 150 150 150 150 
##$DBP07= 0
##$DBPNAM0= <>
##$DBPNAM1= <>
$$ [...]
##$SUBNAM3= <"">
##$SUBNAM4= <"">
##$SUBNAM5= <"">
##$SUBNAM6= <"">
##$SUBNAM7= <"">
##$SUBNAM8= <"">
##$SUBNAM9= <"">
##$SW= 400.765351723535
##$SWIBOX= (0..15)
0 1 3 0 0 0 0 0 0 0 0 0 0 0 0 0 
##$SW_h= 32467.5324675325
##$TD= 32768
##$TD0= 1
##$TE= 0
##$TE2= 300
##$TE3= 300
##$TEG= 300
##$TL= (0..7)
0 120 53 12 22 120 120 120 
##$TP= (0..7)
150 150 150 150 150 150 150 150 
##$TP07= 0
##$TPNAME0= <>
##$TPNAME1= <>
##$TPNAME2= <>
##$TPNAME3= <>
##$TPNAME4= <>
##$TPNAME5= <>
##$TPNAME6= <>
##$TPNAME7= <>
##$TPOAL= (0..7)
0.5 0.5 0.5 0.5 0.5 0.5 0.5 0.5 
##$TPOFFS= (0..7)
0 0 0 0 0 0 0 0 
##$TUNHIN= 0
##$TUNHOUT= 0
##$TUNXOUT= 0
##$USERA1= <user>
##$USERA2= <user>
##$USERA3= <user>
##$USERA4= <user>
##$USERA5= <user>
##$V9= 5
##$VALIST= <valist>
##$VCLIST= <CCCCCCCCCCCCCCC>
##$VD= 0
##$VDLIST= <DDDDDDDDDDDDDDD>
##$VPLIST= <PPPPPPPPPPPPPPP>
##$VTLIST= <TTTTTTTTTTTTTTT>
##$WBST= 1024
##$WBSW= 4
##$XGAIN= (0..3)
0 0 0 0 
##$XL= 0
##$YL= 0
##$YMAX_a= 15579
##$YMIN_a= -9745
##$ZGOPTNS= <>
##$ZL1= 120
##$ZL2= 120
##$ZL3= 120
##$ZL4= 120
##$ABSF1= 198.0616
##$ABSF2= -202.7028
##$ABSG= 5
##$ABSL= 3
##$ALPHA= 0
##$AQORDER= 0
##$ASSFAC= 0
##$ASSFACI= 0
##$ASSFACX= 0
##$ASSWID= 0
##$AUNMP= <proc_1d>
##$AZFE= 0.1
##$AZFW= 0.5
##$BCFW= 0
##$BC_mod= 2
##$BYTORDP= 0
##$COROFFS= 0
##$CY= -3
##$DATMOD= 1
##$DC= 0
##$DFILT= <>
##$DTYPP= 0
##$F1P= 0
##$F2P= 0
##$FCOR= 1
##$FTSIZE= 65536
##$FT_mod= 6
##$GAMMA= 0
##$GB= 0
##$INTBC= 1
##$INTSCL= 9.790993e-09
##$ISEN= 30
##$LB= 1.5
##$LEV0= 0
##$LPBIN= 0
##$MAXI= 10000
##$MC2= 0
##$MEAN= 0
##$ME_mod= 0
##$MI= 50
##$NCOEF= 0
##$NC_proc= -7
##$NLEV= 6
##$NOISF1= 182.463
##$NOISF2= 159.3651
##$NSP= 0
##$NTH_PI= 0
##$NZP= 0
##$OFFSET= 198.0616
##$PC= 4
##$PHC0= 1413.233
##$PHC1= 58.49393
##$PH_mod= 1
##$PKNL= yes
##$PPARMOD= 0
##$PSCAL= 0
##$PSIGN= 0
##$REVERSE= no
##$SF= 81.0140089999434
##$SI= 65536
##$SIGF1= 159.3651
##$SIGF2= -187.1042
##$SINO= 113.3802
##$SIOLD= 16384
##$SREGLST= <1H.CDCl3>
##$SSB= 0
##$STSI= 65536
##$STSR= 0
##$SW_p= 32467.5324675325
##$SYMM= 0
##$S_DEV= 0
##$TDeff= 32768
##$TDoff= 0
##$TI= <>
##$TILT= no
##$TM1= 0
##$TM2= 0
##$TOPLEV= 0
##$USERP1= <user>
##$USERP2= <user>
##$USERP3= <user>
##$USERP4= <user>
##$USERP5= <user>
##$WDW= 1
##$XDIM= 65536
##$YMAX_p= 306363026
##$YMIN_p= -29123654
$$ End of Bruker specific parameters
$$ ---------------------------------
##NTUPLES= NMR SPECTRUM
##VAR_NAME=  FREQUENCY,     SPECTRUM/REAL,   SPECTRUM/IMAG
##SYMBOL=    X,             R,               I
##VAR_TYPE=  INDEPENDENT,   DEPENDENT,       DEPENDENT
##VAR_FORM=  AFFN,          ASDF,            ASDF
##VAR_DIM=   65536,         65536,           65536
##UNITS=     HZ,            ARBITRARY UNITS, ARBITRARY UNITS
##FACTOR=    0.49542278885378, 1,            1
##FIRST=     16045.7642231865, 0,            0
##LAST=      -16421.768244346, 0,            0
##MIN=       -16421.768244346, -29123654,    0
##MAX=       16045.7642231865, 306363026,    0
$$ Real data points
##PAGE= N=1
##DATA TABLE= (X++(R..R)), XYDATA
$$ [...]
38069 1477700 1045330 772422 865726 592279 -454436 -1497339 -1617772 -1068506 -819170
38060 -819170 -1153383 -1444089 -1166541 -515302 -63037 -260781 -1157599 -2175648 -2340537
38051 -2340537 -1266888 194525 840608 581006 441317 1116226 2181474 2909335 3213457
38042 3213457 3386416 3373430 2847435 1829382 767702 -13116 -604348 -1139639 -1389338
38033 -1389338 -1026663 -286104 6940 -616238 -1483925 -1452500 -381593 644256 792307
38024 792307 535314 737869 1288047 1433909 1127478 1081817 1526639 1815656 1468503 833952
38014 833952 415651 187942 -67509 -297660 -419517 -559523 -714531 -615590 -248247 -40198
38004 -40198 -168141 -159160 354116 887629 636053 -521762 -1980480 -3086958 -3451770 -2943511
37994 -2943511 -1923054 -1237192 -1422428 -2078912 -2516043 -2755129 -3253667 -3828623 -3665687
37985 -3665687 -2501987 -1106463 -346272 -313467 -598620 -884139 -931628 -459206 500935
37976 500935 1414154 1867827 2187274 2928199 3812682 3749329 2187468 71718 -1009862
37967 -1009862 -533729 539549 1073496 930504 551740 -19318 -926703 -1606991 -1122585
37958 -1122585 424929 1725990 1924462 1611689 1575033 1420277 415117 -902564 -1191392
37949 -1191392 -214526 864620 1156041 951842 752313 421575 -228341 -850847 -1120155
37940 -1120155 -1256459 -1516450 -1728164 -1785209 -2012893 -2514784 -2705391 -2098213 -1105051 -446977
37930 -446977 -195709 -36377 -52087 -470834 -932589 -852642 -383894 -210121 -436830 -524510
37920 -524510 -394575 -735510 -1913031 -3298916 -4085391 -4201531 -4020820 -3674056 -3125895
37911 -3125895 -2536059 -2062792 -1607595 -1183481 -1195127 -1813335 -2352095 -1954808 -833846
37902 -833846 -140527 -488113 -1242160 -1538092 -1403633 -1405585 -1635094 -1677126 -1389933 -1061792
37892 -1061792 -772160 -197449 752008 1598717 1900387 1786185 1535256 992762 -63139
37883 -63139 -1165802 -1406808 -552944 558041 970251 640132 267976 344268 690866 887686
37873 887686 843727 785854 800202 639930 133757 -388810 -415639 14186 317318 247123
37863 247123 269211 723522 1144918 1010311 719401 1019349 1718690 1919184 1442140 981022
37853 981022 745504 128167 -899149 -1272701 -474058 359696 -30529 -1171335 -1653728
37844 -1653728 -1193942 -689661 -610663 -629586 -722103 -1316980 -2169577 -2253960 -1185871 133244
37834 133244 691901 465793 20474 -284807 -354836 -225478 -166270 -390263 -535146 -71964
37824 -71964 723491 1060317 996243 1412096 2267375 2130208 240523 -2028794 -2825103 -2131916
37814 -2131916 -1329302 -1118622 -1141719 -1219320 -1615409 -2182525 -2441922 -2505727 -2813003 -2962295
37804 -2962295 -2024161 -186270 1155842 1348676 1346677 2034086 2776879 2508515 1404551
37795 1404551 461450 -34204 -578048 -1286185 -1655972 -1461789 -1081242 -831855 -605713
37786 -605713 -259304 178806 800601 1806306 2994855 3645213 3145182 1579849 -326056
37777 -326056 -1635013 -1668908 -495194 965365 1696010 1614679 1568984 2198787 3143665 3559169
37767 3559169 3088221 2058011 986252 219179 -111005 -110999 -76179 -204477 -423129 -638387
37757 -638387 -948992 -1335506 -1359430 -649709 346382 636215 -100170 -1011571 -1135348 -630398
37747 -630398 -492489 -1179747 -2037463 -2208310 -1707996 -1285548 -1396949 -1691972 -1609475 -1205545
37737 -1205545 -1063212 -1377894 -1519375 -851251 207089 496708 -358722 -1280490 -1014986
37728 -1014986 266370 1224039 1055478 300298 -119979 -23047 177761 232248 190965 31763
37718 31763 -393224 -1064868 -1711458 -1987972 -1629128 -609078 664511 1524921 1675889
37709 1675889 1493681 1467909 1544110 1325170 723250 8295 -673559 -1386767 -2035302 -2344760
37699 -2344760 -2295922 -2218177 -2347238 -2569843 -2655924 -2462056 -1913631 -1149060 -684522 -967865
37689 -967865 -1658493 -1848023 -1224130 -540432 -604065 -1222616 -1559703 -1167703 -204440 1037278
37679 1037278 2207941 2673953 1869611 -4907 -2023862 -3315444 -3526254 -2709662 -1325513
37670 -1325513 -321765 -521611 -1655986 -2519137 -2399974 -1910579 -2041452 -2851551 -3613155
37661 -3613155 -3917483 -3971302 -3894174 -3413381 -2455729 -1530440 -1170223 -1259498 -1254516 -945674
37651 -945674 -670228 -715868 -760568 -151925 1221477 2536660 2771866 1849067 762761
37642 762761 418186 619220 499330 -294890 -1314037 -2071143 -2490638 -2484928 -1719320 -216410
37632 -216410 1221113 1705309 1202850 398669 -161791 -355813 -137490 456207 944715
37623 944715 682182 -264941 -977576 -704656 307153 1231918 1560475 1308176 701947
37614 701947 76997 -157942 85608 313664 -14490 -730419 -1111857 -794135 -162336 226279
37604 226279 272087 258351 424686 784141 1170435 1305404 963361 226925 -504882 -889230
37594 -889230 -971259 -1057255 -1303595 -1529486 -1454471 -1060224 -627252 -370626 -150753 279352
37584 279352 808919 1062804 1019692 1155695 1743306 2365572 2474214 2106078 1606545 973777
37574 973777 97160 -601928 -582722 -204183 -438265 -1370855 -1889281 -1280549 -283498 85032
37564 85032 -8373 234845 831090 1166384 1204187 1446729 1804310 1615297 911138 572817
37554 572817 884122 966300 250496 -394746 130741 1446477 2171137 1820423 1259030 1275921
37544 1275921 1586126 1492872 889820 260832 110177 680139 1861367 3055825 3410789
37535 3410789 2563905 1049358 -281908 -1105574 -1626942 -1913018 -1677890 -844627 45691
37526 45691 296977 -194887 -934435 -1522737 -2038631 -2615438 -2963210 -2656459 -1775392 -871018
37516 -871018 -260350 250731 783508 941345 347199 -603641 -1024516 -582290 136647 396061
37506 396061 111684 -243653 -225680 274064 1030598 1551984 1358317 474473 -488101 -985520
37496 -985520 -1133419 -1372532 -1709030 -1695622 -1130367 -326573 405816 1101375 1735276 1898837
37486 1898837 1297461 333902 -280966 -433059 -670030 -1324582 -2039546 -2380825 -2523340
37477 -2523340 -2917598 -3456467 -3445416 -2484182 -1032176 113782 690023 1029045 1336317
37468 1336317 1283938 533917 -561513 -1164995 -911500 -342165 -180018 -416793 -453002 -22004
37458 -22004 469217 613165 597671 833274 1244634 1316044 777005 -84086 -812493 -1223837
37448 -1223837 -1387072 -1420004 -1442613 -1571758 -1794533 -1902496 -1673061 -1135182 -638935 -645397
37438 -645397 -1340429 -2340417 -2878311 -2505838 -1607970 -999043 -999250 -1188645 -1125097 -915274
37428 -915274 -832930 -738240 -330356 191498 227069 -423018 -1255926 -1665039 -1498580 -928699
37418 -928699 -167194 463436 554034 94558 -274468 77447 905115 1252926 546060 -750312
37408 -750312 -1637225 -1540676 -696774 233679 820374 1197096 1758270 2510314 2916793 2600284
37398 2600284 1991064 1852806 2222335 2337170 1713050 735523 -71051 -762945 -1476962
37389 -1476962 -1752541 -1132167 -176113 3446 -749301 -1427451 -1379064 -1210319 -1703114 -2524033
37379 -2524033 -2723522 -2132305 -1531824 -1575474 -2143156 -2706857 -2822191 -2317561 -1501563 -1129238
37369 -1129238 -1627080 -2380390 -2375748 -1553018 -822469 -629900 -352276 472312 1133147 706668
37359 706668 -524705 -1490840 -1888594 -2408759 -3436219 -4389422 -4583396 -4067153 -3272124
37350 -3272124 -2364985 -1350337 -447975 27811 -37070 -629172 -1725218 -3080306 -4151125
37341 -4151125 -4554279 -4460921 -4277828 -4077683 -3616143 -2824169 -2020892 -1623077 -1753821 -2095509
37331 -2095509 -2105063 -1544705 -857100 -773179 -1428074 -2127559 -2159378 -1578861 -1008890 -933594
37321 -933594 -1365019 -1861360 -1659317 -252817 1772654 2942407 2464270 1207855 518253
37312 518253 493596 275766 -301990 -501426 -128182 -8582 -619166 -1238564 -1078198 -490678
37302 -490678 -364127 -882108 -1567584 -2130087 -2608761 -2964502 -3089802 -3005671 -2675302 -1985416
37292 -1985416 -1253289 -1173162 -1728781 -1811935 -699224 683589 964657 336858 180452
37283 180452 916682 1577607 1587559 1580737 1998835 2151702 1447857 540399 293402 371467
37273 371467 -74041 -837173 -962948 -434677 -356569 -1245334 -2177813 -2158866 -1543671 -1334840
37263 -1334840 -1545905 -1233377 -151828 578413 -52213 -1466677 -2281333 -2214769 -2257229
37254 -2257229 -2939069 -3516807 -3330890 -2961837 -3167039 -3418009 -2647826 -1063422 38835
37245 38835 198691 274680 778183 960519 173963 -823230 -774862 380346 1460626 1430273
37235 1430273 345190 -856870 -1152439 -267649 996733 1507401 1019704 355953 320332
37226 320332 909349 1686267 2353723 2745689 2795012 2759828 3082042 3967105 5511381 7969633
37216 7969633 11166825 14099630 16338549 19439083 25354902 33899969 44156506 58013821
37208 58013821 78115696 100376884 112722293 105911107 84233119 61433382 46712889
37201 46712889 38635232 32163684 26219736 22283200 19946182 17586243 15412501 14682238
37193 14682238 14923829 14457770 13009987 11663266 10678803 9302247 7476999 6006251
37185 6006251 5063129 4019600 2773321 1951398 1732072 1594182 1309732 1172985 1169037
37176 1169037 852028 173957 -368344 -520224 -511371 -464574 -218586 208520 558464 766048
37166 766048 972690 1162756 1226220 1239984 1258621 1070398 625092 359071 529155 618056
37156 618056 112158 -490290 -290240 634725 1355743 1478303 1507227 1818359 2125521 2130447
37146 2130447 1998690 1987052 2112300 2293335 2417172 2325396 2133517 2319551 2981629 3375093
37136 3375093 2900920 2166729 2119229 2406996 1765725 1846 -1616366 -2164991 -2122420
37127 -2122420 -2225538 -2315764 -1917063 -1141595 -381997 293267 891706 1170636 1056551 941265
37117 941265 1130260 1396565 1421766 1249264 986330 518447 -134265 -599254 -631081 -457034
37107 -457034 -397472 -504825 -730356 -979000 -851756 76095 1460204 2257421 1940735 1162197
37097 1162197 928399 1631280 3125332 5090043 6909812 7840071 7855569 7904513 8894177
37088 8894177 10863501 13457520 16505546 19535985 21379321 21154390 19437495 17782584
37080 17782584 17197856 17551235 18230557 18853287 19435634 20247078 21399979 22435255 22680398
37071 22680398 22198566 21797702 21724759 21013624 18755721 15483494 12567463 10645401 9375439
37062 9375439 8360197 7470285 6481214 5257166 4253189 4085998 4576131 4829758 4262744
37053 4262744 3003565 1418079 -91378 -908552 -637769 140249 245560 -720849 -1927046
37044 -1927046 -2463093 -2393254 -2316341 -2313278 -1815164 -427506 1413669 2688015 2682833 1650814
37034 1650814 514228 -78268 -195291 -125168 114061 497444 667622 382394 42701
37025 42701 281870 1145365 2039883 2316317 1591403 -151193 -2266675 -3559597 -3329827
37016 -3329827 -2180557 -1247851 -821147 -338568 459333 1173024 1552301 1881709 2343589
37007 2343589 2612655 2379632 1849767 1451466 1319624 1242951 971476 548935 419670 1003901
36997 1003901 2007662 2519938 2105497 1380252 1108596 1269142 1562285 2160845 3069949
36988 3069949 3365297 2302496 851997 759272 2103356 3123423 2618460 1205297 -78131
36979 -78131 -1040507 -1675420 -1532342 -560328 397751 721733 800525 1072575 1206137 964305
36969 964305 951206 1615060 2336808 2450437 2398946 2849326 3368658 3154405 2547195 2568841
36959 2568841 3266786 3727871 3591726 3403584 3474057 3464876 3251145 3284182 3884350 4861390
36949 4861390 5929448 6878354 7379439 7323121 7285820 7888825 8724450 8740162 7708673 6465228
36939 6465228 5628563 5010541 4454775 4275727 4503404 4571551 4196025 3778582 3513417 2929155
36929 2929155 1864646 1070413 1132932 1542254 1642652 1805055 2621611 3483409 3242168
36920 3242168 2108282 1554136 2120777 2567582 1768492 417765 -10213 704791 1524818
36911 1524818 1781859 1726752 1503329 693306 -693056 -1646609 -1327769 -328626 50827
36902 50827 -380414 -435995 765093 2582026 3726160 3820419 3499032 3222969 2697892 1607658
36892 1607658 416376 41591 837522 2169659 3033299 2946641 2166633 1178607 249160
36883 249160 -425651 -431839 575569 2256465 3620900 3902779 3218861 2215323 1320845
36874 1320845 636936 359076 812644 1923447 2957204 3068667 2085038 620921 -544862
36865 -544862 -1074996 -1089469 -827574 -491755 -292754 -339769 -463230 -444349 -480019 -1030768
36855 -1030768 -2018277 -2618489 -2232604 -1280561 -552108 -163396 174834 190989 -708585 -2272222
36845 -2272222 -3421682 -3609425 -3279899 -2761839 -1717043 -187761 800454 517424 -278494
36836 -278494 -306259 572307 1511737 2077471 2492387 2680356 2082831 618565 -866426
36827 -866426 -1384995 -731113 409990 1028530 626320 -231446 -451729 229974 869507
36818 869507 685413 212361 404570 1126515 1435243 1008052 340036 -218573 -623432 -537635
36808 -537635 321102 1290149 1364154 766005 752727 1659972 2360481 2058107 1405460 1220439
36798 1220439 1200263 716738 -31075 -536060 -884717 -1243847 -1141965 -258217 627822 552082
36788 552082 -135708 -288527 209168 250505 -780101 -2115045 -2719971 -2494571 -1960218
36779 -1960218 -1371411 -625047 298475 1205891 1822121 1838280 1075566 -160612 -1120779
36770 -1120779 -1314784 -1061907 -1042186 -1348323 -1332647 -504998 760947 1727378 2261218 2825584
36760 2825584 3580508 4125035 4309761 4595334 5104240 4961709 3403247 1155921 -223687
36751 -223687 -234443 281404 641085 1001551 1383022 1212020 370691 -305900 -267110 -123655
36741 -123655 -523010 -954059 -643232 -33578 -246968 -1354794 -2254855 -2236039 -1742757 -1484303
36731 -1484303 -1572869 -1741386 -1772792 -1459654 -632806 480232 1224159 1072419 105391 -1093846
36721 -1093846 -1908612 -2129000 -2055553 -2064913 -2045030 -1554756 -612594 149306 351137 362796
36711 362796 584867 796903 711147 598552 723438 713082 298504 187172 1186393 2755931
36701 2755931 3538404 3249047 2932897 3262516 3707836 3711242 3636749 3998431 4559416 4819970
36691 4819970 4813794 4871703 5106590 5655985 6942766 9067295 11242445 12419853 12349668
36682 12349668 11610612 10757170 9855938 8785429 7620612 6656281 6181348 6188107 6267185
36673 6267185 5966962 5327421 4844720 4835247 5100023 5323243 5497155 5762562 6078883 6257593
36663 6257593 6137152 5591101 4614521 3593329 3231843 3893896 5067056 5696083 5118724
36654 5118724 3706685 2660704 3084189 5029371 7435027 9163256 10027884 10586786 11108643
36645 11108643 11241713 10729446 9894835 9137576 8359892 7262633 5960410 4921056 4402929
36636 4402929 4281622 4408302 4822911 5479674 5960669 5738208 4794952 3806984 3551062
36627 3551062 4276979 5872652 8330374 11396003 13810603 13857123 11199530 7526274 4752502
36618 4752502 3171019 2065553 1406524 1735858 2719384 3186963 2744615 2183080 1997881
36609 1997881 1583796 389157 -1013927 -1602337 -1037235 303915 1840800 2943415 3152907
36600 3152907 2673662 2203233 2026047 1808115 1475613 1599577 2567037 3985897 5251717
36591 5251717 6164105 6763883 7160609 7669098 8463664 9106968 9284507 9882150 12090836
36582 12090836 15467391 18473100 21088898 24978903 30827568 38239753 49135975 67261499
36574 67261499 90844262 108567233 108245677 89826226 65859863 48417722 39147288
36567 39147288 33062954 27426186 23304464 21097637 19074152 16325128 14089631 13442427
36559 13442427 13624649 13391831 12654028 12073033 11941388 12066396 12193936 12093840 11559673
36550 11559673 10590744 9387947 8134116 6985602 6189912 5921093 6057188 6341515 6625526
36541 6625526 6747913 6452758 5798839 5425843 5926315 6988265 7586990 7136222 6202720
36532 6202720 5968973 7074927 8999094 10524832 10815719 10002878 8723060 7370465 6105014
36523 6105014 5295500 5301914 5817601 6098086 6017277 6246489 7085070 7747834 7293070 5803668
36513 5803668 4177718 3103123 2647621 2513348 2291859 1764947 1250701 1268335 1628056
36504 1628056 1466555 590313 62645 789848 2181124 3063714 3344706 3690570 3982212
36495 3982212 3433303 2246834 1822119 2891813 4500542 5400150 5601042 5838080 6152707
36486 6152707 5876872 4789324 3552434 2937690 3047603 3407525 3587182 3606928 3764744
36477 3764744 4126218 4348189 4147493 3763533 3670415 3967854 4417062 4951247 5670818 6380028
36467 6380028 6694643 6697062 6917096 7473820 7794831 7492477 7024024 7081290 7691925 8327019
36457 8327019 8634835 8734921 9032694 10019165 11965319 14549956 17141902 19718903 22964394
36448 22964394 26897947 29912956 30112940 27603502 24684820 23554505 24348983 25600058
36440 25600058 26010846 25395668 24307048 23285625 22434906 21433798 19933730 18013014
36432 18013014 16123308 14516162 12938396 11098185 9277320 8173957 8087116 8462016
36424 8462016 8396494 7544018 6364965 5439803 4710622 3654165 2188535 1057629 1077215
36415 1077215 2209295 3675173 4836873 5610479 6087890 6206413 5921106 5355424 4602093
36406 4602093 3657957 2748420 2427624 3028267 4110695 4732086 4314951 3198029 2375408
36397 2375408 2658117 3899272 5032354 5120275 4377249 3800685 3770589 3609817 2827432
36388 2827432 2118666 2423837 3422065 3858912 3253789 2388872 2031950 2085846 2285851 2828694
36378 2828694 3728184 4260309 3792136 2716964 1891062 1543190 1443069 1713550 2525297
36369 2525297 3208657 2765497 1373222 350294 310338 334051 -481277 -1554595 -1725517
36360 -1725517 -963104 -184048 251924 789878 1502884 1758572 1353220 1071854 1578376
36351 1578376 2406091 2721099 2655460 3082027 4155184 4851630 4257170 2829332 1934852
36342 1934852 2291416 3272398 3804995 3602083 3217357 3066881 2900827 2446136 2134470
36333 2134470 2635360 3760616 4437986 3962401 2781396 1753171 1130645 778334 959965
36324 959965 2109058 3874154 5163499 5359403 4918785 4541681 4319930 4057815 3902835
36315 3902835 4159343 4836262 5842217 7300053 9223639 11289459 13483086 16472822
36307 16472822 20448186 23889701 24653864 22444387 19213278 16819309 15271497 13744897
36299 13744897 12270066 11495026 11453183 11590795 11692985 11920565 12218595 12601738 13826480
36290 13826480 16693737 20490552 23038997 22750440 20107630 16821305 14062416 11911221
36282 11911221 10084568 8603672 7743013 7623908 7994594 8436206 8750722 8951476 8818508
36273 8818508 7867111 6078631 4261139 3164758 2572108 1903154 1381953 1695422 2616088
36264 2616088 3014519 2439598 1738468 1765206 2344592 2947681 3548510 4225672 4634854 4537153
36254 4537153 4292088 4243965 4176342 3919519 3829640 3993138 3675056 2453385 1274374 1287406
36244 1287406 2067622 2211887 1490252 1109400 1742419 2536949 2490108 1815616 1397942 1603586
36234 1603586 2141603 2560558 2478936 1816547 1134967 1242295 2133217 2854672 2788110 2500056
36224 2500056 2836674 3687764 4256688 4183715 3746501 3180902 2487116 1854781 1647345 1856407
36214 1856407 2066466 2112705 2346049 3040179 3934811 4724439 5760137 7805907 11037874
36205 11037874 14559910 17021580 17582397 16306050 13956229 11584676 9970091 9041659
36197 9041659 7985117 6298651 4601631 3905643 4190429 4390562 3893470 3278796 3234150
36188 3234150 3505039 3507199 3332603 3390013 3531971 3379611 3166847 3367393 3709981 3509616
36178 3509616 2891806 2731180 3324437 4046711 4450264 4771272 5119808 5113566 4694611 4424586
36168 4424586 4477898 4157428 3006351 1677923 1017625 897049 715191 555134 977885
36159 977885 1923927 2646399 2721633 2502158 2512551 2862811 3338125 3738468 4029356 4287252
36149 4287252 4501332 4473456 4135578 3903123 4272640 5019394 5345095 4980227 4509708 4333544
36139 4333544 4027648 3219069 2396984 2164689 2243594 2016342 1653498 1853847 2706663 3623065
36129 3623065 4242510 4603405 4490985 3487591 1869596 784765 1194046 2929969 4908383
36120 4908383 6042371 6026051 5517365 5444732 5902852 6036713 5348765 4624996 4909699 5964827
36110 5964827 6627059 6500396 6310556 6524621 6600868 5941926 4794018 3730862 2839679
36101 2839679 1946487 1274374 1354538 2360514 3795791 4832634 4944165 4324113 3649530
36092 3649530 3326338 3151188 2862156 2625928 2593547 2404986 1761107 1164812 1336593 2087138
36082 2087138 2581102 2620403 2802093 3389406 3911688 4037549 4041669 4214709 4530288 5005849
36072 5005849 5611641 5746531 4735345 3034841 1967845 1990568 2252328 2199358 2412758
36063 2412758 3251780 3865691 3468451 2629126 2314334 2491768 2705561 3201861 4239826
36054 4239826 4925178 4137227 2337243 1161676 1306232 1957682 2273354 2275727 2177106 1890312
36044 1890312 1485250 1293160 1325122 1298420 1356390 2001397 3167721 4117550 4449123 4502018
36034 4502018 4580404 4491333 4082390 3545170 2910675 1884849 489040 -696008 -1193485
36025 -1193485 -1041366 -403210 614150 1590783 1954765 1800372 1872762 2437992 2888593
36016 2888593 2832424 2762040 3086005 3283752 2812668 2247464 2596465 3844756 5069874
36007 5069874 5775310 6193396 6345069 5788707 4553764 3489603 3178148 3051216 2229084
35998 2229084 1013678 857662 2601650 5138367 6328858 5269349 3197870 1901324
35990 1901324 1689505 1540409 934699 569872 1059451 1859725 2096968 1821291 1705295
35981 1705295 1894047 1902489 1457536 777164 120770 -358296 -421835 17184 549592 713667
35971 713667 695057 1020071 1663761 2103783 2171276 2115832 1866743 1100749 155287 -87828
35961 -87828 438038 691912 113747 -436262 -107255 427346 5667 -985341 -902594 852557
35951 852557 2946828 3764532 3069335 1729326 571394 -53523 -142620 43292 234312
35942 234312 525696 1119671 1625955 1270863 92500 -740183 -292030 979161 1926061
35933 1926061 2058541 1633118 963719 412918 616510 1763256 2863176 2701734 1481208
35924 1481208 576402 636537 970457 1029930 1366888 2506232 3773495 4077488 3331953
35915 3331953 2388038 1964038 2257121 3177497 4260696 4654236 3880769 2448250 1213646
35906 1213646 467240 165553 557969 1742893 2944928 3204962 2680111 2358484 2545795
35897 2545795 2568217 1990633 1137761 255952 -835074 -1945613 -2325267 -1721977 -838122
35888 -838122 -306157 33992 457822 799360 1014665 1413629 1830789 1566629 793378 863855
35878 863855 2251511 3330683 2548303 829718 168675 574153 410270 -582014 -855179
35869 -855179 122765 846895 366230 -115799 549455 1385652 1046444 294660 791790 2207149
35859 2207149 2582385 1379947 274403 650923 1921552 2850820 3207234 3360510 3293651
35850 3293651 2915962 2702405 3177679 4097050 4754119 4860826 4673756 4493390 4404077 4266054
35840 4266054 3711175 2516440 1252471 1036951 2155070 3394911 3411012 2431074 1885819
35831 1885819 2536337 3761760 4678457 5123631 5317020 5328455 5322923 5726519 6569289 7061721
35821 7061721 6454138 5118818 4168497 4050249 4112705 3675288 2958659 2633050 2862371
35812 2862371 3270230 3651979 4173287 4791802 4960928 4225485 2876792 1692459 1138218
35803 1138218 1116608 1379192 1768625 2063623 2105262 2261690 3216413 4869148 5927927
35794 5927927 5276581 3507509 2330293 2512767 3245282 3678309 4119973 5153068 6353467
35785 6353467 6753296 6196484 5440458 5139282 5456093 6448231 7945810 9096514 9007136
35776 9007136 8066218 7729341 8560096 9273928 8339721 5933348 3619565 2532940 2578848
35767 2578848 3094835 3488301 3319783 2538842 1790655 1941517 3131477 4667893 5875368
35758 5875368 6597186 6820033 6371282 5267973 3994802 3136406 2912617 3198721 3755471
35749 3755471 4299547 4579376 4555339 4433311 4571075 5490581 7681159 10846154 13476762
35740 13476762 13951469 12281865 10122445 8797882 8059338 7197932 6487136 6624271 7345246
35731 7345246 7727400 7663276 7925030 8716893 9256377 9132645 9114462 10001839 11354717 12036694
35721 12036694 11593122 10484920 9280615 8214104 7345834 6615585 5819606 4938013 4335263
35712 4335263 4232131 4185289 3619338 2761420 2445868 2930407 3455564 3175392 2114440
35703 2114440 992796 433943 552593 1042660 1437100 1447296 1195052 984546 851187
35694 851187 626266 487777 1021284 2468291 4207471 5300686 5409506 4964230 4618653
35685 4618653 4764423 5370755 5994179 6070890 5494848 4832098 4701522 5012754 5088257 4518269
35675 4518269 3651590 3213306 3584053 4424972 4894548 4348376 3004422 1814168 1505962
35666 1505962 1907486 2406407 2823285 3446132 4372839 5312969 6035804 6558559 6818390
35657 6818390 6574142 5756112 4561920 3121514 1464214 -62372 -791205 -412333 667010
35648 667010 1828767 2764757 3330187 3363300 3001868 2759682 2849984 2792182 2197087 1618432
35638 1618432 1966521 3211687 4354786 4746742 4828325 5354815 6363980 7197485 7248596
35629 7248596 6473788 5408246 4850039 5287938 6418377 7342851 7372097 6563369 5489122
35620 5489122 4704577 4488714 4839152 5546550 6384692 7285928 8200070 8808350 8651060
35611 8651060 7642008 6248949 5049903 4252308 3684029 3062167 2225541 1307964 726851
35602 726851 800868 1378960 2085884 2872634 3938920 5102877 5735334 5484497 4639339
35593 4639339 3615918 2581241 1807990 1784662 2511853 3212312 3308221 3223820 3554889 3905228
35583 3905228 3468612 2514416 2200660 2817095 3286314 2808709 2051309 2032487 2548769 2575904
35573 2575904 1846758 1142595 1082526 1389461 1521175 1451822 1505627 1715887 1669813 976325
35563 976325 -197393 -1093570 -1014043 -116261 639041 585088 208629 513434 1603257 2431669
35553 2431669 2135560 1128663 479509 552042 830177 969132 1323694 2162423 2917086
35544 2917086 2798627 1952410 1388980 1724070 2538303 3162993 3536158 3881000 4015807
35535 4015807 3618648 2965636 2745524 3128697 3555929 3491369 2890639 1926941 870078
35526 870078 324493 858052 2089913 2821874 2493266 1858145 1710020 1649140 914992 -119260
35516 -119260 -308625 654421 1980182 3025689 3792005 4152685 3676658 2540250 1660670
35507 1660670 1463078 1349599 901721 757481 1568564 2806512 3511179 3734081 4258635
35498 4258635 5147511 5570879 5097991 4296413 3858426 3797991 3732738 3430166 2873217 2227774
35488 2227774 1887283 2111700 2514122 2399291 1758730 1375775 1677671 2052096 1762567
35479 1762567 1102151 1033991 1876877 2914952 3293077 2821683 1827042 664299 -357327
35470 -357327 -860373 -623651 34515 368560 -80267 -941782 -1395144 -1100145 -491814 -41360
35460 -41360 406564 1178322 1937895 1962311 1280996 844201 1212742 1661084 1169282 -54112
35450 -54112 -765100 -320722 608096 1142514 1338617 1740540 2252856 2197822 1466979 908838
35440 908838 1210864 1845206 1669672 405963 -1069792 -1953118 -2387885 -2785895 -2867438
35431 -2867438 -2109236 -926120 -540127 -1420458 -2490269 -2349031 -916071 625046 1303026
35422 1303026 1250208 1125602 1148984 987704 399462 -310173 -533748 35723 1124897 2171198
35412 2171198 2784565 2893906 2618275 2188108 1885968 1784875 1552731 811057 -251240
35403 -251240 -921762 -751922 -29838 688010 1227943 1744545 2277109 2701317 2989705 3182302
35393 3182302 3139509 2643460 1809404 1156359 1125555 1620585 2130194 2278236 2137635 1921251
35383 1921251 1494746 538890 -698082 -1285391 -737989 66230 -148056 -1240609 -1701864
35374 -1701864 -741526 591043 923306 383635 99729 484787 1014118 1365672 1719458
35365 1719458 1978676 1700902 987015 604818 958001 1612053 2081872 2412870 2690965
35356 2690965 2660582 2262009 1975365 2114437 2199037 1562101 332252 -627362 -606656 402628
35346 402628 1807197 2774237 2741016 1888801 969159 487248 304038 177687 252049 666493
35336 666493 1095879 1182129 1162328 1548060 2345370 3111744 3678801 4239787 4682473 4425476
35326 4425476 3192065 1557665 401010 42031 232225 800289 1819336 3024747 3530260
35317 3530260 2626227 800177 -533763 -509501 380489 1195524 1777584 2526586 3313043
35308 3313043 3436274 2671496 1614630 818423 243381 -219795 -363632 -152360 2690
35299 2690 -135708 -257870 -137922 -72837 -266474 -411096 -441674 -1032068 -2544854 -4040121
35289 -4040121 -4303610 -3530379 -2970172 -3054702 -2923396 -1870017 -282417 1089433 1962664
35280 1962664 2320226 2121008 1581455 1158059 911901 394747 -566693 -1497434 -1956579
35271 -1956579 -2070660 -2105178 -2048267 -1958166 -2176952 -2746150 -3038424 -2431560 -1047993 493059
35261 493059 1671124 2112935 1588889 469996 -272790 -137409 189392 -198309 -1083077
35252 -1083077 -1519865 -1351599 -1402555 -2068798 -2588771 -2097533 -777409 499603 1227849
35243 1227849 1489391 1450046 1185368 911102 907310 1137576 1264045 1146531 1079896 1375874
35233 1375874 1864848 2025311 1611280 995536 763492 977272 995975 203883 -1097950
35224 -1097950 -1795556 -1183667 71343 563980 -219167 -1314367 -1546130 -953387 -478243
35215 -478243 -528078 -559193 -102911 537088 898271 1030773 1117709 979496 532718 282314
35205 282314 639022 1059681 679809 -341568 -965091 -771864 -433640 -490067 -564094 -253418
35195 -253418 -4318 -382466 -995856 -957111 -211766 333475 36484 -704867 -1070305 -818969
35185 -818969 -440741 -497421 -1031705 -1623196 -1888728 -1785454 -1439310 -942604 -500751 -477162
35175 -477162 -894061 -1109133 -522036 533478 1230761 1470190 1817120 2188726 1703726
35166 1703726 278496 -745418 -428540 221060 -325393 -1781976 -2504131 -2008424 -1555882
35157 -1555882 -2012340 -2485278 -1735727 34057 1594266 2241394 2158748 1676044 1016701
35148 1016701 635109 1007365 1899735 2384739 1918118 1117943 1088881 2013757 2806946 2409731
35138 2409731 1170941 465123 948940 1777080 1822350 1110428 501021 382392 449094 573050
35128 573050 1007742 1617475 1729325 1117483 512704 670092 1350196 1671983 1199744 303198
35118 303198 -357991 -406989 17479 374166 235362 -189476 -316445 -54196 43009 -295551
35108 -295551 -518364 -81241 665488 1036334 1110599 1516083 2246494 2510480 1904775 1032177
35098 1032177 630624 643212 572042 329214 215263 281934 252257 46028 -60219 124037
35088 124037 455914 784819 1212725 1801457 2223403 1984353 967065 -388498 -1389410
35079 -1389410 -1502064 -672329 529315 1252750 1187073 921082 1105266 1400201 891655
35070 891655 -383762 -1127914 -448581 848311 1362508 1011595 918622 1609389 2350005
35061 2350005 2390542 1904926 1347383 728809 57380 -236614 -4280 62810 -617316 -1383112
35051 -1383112 -1029916 498801 1999978 2646058 2854715 3203079 3261870 2199466 197296
35042 197296 -1442431 -1669947 -773214 36492 -85679 -850536 -1245627 -600525 799441
35033 799441 2169473 3162423 4071526 5019015 5333773 4230286 2056189 294324 9922
35024 9922 666125 923827 363957 -202183 -94352 338025 534085 774385 1702910 3104343
35014 3104343 3953764 3718100 2945493 2388092 2116831 1793901 1339327 936949 703143
35005 703143 711590 1077184 1649899 1858588 1265182 134044 -914079 -1669204 -2342805 -2927621
34995 -2927621 -3070331 -2663381 -2098548 -1732905 -1489902 -1258768 -1318637 -1905808 -2550888 -2431759
34985 -2431759 -1492064 -684570 -771455 -1299822 -1312581 -830726 -859599 -1807796 -2694758 -2433615
34975 -2433615 -1321128 -551678 -605454 -919402 -1011594 -1065142 -1277086 -1407750 -1267442 -1029611
34965 -1029611 -764081 -238016 509559 989823 1032535 1132147 1577656 1864577 1584414 1325673
34955 1325673 1895126 3029419 3730540 3661525 3360850 3168306 2809223 2145364 1566933
34946 1566933 1390856 1430875 1368887 1102025 625283 44608 -240384 95782 677572 746259
34936 746259 224551 -144884 89711 465192 367138 -174612 -795754 -1351951 -1763681 -1791213
34926 -1791213 -1391858 -909727 -562941 -172022 296227 485039 362238 520207 1153635
34917 1153635 1400745 561814 -556401 -573265 493976 1346624 1396332 1375220 1745096 1800331
34907 1800331 1010909 206377 471777 1501873 2000208 1364341 152381 -857485 -1249891
34898 -1249891 -792820 421596 1567091 1601536 480750 -676672 -855884 -110017 892115
34889 892115 1702548 2147898 2060640 1485360 937429 1013832 1764375 2636613 2957753 2432217
34879 2432217 1444532 950129 1639684 2992658 3632974 2977375 2029929 2000017 2589717
34870 2589717 2438513 1060920 -504940 -1037588 -407739 621304 1238850 1064818 372826
34861 372826 32360 672954 1724070 1899326 884323 -116628 103585 1314272 2393294
34852 2393294 2731601 2509237 2062594 1657592 1576509 1808446 1906803 1690261 1729950 2489334
34842 2489334 3334882 3232568 2245635 1468989 1518219 1974499 2414677 3035980 3894789 4359975
34832 4359975 3923818 3016781 2406626 2128932 1604394 655578 -143364 -185565 470966 1276807
34822 1276807 1867103 2355981 2948837 3460691 3461804 2862443 2020684 1191134 282302 -624608
34812 -624608 -1007688 -578587 199917 776321 1249223 1809583 1937113 1088573 -122193
34803 -122193 -551743 -278395 -551020 -1814882 -2966521 -2974428 -2129833 -1127187 18392
34794 18392 1349773 2202278 2037002 1391407 1078180 981863 545229 -90376 -426148 -613432
34784 -613432 -989057 -931319 508049 2789121 3956953 2931952 794705 -657544 -850493
34775 -850493 -436303 -74261 75550 8184 -271053 -557584 -553872 -260041 -33754 -165367
34765 -165367 -495317 -573162 -229762 141092 86409 -175066 95602 1133019 2183981 2347597
34755 2347597 1602339 683828 230238 381144 888024 1183418 645295 -676988 -1803981
34746 -1803981 -1798641 -813025 306554 1168695 1965266 2704381 3105067 3201532 3284455 3194917
34736 3194917 2431482 1113754 141428 146777 836311 1532765 1810782 1482338 616239 -213617
34726 -213617 -351924 -2561 -118502 -1070274 -2082914 -2337799 -1933433 -1305879 -441443
34717 -441443 656647 1335876 992948 87059 -333153 57239 711236 1221999 1743878
34708 1743878 2399711 2954147 3221113 3245440 2922784 1980195 625657 -217024 241479
34699 241479 1722718 3137193 3758072 3901791 4393766 5555476 6899237 7773703 8083891
34690 8083891 8251792 8623375 9117584 9388580 9137249 8319737 7248087 6413231 5988671
34681 5988671 5612065 4915175 4093613 3548249 3130343 2346136 1320678 877709 1412580
34672 1412580 2246138 2436334 1807100 880854 210643 87461 513974 1142436 1552019
34663 1552019 1778593 2154127 2502772 2167638 1153244 493499 940923 1965323 2689405
34654 2689405 3123407 3659386 4025369 3844312 3770438 4796259 6580238 7732321 7836341
34645 7836341 7929899 8661503 9192723 8573975 7248811 6375528 6281091 6364541 6119493 5541829
34635 5541829 4766375 3901088 3109327 2440231 1714240 893565 348217 406159 839089 1144004
34625 1144004 1161772 1079567 990564 835624 705852 833770 1223587 1507878 1255960 385081
34615 385081 -696989 -1361357 -1302578 -836159 -529421 -605895 -925665 -1389005 -1917829 -2121996
34605 -2121996 -1614058 -778022 -552928 -1153431 -1675595 -1437268 -1055636 -1509720 -2648461
34596 -2648461 -3471304 -3579215 -3445369 -3363674 -3052383 -2404443 -1793078 -1381141 -839431 -40597
34586 -40597 647421 1121459 1914387 3275544 4458667 4613513 4000142 3567241 3534615 3193038
34576 3193038 2123376 846633 33768 -274491 -278607 194395 1328501 2622596 3186250
34567 3186250 2742192 1884495 1299312 1154710 1348965 1866574 2576714 3047360 2993917 2725982
34557 2725982 2733992 2957715 2919363 2531672 2248942 2320699 2433609 2353953 2431389 3034095
34547 3034095 3845207 4261653 4323124 4714965 5873243 7532565 9151025 10307850 10608628
34538 10608628 9715650 7774596 5523105 3716125 2609514 2111050 2117635 2459504 2788069
34529 2788069 2873050 2903862 3212419 3753365 4097538 3926168 3367376 2873160 2869591 3420802
34519 3420802 4087870 4233966 3661446 2886710 2644300 3202479 4249772 5228264 5592997
34510 5592997 5056028 3976503 3299759 3597361 4246768 4114244 3057402 2115977 2055569
34501 2055569 2427634 2487601 2400306 2854205 3910559 5067038 6273762 7940341 9774442
34492 9774442 10520498 9417708 7363702 5976994 5785149 5958939 5678782 5050142 4544193
34483 4544193 4196597 3794408 3458087 3478829 3681074 3465591 2612649 1672276 1336105 1656682
34473 1656682 2116678 2289768 2161305 1901609 1637918 1486127 1567270 1881709 2263331 2491511
34463 2491511 2406134 2005599 1531180 1276554 1114134 458446 -912262 -2206532 -2368950
34454 -2368950 -1434210 -488630 -216162 -229146 -65732 20699 -208759 -289253 115960 389501
34444 389501 -29686 -342815 673437 2670018 3976984 3879916 3302192 2947002 2196710
34435 2196710 584287 -906737 -1133668 -536349 -361042 -656973 -327904 959003 2128087
34426 2128087 2204566 1562937 1252738 1665128 2301133 2538400 2247504 1736640 1333973 1142381
34416 1142381 1203327 1678628 2526249 3095956 2638485 1376727 436460 389834 558913 272897
34406 272897 50731 680303 1727444 2077384 1667350 1501821 1962492 2267984 1879634
34397 1879634 1433110 1809790 3021724 4443678 5537042 5975760 5647657 4944045 4585909
34388 4585909 4832177 5262734 5518625 5713781 5914746 5851074 5448477 5028751 4644263 3869745
34378 3869745 2668572 1796272 1823663 2378414 2903681 3487670 4226373 4451454 3624292
34369 3624292 2603822 2864991 4450036 5710641 5340123 3861773 2717833 2494669 2577984
34360 2577984 2270949 1714599 1581169 2084714 2600041 2450329 1889365 1865684 2783055 4006482
34350 4006482 4762990 4946244 4721780 4027444 3062157 2663456 3366343 4464726 4872962
34341 4872962 4643802 4684241 5133429 5134273 4350429 3615557 3626639 3886896 3576315 2833503
34331 2833503 2495678 2969760 3990247 5261559 6781741 8593361 10572775 12391869
34323 12391869 13465535 13152107 11343039 8751931 6361844 4686454 3744104 3475981
34315 3475981 3759485 4095450 3775215 2583514 1129669 285613 352711 872513 1184040
34306 1184040 1051380 776785 842592 1487957 2506068 3361609 3637219 3498594 3540557 3934052
34296 3934052 3960046 2876076 1153647 205273 734644 1995784 2939913 3359703 3420151
34287 3420151 2847770 1459286 -10634 -616066 -518657 -671565 -1322180 -1801362 -1792687 -1783541
34277 -1783541 -2052894 -2168619 -1840742 -1430830 -1195361 -782644 42913 849455 1220237
34268 1220237 1412430 1837799 2391281 2750861 2858125 2689458 2088411 1270130 917692
34259 917692 1244171 1489196 910946 -222694 -1188894 -1790485 -2114620 -1871719 -821886
34250 -821886 503822 1326676 1592852 1693329 1579642 1033902 518086 728923 1384638
34241 1384638 1445626 620188 -242276 -400094 -47903 258164 226270 -294849 -1298841 -2252770
34231 -2252770 -2456135 -2000174 -1697132 -1872506 -1960737 -1489041 -628418 494067 2061143
34222 2061143 3657665 4077027 2821885 1068596 307095 610597 1068853 1306080 1514716
34213 1514716 1433910 573292 -564633 -663880 688452 2349740 3069260 2871658 2565161
34204 2565161 2488039 2331259 1873200 1323105 985307 930894 1028366 1130593 1216782 1389767
34194 1389767 1688861 1942138 1941908 1748400 1652472 1818207 2074629 2030976 1329243 -30342
34184 -30342 -1415964 -1852395 -960477 507410 1443620 1567415 1400746 1255032 930694
34175 930694 441651 240536 423616 425607 -33570 -327095 160878 1023307 1445969 1430049
34165 1430049 1594635 2032864 2274156 2295118 2576145 2985417 2599933 1126651 -300399
34156 -300399 -440783 445214 1028447 653232 -39712 -112280 653914 1739440 2394856 2126008
34146 2126008 1089515 87653 -136047 363031 922075 1099588 970309 707828 373102
34137 373102 165287 375217 887164 1128923 766819 139320 -242817 -359686 -597151 -1205087
34127 -1205087 -2047477 -2712014 -2741309 -2030693 -1165279 -1025387 -1784578 -2607483 -2652901 -2041066
34117 -2041066 -1416885 -918428 -223896 559932 842059 500356 179552 301886 355841 -330809
34107 -330809 -1485695 -2127671 -1754130 -787488 111609 675020 892082 737186 330645
34098 330645 70166 235602 573956 597696 271146 88608 389945 878135 1019771 759668
34088 759668 585864 914141 1608292 2135995 2042090 1222679 -98388 -1485572 -2379081
34079 -2379081 -2231065 -810585 1434751 3416990 4158388 3693851 3027892 3009435 3460408
34070 3460408 3643471 3298945 2784653 2373771 1974544 1543347 1229824 1016333 731469
34061 731469 540447 830128 1371357 1241616 40584 -1327028 -1619865 -633022 888023
34052 888023 2269270 3199910 3367979 2634503 1506262 732413 411749 92880 -288644
34043 -288644 -279291 198469 512712 126224 -789605 -1733420 -2354988 -2386467 -1663097 -508755
34033 -508755 360945 605475 543936 521686 539202 744495 1609733 3098764 4205766 4006688
34023 4006688 2881207 2071443 2219943 2934177 3653326 4263567 4746203 4792150 4132244
34014 4132244 3061634 2359313 2592837 3475873 3986450 3315157 1714368 192613 -600580
34005 -600580 -811959 -710048 -188182 754407 1600118 1889367 1810648 1698115 1321560 306611
33995 306611 -1007844 -1814268 -1805457 -1280272 -428362 782219 2039621 2761421 2884147
33986 2884147 2961810 3302142 3561077 3386937 2952542 2632352 2586984 2819226 3198530 3325531
33976 3325531 2869869 2132486 1705555 1505060 882258 -116076 -502601 164041 919263
33967 919263 749601 88553 51101 708102 1161191 1059253 978248 1296446 1617655 1445422
33957 1445422 681792 -615520 -2184248 -3147454 -2526202 -520400 1416408 2150510 1903934
33948 1903934 1418179 860417 136256 -376845 -225275 309594 519957 246851 -40611
33939 -40611 -35449 70138 -318 -281279 -616007 -721426 -345854 336757 744099 655893
33929 655893 602826 975403 1173819 436893 -759723 -1106604 -238597 863314 1373263
33920 1373263 1517392 1671666 1601858 1176624 951849 1327665 1833074 1962457 2033627 2427612
33910 2427612 2684227 2336078 2013109 2509534 3176592 2623443 901419 -411498 -460593
33901 -460593 -103893 -290238 -747275 -896183 -901314 -983718 -664051 350703 1278865 1262223
33891 1262223 687633 538575 900903 1115835 1028048 985716 827578 39198 -1051467 -1338575
33881 -1338575 -467650 576471 713180 -123803 -1329511 -2288656 -2396593 -1261334 562454
33872 562454 1656404 1158160 -270148 -1300103 -1329133 -618410 412546 1392341 1850720
33863 1850720 1560892 938750 612586 711448 994011 1459296 2273796 3214311 3783772 3893693
33853 3893693 3879648 3777099 3165690 1948259 768875 300644 463655 706877 795865
33844 795865 911873 1122919 1212736 1084212 965410 1028239 1036260 646751 9579 -216697
33834 -216697 403070 1475216 2135026 2018882 1664277 1835212 2631173 3447214 3685600
33825 3685600 3264750 2487103 1700149 1162511 1014792 1233197 1688698 2257278 2725504
33816 2725504 2657183 1722845 298878 -631677 -479890 325344 1066865 1776662 2939221
33807 2939221 4291811 4741245 3784177 2352475 1696529 1858355 1899963 1387088 867816
33798 867816 829855 923418 589243 -11297 -160930 499288 1570907 2344509 2385672 1684309
33788 1684309 446827 -1073397 -2463340 -3011185 -2121802 -188448 1299201 1141471 -145116
33779 -145116 -944155 -628171 -238394 -790289 -1778812 -2071314 -1623816 -1329595 -1441337 -1163032
33769 -1163032 65245 1642623 2448252 1973288 688951 -363411 -372807 450730 982315
33760 982315 535253 -104432 331253 1753669 2804332 2806448 2523186 2614783 2499550 1552121
33750 1552121 509715 564647 1548301 2148226 1760477 1085125 826249 739791 260919 -623106
33740 -623106 -1485767 -1979953 -1965916 -1494229 -885776 -522871 -414240 -272489 -95432 -252022
33730 -252022 -829164 -1331412 -1320104 -1014890 -941093 -1227907 -1557161 -1606827 -1271909 -643934
33720 -643934 -49853 93559 -217612 -409676 -38719 514393 518697 -53911 -530011 -603625
33710 -603625 -703815 -1033134 -988894 -182662 534809 40614 -1236070 -1529915 -50301
33701 -50301 1863465 2452294 1620280 525427 -278185 -1182324 -2235577 -2731152 -2358128
33692 -2358128 -1768373 -1467243 -918718 531340 2351440 3241073 2664410 1312522 108393
33683 108393 -651687 -1118083 -1394847 -1464005 -1313150 -949042 -424669 84120 374391 421559
33673 421559 357717 241588 -2348 -384346 -706468 -692613 -269003 283170 539122 417941
33663 417941 359500 768200 1369820 1526275 1182038 930416 968094 676219 -274857 -1040425
33653 -1040425 -616376 629638 1353888 1057433 588710 708523 1058081 948729 441932
33644 441932 69113 -39306 -148706 -331243 -431796 -476267 -630988 -798239 -657705 -148730
33634 -148730 383721 578849 408199 157907 267741 1127515 2704410 4260135 4728376
33625 4728376 3684527 1912930 764518 845779 1488276 1636418 1083236 543612 592906
33616 592906 999733 1300257 1578005 2185071 2902899 2975593 2068942 754149 -144308 -373264
33606 -373264 -274810 -296041 -674526 -1336066 -1846623 -1676693 -815272 1369 -7728 -742953
33596 -742953 -1268275 -842210 314071 1397241 1985424 2392188 3100367 4097529 4901716
33587 4901716 5098905 4703199 4106296 3850721 4300961 5231099 5822595 5462145 4539917
33578 4539917 4017809 4177443 4382997 4254287 4324223 5022394 5695020 5467277 4659538 4398323
33568 4398323 5001950 5740317 6218490 6965922 8341913 9790085 10744493 11570756 12917652
33559 12917652 14584188 15736637 16049637 16030277 16260418 16808018 17460208 18180228 19127759
33550 19127759 20308712 21356652 21827447 21785612 21869300 22489665 23154817 23033739 22109824
33541 22109824 21242557 21041062 21223482 21219591 20833275 20053100 18739817 16896417 14922430
33532 14922430 13298925 12240675 11722406 11443019 10742656 9194938 7464299 6849031 7620047
33523 7620047 8556905 8638520 8426490 9011698 10228638 10908990 10581936 9907583 9453928
33514 9453928 8940328 7893536 6397506 4909031 3722252 2832948 2123181 1565725 1272912
33505 1272912 1222678 972054 87799 -978539 -1039268 385270 2305127 3471462 3831354
33496 3831354 4139871 4642085 4970440 4987952 4840461 4394298 3494210 2608972 2334350 2389059
33486 2389059 2040877 1446834 1535610 2489949 3406529 3713791 3934675 4652738 5595185 6202799
33476 6202799 6367182 6152534 5471688 4505475 3823868 3615957 3341389 2582268 1730905
33467 1730905 1428488 1817637 2703361 3881004 4884305 5006083 4137872 3158185 2957262
33458 2957262 3404252 3690338 3330895 2459306 1544854 1202704 1844078 3106402 4051857
33449 4051857 4285347 4354170 4656371 4645454 3772980 2617084 2223270 2692756 3270164 3597142
33439 3597142 4023087 4731511 5351315 5571879 5589801 5814845 6491736 7604027 8834698
33430 8834698 9730085 10224017 10822041 11937329 13310730 14485101 15529021 16777867 18159008
33421 18159008 19372195 20498601 21795719 23095581 24117928 25290889 27562575 31372506
33413 31372506 36363303 42040739 48137368 54455956 61076820 68707341 78111779 89144137
33405 89144137 100993146 113328573 126369549 139733725 152119952 162403871 170231278
33398 170231278 175225710 176506935 173543526 166775629 156861291 144047655 129006736 113653321
33390 113653321 100154941 89276048 80315528 72408904 65226175 58645633 52582388 47219987
33382 47219987 42807864 39131411 35657121 32246102 29256564 26885168 24871045 22948288
33374 22948288 21155959 19576356 18176049 17036465 16308240 15748366 14758688 13198852
33366 13198852 11770658 11187549 11251143 11192743 10696036 10068978 9564495 9146803 8905119
33357 8905119 8994247 8992384 8075997 6294281 5004835 5321659 6582666 7214446 6845177
33348 6845177 6549089 7006135 7537397 7344198 6704726 6266134 5911753 5160451 4184707
33339 4184707 3576157 3400239 3282715 3226367 3538024 4030495 4075763 3506858 2830921 2517167
33329 2517167 2667706 3355523 4574784 5780465 6205308 5842056 5480700 5549282 5512759
33320 5512759 4662267 2944106 794271 -1244127 -2487676 -2371593 -1166700 83979
33312 83979 721106 1050493 1453744 1610096 1170706 601229 604968 1086059 1400741 1346910
33302 1346910 1187268 925323 355049 -230385 -158696 664576 1550484 1961956 2112716 2390850
33292 2390850 2646940 2401673 1506776 310208 -712438 -1313228 -1561109 -1717126 -1979910
33283 -1979910 -2300851 -2490374 -2489257 -2426776 -2375706 -2136942 -1384921 -114479 1094297 1487729
33273 1487729 977376 330524 200862 212873 -419916 -1475747 -1732703 -636395 814526
33264 814526 1344053 911702 319567 -109449 -595470 -979187 -714437 179761 934516 958103
33254 958103 390787 -325138 -852845 -874585 -232494 648579 1024286 730822 323912 136476
33244 136476 -209033 -1013742 -1799886 -1907857 -1377798 -650619 300893 1800172 3447501
33235 3447501 4043333 2938230 1038541 -45804 258185 1036136 1178180 617772 5814
33226 5814 -415862 -1013191 -1912240 -2580089 -2495108 -1841364 -1278844 -1304402 -2008866 -3104065
33216 -3104065 -3956593 -3975204 -3272126 -2603966 -2389098 -2228872 -1753627 -1373430 -1576626 -1963977
33206 -1963977 -1781151 -1117794 -714226 -707878 -457974 337779 1171848 1535920 1515190 1425304
33196 1425304 1492795 2000679 3062145 4106397 4307371 3716400 3234425 3244501 3116324
33187 3116324 2449445 1929131 2297464 3164191 3604514 3462614 3294219 3334987 3307850 3157672
33177 3157672 3292704 3972280 4867652 5383870 5262363 4828926 4667496 4987280 5434084
33168 5434084 5756812 6429157 8099331 10569514 13014067 15199933 17704743 20816498
33160 20816498 24060155 27040816 29944342 33025864 36553304 41458605 48910615 58964386
33152 58964386 70964051 85599879 104833174 129279256 158010924 191821685 232705970
33145 232705970 276122701 306363026 306142633 272964446 222711333 175406406 140040594
33138 140040594 114156611 93403572 76722971 63947790 53576353 44461376 37180610
33131 37180610 32407929 29353175 26689298 23940965 21257904 18681825 16285326 14430584
33123 14430584 13343954 12757094 12217474 11465046 10477502 9518802 9060099 9180177 9183842
33114 9183842 8403286 7226035 6587125 6519987 6111164 5017861 4069657 3964380 4226143
33105 4226143 4072174 3637826 3575508 3857670 3788010 3070370 2181594 1653642 1518902 1541954
33095 1541954 1534900 1300766 669599 -171844 -671192 -504256 -9119 235708 159426 233720
33085 233720 772070 1497315 1925615 1950963 1871815 1994033 2377206 2826261 2963457 2503831
33075 2503831 1700063 1294480 1689690 2384635 2681437 2722424 3171387 3988230 4391439 4183583
33065 4183583 4164607 4774730 5220947 4690964 3724983 3464025 4015399 4536895 4630594 4623499
33055 4623499 4585244 4110254 3186829 2379941 1959901 1629728 1255820 1031337 732804 -226043
33045 -226043 -1591324 -2040166 -803367 1165873 2297078 2093299 1074835 -332021 -1932564
33036 -1932564 -3138882 -3201254 -2122861 -670282 570195 1560603 2218102 2139586 1231062
33027 1231062 172390 -166573 321130 862143 681868 -114825 -701111 -612309 -391476
33018 -391476 -796173 -1577363 -1714412 -926293 -160671 -214591 -634249 -607777 -274154 -278790
33008 -278790 -516243 -352653 128782 190637 -241708 -386894 58424 401647 172136 -63133
32998 -63133 305040 868968 858663 313654 -142415 -318639 -492216 -635712 -341586 482551
32988 482551 1401121 1980875 2133508 1958805 1635916 1426707 1405603 1245347 658300 -50938
32978 -50938 -350734 -332948 -618074 -1346820 -1868652 -1628361 -785281 319739 1682479 3148395
32968 3148395 3998922 3764158 3105156 3050651 3477480 3249639 2002503 881349 1043515
32959 1043515 2146465 2976026 3060749 2885872 2807930 2644063 2361410 2371405 2859789 3394081
32949 3394081 3514297 3285084 2966943 2532494 1857140 1092597 496975 82461 -296596
32940 -296596 -675802 -996937 -1181061 -1046927 -484110 112709 27022 -827052 -1573292 -1447247
32930 -1447247 -802420 -499584 -657260 -674839 -233472 451034 1184014 1824754 1908645 1131166
32920 1131166 190442 151407 809108 757054 -503278 -1602614 -1191528 115827 682479
32911 682479 134668 -397922 -57132 815731 1571002 2124788 2631556 2933420 2739347 2053689
32901 2053689 1201368 593362 488539 773906 1024971 1013626 1038016 1465191 2119533 2513604
32891 2513604 2539043 2467150 2361896 2016403 1465542 1032259 793420 498235 115953 -46780
32881 -46780 66260 66859 -239307 -483985 -315113 54233 227562 228876 345324 611620 842086
32870 842086 1032974 1378577 1933823 2502153 2811624 2655565 1990433 1066222 322567 -17323
32860 -17323 -118145 -173565 -94727 251025 726308 1113466 1416338 1681532 1728338 1439832
32850 1439832 1176320 1432560 2085983 2432784 2080819 1424181 1063451 1093391 1204192 1216496
32840 1216496 1197153 1176643 1071383 911804 944735 1415720 2275376 3088779 3259625 2496467
32830 2496467 1136229 -132930 -949740 -1478271 -1805188 -1495822 -199657 1472449 2278967
32821 2278967 1675342 321476 -882371 -1679229 -2065253 -1723642 -586820 486946 554531
32812 554531 -11854 72048 1119053 2018112 2017405 1918118 2757826 4134543 4841472 4681914
32802 4681914 4600988 5221081 6243619 7266260 8227125 8912455 8947173 8589428 8754370
32793 8754370 9840420 11159896 11932189 12254301 12639087 13133986 13447227 13550003 13585368
32784 13585368 13418727 12763706 11604958 10158784 8636343 7355978 6769518 6945323 7282700
32775 7282700 7201907 6899584 6916110 7129297 6790760 5611261 4305425 3870104 4585977
32766 4585977 5802908 6489644 6016922 4691407 3551009 3372282 3828639 3849422 2856772
32757 2856772 1450584 807735 1527446 3074170 4243392 4204494 3211413 2281081 2131689
32748 2131689 2545926 2826473 2648325 2268708 2076694 2194262 2449643 2552669 2351926
32739 2351926 2036242 1982393 2331262 2877534 3399713 3787752 3778193 3048468 1859398 1138576
32729 1138576 1482253 2432131 3195146 3676894 4184763 4453179 3809513 2285787 804421
32720 804421 91562 -22300 -66060 -220015 -347707 -315126 -86635 184377 86768 -670435
32710 -670435 -1758326 -2487510 -2614851 -2490520 -2367245 -2038837 -1290821 -269702 757653
32701 757653 1632039 2175449 2248864 2066326 2028060 2089201 1733730 783468 -181314 -474637
32691 -474637 -66078 533637 892023 1002605 1232641 1959908 2995425 3455946 2654722
32682 2654722 1067420 -127539 -446063 -398088 -394016 -184288 384307 891470 1041267 1126087
32672 1126087 1368480 1514447 1546031 2015398 3050960 3795462 3601468 3086797 3117316 3412138
32662 3412138 3255962 3052496 3804010 5223772 5799372 4990946 4125094 4566548 5977088
32653 5977088 7079233 7437751 7692018 8396548 9377639 10183585 10640411 10861106 11018992
32644 11018992 11277806 11833950 12857147 14305042 15879733 17353385 18924732 21006420
32636 21006420 23655458 26598993 29935960 34325556 40177205 47079283 54375151 61870746
32628 61870746 69610335 77518516 85824511 95268841 106085534 117124195 126693717 133824842
32620 133824842 137858417 137421234 131303198 120411241 107578941 95144122 83706096
32613 83706096 73337000 64598247 57728924 51994845 46729671 42253427 38999721 36447733
32605 36447733 33756840 30945004 28664800 27199306 26343567 25932511 25911690 26222060 27044477
32596 27044477 28638125 30455683 31122091 30041558 28383482 27540632 27159977 25843917
32588 25843917 23449631 21346068 20333187 19594462 18138511 16229920 14721916 13673867
32580 13673867 12370803 10400958 8167934 6464463 5829798 6140410 6608952 6404699 5500520
32571 5500520 4716738 4735149 5278624 5506931 5075190 4514931 4554282 5257002 5974271 6142030
32561 6142030 5969932 6131630 6804577 7362430 7195740 6502353 5925025 5658864 5353258
32552 5353258 4740264 3868479 2782992 1528528 548433 510726 1437380 2397482 2436288
32543 2436288 1621740 892539 1012408 1924197 3019873 3746575 3912580 3641261 3226844
32534 3226844 3014893 3236962 3791944 4226189 4123334 3561857 3016925 2779877 2721776 2688376
32524 2688376 2747181 2820397 2493299 1627249 855504 904552 1574287 1986240 1801973 1568480
32514 1568480 1771445 2196026 2500034 2856967 3591539 4530242 5149139 5170409 4676437 3822449
32504 3822449 2788206 1892370 1400357 1225727 1077057 911006 1037479 1730494 2842752
32495 2842752 3827019 4118379 3581917 2648179 1921683 1610216 1455575 1233204 1062875
32486 1062875 1080087 1069162 728748 161069 -244993 -372752 -452286 -514772 -167432 819857
32476 819857 1961383 2466256 2144856 1567116 1282191 1223892 1061235 846389 998961 1745307
32466 1745307 2815333 3643242 3729433 2995984 2031282 1743763 2370441 3033387 2823632
32457 2823632 2157802 2269158 3287657 3780398 2662779 722792 -486827 -601598 -368256
32448 -368256 -111092 556573 1569282 2110338 1799142 1316121 1401480 1869169 2076059 1871811
32438 1871811 1590825 1434099 1320961 1171466 968191 633474 112127 -460542 -809900
32429 -809900 -704817 -94298 800894 1573771 2017620 2376339 2949865 3528110 3580215 2989133
32419 2989133 2197235 1589974 1163914 898971 1006074 1581433 2342658 2924661 3209251
32410 3209251 3235805 3026125 2622037 2135103 1740525 1737009 2398644 3465140 4060443 3611939
32400 3611939 2607997 1859182 1326755 538040 -86611 465706 2019319 2975282 2397558
32391 2397558 1299063 1153462 1994631 2782786 2939027 2655952 2208250 1777940 1599449
32382 1599449 1604135 1289854 529016 54295 528192 1609134 2579090 3360590 4160269 4629585
32372 4629585 4297163 3512850 3096470 3259479 3605499 3918128 4193183 4181614 3716847 3293583
32362 3293583 3545235 4295177 4818480 4894840 4999567 5633204 6926379 8566714 9732619
32353 9732619 9706180 9009310 9101996 10392365 11654271 12198384 13202215 15674799 18698989
32344 18698989 21466331 25480265 32398363 41078330 49583972 58928814 71591243 87610813
32336 87610813 106413743 131200788 164610830 198175344 213277155 198604918 163559789
32329 163559789 129207056 107914450 96424167 86391351 74701818 62648771 51234067
32322 51234067 40880461 32826364 27859568 24977633 22817528 21078439 19609507 17786801
32314 17786801 15832462 15082178 15801965 16261036 15117282 13276534 12190822 11707903 10959715
32305 10959715 10162680 10043823 10368420 10424079 10244338 10075789 9329359 7430521 5240291
32296 5240291 4292161 4814114 5614488 5787968 5540380 5374824 5340966 5208073 4833037 4306220
32286 4306220 3980104 4127072 4410633 4202559 3630123 3552745 4125092 4310543 3463048 2449794
32276 2449794 2323973 2755950 2848487 2728360 3061234 3574512 3452702 2861681 2705379 3042092
32266 3042092 3096515 2803355 2973722 3766730 4267663 3898811 3136906 2491320 1823942 1092184
32256 1092184 784688 1105819 1523862 1594833 1548692 1697200 1947843 2201231 2492814 2474324
32246 2474324 1602279 186474 -644454 -446930 909 150833 585457 1684105 2445051
32237 2445051 1797395 367289 -320603 28949 386304 171497 -149354 -239376 -428097
32228 -428097 -801451 -829115 -358420 -83594 -425478 -659887 84726 1395804 1955131 1261568
32218 1261568 287538 246091 1184921 2115401 2243202 1646933 817120 48896 -456473 -348169
32208 -348169 432763 1153796 942886 24678 -413057 129106 681387 211301 -851217
32199 -851217 -1290174 -845419 -311426 -87475 316440 1169415 1858157 1760549 1104370 488604
32189 488604 59896 -364766 -753580 -920493 -875364 -718169 -403830 37147 275373 75473
32179 75473 -244427 -139658 444469 1026167 1242578 1266569 1528109 2193868 2958176 3313297
32169 3313297 3120745 2907470 3322592 4214599 4641498 4056352 3066345 2571034 2515719 2143057
32159 2143057 1273368 558125 443742 698960 1212907 2424477 4365261 5893224 5723625
32150 5723625 4047164 2425863 2079563 2807635 3588812 3670533 2959420 1888325 1161154
32141 1161154 1245936 1877353 2345123 2377840 2315887 2281261 1826502 859363 301963 1031464
32131 1031464 2466052 3102951 2465219 1664919 1827483 2762542 3627759 4212816 4878105
32122 4878105 5605537 5842978 5242504 4048539 2747310 1688581 1020602 685531 512887
32113 512887 527417 968606 1710459 1978115 1195509 -63141 -640727 -299018 81636 -39929
32103 -39929 -14943 899756 2225775 2762105 2108088 1007172 271031 7252 13063 368772
32093 368772 1285798 2584110 3613351 3734355 2874877 1649053 848350 701360 729624
32084 729624 465457 130823 309713 1050695 1699092 1700977 1230007 847627 812420 930480
32074 930480 863977 350733 -671511 -1820664 -2265309 -1408527 288236 1493059 1283635
32065 1283635 96894 -827820 -834140 -373997 -165607 -214773 72197 1012425 2238387 3181119
32055 3181119 3687918 4029996 4458485 4924768 5203541 5167507 4909089 4637409 4489705 4452346
32045 4452346 4448589 4445563 4432532 4334240 4020036 3433206 2734798 2324612 2587567 3416465
32035 3416465 4044903 3708251 2599657 1801844 1992598 2573571 2518200 1779927 1232100
32026 1232100 1330926 1559161 1319784 730829 268072 158433 428545 1062594 1766505 2007600
32016 2007600 1634922 1068119 598380 25960 -651027 -835659 -229333 422791 245405
32007 245405 -509078 -912432 -728827 -444039 -179723 406401 1176127 1473889 1170328 842491
31997 842491 757178 590930 362997 626206 1327442 1487290 631660 -338908 -437263 40858
31987 40858 280480 387625 1029518 2060058 2585802 2291376 1792861 1668549 1892328 2241761
31977 2241761 2572034 2632944 2232749 1641362 1301466 1180004 974455 830722 1078618 1268781
31967 1268781 437485 -1333889 -2484190 -1707565 425409 2179518 2586665 2065018 1411342
31958 1411342 898454 419864 -10743 -165086 179693 1060310 2316805 3759656 5353592
31949 5353592 7101233 8672226 9360119 8658456 6842226 4806894 3347434 2695876 2639364
31940 2639364 2807288 2790600 2265449 1275250 337350 21049 349075 785922 867368 593596
31930 593596 83734 -761584 -1842713 -2432074 -1860932 -599152 107586 -136959 -389338
31921 -389338 121750 800793 690716 10674 -252153 88875 284790 -7932 -234326 63289
31911 63289 584782 878917 974915 1150368 1565898 2276989 3126851 3597116 3357131 2968697
31901 2968697 3304337 4177593 4405483 3459146 2139806 1246982 568108 -188375 -437789
31892 -437789 326919 1307705 1239064 123225 -877310 -1099113 -960943 -913795 -747137 -181637
31882 -181637 515552 795019 329993 -799279 -2038705 -2541658 -1926063 -844027 -282744
31873 -282744 -311655 -128487 576113 1006185 365601 -945611 -1716872 -1246750 116199
31864 116199 1575051 2610630 3089978 2995116 2318126 1244392 273864 -34515 519553
31855 519553 1699999 3112998 4361793 5006152 4794266 4096664 3753646 4263906 5394706
31846 5394706 6694865 7912032 8674601 8392299 7011278 5387245 4286008 3417436 2140442
31837 2140442 709736 -77626 -243594 -612419 -1390382 -1755688 -1171092 -280811 -29144
31828 -29144 -452610 -811670 -560211 182115 887740 1113391 880622 604086 491485 234990
31818 234990 -325392 -548164 318126 1950029 3241230 3720510 3815785 3727161 3147967 2386116
31808 2386116 2563714 3977456 5187855 4657305 2697391 918366 198066 95640 20051
31799 20051 64138 576365 1479342 2198670 2111834 1176701 181220 9193 552976 907779
31789 907779 813154 1061482 1969082 2358177 1028569 -1353099 -2937094 -2954184 -2213741
31780 -2213741 -1502899 -675559 457960 1366790 1442938 813522 86613 -357102 -579088
31771 -579088 -880616 -1496295 -2242838 -2539366 -2105863 -1463009 -1258867 -1299692 -902402 -91646
31761 -91646 347880 75745 -356437 -475518 -519570 -736282 -775327 -323149 196715 163770
31751 163770 -336414 -703958 -708889 -689497 -970704 -1487763 -1959234 -2147717 -1961972 -1479334
31741 -1479334 -843611 -107702 650785 1058483 684818 -232367 -691464 12664 1321311
31732 1321311 1930350 1207210 -280604 -1582552 -2233596 -2220248 -1633027 -797622 -442018
31723 -442018 -1090178 -2217059 -2575909 -1684444 -542102 -389638 -1095723 -1450741 -932254
31714 -932254 -394560 -870533 -2408890 -4336509 -5927187 -6443853 -5347090 -3150362 -1442479
31705 -1442479 -1271570 -1946268 -2143967 -1660508 -1169184 -787083 -96912 637173 580312 -243247
31695 -243247 -805012 -627427 -440379 -929419 -1772058 -2327289 -2430146 -2097685 -1289315 -410015
31685 -410015 -234993 -831511 -1314111 -1156077 -946980 -1303386 -1857487 -2001142 -1864321 -1811124
31675 -1811124 -1691867 -1408770 -1516199 -2305649 -2886804 -2230909 -720357 356452 518795
31666 518795 287429 -29874 -620613 -1345067 -1725604 -1801770 -2012793 -2178058 -1625919 -512063
31656 -512063 41520 -486789 -1225045 -1179248 -515316 8650 215772 401098 509241 214050
31646 214050 -325021 -479300 -35652 408487 172853 -629817 -1223451 -1129423 -717866 -631878
31636 -631878 -881977 -903127 -474894 -74766 -117571 -323115 -195631 265552 754202 1196112
31626 1196112 1605153 1694126 1175444 265900 -578927 -1207378 -1572890 -1309825 -160649
31617 -160649 1358266 2376645 2656090 2577906 2334019 1820996 1210197 869766 745028
31608 745028 525396 381196 754412 1399787 1472544 733234 -89359 -333746 -122716 109810
31598 109810 122890 -228633 -859647 -1085839 -198909 1379919 2362282 2286016 2070861 2515449
31588 2515449 3165564 3243025 2853054 2520428 2158334 1305909 44061 -967587 -1173298
31579 -1173298 -492201 672769 1546821 1532657 869793 293032 -7690 -365515 -539091
31570 -539091 287102 2045920 3443713 3640834 3196577 2711854 1788716 282195 -684323
31561 -684323 -269119 570269 574921 267340 857995 1861618 1801819 870619 707014 1485508
31551 1485508 1432729 -192957 -1649091 -1241863 282255 1088967 815324 492371 696496
31542 696496 1032168 1112067 1079610 1240764 1718319 2322299 2523030 1950481 1099431 930576
31532 930576 1536742 1966188 1704702 1399975 1525644 1338053 184579 -905131 -277157
31523 -277157 1914356 3600704 3346332 2017364 1428903 2002879 2476295 1777502 523861
31514 523861 245134 1363329 2647011 2987431 3010118 4042320 5891026 6939443 6570551
31505 6570551 6128345 6886571 8344602 9525010 10832274 13141315 15636625 16211691 14097596
31496 14097596 10815372 8251344 6832862 5951661 5217345 4661021 4266255 3892353 3457449
31487 3457449 2934187 2371600 1998307 1994751 2137647 2062053 1901499 2197408 3078997 4011951
31477 4011951 4502845 4576235 4386313 3896191 3263050 3057143 3619178 4475896 4848045 4578822
31467 4578822 4130080 3737358 3048597 1771247 358442 -280729 271510 1522630 2654883
31458 2654883 3271998 3380970 2975333 2178763 1665182 2144850 3209478 3522445 2713321
31449 2713321 2287293 3721449 6237886 7696510 7470101 7047628 7603200 8379914 8153767
31440 8153767 7121289 6295880 5775558 4750322 2930300 1007501 -219540 -460351 200338
31431 200338 1324795 2052716 1713680 632208 -161864 -53405 747104 1766961 2626338
31422 2626338 2894383 2355339 1591435 1590649 2440507 3006481 2317652 774963 -457075 -797952
31412 -797952 -473574 168102 835860 979351 86354 -1543550 -2866406 -3151259 -2598266
31403 -2598266 -1779838 -919739 11967 894941 1570834 2155930 2848895 3521586 3844850
31394 3844850 3758177 3464311 2996967 2234178 1445479 1343668 2226542 3362209 3696805
31385 3696805 3086054 2371837 2203542 2272939 1971523 1395809 1212891 1680535 2350071 2852786
31375 2852786 3476510 4583929 5766051 6118572 5370414 4277162 3730238 3858959 4267725
31366 4267725 4775613 5439587 6042732 6164012 5844019 5672784 5987431 6382750 6302206 5767326
31356 5767326 5168026 4624508 4002831 3379271 2998747 2826043 2597373 2324089 2282563 2420263
31346 2420263 2238378 1474906 539133 32731 136134 680532 1504679 2448912 3255813
31337 3255813 3802020 4257822 4759618 5137644 5243639 5269950 5338946 5031113 3901991 2398903
31327 2398903 1632465 2087347 3095997 3832217 4310566 4981553 5728272 5873167 5130430
31318 5130430 4056708 3412473 3366029 3486287 3339538 2911549 2486492 2258610 2175594 2182148
31308 2182148 2452787 3123547 3808065 3780739 2901325 2033311 2092465 2846735 3216581 2764423
31298 2764423 2228329 2306828 2556633 2108450 1083799 491442 755768 1164803 1065914 893419
31288 893419 1400480 2314610 2569804 1833722 1023026 1001571 1382963 1180862 284814 -421270
31278 -421270 -360615 46090 236549 388455 900678 1472588 1496163 1202080 1515126 2582109
31268 2582109 3295464 2770586 1606065 995653 1120162 1259768 1142258 1173420 1407685
31259 1407685 1331393 862444 608529 787273 809155 426494 374427 1127671 1831888 1458579
31249 1458579 452615 124475 726404 1281057 1231766 1114991 1428823 1862145 1980735
31240 1980735 1833500 1544398 1098927 883291 1594546 3112352 4230236 4134977 3505224
31231 3505224 3461048 3995251 4224946 3767600 3029977 2374317 1799857 1374563 1296165 1505947
31221 1505947 1750158 1980132 2266337 2485503 2574547 2862850 3554241 4084371 3703568 2604407
31211 2604407 1735854 1517160 1500412 1361912 1395654 1798933 2260412 2618145 3219001 4169624
31201 4169624 4843869 4667566 3914840 3204745 2637156 1999347 1487766 1582730 2334524 3294731
31191 3294731 4123017 4903499 5926309 7407188 9239057 10751856 11002978 9731347 7858534
31182 7858534 6648502 6489309 6802126 6887277 6424104 5396299 4115209 3216997 3064246
31173 3064246 3185685 2861338 2217036 2082413 2710312 3396211 3645261 3970233 4976351
31164 4976351 6199371 6583236 5895671 4994889 4682898 4849768 4920809 4745592 4729459 5181049
31154 5181049 5745513 5621792 4437375 2852389 2031094 2396004 3197303 3564395 3648028
31145 3648028 4200488 5182912 5532340 4596578 3225974 2879258 3884357 5142920 5517048
31136 5517048 4964671 4152318 3454186 2768339 2103922 1856395 2375805 3482372 4529387
31127 4529387 4884763 4376613 3391351 2522326 2008284 1571019 945181 419453 508400 1125589
31117 1125589 1573953 1559933 1726729 2714135 4018608 4442358 3633854 2531459 2092799
31108 2092799 2178208 2100255 1818001 1951242 2742522 3625904 3963144 3747226 3343257 2915154
31098 2915154 2479180 2283683 2646959 3402710 3919510 3829877 3437816 3215463 3199525 3191880
31088 3191880 3297806 3791072 4514761 4922035 4813802 4580799 4529682 4428956 4032167 3609905
31078 3609905 3489834 3408590 2925124 2303081 2319879 3186642 4266657 4954990 5226242 5144449
31068 5144449 4512673 3403217 2456723 2112799 1962530 1441099 817522 819940 1475914 2057674
31058 2057674 2166674 2155105 2301941 2215084 1414652 107712 -945984 -1080887 -62656
31049 -62656 1841634 3828242 4893587 4582502 3314432 1830687 565024 -302260 -610125
31040 -610125 -454748 -354328 -657127 -926620 -418734 877538 2149934 2712105 2580846
31031 2580846 2091605 1491583 1094881 1307855 2123954 2933702 3212077 3149751 3236031 3422457
31021 3422457 3144944 2145129 900319 160117 277355 1037976 1960504 2685005 3149990
31012 3149990 3432911 3481250 3178926 2694891 2454897 2586350 2703269 2525178 2379513 2662811
31002 2662811 3102594 3141856 2847458 2690039 2485177 1493652 -147818 -1044224 -258770
30993 -258770 1273844 1894351 1351674 866201 1251809 1957471 2125191 1758239 1459447
30984 1459447 1594394 2113651 2777399 3191042 2989774 2378932 2192479 2984839 4233859
30975 4233859 4833814 4296988 3155280 2253594 1972679 2146366 2439509 2667536 2841615
30966 2841615 2971688 2864903 2245760 1124793 -120609 -1133837 -1855740 -2270620 -2131696
30957 -2131696 -1273423 -107925 549183 266705 -543405 -1036556 -750564 -3193 497833
30948 497833 450597 274327 471183 827019 704021 164922 138476 1035033 1797366 1130532
30938 1130532 -594230 -1583269 -838059 710317 1563278 1390399 914635 677187 608293
30929 608293 530777 426742 255596 -3360 -127445 152653 745983 1320675 1785910 2298721
30919 2298721 2811358 3013374 2811895 2526640 2473159 2625015 2799515 2886702 2749443 2215509
30909 2215509 1422503 907735 1014812 1369751 1314270 769403 240773 -45654 -485233 -1309931
30899 -1309931 -1936066 -1634187 -627939 113223 196760 250058 760389 1109358 385734 -1178145
30889 -1178145 -2306861 -2179268 -1198548 -200004 483987 941995 1241549 1463963 1771066
30880 1771066 2014010 1596890 200573 -1557875 -2639245 -2636883 -1936768 -1010797 -82535
30871 -82535 551174 493603 -186702 -756865 -530614 372628 1205451 1424640 1140561 762143
30861 762143 396884 -221561 -1183980 -1980852 -1917273 -970604 87051 574080 600298 662316
30851 662316 880688 1009056 928771 686859 255984 -241715 -265477 554830 1618581 1837697
30841 1837697 1033561 204344 196041 732040 1056007 921719 508976 -112490 -864616 -1332964
30831 -1332964 -1105053 -302182 564575 1071329 981413 266945 -582423 -696653 166785 1054951
30821 1054951 864482 -271821 -1274163 -1585898 -1589361 -1598979 -1289622 -384558 750190 1544775
30811 1544775 1775551 1413353 461885 -665108 -1092351 -361387 886566 1592422 1486151
30802 1486151 1166081 1111437 1168271 1096322 1110695 1541181 2208382 2531777 2266031 1860362
30792 1860362 1972521 2785223 3939826 5011711 5826806 6356277 6584912 6585325 6515137 6424599
30782 6424599 6244490 6042744 6034880 6200882 6196443 5868923 5537000 5443606 5277489 4695928
30772 4695928 4023907 3837876 4043934 4061663 3866445 4078428 4885510 5651920 5923312 6121345
30762 6121345 6743930 7429630 7421207 6612148 5572215 4790992 4434572 4633026 5386366 6206734
30752 6206734 6405020 5879639 5285743 5314576 6035328 6982982 7664403 7921730 7961747 8075221
30742 8075221 8276058 8311289 8106327 7997869 8310323 8843177 9024222 8509024 7468849
30733 7468849 6401797 5814384 5924873 6483196 7012173 7333501 7597868 7685677 7069330
30724 7069330 5670516 4408458 4269421 5077300 5834904 6105857 6315011 6734163 7020098
30715 7020098 6960856 6905928 7074364 7062433 6487199 5607696 4844251 4155597 3432561 3088869
30705 3088869 3571161 4482204 4868689 4372088 3550524 3045145 2953818 3107651 3442014 3885457
30695 3885457 4299758 4770124 5592507 6699376 7438158 7298556 6635891 6247331 6321156
30686 6321156 6226897 5390079 4029549 2912133 2608790 3047633 3547586 3264778 1968384
30677 1968384 502379 65619 784586 1445352 1051029 177207 92099 850829 1223273
30668 1223273 555985 -305303 -354243 196706 533408 546476 685758 969385 1065063 1133910
30658 1133910 1645261 2366827 2481888 1931907 1791860 2876363 4632901 5956791 6612990
30649 6612990 7210437 8020683 8504884 8123347 7174762 6534825 6641209 6951131 6555601
30640 6555601 5292692 4001780 3536142 3787027 3971019 3655161 3097279 2732830 2796677
30631 2796677 3357358 4203174 4725149 4470666 3845529 3705772 4224947 4815722 5230436
30622 5230436 5893396 6832413 7157233 6230092 4718560 3784449 3682220 3827451 3830457 3701611
30612 3701611 3330629 2606617 2007910 2331235 3690608 5262436 6103800 5881437 4871428
30603 4871428 3676589 2919729 2794602 2875646 2644201 2117046 1669126 1419899 1199320
30594 1199320 990960 981114 1222262 1581112 1923018 2093073 1967760 1833461 2314735 3450420
30584 3450420 4285751 4048733 3324007 3228699 3778940 4121029 4194710 4916678 6546345 8066887
30574 8066887 8607846 8435467 8026601 7191920 5828509 4635987 4189502 3963717 3189948
30565 3189948 2171071 1803817 2153764 2468546 2435190 2496244 2901281 3273251 3299187 3207795
30555 3207795 3313804 3543077 3635199 3502318 3211232 2810560 2287512 1626726 959799 669666
30545 669666 1069749 1849711 2242343 2029122 1927355 2523668 3285171 3299820 2642263 2149025
30535 2149025 1989394 1435847 225036 -749105 -556590 556904 1558897 1843481 1663005
30526 1663005 1643249 2194606 3175499 3907392 3760602 2891646 2109134 1869703 1797857 1412854
30516 1412854 881252 684651 906864 1260906 1518337 1493183 917706 -142321 -998976
30507 -998976 -1074960 -771878 -931787 -1478831 -1392525 -250500 960346 1042929 23820 -1184507
30497 -1184507 -2089879 -2853343 -3468440 -3555540 -3065853 -2492649 -2153683 -1839247 -1429311 -1251366
30487 -1251366 -1393674 -1222198 -242838 894141 1018140 7045 -962453 -844980 178386
30478 178386 1224474 1791426 1989428 2059661 2035970 1750977 1009633 -92633 -997075 -1134876
30468 -1134876 -634223 -220152 -298856 -553094 -599570 -533407 -504033 -263281 355582 869437
30458 869437 636436 -255214 -1084540 -1372584 -1239483 -1016184 -928406 -1074704 -1315245 -1254296
30448 -1254296 -692609 -2774 280619 106133 -183680 -354692 -288384 231438 1190524 2016803
30438 2016803 2182090 1959777 1967580 2195717 2281395 2526601 3548855 4843436 4913852 3330043
30428 3330043 1599561 1233917 1774214 1643317 376592 -982923 -1410564 -879121 113201
30419 113201 1147925 1860397 1921012 1324584 454731 -207002 -305149 260212 1139308 1677285
30409 1677285 1611290 1424957 1622906 1903750 1597324 776099 288497 620584 1279525 1482849
30399 1482849 1026260 272377 -359892 -663753 -651945 -500312 -360753 -191278 38965 21358
30389 21358 -632841 -1675946 -2156965 -1417093 23921 940231 762451 159062 112880 674457
30379 674457 1006101 642861 196255 423254 967891 733177 -511568 -1665566 -1748305
30370 -1748305 -1145614 -876356 -1150241 -1369732 -1253981 -1163252 -1347550 -1582538 -1684107 -1824758
30360 -1824758 -2125677 -2326525 -2080781 -1393664 -714941 -703915 -1694697 -3116484 -3725533
30351 -3725533 -2870466 -1309487 -278222 -22870 105255 408312 607217 724023 1138190
30342 1138190 1634779 1481758 788999 695215 1632458 2438450 2002358 919530 548931
30333 548931 1122237 1837059 2263890 2485844 2217442 1090335 -233440 -477205 509005
30324 509005 1479064 1542493 1165603 999161 710820 -271090 -1548116 -2144722 -1788741 -1096126
30314 -1096126 -642193 -437831 -278672 -130083 -97639 -299333 -792085 -1439994 -1888042 -1826207
30304 -1826207 -1261168 -471652 199513 487387 352815 69544 -64269 -184266 -731993
30295 -731993 -1715933 -2439202 -2257856 -1371220 -543491 -222846 -264875 -384512 -494155 -596464
30285 -596464 -665459 -725129 -849106 -992005 -925872 -421524 492336 1426429 1855096 1600358
30275 1600358 1066560 786364 771712 623489 253834 15408 488 -193784 -670924 -802992
30265 -802992 -143351 728578 992928 861612 1229984 2247333 3142688 3476041 3642974
30256 3642974 3955420 4114201 3942884 3825603 3940958 3799914 3121662 2499831 2502758 2682240
30246 2682240 2300973 1637475 1646492 2481026 3226808 3150032 2481803 1845118 1520626 1451328
30236 1451328 1492721 1507102 1547223 1910301 2607054 2950833 2317840 1246577 991570 1851482
30226 1851482 2733281 2656492 1908447 1280540 930752 664999 736744 1525004 2715513 3581458
30216 3581458 3963935 4299095 4703603 4673323 3821409 2460453 1311740 933161 1444977
30207 1444977 2472662 3312090 3472245 3140288 2879402 2856017 2642111 1847214 709136
30198 709136 -67192 23641 795536 1496586 1497064 883027 217426 -260814 -832055 -1592672
30188 -1592672 -2072761 -1902116 -1383389 -913828 -285912 775937 1744420 1790670 1011634
30179 1011634 320222 141534 82452 -30960 249568 1029355 1572056 1292560 590337 165738
30169 165738 83783 69507 195808 631277 1114086 1340894 1568297 2153287 2724273 2537990
30159 2537990 1619030 885399 1039016 1848529 2668604 3217467 3606568 3906371 3978257 3677607
30149 3677607 3059355 2329355 1635669 1043649 793329 1318246 2643224 3942543 4274820
30140 4274820 3751102 3299740 3168383 2521263 920127 -694239 -1226720 -885910 -491281
30131 -491281 60629 1440560 3265111 4103501 3269070 1611764 286561 -407632 -689558
30122 -689558 -620168 -200092 411312 1094285 1760345 2062914 1700703 1076623 948459 1315242
30112 1315242 1457472 1232849 1333321 1897176 1992724 1205941 715422 1730981 3578402
30103 3578402 4506666 3973177 2976192 2367939 2022141 1670008 1429727 1254802 781393
30094 781393 60325 -314917 -140880 21307 -235083 -492394 -169756 668580 1559163 2195777
30084 2195777 2345757 1764548 750433 307838 1037451 2135902 2255863 1251572 276548
30075 276548 68317 -20157 -863742 -2121499 -2653622 -2067063 -1098080 -465398 -58319 441487
30065 441487 708917 148045 -1078690 -2022192 -2105161 -1858014 -2146038 -2893268 -3049876 -1936126
30055 -1936126 -257888 588893 174516 -403799 143270 1660676 2672942 2114158 471084
30046 471084 -964741 -1544422 -1618955 -1803614 -2374273 -3218155 -3884556 -3750869 -2623488
30037 -2623488 -1188845 -431835 -577373 -1011189 -1206417 -1200801 -1137862 -969683 -798465 -919924
30027 -919924 -1275999 -1426572 -1322208 -1472334 -1999349 -2237994 -1821269 -1475167 -1952314 -2694029
30017 -2694029 -2485225 -1184436 111398 566183 445919 406013 664670 1043514 1272930
30008 1272930 1126605 677182 393770 522784 519235 -252867 -1333006 -1475813 -287968
29999 -287968 1177131 1694780 1093822 -17809 -1053813 -1608200 -1439603 -794986 -335706
29990 -335706 -323989 -222666 559114 1864467 3043256 3669334 3701398 3243979 2448206 1434547
29980 1434547 192964 -1136237 -1917200 -1565179 -565260 -206604 -969131 -1909746 -2107070
29971 -2107070 -1924495 -2136071 -2507773 -2219430 -1302490 -671027 -840464 -1424300 -1838317
29962 -1838317 -1800011 -1225241 -354449 68923 -523491 -1645470 -2228587 -1991802 -1649462
29953 -1649462 -1720084 -1902629 -1821490 -1640166 -1588764 -1482136 -1089445 -520518 80007 798988
29943 798988 1610187 2151314 2129072 1602508 674010 -640913 -1975804 -2567917 -2082928
29934 -2082928 -1092434 -292365 385722 1370211 2455815 2846449 2151799 853076 -267210
29925 -267210 -815804 -910924 -937101 -1204772 -1616831 -1710396 -1258653 -714447 -723180 -1279683
29915 -1279683 -1784138 -1920178 -1960405 -2040658 -1697645 -603729 590750 801645 -117644
29906 -117644 -1128119 -1290858 -758888 -132309 657668 2098189 3874845 4734093 3894909
29897 3894909 2055827 547179 -166906 -649294 -1387362 -2123101 -2333824 -1923433 -1232078
29888 -1232078 -602521 -140949 155196 160644 -359464 -1352850 -2193535 -2170975 -1383953 -724255
29878 -724255 -709690 -790864 -239461 735280 1370241 1464083 1335700 946951 33135 -930619
29868 -930619 -948886 37269 856704 710122 221996 314817 773220 668978 -303573 -1663732
29858 -1663732 -2936701 -3867567 -4100901 -3404511 -2173552 -1137408 -578400 -275004 -102484
29849 -102484 -189069 -511633 -781764 -753720 -360618 315722 874379 635000 -622971 -2055065
29839 -2055065 -2433882 -1494991 -191594 418376 145536 -489755 -961118 -1126024 -1168753
29830 -1168753 -1282165 -1346164 -1048137 -437890 -47072 -143160 -203842 382342 1375877 2044216
29820 2044216 2227954 2307630 2220363 1430875 97547 -597224 184859 1772723 2704477
29811 2704477 2257548 841161 -752812 -1899207 -2105536 -1111028 672486 2102733 2119933
29802 2119933 809963 -501508 -546809 447330 1001233 232636 -1029556 -1409819 -778758
29793 -778758 -179035 -289272 -847982 -1488742 -2148379 -2505517 -2028399 -997578 -604780
29784 -604780 -1460974 -2702810 -3159772 -2747057 -2052400 -1216295 -117662 783019 817431
29775 817431 225950 12581 605782 1380285 1626803 1326068 742530 -122148 -1235575
29766 -1235575 -2072866 -1972006 -940849 217512 724751 615887 495610 578975 409822
29757 409822 -218142 -577568 46064 1010348 954707 -102292 -464331 876781 2637471
29748 2637471 2940592 1787006 648016 161643 -353372 -1242376 -1818124 -1610661 -1120478
29739 -1120478 -826961 -405675 471413 1326146 1525343 1186704 822699 528854 122650
29730 122650 -278735 -451036 -606275 -1125756 -1814216 -1967929 -1292995 -390168 -158819 -885124
29720 -885124 -2019312 -2767017 -2819439 -2493164 -2213057 -2025789 -1736494 -1352164 -1125359 -1200039
29710 -1200039 -1432152 -1531339 -1228392 -442050 515209 1109113 1245406 1485343 2195490 2797280
29700 2797280 2457869 1294262 181665 -478173 -979172 -1378319 -1307568 -854637 -660792
29691 -660792 -849124 -791387 -295434 -12978 -154840 113718 1195980 1980798 1313454 -193351
29681 -193351 -1008007 -837446 -715003 -1213137 -1775848 -1799336 -1334752 -646082 70761 499492
29671 499492 494940 482645 818303 1003767 487540 -65556 423843 1507908 1591298 448840
29661 448840 -287100 231264 579868 -669546 -2553418 -3070410 -2035712 -991465 -751723
29652 -751723 -633656 -59994 535392 682962 616822 651079 691448 708839 919929 1171634
29642 1171634 923973 258460 149475 1144115 2364793 2512419 1472221 238272 -486842
29633 -486842 -857529 -1098953 -919634 -5977 1361464 2537167 3121782 3090170 2527616
29624 2527616 1571359 552311 -111715 -250269 -26584 316945 627586 751285 524569
29615 524569 -11912 -577398 -960331 -1163317 -1104797 -510152 548026 1297653 1039223 199114
29605 199114 -24895 807803 1817772 2009233 1397612 515408 -550895 -1865177 -2768710
29596 -2768710 -2267185 -384897 1589894 2445881 2117035 1243928 275111 -591799 -1034143
29587 -1034143 -771844 -39403 519935 484751 -23894 -614042 -980759 -978143 -578440 61526
29577 61526 542773 407813 -459874 -1589617 -2218638 -1995944 -1362878 -1084461 -1409535 -1857270
29567 -1857270 -1849133 -1344631 -736135 -279663 152784 753897 1379707 1599275 1156811 290885
29557 290885 -514356 -1064318 -1572747 -2205805 -2728260 -2781267 -2355636 -1757058 -1198283 -679803
29547 -679803 -222498 63536 176286 266517 444104 708170 1048495 1405039 1557081 1314146
29537 1314146 815945 367643 -6658 -489131 -922816 -814590 -95842 553795 504633 -9888
29527 -9888 -291672 -179160 -179217 -643944 -1246201 -1389756 -891074 -162970 134724 -359104 -1324088
29516 -1324088 -1933957 -1602152 -531964 647704 1664293 2653065 3462415 3473111 2455381
29507 2455381 1207145 769968 1121403 1251578 649877 58868 287300 803261 357986
29498 357986 -1086686 -2010667 -1299764 214000 862517 271748 -486408 -612268 -428928
29489 -428928 -386893 -189820 559659 1475763 1776705 1249383 368671 -292412 -395565 119605
29479 119605 870936 1114356 434737 -744182 -1671114 -2130143 -2448683 -2824581 -3073523
29470 -3073523 -2989178 -2595729 -2057939 -1601444 -1459116 -1666359 -1997910 -2273616 -2538503 -2782288
29460 -2782288 -2810812 -2658449 -2726162 -3107017 -3174074 -2373710 -1102745 -207284 112886 278595
29450 278595 487490 609050 724306 1025567 1303216 1235216 1009108 908387 561594 -431744
29440 -431744 -1366793 -1128320 22428 667377 365417 140525 504200 557172 -227456 -842222
29430 -842222 -432748 149110 -240451 -1118914 -1261144 -674043 -257061 -137292 209221 679561
29420 679561 840288 1089309 2020608 2927318 2502575 888084 -546279 -1381540 -2381679
29411 -2381679 -3425728 -3111199 -1044640 1144696 1963303 1842498 1843543 1868405 1309932
29402 1309932 478461 143888 305747 489426 739291 1335753 1963324 2097143 1919582
29393 1919582 2046620 2549743 2850518 2343047 750354 -1593322 -3367010 -2960199 -355214
29384 -355214 2299451 2877776 1555862 94809 -542213 -786974 -1127138 -1410965 -1429415
29375 -1429415 -1182505 -552854 460001 1255097 1183778 467393 -229337 -902591 -1932601
29366 -1932601 -2931783 -3056224 -2482535 -2351666 -3001268 -3421541 -2883117 -2007964 -1617142
29357 -1617142 -1465532 -898909 -75851 300210 103027 -28273 547674 1896890 3453528
29348 3453528 4298514 3858922 2600597 1678303 1694125 2204017 2587803 2794119 2889830 2512804
29338 2512804 1396918 101499 -401929 173905 1104870 1417471 834239 29143 -56868
29329 -56868 704093 1401535 1281135 904456 1459904 3010327 4234122 4039894 2668104
29320 2668104 1003583 -360685 -1040743 -718172 337821 1232919 1469176 1498823 1877435
29311 1877435 2469791 2884658 3027867 2810036 2051346 1153682 1053666 1929386 2778521
29302 2778521 2887419 2768799 2906336 2693879 1712835 983210 1491458 2306324 1822902
29293 1822902 342558 -337485 366384 1297915 1698613 2079162 2709656 2929799 2458323
29284 2458323 1946531 1737687 1428445 1076055 1312042 1654678 364842 -2993843 -6280583
29275 -6280583 -7292022 -6385689 -5339263 -4729789 -4003205 -3299830 -3394908 -4084505 -4234033
29266 -4234033 -3486629 -2609632 -2030213 -1269933 -149061 518149 -41432 -1503361 -2836646
29257 -2836646 -3295317 -2816541 -1916359 -1388002 -1676101 -2370988 -2654018 -2284405 -1731603
29248 -1731603 -1299475 -665261 445872 1523211 1628844 483093 -1016691 -1547592 -760608
29239 -760608 195342 -107991 -1652567 -2968194 -2956439 -2049279 -1225975 -674240 -116254
29230 -116254 234991 40888 -269620 -62865 266454 -200410 -1158222 -1074208 687392 2783451
29220 2783451 3524583 2811260 1826449 1425973 1519830 1658818 1581942 1306940 1065696 1047972
29210 1047972 1064690 752427 226962 86381 544475 1042777 1030372 653685 308011 752
29200 752 -352308 -443629 -9058 532415 511174 -41787 -443678 -322261 -31073 -88035 -625525
29189 -625525 -1429605 -2142134 -2380361 -2023040 -1475848 -1354899 -1790244 -2254033 -2146545 -1368084
29179 -1368084 -302402 518397 676205 73778 -930209 -1742943 -2095087 -2324278 -2911255
29170 -2911255 -3707719 -3857664 -2741962 -937304 144930 -231661 -1306320 -1849289 -1698387
29161 -1698387 -1688458 -2214555 -2681717 -2575790 -2269930 -2242382 -2125356 -1282954 -845 683375
29151 683375 274929 -696797 -1515016 -2009356 -2324547 -2458059 -2293755 -1845267 -1305132 -972560
29141 -972560 -1081634 -1482286 -1600947 -1037836 -113965 539930 830473 1156439 1559559 1528038
29131 1528038 824529 -24217 -364179 -138641 304830 734858 1020728 967610 631388 579821
29121 579821 1361952 2777472 4047374 4666448 4734289 4476267 3874413 2946499 2079740
29112 2079740 1785749 2177154 2859293 3328442 3343996 2893574 1982097 685413 -594957
29103 -594957 -1228035 -946007 -213353 250965 242255 84991 -32050 -313873 -881462 -1466349
29093 -1466349 -1789417 -1876581 -1743268 -1150154 -73277 878599 1031352 525621 173943
29084 173943 478499 1203853 1867240 2141287 1727146 438749 -1273854 -2360913 -2202595
29075 -2202595 -1355398 -843648 -904617 -944910 -655134 -514673 -938871 -1473236 -1381916 -788154
29065 -788154 -581340 -1131478 -1721740 -1600015 -1075605 -952570 -1153619 -734019 622895
29056 622895 1924992 2144145 1565237 1203613 1272005 1048019 166250 -799954 -1235065 -1252502
29046 -1252502 -1229090 -1140724 -789261 -241154 413788 1336819 2448508 3029422 2498936 1414037
29036 1414037 948049 1347536 1618276 924377 -378836 -1447437 -2062009 -2490148 -2673787
29027 -2673787 -2255358 -1304244 -421060 -57728 -156223 -480608 -849410 -957109 -487887 303167
29017 303167 537550 -336057 -1781019 -2788270 -3068831 -3111181 -3119162 -2586772 -1240160 158740
29007 158740 545071 -145628 -999078 -1372743 -1484423 -1635064 -1540762 -910503 -216891 -236037
28997 -236037 -960798 -1531933 -1243441 -173054 1131773 2063439 2040529 847891 -836671
28988 -836671 -1797881 -1541484 -782437 -341890 -69107 607687 1518405 1907809 1564685 1024735
28978 1024735 660267 303791 -119111 -323824 -299201 -516626 -1077739 -1229043 -299365 1244323
28968 1244323 2245402 2148446 1368728 605935 338269 842888 2053476 3279604 3593727
28959 3593727 2758637 1479978 565029 82011 -487600 -1494087 -2727212 -3666412 -3967002
28950 -3967002 -3736127 -3400392 -3296387 -3411992 -3527250 -3444611 -2967553 -1891534 -333094
28941 -333094 1048108 1521673 988085 -52481 -1112110 -1881235 -1904054 -794067 969437
28932 969437 2071717 1688144 428438 -486723 -647846 -520066 -392295 -18865 683971
28923 683971 1293944 1479452 1415448 1314560 1000951 339934 -250973 -192956 493955 1205567
28913 1205567 1439226 1131430 423945 -478418 -1202701 -1400962 -1227281 -1297902 -1938716 -2688655
28903 -2688655 -2788349 -2014572 -812013 271512 1021787 1484553 1714910 1671617 1261533
28894 1261533 499841 -305759 -654473 -332746 257628 462619 73406 -497401 -705616
28885 -705616 -359744 339885 1009729 1324046 1270912 1185147 1331761 1512752 1364269 966581
28875 966581 748308 786325 704947 385788 226188 449566 713903 744624 777396 922590
28865 922590 738217 119788 -9396 1109189 2590514 2818885 1741855 965146 1336498
28856 1336498 1757145 1036430 -233112 -671851 -213447 -46151 -787380 -1779857 -2184372
28847 -2184372 -1929025 -1462034 -1206252 -1401320 -1993825 -2547861 -2612585 -2225269 -1769618 -1411118
28837 -1411118 -1000786 -432126 258461 1018222 1650494 1761400 1264903 717793 646293 790834
28827 790834 634715 394144 636112 1080679 840030 -50799 -461409 102525 678273 385571
28817 385571 -198335 -91980 429915 288803 -759538 -2001509 -3002224 -3907075 -4606377
28808 -4606377 -4649095 -4113328 -3644776 -3416489 -2899989 -1961756 -1353598 -1653711 -2424198 -2959489
28798 -2959489 -3256175 -3594587 -3667585 -2941589 -1664894 -728045 -497818 -444086 -74181 322599
28788 322599 169578 -525867 -1181220 -1411183 -1480266 -1885884 -2616698 -3027964 -2587606 -1627451
28778 -1627451 -1050232 -1254813 -1733509 -1920547 -1972513 -2246877 -2402610 -1778681 -579822
28769 -579822 147938 -56268 -409092 -54499 757725 1226901 1182647 997630 748135 332789
28759 332789 177743 798976 1631052 1366731 -183210 -1547543 -1497982 -638192 -299899
28750 -299899 -586926 -583048 -59215 268418 134119 159466 590763 664438 -165408 -1140935
28740 -1140935 -1074455 132050 1475801 2079999 1908162 1480745 1343837 1644150 1866153
28731 1866153 1222367 -347368 -1878140 -2492481 -2437886 -2460043 -2528004 -2009581 -974803
28722 -974803 -378529 -710268 -1224219 -937675 109872 1021118 1139611 625013 129290
28713 129290 142457 527152 633792 86280 -608895 -654626 -141966 -23102 -733327 -1525323
28703 -1525323 -1598495 -1283468 -1481436 -2340489 -3165460 -3391220 -2997119 -2145222 -1100456
28694 -1100456 -432397 -571068 -1065267 -927419 84479 1076078 1146900 428575 -291740
28685 -291740 -556984 -479596 -287456 -30302 326498 721616 897671 530052 -326077 -1008797
28675 -1008797 -899813 -322560 -250386 -970545 -1670615 -1683345 -1444782 -1592763 -1726872 -1012360
28665 -1012360 269824 846033 220200 -630548 -660849 -49624 398215 461571 454616 420976
28655 420976 107279 -440086 -868974 -1034679 -1001301 -620182 322054 1520660 2285658 2375542
28645 2375542 2171029 1852822 1000634 -600013 -2230790 -2879621 -2384258 -1449733 -694551
28636 -694551 -208244 32714 -45965 -244210 -76438 491819 695225 -149361 -1598334 -2437674
28626 -2437674 -2116161 -1388770 -1352008 -2154312 -2937467 -2879607 -1974795 -801929 148415 723351
28616 723351 869655 494898 -285912 -947461 -898543 -122458 710479 944306 654687 462762
28606 462762 687986 971694 824920 269390 -282907 -591218 -748838 -910816 -1182235 -1713290
28596 -1713290 -2510346 -3095464 -2779757 -1498538 -38757 832335 1142522 1283697 1173207
28587 1173207 436561 -725071 -1534823 -1620688 -1411093 -1330241 -1141941 -457518 524806 1209267
28577 1209267 1238460 584108 -651127 -2054625 -2815001 -2392812 -1185894 -67023 596915
28568 596915 979264 1076934 689110 91811 -60458 273076 325083 -339147 -1097681 -1135244
28558 -1135244 -550871 -125352 -332137 -997186 -1628845 -1721735 -1082691 -218977 1381 -522220
28548 -522220 -818597 -189857 678409 694889 -13081 -414689 -260559 -371700 -1226999 -2307619
28538 -2307619 -3054762 -3495226 -3586631 -2934313 -1713640 -992693 -1390762 -2083749 -1937489
28529 -1937489 -1084554 -486672 -313805 227958 1495702 2731483 2999152 2191212 881742
28520 881742 -363322 -1292951 -1894367 -2230610 -2278895 -1962892 -1447249 -1182508 -1382522 -1664904
28510 -1664904 -1571410 -1262098 -1262520 -1653578 -1984325 -1930600 -1591097 -1176946 -859954 -877447
28500 -877447 -1287069 -1618227 -1266341 -257901 842924 1716424 2363162 2465644 1543696
28491 1543696 -17572 -958109 -666980 -42249 -254839 -1231661 -2021616 -2183020 -2041190
28482 -2041190 -1866619 -1572270 -1121868 -599008 43187 728530 906725 131083 -1081530
28473 -1081530 -1693272 -1496606 -1304929 -1670593 -2194848 -2438108 -2772134 -3747920 -5097650
28464 -5097650 -5963014 -5834994 -4795862 -3161424 -1468935 -569941 -989738 -2128248 -2701724
28455 -2701724 -2178876 -1329693 -1150990 -1691509 -2260450 -2437525 -2412928 -2458723 -2497468 -2250946
28445 -2250946 -1548794 -447612 732406 1467386 1393026 715507 44760 -295486 -558490
28436 -558490 -1017520 -1408640 -1285620 -782237 -573805 -1027569 -1788602 -2376430 -2833791 -3472419
28426 -3472419 -4211474 -4583756 -4382221 -3945549 -3674446 -3505983 -3076727 -2305745 -1586055
28417 -1586055 -1338914 -1524042 -1727240 -1668780 -1443648 -1253081 -1141012 -1123512 -1315978 -1642733
28407 -1642733 -1613935 -818450 388312 1119371 966795 409459 137316 399188 1138421
28398 1138421 2209105 3105113 2988048 1548912 -433727 -1896984 -2617001 -3046625 -3346862
28389 -3346862 -3285360 -2971346 -2904787 -3169166 -3247094 -2856357 -2366852 -2097335 -1768787 -1093068
28379 -1093068 -480007 -626880 -1564644 -2508306 -2613160 -1689787 -312839 599102 492407
28370 492407 -302003 -842706 -496976 502729 1413341 1656490 1149572 347332 60577 802259
28360 802259 2081558 2743115 2297575 1537844 1495285 2170877 2747196 2720211 2260149 1660041
28350 1660041 1046261 610272 568734 783019 833994 596824 416424 607218 1051862 1387921
28340 1387921 1362001 928202 213099 -513667 -958823 -965488 -545960 147981 836772 1278450
28330 1278450 1524218 1777432 1896190 1425216 382367 -432285 -366580 220844 567983
28321 567983 600384 703552 727513 179837 -629881 -667968 326262 1312288 1355852 827786
28311 827786 686643 1180844 1813473 2083738 1715071 629833 -689324 -1226927 -516145
28302 -516145 565648 743825 -76818 -800040 -582321 325133 1129723 1300770 800993
28293 800993 75686 -104788 686549 1852955 2180839 1124418 -596711 -1767420 -1744985
28284 -1744985 -746638 475054 1045428 440306 -1098558 -2716863 -3691348 -3966739 -3939023
28275 -3939023 -3884932 -3678497 -2943305 -1472250 362633 1677450 1804785 970929 23986
28266 23986 -493775 -724992 -969599 -1175380 -1118898 -800106 -436622 -215909 -172223 -162791
28256 -162791 77025 635733 1133328 1007211 202926 -700182 -1202396 -1433235 -1777204 -2233899
28246 -2233899 -2482572 -2442031 -2422947 -2692618 -3089349 -3148222 -2579328 -1631290 -940985 -914062
28236 -914062 -1299360 -1535682 -1424132 -1177918 -909786 -533812 -199317 -237599 -453398 -78131
28226 -78131 1127722 2246955 2278855 1446862 741358 456762 42118 -663267 -1000674 -585222
28216 -585222 -29811 -41231 -302435 148051 1636708 3401621 4306580 3717978 1857701
28207 1857701 -348315 -1828670 -2085055 -1445791 -589635 29286 243386 19149 -439401
28198 -439401 -646032 -268870 439902 917532 908739 548780 -22808 -725176 -1247689 -1177011
28188 -1177011 -586923 -128202 -252530 -592995 -437846 303442 941024 825967 49575
28179 49575 -798353 -1356371 -1736394 -2098368 -2267444 -1954279 -1234792 -576531 -351314 -470531
28169 -470531 -547506 -298764 221530 597647 244883 -1049316 -2566968 -2947415 -1472236
28160 -1472236 973076 2590112 2405353 1080340 -34083 -328207 -256451 -495700 -1103559
$$ [...]
##END NTUPLES=NMR SPECTRUM
##END=
