##TITLE=31Pdec_78-2022
 CDCl3, 24 sc
 26.9.2022
##JCAMPDX= 6.0         $$ Bruker NMR JCAMP-DX V2.0
##DATA TYPE= NMR SPECTRUM
##DATA CLASS= NTUPLES
##ORIGIN= UXNMR, Bruker Analytische Messtechnik GmbH
##OWNER= root
$$ XWIN-NMR		Version 3.5
$$ Mon Sep 26 13:55:49 2022 Russian Standard Time (UT+4h)  she@DPX200
##.OBSERVE FREQUENCY= 81.013821
##.OBSERVE NUCLEUS= ^31P
##.ACQUISITION MODE= SIMULTANEOUS
##.ACQUISITION SCHEME= undefined
##.AVERAGES= 24
##.DIGITISER RES= 16
##SPECTROMETER/DATA SYSTEM= spect
##.PULSE SEQUENCE= zgpg30
##.SOLVENT NAME= CDCl3
##.SHIFT REFERENCE= (INTERNAL, CDCl3, 0, 248.564)
##AUDIT TRAIL= $$ (NUMBER, WHEN, WHO, WHERE, WHAT)
$$ ##TITLE= Audit trail, XWIN-NMR		Version 3.5
$$ ##JCAMPDX= 5.01
$$ ##ORIGIN= Bruker BioSpin GmbH
$$ ##OWNER= she
$$ F:/spectra/data/she/nmr/P31/1/pdata/1/auditp.txt
$$ ##AUDIT TRAIL=  $$ (NUMBER, WHEN, WHO, WHERE, WHAT)
(   1,<2022-09-26 13:54:43.39 +0400>,<she>,<DPX200>,
      <created by zg, POWCHK disabled, PULCHK disabled
       configuration hash MD5:
       00 E9 B6 7A A2 85 ED C7 34 08 36 98 17 FE 4E 26
       data hash MD5: 32K
       EA D0 B7 D5 05 76 39 BC A6 5B 99 FD 1A 75 0E 1A>)
(   2,<2022-09-26 13:55:05.45 +0400>,<she>,<DPX200>,
      <Start of raw data processing
       efp BC_mod = 2 LB = 1 FT_mod = 6 PKNL = 1 PHC0 = -10258.45 PHC1 = 39.25659 SI = 64K 
       data hash MD5: 64K
       36 EB A8 57 05 FC 63 47 4B 89 B7 3F 91 5B 05 7A>)
(   3,<2022-09-26 13:55:21.21 +0400>,<she>,<DPX200>,
      <pk PHC0 = 23.38063 PHC1 = 0 
       data hash MD5: 64K
       3D 8A 4E EA 8F 53 40 EF 63 79 2C 00 18 6F 16 DD>)
(   4,<2022-09-26 13:55:26.68 +0400>,<she>,<DPX200>,
      <abs ABSG = 5 
       data hash MD5: 64K
       99 34 02 9D 0B 34 E4 99 A4 BE BB 9B 37 8A E5 A3>)
$$ ##END=
$$ 
$$ hash MD5
$$ 7B 3D C8 CE F7 DC ED 36 66 37 2C 07 E4 68 D7 41
##$RELAX= 
##$RELAX= 
##$RELAX= 
##$RELAX= 
##$RELAX= 
##$RELAX= 
##$RELAX= 
##$RELAX= 
##$RELAX= 
$$ Bruker specific parameters
$$ --------------------------
##$DU= <F:/spectra>
##$EXPNO= 1
##$NAME= <P31>
##$PROCNO= 1
##$TYPE= <nmr>
##$USER= <she>
##$AMP= (0..31)
100 100 100 100 100 100 100 100 100 100 100 100 100 100 100 100 100 100 
100 100 100 100 100 100 100 100 100 100 100 100 100 100 
##$AQSEQ= 0
##$AQ_mod= 1
##$AUNM= <au_zg>
##$AUTOPOS= <>
##$BF1= 81.014009
##$BF2= 200.13
##$BF3= 200.13
##$BF4= 200.13
##$BF5= 200.13
##$BF6= 200.13
##$BF7= 200.13
##$BF8= 200.13
##$BYTORDA= 1
##$CFDGTYP= 0
##$CFRGTYP= 5
##$CHEMSTR= <none>
##$CNST= (0..31)
1 1 145 1 1 1 1 1 1 1 1 1 1 1 1 1 1 1 1 1 1 1 1 1 1 1 1 1 1 1 1 1 
##$CPDPRG= <waltz16>
##$CPDPRG1= <>
##$CPDPRG2= <waltz16>
##$CPDPRG3= <>
##$CPDPRG4= <mlev>
##$CPDPRG5= <mlev>
##$CPDPRG6= <mlev>
##$CPDPRG7= <mlev>
##$CPDPRG8= <mlev>
##$CPDPRGB= <>
##$CPDPRGT= <>
##$D= (0..31)
0 1 0 0 0 0 0 0 0 0 0 0.03 2e-05 3e-06 0 0 0 0 0 0 0 0 0 0 0 0 0 0 0 0 
0 0 
##$DATE= 1664186082
##$DBL= (0..7)
120 120 120 11 120 120 24 19 
##$DBP= (0..7)
150 150 150 150 150 150 150 150 
##$DBP07= 0
##$DBPNAM0= <>
##$DBPNAM1= <>
$$ [...]
##$SUBNAM3= <"">
##$SUBNAM4= <"">
##$SUBNAM5= <"">
##$SUBNAM6= <"">
##$SUBNAM7= <"">
##$SUBNAM8= <"">
##$SUBNAM9= <"">
##$SW= 501.771253377433
##$SWIBOX= (0..15)
0 1 3 0 0 0 0 0 0 0 0 0 0 0 0 0 
##$SW_h= 40650.406504065
##$TD= 32768
##$TD0= 1
##$TE= 0
##$TE2= 300
##$TE3= 300
##$TEG= 300
##$TL= (0..7)
0 120 53 12 22 120 120 120 
##$TP= (0..7)
150 150 150 150 150 150 150 150 
##$TP07= 0
##$TPNAME0= <>
##$TPNAME1= <>
##$TPNAME2= <>
##$TPNAME3= <>
##$TPNAME4= <>
##$TPNAME5= <>
##$TPNAME6= <>
##$TPNAME7= <>
##$TPOAL= (0..7)
0.5 0.5 0.5 0.5 0.5 0.5 0.5 0.5 
##$TPOFFS= (0..7)
0 0 0 0 0 0 0 0 
##$TUNHIN= 0
##$TUNHOUT= 0
##$TUNXOUT= 0
##$USERA1= <user>
##$USERA2= <user>
##$USERA3= <user>
##$USERA4= <user>
##$USERA5= <user>
##$V9= 5
##$VALIST= <valist>
##$VCLIST= <CCCCCCCCCCCCCCC>
##$VD= 0
##$VDLIST= <DDDDDDDDDDDDDDD>
##$VPLIST= <PPPPPPPPPPPPPPP>
##$VTLIST= <TTTTTTTTTTTTTTT>
##$WBST= 1024
##$WBSW= 4
##$XGAIN= (0..3)
0 0 0 0 
##$XL= 0
##$YL= 0
##$YMAX_a= 4762
##$YMIN_a= -5027
##$ZGOPTNS= <>
##$ZL1= 120
##$ZL2= 120
##$ZL3= 120
##$ZL4= 120
##$ABSF1= 248.5645
##$ABSF2= -253.2056
##$ABSG= 5
##$ABSL= 3
##$ALPHA= 0
##$AQORDER= 0
##$ASSFAC= 0
##$ASSFACI= 0
##$ASSFACX= 0
##$ASSWID= 0
##$AUNMP= <proc_1d>
##$AZFE= 0.1
##$AZFW= 0.5
##$BCFW= 0
##$BC_mod= 2
##$BYTORDP= 0
##$COROFFS= 0
##$CY= -3
##$DATMOD= 1
##$DC= 0
##$DFILT= <>
##$DTYPP= 0
##$F1P= 0
##$F2P= 0
##$FCOR= 1
##$FTSIZE= 65536
##$FT_mod= 6
##$GAMMA= 0
##$GB= 0
##$INTBC= 1
##$INTSCL= 6.834604e-11
##$ISEN= 30
##$LB= 1
##$LEV0= 0
##$LPBIN= 0
##$MAXI= 10000
##$MC2= 0
##$MEAN= 0
##$ME_mod= 0
##$MI= 50
##$NCOEF= 0
##$NC_proc= -6
##$NLEV= 6
##$NOISF1= 182.463
##$NOISF2= 159.3651
##$NSP= 0
##$NTH_PI= 0
##$NZP= 0
##$OFFSET= 248.5645
##$PC= 4
##$PHC0= -10235.07
##$PHC1= 39.25659
##$PH_mod= 1
##$PKNL= yes
##$PPARMOD= 0
##$PSCAL= 0
##$PSIGN= 0
##$REVERSE= no
##$SF= 81.0140089999694
##$SI= 65536
##$SIGF1= 159.3651
##$SIGF2= -187.1042
##$SINO= 113.3802
##$SIOLD= 16384
##$SREGLST= <1H.CDCl3>
##$SSB= 0
##$STSI= 65536
##$STSR= 0
##$SW_p= 40650.406504065
##$SYMM= 0
##$S_DEV= 0
##$TDeff= 32768
##$TDoff= 0
##$TI= <>
##$TILT= no
##$TM1= 0
##$TM2= 0
##$TOPLEV= 0
##$USERP1= <user>
##$USERP2= <user>
##$USERP3= <user>
##$USERP4= <user>
##$USERP5= <user>
##$WDW= 1
##$XDIM= 65536
##$YMAX_p= 506851760
##$YMIN_p= -19414614
$$ End of Bruker specific parameters
$$ ---------------------------------
##NTUPLES= NMR SPECTRUM
##VAR_NAME=  FREQUENCY,     SPECTRUM/REAL,   SPECTRUM/IMAG
##SYMBOL=    X,             R,               I
##VAR_TYPE=  INDEPENDENT,   DEPENDENT,       DEPENDENT
##VAR_FORM=  AFFN,          ASDF,            ASDF
##VAR_DIM=   65536,         65536,           65536
##UNITS=     HZ,            ARBITRARY UNITS, ARBITRARY UNITS
##FACTOR=    0.620285442955139, 1,           1
##FIRST=     20137.2065510682, 0,            0
##LAST=      -20513.1999529968, 0,           0
##MIN=       -20513.1999529968, -19414614,   0
##MAX=       20137.2065510682, 506851760,    0
$$ Real data points
##PAGE= N=1
##DATA TABLE= (X++(R..R)), XYDATA
$$ [...]
39413a339610K22856J397423J419118L46593p19324q41533j15157N69886N20528
39404A460780p4383n19080n29154m10909l29916j0945N31556O39380J867n98081
39394A61115l67455J91661J20903k99385o2952N97473M38977m64050n02725P32620
39384E46182J414693L20975j051232q30260K53153K61548o55912p13467K95620
39375a58700P02347n3198n06448J82288P81275J82741p08366n45138L22544O32531
39365H31876K00484j99407l15539n11601p26476n19203q0809j70533q41149j035066
39355c367423O0878J657549K001951N42309j047767p01855J291803K400410J105610
39346C943465j101408j901318j166270l39273J75609R34211J387473M37939r58308
$$ plain form
39413 -1339610 -1116754 280669 1699787 2046380 1327056 485523 370366 940252 1460780
39404 1460780 1386397 867317 338163 -72746 -402662 -413607 117949 757329 759196 161115
39394 161115 -206340 -14679 106224 -193161 -256113 341360 780337 316287 -186438 546182
39384 546182 1960875 2281850 1230618 400358 653511 915059 259147 -454320 -158700
39375 -158700 543647 490449 -15999 166289 947564 1130305 421939 -123199 199345 831876
39365 831876 1032360 832953 517414 5813 -720663 -1239866 -1320675 -1491208 -2332357 -3367423
39355 -3367423 -3306545 -1648996 352955 895264 -152503 -854358 437445 2837855 3943465
39346 3943465 2842057 940739 -225531 -564804 -389195 545016 1932489 2370428 1412120
39337A412120n10286J511612J978443k79300k244320j276503P45368N83860j163037
39328G57957j398358K09866R75080q2150q01021K42072J484756J152377j43248
39319B397331r04190r39080p50290l09163K89021K90771l81559m76080O79971
39310a03268J733157J126204n12458j242069n11189M12066M52406j09500n21277
39301G24072n52653l39794L0694M09198M41835r0397q27469r58757o6906J122507
39291a07670J284549J35311r72392p29868L48211P71409K89362l0987J99304J56840
39281A344069m62731p35075j70961L23794K1393l68282n7322L44713m4188p15060
39271e19650o09139N4485K14147j94984k32235L92327R23818Q36375M35091J19431
$$ plain form
39337 1412120 901834 2413446 4391889 4112589 1868269 591766 1337134 1920994 757957
39328 757957 -640401 -430535 544545 462395 -338626 -96554 1388202 2540579 2397331
39319 2397331 1493141 554061 -196229 -505392 -216371 74400 -307159 -783239 -103268
39310 -103268 1629889 2756093 2243635 1001566 490377 902443 1354849 1245349 724072
39301 724072 171419 -168375 -137681 271517 713352 622955 -204514 -1163271 -1230177 -107670
39291 -107670 1176879 1312190 339798 -390070 -41859 729550 1018912 987925 1187229 1344069
39281 1344069 881338 146263 -24698 299096 320489 -47793 -105115 239598 195410 -519650
39271 -519650 -1128789 -1074304 -860157 -1055141 -1287376 -895049 28769 865144 1300235 1419666
39261A419666p1295j45721j35210k87852n99975m47391M73188J206933O32223
39252B044566p73105j486979j108400n71833k17676O57218J892284J899063P2749
39243B407887j682875j308699M93039J285305K80032r52026r99875k21997M18635
39234b80574O77715O10552M4684p38579p75666K00661R44438L08899r51580j204802
39224a164252l32413L13883K01351K50587Q66039R73123j14341j246966j092063
39215a345052k06412l8459n78567n84418J94109O42908K10329k46222R8692Q93445
39205i59647J310593J010446J51245p44388q57910O4507R47590O04127l55128
39196A171435k80137P74977Q91718o08097j858744j306516l3636K50619q0888
$$ plain form
39261 1419666 1348371 1202650 1067440 779588 179613 -267778 205410 1412343 2044566
39252 2044566 1271461 -215518 -1323918 -1895751 -2113427 -1456209 436075 2335138 2407887
39243 2407887 725012 -583687 -90648 1194657 1474689 522663 -477212 -699209 -280574
39234 -280574 397141 1007693 1052377 313798 -461868 -261207 683231 992130 40550 -1164252
39224 -1164252 -1496665 -1182782 -981431 -730844 135195 1108318 993977 -252989 -1345052
39215 -1345052 -1551464 -1589923 -2168490 -2752908 -2558799 -1915891 -1705562 -1951784 -1853092 -959647
39205 -959647 350946 1361392 1512637 768249 -89661 -25154 922436 1526563 1171435
39196 1171435 891298 1666275 2557993 1949896 91152 -1215364 -1249000 -998381 -1079269
39187a079269K63639R06064N39081n36058q30588k42611n3469m56851k46999P94122
39177i42939J282471N82360j27654K7774J67194n65910j248715o19903P58564
39168f86758J264112N36682l32716o08524o12600o59901m51801J88746P91698
39159e71062Q07842K15850o21427j243261j117877J4293J486049J936513P86903
39150A693823q18460j228628l42732L34242j62516r60975p81118J35687N29443
39141a601234J08439j80394J77130N47333L90957J03497J17395J44700q0449j88170
39131d60796K8353L6472m58849p38038j07217R47561J460626J203189M54925o36267
39121A729959j579158j335269K45045J597293J365340L76790K06984N47206r3179
$$ plain form
39187 -1079269 -815630 90434 629515 93457 -737131 -979742 -1033211 -1490062 -1737061 -942939
39177 -942939 339532 921892 794238 822012 989206 423296 -825419 -1445322 -686758
39168 -686758 577354 1114036 781320 172796 -439804 -1099705 -1551506 -1362760 -571062
39159 -571062 236780 452630 -168797 -1412058 -2529935 -2515642 -1029593 906920 1693823
39150 1693823 875363 -353265 -695997 -361755 -524271 -1485246 -2266364 -2130677 -1601234
39141 -1601234 -1492795 -1673189 -1496059 -948726 -557769 -454272 -336877 -192177 -272626 -460796
39131 -460796 -432443 -395971 -854820 -1592858 -1700075 -752514 708112 1911301 2366226 1729959
39121 1729959 150801 -1184468 -939423 657870 2023210 2400000 2606984 3154190 3061011
39112C061011j518934j879131o66124M23987J50017o19407o54827j28587K65825
39103a566170N33738P39877L77644n90474j097928m19886N98138P37409Q0175
39094f07477m54723n55401n12786l24219K13814Q49503J128824J062653R29453
39085A729641P22033L28446r2818m09250p79458j167025j091015l86962K97901
39076h48507L64957J43837K88077P41754R76827Q56891N58807j20q60325j396107
39066H26091q78314L37984R93619M93928l59654n37613j34117R467k57018j24380
39056C69993P71661J418979O93074q12375j338133m35332L80333n049o22401j85848
39046B34902O63343M69986n08227p69351j46338P9609m10106m81604K37851O19194
$$ plain form
39112 3061011 1542077 -337054 -1003178 -579191 -429174 -1048581 -1703408 -1831995 -1566170
39103 -1566170 -1032432 -292555 85089 -505385 -1603313 -2023199 -1425061 -687652 -607477
39094 -607477 -1062200 -1617601 -2130387 -2454606 -2240792 -1391289 -262465 800188 1729641
39085 1729641 2451674 2780120 2687302 2278052 1498594 331569 -759446 -1146408 -848507
39076 -848507 -483550 -339713 -51636 690118 1666945 2523836 3082643 3082523 2222198 826091
39066 826091 -52223 285761 1279380 1773308 1413654 876041 741924 751391 494373 369993
39056 369993 1141654 2560633 3253707 2441332 1103199 667867 1048200 1043151 420750 234902
39046 234902 898245 1368231 860004 90653 -55685 23924 -386182 -867786 -629935 -10741
39036a0741P1051m92873m17310l02058m59620j20770Q83340J361032P64472K62757
39026A539280N92438N85268o31340j646907q93597O09990P82333k31194n20616
39017A85655L89374R76971K73008q60944j176571m30585P32626J324098O90317
39008B103949n19191p08709M18821J018785j81324j569864r59745Q56144J274483
38999A733349k779p21832Q2641P42399M4555q24374n09108L56441N22826J10277
38989A534395j11606k74375r24935j699253j608213l80481J109042J609894O21545
38980a23987q81080j113428M13746J879436J339382n04178j234884j98436Q03223
38971C79794M58281l96921o74341o74459q18224m22840R13922J970435J381595
$$ plain form
39036 -10741 60310 -432563 -849873 -1151931 -1611551 -1732321 -848981 512051 1276523 1539280
39026 1539280 2131718 2716986 2085646 438739 -454858 155132 937465 706271 185655
39017 185655 575029 1552000 1825008 964064 -212507 -643092 89534 1413632 2103949
39008 2103949 1584758 876049 1294870 2313655 2132331 562467 -397278 458866 1733349
38999 1733349 1730570 1008738 1091379 1833778 1878333 1053959 544851 901292 1424118 1534395
38989 1534395 1422789 1148414 223479 -1475774 -3083987 -3464468 -2355426 -745532 -123987
38980 -123987 -1005067 -2118495 -1704749 174687 1514069 1009891 -224993 -423429 379794
38971 379794 838075 441154 -233187 -907646 -1725870 -2148710 -1234788 735647 2117242
38962B117242l31433j431896j101826L4605R42543R12848j23650j237954j053822
38953a273343N98744K142277K039222N52767q82335j385254j047894k93702L73415
38944H23897M41978n9283m09754j10239M24044M89758k4950p27608j189096j046984
38934a388237k32430O36899P30919J11991l26159j84936K3531k6145L7528L65883
38924b51156M65901J01655k93921m15729l66005l3268O40582P82090m46255j892842
38914a708948j420211P07366J728095N33709n95889J58770J166587L86371r22139
38905C3711m01972J176727J148917n31911j315125l26650N06084q9251r19250
38896g18720o72917K11564Q56214J227096J297835N53121q49428j711305j275030
$$ plain form
38962 2117242 1785809 353913 -747913 -713308 229235 1142083 1018433 -219521 -1273343
38953 -1273343 -674599 1467678 3506900 4059667 3177332 1792078 744184 450482 823897
38944 823897 1265875 1206592 796838 686599 1110643 1600401 1575451 847843 -341253 -1388237
38934 -1388237 -1620667 -983768 -252849 -140858 -467017 -651953 -628422 -654567 -617039 -251156
38924 -251156 214745 316400 22479 -393250 -759255 -792523 -151941 630149 183894 -1708948
38914 -1708948 -3129159 -2421793 -693698 -159989 -755878 -597108 569479 955850 33711
38905 33711 -368261 808466 1957383 1425472 110347 -216303 289781 200530 -718720
38896 -718720 -1391637 -1180073 -323859 903237 2201072 2754193 1904765 193460 -1081570
38887a081570r1484R15746J270486P86912k58592q39291k91026M52901J06033
38878I70115q17164p89447P9254K47059m44549m79020M79171Q45033l5213o24816
38868e69577J39198J075509R47499M45439N09653M94883l11619r27811k79744
38859A523430P01170M63712o50569j103988o31801k54862l27504k18700K96768
38850b02344O92803O16732J71216m61706r13249o57635J27867M42236p4254m85060
38840g43394j79790L2518m68927p37147O2358Q59601L58663n84174l19237P19440
38830a000089P86036p6824j78936P07436Q89989k49405j150231o86468J69913
38821g88579K48822r839K51373P35281P64225N36282N39137N52894J77076l11946
$$ plain form
38887 -1081570 -1173054 -257308 1013178 1800090 1541498 702207 411181 864082 970115
38878 970115 152951 -636496 -557242 -310183 -754732 -1233752 -754581 90452 55239 -569577
38868 -569577 -430379 645130 1592629 2038068 2547721 3042604 2730985 1803174 1523430
38859 1523430 2224600 2688312 2037743 933755 301954 47092 -280412 -499112 -202344
38850 -202344 490459 1107191 1278407 816701 -96548 -754183 -626316 -184080 -258334 -743394
38840 -743394 -923184 -890666 -1359593 -2096740 -2034382 -1174781 -816118 -1400292 -1719529 -1000089
38830 -1000089 -214053 -290877 -469813 237623 1127612 878207 -272024 -958492 -788579
38821 -788579 -539757 -549596 -298223 437058 1201283 1737565 2276702 2829596 3006672 2694726
38811B694726m12981j69704R1716K64811K69336p6674o31266r30638q48430o56238
38801d05342l58035K38331P20794L39981p00175j228962p01034J67429O44970
38792a282043Q16511Q15537L55328m39659p59343k46047M79763Q65212J022947
38783A628206R12762J07413j084825j482550p04245J66600K62191N8217J08212
38774b8019K0938l83270l10411M80246P79054j14578q90238k40654Q78347P84264
38764I75679k19412o18647k84151k07336l42513P7937N58741o328r41299m63546
38754a470875J196225J800360N89857o61661p11719n29580r11725q10407M36741
38745a072784J282927L13639j145452q76110Q00165J553608M88667r04300j130090
$$ plain form
38811 2694726 2281745 2112041 2203757 2468568 2737904 2661230 2029964 1099326 250896 -405342
38801 -405342 -763377 -525046 195748 535729 -164446 -1393408 -2094442 -1927013 -1282043
38792 -1282043 -465532 350005 705333 265674 -493669 -739716 -259953 605259 1628206
38783 1628206 2540968 2648381 1563556 81006 -623239 -456639 -194448 -136231 -28019
38774 -28019 -7081 -390351 -700762 -220516 558538 443960 -446278 -686932 191415 975679
38764 975679 756267 137620 -146531 -353867 -696380 -618443 -59702 -66030 -1007329 -1470875
38754 -1470875 -274650 1525710 2115567 1453906 742187 212607 -699118 -1509525 -1072784
38745 -1072784 210143 523782 -621670 -1497780 -697615 855993 1344660 440360 -689730
38736f89730l37060N73448J094097J030272L44528m97376p55801l28942P9601
38727E13037p8351m96468m96002M4573M46893j0573j026679j252432J09328J835197
38717d11477J795153k11562j868319j297333M57466J025465j8698r21621m31485
38708a882411P97810J569239J551146R38831j29934j188412j333828k61972J082297
38699A142766J501110Q52004r9977p50404j020835r38477n08649m338J46919q9829
38689B30290k85209j68230J2989k0705m4794L09752Q18483Q11709J45816m88141
38679A321960n03003k03710k07149m64278m49770p4683K59155L86426M55541L45643
38669H66132j91411p50169n25644L99775R16457M60746j34666L3524N55861M53934
$$ plain form
38736 -689730 -1026790 -453342 640755 1671027 2015555 1518179 762378 433436 513037
38727 513037 434686 -61782 -557784 -513211 -66318 -76891 -1103570 -2356002 -2246674 -411477
38717 -411477 1383676 1172114 -696205 -1993538 -1536072 -510607 -529305 -1450926 -1882411
38708 -1882411 -1084601 484638 2035784 2974615 2844681 1656269 322441 60469 1142766
38699 1142766 2643876 3495880 3395903 2645499 1624664 686187 177538 173200 320119 230290
38689 230290 -54919 -223149 -210160 -230865 -275659 34093 852576 1664285 1810101 1321960
38679 1321960 818957 615247 408098 -56180 -505950 -580633 -321478 64948 520489 866132
38669 866132 674721 -75448 -601092 -201317 715140 1175886 1041220 1074744 1630605 2084539
38659B084539k93603q59323q20103m57371o3778K62619L23690O0090q2444K59358
38649D13674N96359J87675p13165j064846n01471K47134N10333M39551M04165
38640E19409L97508L63962M34611M84833J08125n79362p94044k70825R9240m17859
38630C45598j041821n08121Q25878J199093k1865j311896j165906j72431K13294
38621a638177O5517N18212J302125Q02348j023032j852790l20208J633562J474437
38612I61994k16550r36958k24975J92561j32065L07900J717084J980549J47986
38603C797526j614127j281142j3908R1757n70842l28014N91588O84713Q059k14790
38593A150820j30320p66859j499219p87973P40131Q81623l21675m41007J044386
$$ plain form
38659 2084539 1790936 931613 111510 -345861 -409639 -147020 176670 236760 154316 413674
38649 413674 1010033 1197708 484543 -580303 -1081774 -834640 -324307 115244 519409
38640 519409 916917 1280879 1715490 2200323 2308448 1729086 935042 664217 763457 345598
38630 345598 -696223 -1204344 -378466 820627 798762 -513134 -1679040 -1851471 -1638177
38621 -1638177 -1572660 -1054448 247677 1050025 26993 -1825797 -2146005 -512443 961994
38612 961994 745444 -191514 -416489 -223928 -355993 -48093 1668991 3649540 3797526
38603 3797526 2183399 902257 888349 980106 409264 81250 672838 1357551 1365610 1150820
38593 1150820 1020500 253641 -1245578 -2033551 -1293420 -411797 -733472 -1174479 -130093
38584a30093J538175k81242j941243j067204Q16558Q92782n56365j154101m21439
38575b304172J40271J44916O05338J357634R41235o46504j473901n94879N68391
38566a261671N52192j79119n04795l89185l04947j18029L71501O90479M71182
38557f72392J91082K72629K59355j90016l40187M39317J251823Q02231m92097
38548A521745r79715k09082N80408M72722r1974n77912j119644j469639p52477
38539b625568P88846J311454j2041j250105l72180J424399J308756q07408k055804
38530b289651r30202P50328J003005M38227M92958Q88793N93693j38061m60184
38521C48906n39081p91778o01315M47917J099115J72981j101742p11697Q51937
$$ plain form
38584 -130093 1408082 1126840 -814403 -1881607 -1065049 -172267 -728632 -1882733 -2304172
38575 -2304172 -2163901 -2018985 -1413647 -56013 885222 238718 -1235183 -1830062 -1261671
38566 -1261671 -709479 -888598 -1393393 -1782578 -2087525 -2205554 -1834053 -1143574 -672392
38557 -672392 -481310 -208681 50674 -139342 -479529 -40212 1211611 2013842 1521745
38548 1521745 542030 332948 913356 1386078 1294104 716192 -403452 -1873091 -2625568
38539 -2625568 -1836722 -525268 -537309 -1787414 -2159594 -735195 573561 -233847 -2289651
38530 -2289651 -3219853 -2469525 -1466520 -1028293 -535335 353458 947151 809090 348906
38521 348906 -190175 -981953 -1583268 -1135351 -36236 136745 -964997 -1676694 -824757
38512h24757J331764L52915k51293K38242M69957j47231l03277N81746J012345
38503B460411J9875r95156n82581L57893K06878p45355j061994n22262l9263N7587
38493h43967J44917K23422M922l12651l75503l32030l39155l8119O58116R94224
38483b15824M90240j06040P6350O74077P67051K49395l46154p20877p32427k17019
38473h1228L99024K51799m89477m95652N36479J019820k3705j128161o11756P61982
38463A39125J170881N48590M3020k20482p12358q42722k122O43166j91456j307887
38453g32245p36112P27188P22964m57239l29276J143727J164689r29390k123797
38444a549491o37602J139257P09582o27765m97740N07925M08739m91181n00712
$$ plain form
38512 -824757 507007 859922 608629 846871 1316828 1169597 866320 1448066 2460411
38503 2460411 2480286 1485130 902549 1260442 1467320 721965 -340029 -862291 -901554 -843967
38493 -843967 -699050 -475628 -470706 -783357 -1158860 -1490890 -1830045 -1868164 -1210048 -215824
38483 -215824 274416 168376 244726 918803 1685854 1935249 1589095 868218 135791 -81228
38473 -81228 317796 569595 80118 -415534 120945 1140765 1117060 -11101 -622857 139125
38463 139125 1310006 1858596 1901616 1681134 968776 126054 123932 767098 575642 -732245
38453 -732245 -1468357 -741169 -18205 -475444 -804720 339007 1503696 574306 -1549491
38444 -1549491 -2187093 -1047836 -338254 -966019 -1463759 -955834 -547095 -1038276 -1538988
38435a538988K51232L77203J3302K92861P78041J43586j027850q51529N67853
38426i94289J085390m554r27928m50301L36886J65571m01689k72171L32126N09494
38416f21465J23218l79342p69784q58613k77936Q18916J514407J231380M68364
38407A249145p4721l81811o00308m71459j2022J0911p97944j477166q81126N66296
38397b870205J377743J057340N20762M49064M15963K6247j88174K30178N95608
38388A614526L4918r50621j034801r0908N40857J11860m07658j8076N42402j1308
38378C31191j173858j120362M69202J681147J053133m14393r19256l94637n4030
38369e41863j65325J21716R41312J273052N92950l33752p44176q24113q22400
$$ plain form
38435 -1538988 -1287756 -910553 -897251 -604390 173651 317237 -710613 -1562142 -994289
38426 -994289 91101 86547 -841381 -1291682 -954796 -789225 -1190914 -1463085 -1130959 -621465
38416 -621465 -498247 -877589 -1647373 -2505986 -2783922 -1965006 -450599 780781 1249145
38407 1249145 1174424 792613 192305 -279154 -291176 -280265 -1078209 -2555375 -3436501 -2870205
38397 -2870205 -1492462 -435122 85640 534704 950667 976914 788740 1018918 1614526
38388 1614526 1649444 698823 -335978 -426886 113971 225831 -181827 -199903 342499 331191
38378 331191 -842667 -1963029 -1493827 187320 1240453 826060 -93196 -487833 -541863
38369 -541863 -707188 -585472 355840 1628892 2221842 1888090 1143914 319801 -502599
38360e02599l48594O18065J002271N2007j173097j037046K39979P64863k86519
38351f70670j444784j059946M10095J164773N22873m26361n15123R2754M64675
38342a461714K46486o1187K6573L04117K44497j71368l53957N3116N86873O17003
38332C0439L24651L73530O75925L92767n56192r99967k55342N67174J34764q97671
38322b09922p32683P51948J673074Q96499m31307p73687k97527j33339n56680
38313A86376r50395q91752l78598M27696R48737M38592p22900r30174M06628J542600
38303G6810P62640q52325r16779N61141J223320J28410q94977l70150N43983K30842
38293D92915o61488m59915O72285J052970K13201n23135k80086J58565p5149m18908
$$ plain form
38360 -502599 -851193 -233128 769143 821150 -351947 -1388993 -1149014 -384151 -670670
38351 -670670 -2115454 -3175400 -2765305 -1600532 -1077659 -1504020 -2019143 -1926389 -1461714
38342 -1461714 -1215228 -1276415 -1249842 -945725 -701228 -872596 -1226553 -1173437 -586564 30439
38332 30439 355090 728620 1404545 1797312 1241120 241153 -14189 552985 687749 -209922
38322 -209922 -942605 -190657 1482417 2378916 1947609 1173922 876395 743056 186376
38313 186376 -764019 -1655771 -2034369 -1606673 -657936 -219344 -942244 -1872418 -1465790 76810
38303 76810 839450 -12875 -929654 -368513 854807 983217 88240 -281910 262073 492915
38293 492915 -168573 -628488 43797 1096767 1309968 786833 506747 665312 590163 171255
38283A71255J07247J116477J226871Q9514j003996q99103j21900R5070k69434
38274E12001k22687L12400K09359q01498j261130j95627J056636P30099n70034
38265b30481p94366L27784J063860O47354K74591O11571M66873q94907j933614
38256d61335r67447J084103J859585Q12125l66666l73231J71209P5113o41267
38247A192189r20484j99408P31925N87968p07436j613391q17734Q83650J530767
38238F68046O47277l59062n38414n51838r50418r80229j29903O18980L87101m9841
38228a238301K63610O52658J16319o78616n83833j61488n44787r33937K26617
38219b881758J999603J771800m62700j599240j06389J612426J112238l51818k31675
$$ plain form
38283 171255 278502 1394979 2621850 2711364 1707368 808265 686365 781435 512001
38274 512001 289314 601714 811073 9575 -1251555 -1447182 -390546 339553 -230481
38265 -230481 -1024847 -697063 366797 1014151 1288742 1900313 2367186 1472279 -461335
38256 -461335 -1428782 -344679 1514906 2327031 1960365 1587134 1758343 1833456 1192189
38247 1192189 271705 72297 804222 1392190 684754 -928637 -1746371 -862721 668046
38238 668046 1315323 956261 417847 -133991 -1084409 -2064638 -2194541 -1575561 -1188460 -1238301
38228 -1238301 -974691 -322033 -205714 -884330 -1468163 -1629651 -2174438 -3108375 -2881758
38219 -2881758 -882155 889645 426945 -1172295 -1278684 333742 1445980 1094162 862487
38210H62487J049170R98754p27554j818126r56722M53474P39281J51142k55591
38201D96315l69091n29759m05362L73236J085475O84934n19051j056524k74482
38192e14309Q12778R69672K79523k66427j74982J93758L95526L70914J78778j95910
38182B049321o49320r14141p91948k54385N42708J097331P58851l97281j241417
38173A99719q83809P907J75660j91636K23910J432005J724152L77920r20910n89316
38163A555602L82532J36734r96532j168463j21906N25952K8535n31029l53944
38154e42519j12121l83491n57987j64307J10530k87323o26762r0116P88665R37911
38144i27520L07741l44715o44864o83638m33313O3197L64109K48418J76562M12368
$$ plain form
38210 862487 1911657 2910411 2182857 364731 -591991 -138517 600764 751906 496315
38201 496315 127224 -402535 -807897 -434661 650814 1335748 816697 -239827 -514309
38192 -514309 298469 1268141 1547664 1281237 1106255 1300013 1695539 2066453 2245231 2049321
38182 2049321 1400001 485860 -306088 -560473 -17765 1079566 1838417 1441136 199719
38173 199719 -684090 -676183 -500523 -692159 -468249 963756 2687908 3065828 2144918 1555602
38163 1555602 1938134 2074868 1078336 -90127 -212033 313919 342454 -188575 -542519
38154 -542519 -654640 -1038131 -1596118 -1760425 -1649895 -1937218 -2563980 -2654096 -1865431 -927520
38144 -927520 -619779 -964494 -1609358 -2292996 -2726309 -2663112 -2299003 -2050585 -1874023 -1461655
38134a461655L34891m42984r31726L282J659151K148235R76130m14588q52212
38125A018524p75745q64187p01507K08556J102041Q79474j40475o02542o4463
38116E9676N48571M62869k2329l51530m71569l87835J21222Q00440P93879o0341
38106A493053o34224j28176N06957N810r92242p77924O22715J314021M40731o03212
38096A247509n25039N2227J09833n6489P3496p3015q43504j067149Q8489J135975
38086A42333K92432j414300j510030k973P51056K2989l36721N87113J199790M50080
38076A81769k17160M17319J028683J81563q99908l85610Q47543O07720q59072
38067I02847j275115j25674O89272K12289j54190N91301J125120M5654j557583
$$ plain form
38134 -1461655 -1126764 -1569748 -2501474 -2498192 -839041 1309194 2285324 1870736 1018524
38125 1018524 242779 -621408 -1322915 -1114359 -12318 867156 726681 124139 59676
38116 59676 608247 1071116 1048787 697257 225688 -162147 -40925 759515 1553394 1493053
38106 1493053 858829 730653 1237610 1243420 251178 -526746 95969 1409990 1850721 1247509
38096 1247509 722470 774697 884530 828041 901537 828522 -14982 -1082131 -993642 142333
38086 142333 434765 -979535 -2489565 -2492538 -1741482 -1718493 -2055214 -1468101 -268311 181769
38076 181769 -35391 381928 1410611 1592174 692266 306656 1154199 1761919 902847
38067 902847 -372268 -497942 191330 403619 249429 840730 1965850 2011504 453921
38058D53921j507187K79030J640133J097902l64530q27214R4074R86995O05975
38049B459099o22627j341569r85297j35961N44815Q56980N87291l93775j274814
38040c05858p80007Q35683J519804J89356j426635j163955L53821P49082m30790
38031d59499j229891m90643O07677P74298M52069M87823N43738L4614n41997m71690
38021b93501j47720l13458o40057k60725P06971J290441J060333M28771k34923
38012A596132q41076j070729n91654J82092M17651Q3210K0671N53754Q44401J62552
38002A357004q39177r12932k9386M79581j91841j063587o61193Q64547J846628
37993H49644J327932J72595m06233m09747m26245m03750j27652j10319o32529
$$ plain form
38058 453921 -1053266 -774236 865897 1963799 1599269 772055 866129 1853124 2459099
38049 2459099 1836472 494903 -490394 -626355 -81540 775440 1362731 968956 -305858
38040 -305858 -1085865 -250182 1269622 1458978 32343 -1131612 -777791 -28709 -459499
38031 -459499 -1689390 -2180033 -1572356 -798058 -345989 141834 685572 720186 178189 -293501
38021 -293501 -441221 -754679 -1394736 -1655461 -948490 341951 1402284 1831055 1596132
38012 1596132 755056 -315673 -907327 -725235 -307584 -224374 -203703 350051 1194452 1357004
38002 1357004 517827 -395105 -424491 55090 -136751 -1200338 -1861531 -996984 849644
37993 849644 2177576 2350171 1943938 1534191 1107946 704196 576544 466225 -166304
37984a66304n89359R49716K484548J602436j185035k596082j238567M50297K19954
37975f8396o30469k8417J004215K03496j703367j953478l07193O86916Q325n04618
37965c292986K75261R67122N68697K83021R06157R73949m99809j659803n58684
37956b037075J444404J623222L6646r14596l79098J72113r9946k00572N62203
37947B07301J315067J131979K66118o37339j270904j301582n52844K24035N4330
37938e63839o28322m67129N41825Q96345Q7493n18305j3005N81670K49813j91097
37928b4551L90889J336231J211279J18354n99093m98629m01543p67254j002437
37919b36754n30622L59575R18495O76611j70998p87132m24213N33655Q23533L3965
$$ plain form
37984 -166304 -755663 194053 2678601 4281037 3096002 499920 -738647 -288350 -68396
37975 -68396 -698865 -727282 276933 480429 -1222938 -3176416 -3483609 -2796693 -2788368 -3292986
37965 -3292986 -3017725 -2050603 -1481906 -1198885 -292728 681221 181412 -1478391 -2037075
37956 -2037075 -592671 1030551 1067197 152601 -226497 -54384 -154330 -354902 207301
37947 207301 1522368 2654347 2920465 2283126 1012222 -289360 -842204 -618169 -563839
37938 -563839 -1192161 -1659290 -1117465 -221120 -133627 -651932 -664937 -83267 166546 -24551
37928 -24551 366338 1702569 2913848 3032202 2433109 1934480 1532937 765683 -236754
37919 -236754 -767376 -407801 510694 1187305 1016307 229175 -195038 338617 1162150 1196115
37909A196115o91040l54598L58096K64273l63570l56638K99471M35775l50336
37900D37548j067116q53550l1686O30189P89048M30559k56244o84680l41555L35249
37890f12238L32962m47488q92251k39972P88314R66719J73058n68831m58344J58557
37880g99514L48982j26522m36649J24090Q62931M53140r29289j394531L6477J718419
37870a42466J516774j79840j140615n21774L27011K54544k38032l41097k19173
37861f84668k72667k81140J5124L48442M69007M87527L51840j46242o03597k89368
37851f05742N16600O54034n0319l70681K51438O41729j54257j150478r04398K82429
37841h89645J000079Q27242M44903K08458l8660p9240M27225R58169O14792l92669
$$ plain form
37909 1196115 505075 150477 508573 772846 409276 52638 352109 787884 437548
37900 437548 -629568 -1483118 -1514804 -884615 -95567 334992 78748 -605932 -947487 -612238
37890 -612238 -279276 -726764 -1619015 -1858987 -1070673 -103954 69104 -499727 -958071 -799514
37880 -799514 -450532 -577054 -1013703 -889613 -26682 426458 -502831 -1897362 -1860885 -142466
37870 -142466 1374308 1194468 53853 -467921 -140910 113634 -124398 -465495 -684668
37861 -684668 -957335 -1238475 -1223351 -874909 -405902 81625 433465 287223 -316374 -605742
37851 -605742 -89142 564892 514573 143892 395330 1037059 882802 -267676 -1172074 -889645
37841 -889645 110434 937676 1382579 1591037 1552377 1473137 1900362 2858531 3473323 3080654
37831C080654q40071k15104N79141M83507m63053j354769j397984n47145M41057
37822b33767O21675r1701o61956j67924R19044J294624N08887n75484j008799
37813F04599p79357m45809l01487k53271k31187l10191m00479j16031P31339J551354
37803D9480J384105J78549q44989o63477J96375N45183K74859J15558M8897n53748
37793G30792j298490r93856K01388O45584j63957o74821Q3831Q20434K85917m95890
37783h59068o5497Q63426O68480l91149p74800k89581j0635j08900J61871O60230
37773a45623N55375P9522J24011L54374k05151r47531l66174J037491J045620
37764A531914o72497j773780q71169M43091L72613m52114n87247j77667q0578
$$ plain form
37831 3080654 2240583 2025479 2604620 3088127 2625074 1270305 -127679 -674824 -233767
37822 -233767 387908 296207 -365749 -533673 385371 1679995 2188882 1613398 604599
37813 604599 -174758 -620567 -922054 -1175325 -1406512 -1716703 -2117182 -2233213 -1501874 49480
37803 49480 1433585 1612134 767145 103668 300043 845226 1120085 1235643 1284540 730792
37793 730792 -567698 -1561554 -1360166 -714582 -878539 -1553360 -1469529 -649095 -363178 -859068
37783 -859068 -924565 -61139 607341 216192 -558608 -848189 -858824 -967724 -805853 -145623
37773 -145623 409752 489274 613285 967659 762508 -185023 -551197 486294 1531914
37764 1531914 859417 -914363 -1785532 -1342441 -969828 -1421942 -2009189 -2186856 -2267434
37755b267434l6440N74289J198576R12428n661o09566o90177n38936j03669N26301
37745a040289O26098l5457l98921L51696J259129R20157l34169r98922o53602
37736c04280k27471k61327k76246J13025N89034P68383O25222K37372k49823m99637
37726E14252l75836k44206l98797n60687m33712k21890m4962M53590J203847J242745
37716A134344J31190r41427o76594L48385N69560j71519o08827j77807L45125
37707d7570L19785l0608m50176q95329q60113J75127J428351J374133m374r26466
37697H2760l35341O57261O23013j56318n46507m08134l63592m14478o1854N26563
37687c96627O14947Q9396l84114m07941k56933j63260M2318L58621L52507j31735
$$ plain form
37755 -2267434 -2303874 -1729585 -531009 381419 375758 -233808 -923985 -1462921 -1566590 -1040289
37745 -1040289 -414191 -449648 -848569 -496873 762256 1682413 1348244 349322 -304280
37736 -304280 -531751 -793078 -1069324 -956299 -367265 401118 1026340 1263712 1013889 514252
37726 514252 138416 -105790 -504587 -1065274 -1498986 -1720876 -1765838 -1312248 -108401 1134344
37716 1134344 1265534 324107 -352487 -4102 565458 393939 -214888 -392695 -47570
37707 -47570 272215 241607 -208569 -1103898 -1964011 -1788884 -360533 1013600 1009226 82760
37697 82760 -252581 404680 1027693 871375 324868 -83266 -446858 -861336 -923190 -396627
37687 -396627 218320 307716 -76398 -484339 -741272 -904532 -862214 -503593 -151086 -282821
37677b82821m70529J543R38649J215863L29670q67457j179451n46947J4838r8516
37667i45158l59241j56525J63232J834k71682J79053J088747J162075J1104j014581
37657a41142o10834O29588J062995K77120n13922l61445J48529j167o31224p05482
37647h46984n4735K31659n23195j337210q16795P39333J538311O98143n81584
37638i53057p69260l2905L41895m5039l95369j93987J30615J89648K73474N79594
37628h74391O16447J8980n79281k43429Q72681J502889P62876p46238j577776
37619b47242j026940J67719P52705L72285k18639k87772j9441l6481m21090o76947
37609a641843m83975o294N03048R51633J217649J105236O22580O3997k70178l02709
$$ plain form
37677 -282821 -753350 -751807 186842 1402705 1732375 864918 -314533 -861480 -846642 -945158
37667 -945158 -1304399 -1460924 -1297692 -1295858 -1567540 -1388487 -299740 862335 873439 -141142
37657 -141142 -751976 -122388 940607 1217727 703805 342360 490889 489722 -141502 -846984
37647 -846984 -901719 -670060 -1193255 -2530465 -3347260 -2607927 -1069616 -371473 -953057
37638 -953057 -1722317 -1755222 -1413327 -1458366 -1853735 -2047722 -1917107 -1727459 -1453985 -874391
37628 -874391 -257944 -238964 -818245 -1061674 -188993 1313896 2076772 1330534 -247242
37619 -247242 -1274182 -1106463 -353758 18527 -200112 -487884 -507325 -543806 -964896 -1641843
37609 -1641843 -2125818 -2132112 -1629064 -677431 540218 1645454 2268034 2332031 2061853 1759144
37599A759144j77053j65466m41931p82186p05763j15653N04998P78673Q84615
37590A539378R51354N60868m76454j339198j084781m6080N95562M47342J14366
37581A262357q9907m56108q30047n44343K41305L90277m25311r77481l40664N86263
37571a183659M86929l15265m84789J95379O90518N16069L36113N99255P55091
37562A595641L15898j86059k936N60770M54154n87151j447047r49126M90498J139509
37552A384151J10437j324317j262718K91549J420649R16602j99586l61199L12935
37543A288503M77675k94299r85051p14957J05429N03979K24997j26586J842L81541
37533H63073L23973l12803p81568m60133J29897M2646n31626m57106M79432J083892
$$ plain form
37599 1759144 1582091 1416625 974694 192508 -513255 -628908 -123910 654763 1539378
37590 1539378 2490732 3051600 2575146 1235948 151167 105087 700649 1147991 1262357
37581 1262357 1172450 716342 -113705 -658048 -416743 -26466 -451777 -1429258 -1769922 -1183659
37571 -1183659 -696730 -1011995 -1496784 -1301405 -610887 -94818 241295 840550 1595641
37562 1595641 1911539 1725480 1722544 2283314 2737468 2150317 703270 -245856 244642 1384151
37552 1384151 1494588 170271 -1092447 -800898 619751 1536353 1336767 975568 1288503
37543 1288503 1766178 1471879 486828 -228129 -122700 381279 606276 479690 481532 863073
37533 863073 1187046 874243 92675 -367458 -237561 -194915 -726541 -1183647 -704215 379677
37523C79677N82557k72472o04301o83301q80363o21465L69855R86371M16515k11839
37513e38766L15908Q82956k05004j831858j290480J226848K423917Q15925j122307
37504F77139r83070J48672J45721o34633o01292N3901J12143j13410M94707J368236
37494F68114R88079l29289p96267j36084J69592l05130k59970P27899J217022
37485A943966L75527n72549m82872j23917n55058j131344o55449N06566J000309
37476C05179N50949Q0625J23265L07071K37485m7572l83435n58343l42206P019
37466B80037k38418j075716j247516Q8813J733728J778119L01366o90281j28204
37457H01928P60128N01195m80699p42780l0216N59122L27416j92009l06719k10839
$$ plain form
37523 379677 962234 689762 85461 -597840 -1478203 -2099668 -1729813 -743442 -326927 -538766
37513 -538766 -222858 660098 455094 -1376764 -2667244 -1440396 983521 1799446 677139
37504 677139 -305931 -157259 -11538 -646171 -1247463 -1193562 -1081419 -1194829 -700122 668114
37494 668114 1656193 1326904 530637 394553 564145 259015 -955 726944 1943966
37485 1943966 2319493 1746944 1264072 1140155 585097 -546247 -1201696 -695130 305179
37476 305179 856128 936753 1060018 1367089 1604574 1557002 1173567 615224 273018 280037
37466 280037 41619 -1034097 -2281613 -2192800 -459072 1319047 1620413 930132 801928
37457 801928 1562056 2063251 1582552 839772 809556 1368678 1696094 1504085 1197366 986527
37447I86527m67606r31256q45480P810Q14049O86447j77008p28871m03200K36800
37437h21788L30541j70220n40654k64770L49814N81812J47141m96000p22258m74331
37427b080713j44674K15396R44145J732864J399318l80921j829410j056201R81395
37418b18801J416400l42897j560031l69808J204128M68651j486326j431292P93382
37409a526594J990113O72799q20588l71733O71203J94797j017770q00303O63822
37400c44254J250327L67385m47424k67400J12955J8301j63488l17551j009062
37391h00211j879294j424929N98765K131553J495600j40466n26116M27017R54753
37382H36672M11189n8229J98873L36166j75683m45777J64705O71370N2667q32480
$$ plain form
37447 986527 518921 -412335 -1257815 -1250005 -435956 250491 73483 -655388 -1058588 -821788
37437 -821788 -491247 -661467 -1202121 -1466891 -1117077 -535265 -388124 -884124 -1606382 -2080713
37427 -2080713 -2225387 -2009991 -1065846 667018 2066336 1685415 -143995 -1200196 -218801
37418 -218801 1197599 854702 -705329 -1075137 128991 597642 -888684 -2319976 -1526594
37409 -1526594 463519 1136318 315730 -56003 615200 809997 -207773 -1008076 -344254
37400 -344254 906073 1273458 826034 558634 671589 689890 526402 208851 -800211
37391 -800211 -2679505 -4104434 -3505669 -1374116 121484 -18982 -545098 -118081 836672
37382 836672 1247861 1189632 1388505 1724671 1548988 1103211 1267916 1939286 1991953 1159473
37372A159473m51471Q68706J275513J59419j011142r47420k09394L8308k35770
37363F46222l33118j19188M9849J35156K68320K24917j54689m25709j97981J11762
37353B05541K2471l6589M63047Q54218J25445j192472j507828n79301J33569j51389
37343a663288m44752O4314N57946J59745m01653n7083O98360O54201o4475l08463
37333h05148J63265N29708M53773L70222L16133j37875p21901n91339J59546M22507
37323A58891j16062l78738L18104J090442R04880J53780j67152q0702l33351r54119
37313E95973j205631q07376k60716L8974K01404K82986R0544k51442k07033L59270
37303a163047Q12427O16312J55452J49238N03253M04205m26381j227157j222067
$$ plain form
37372 1159473 708002 1576708 2852221 3011640 2000498 1053078 843684 881992 646222
37363 646222 313104 193916 243765 378921 647241 872158 717469 291760 93779 205541
37353 205541 228012 191423 654470 1508688 1634133 441661 -1066167 -1645468 -1511899 -1663288
37343 -1663288 -2108040 -2043726 -1485780 -1326035 -1727688 -1784771 -1086411 -432210 -496685 -805148
37333 -805148 -641883 -112175 341598 711820 1027953 890078 168177 -423162 -263616 158891
37323 158891 42829 -335909 -17805 1072637 1977517 2131297 1964145 1883443 1550092 595973
37313 595973 -609658 -1417034 -1677750 -1638776 -1437372 -1154386 -1063842 -1315284 -1522317 -1163047
37303 -1163047 -350620 265692 421144 570382 1073635 1477840 1051459 -175698 -1397765
37294a397765o11508r1732J64317L98899M60696o005n75316k41958J011645J739642
37284H50915Q07346r89803j870280j216081J2954P20559O86936K47987k18505
37275i67972l69423o1004M11122O01292M17796L7907m30196p78291n63034K43471
37265a458332Q30161N28811j20434j71712J95520O7515m81348m02719M76019R99686
37255D63167N01362j99415k19736J03974P9215k08857m09489o26387q05808l15207
37245a637181R24678J730894J161103J1565l51007l2795j61128q15738r06364
37236g5973q2153O65184O15286L22790M71003O75082J48645r87818j737018j371620
37226a356592j58716R57604J199290N83153j88482m98966l86944k51017k45658
$$ plain form
37294 -1397765 -2009273 -2101005 -1936688 -1537789 -1077093 -1083098 -1658414 -1900372 -888727 850915
37284 850915 1658261 668458 -1201822 -2417903 -2404949 -1684390 -997454 -749467 -967972
37275 -967972 -1337395 -1398399 -987277 -385985 31811 69718 -360478 -1138769 -1701803 -1458332
37265 -1458332 -628171 -99360 -219794 -391506 -195986 -128471 -609819 -1012538 -536519 463167
37255 463167 964529 765114 545378 649352 728567 519710 110221 -516166 -1321974 -1637181
37245 -1637181 -712503 1018391 2179494 2191059 1840052 1807257 1646129 830391 -75973
37236 -75973 -158126 507058 1122344 1445134 1916137 2591219 2739864 1752046 15028 -1356592
37226 -1356592 -1515308 -557704 641586 1224739 1036257 537291 150347 -100670 -346328
37217c46328k73343l57173n83216p36844m12355M33028J269045J414627O53185
37208A060626m59616r56581m51571K66630J49070o11362p84279J3256O79219M13011
37198f81597Q467M03736R79584O47950j63936k34514K67051J36548n38156m20911
37188D04222N00693N19421q66605j673103l93830J438168J390636l31707j402526
37179d14631p70028L77939Q37031P52630N56626J28464m73346o83989l86164j58964
37169b34432j06877M47162J478701J666286K98929j212525j082891K20992O48810
37160B124155l67174j186816n89503M70722N37317k11875o32081m99836m22299
37151g77390l99560J40219J019425J298454O95632n4691m12393n65363n70191
$$ plain form
37217 -346328 -619671 -976844 -1560060 -2296904 -2709259 -2276231 -1007186 407441 1060626
37208 1060626 601010 -355571 -807142 -540512 -391442 -1002804 -1787083 -1773827 -1094608 -681597
37198 -681597 -673130 -269394 710190 1358140 1194204 959690 1226741 1363289 825133 404222
37188 404222 904915 1424336 557731 -1115372 -1509202 -71034 1319602 987895 -414631
37179 -414631 -1184659 -806720 30311 782941 1339567 1468031 994685 310696 -75468 -234432
37169 -234432 -341309 105853 1584554 3250840 3549769 2337244 1254353 1475345 2124155
37160 2124155 1756981 570165 -19338 451384 988701 776826 144745 -355091 -777390
37151 -777390 -1176950 -1036731 -17306 1281148 1976780 1922089 1509696 944333 374142
37142C74142q6741O35077O06959m28198j304055r37152K18576R32776P63392J86550
37132I61326k30021j50140M36052Q86713L75718p90533j213626l75079N27632
37123D28042N24114L24150O35754M90876r53308k204308j363907N42001Q24175
37114g52411n93700j044360M69657J706262R80268k65910k46078K42218l00331
37105A95615j190965q75534K27561N39562Q0036J32500P23104O77448m8445k62930
37095A97952J82299Q7056p62089r13687L48934J589366J226577k45397j108959
37086F02052o70920K93793P78631M21584m57089j073200p69561J78791P63141
37077F7222N74048L11764N05372N17239l20740j232065q90775M23627R29253j05344
$$ plain form
37142 374142 287401 922478 1529437 1101239 -202816 -1139968 -921392 11384 774776 961326
37132 961326 731305 581165 1017217 1903930 2279648 1489115 275489 -99590 428042
37123 428042 952156 1276306 1912060 2402936 1449628 -754680 -2118587 -1576586 -752411
37114 -752411 -1346111 -2390471 -1920814 -214552 765716 499806 253728 495946 195615
37105 195615 -995350 -1870884 -1643323 -1103761 -1023725 -891225 -168121 509327 460882 197952
37095 197952 380251 467307 -294782 -1208469 -859535 729831 1956408 1711011 602052
37086 602052 -68868 224925 1003556 1425140 968051 -105149 -874710 -695919 67222
37077 67222 641270 953034 1458406 1975645 1654905 422840 -467935 -44308 884945 779601
37067G79601j174244o64626Q07411J329657M14146n55559n47064j86530l80783
37058a77991p94343n67075K19701P66930P69452M78623l9106o84860o95450N23383
37048b00736J965635J780767j78254j805367j405682J34034P35601r7282r91560
37039f2844q17721N041M13194J18492k49277r1722M14156N90705J73715l05808
37029A87931k19187L56253Q57009R66088O81650Q785p84469r68425k41014N06803
37019A351424L04698l48152k87075K65556Q0452o91482m96837Q05854J221250
37010B205688k70725j837844j500594m7455N05763K085k80476j15413k85030o51537
37000b275538l11565N73455R19346N73507L85353N24765L26340k16731l49980
$$ plain form
37067 779601 -394643 -1059269 -251858 1077799 1491945 936386 389322 202792 -177991
37058 -177991 -972334 -1539409 -1319708 -552778 216674 695297 656191 -28669 -724119 -200736
37048 -200736 1764899 3545666 3367412 1562045 156363 290397 1025998 928716 -62844
37039 -62844 -880565 -875524 -462330 -343838 -593115 -684837 -270681 320024 493739 187931
37029 187931 -31256 324997 1182006 2148094 2829744 2838529 2054060 1085635 844621 1351424
37019 1351424 1656122 1307970 1020895 1286451 1366903 675421 178584 984438 2205688
37010 2205688 1934963 97119 -1403475 -1450930 -945167 -943082 -1223558 -1338971 -1624001 -2275538
37000 -2275538 -2587103 -2013648 -1094302 -520795 -135442 389323 715663 498932 148952
36991A48952o918Q1748j99529k06299J34166J95493p1782m0985L77044O89389
36981A101279Q94650J221239J004586m78923k125858j907479P7230J429466Q47876
36972B064066k83169m60562k03345m58076o82043p1816O53201L42083o19862r30986
36962f50509l25999L85862P23000Q22972P48220M99573L68453M63200L00046m16927
36952B917891j110320j122559o45958j92594K08139N45031L09264o10786j173403
36943h75295m18736R77044J468643O90903k77233n23916j86709K52558O28915
36934A736174Q57025P17158J78126m01319n72651k12581L04216L47489k93450
36925B660187j001217j023425n23100k95569m47252k52849M78691R25823N83216
$$ plain form
36991 148952 142034 223782 24253 -182046 -47880 147613 75831 34846 411890 1101279
36981 1101279 1995929 3217168 4221754 3742831 1616973 -290506 -213276 1216190 2064066
36972 2064066 1780897 1320335 1116990 658914 -23129 -94945 558256 900339 280477 -650509
36962 -650509 -976508 -590646 132354 955326 1703546 2203119 2571572 3034772 3334818 2917891
36952 2917891 1807571 685012 39054 -153540 54599 599630 908894 298108 -875295
36943 -875295 -1294031 -316987 1151656 1842559 1565326 1041410 854701 1107259 1736174
36934 1736174 2593199 3310357 3488483 3087164 2514513 2301932 2606148 2953637 2660187
36925 2660187 1658970 635545 112445 -183124 -630376 -883225 -404534 521289 1104505
36916A104505O2103k9977k9886l33290n35425k81885m3779j40185M1063P92115
36906F05359J077111J21918r01185m15647R93493J387914M81380j56088R6333
36897C290588R419j044120j720908q98252L25704K69497p33091r48947N9979R13736
36887d76395N79565k79155n03730J2977N71063P73260P05738M07992j35630o27336
36877A028349p02540m98491m01814k99101J93055P35693M71075m76750p92148
36868g42672P2295Q12800K02334q72356p30869M64588J110088Q00154O42870R42309
36858B701541N99981o92162j561351j092718k29130o4737k11374K9905K04142
36849c15903k94572q03384l20609Q44177J503276J147096J85321p96027j284663
$$ plain form
36916 1104505 1166608 1136631 1106745 773455 238030 -43855 -87634 -227819 -186756 605359
36906 605359 1682470 1804388 903203 487556 1481049 2868963 3350343 3194255 3290588
36897 3290588 3300007 2255887 534979 -363273 -37569 231928 -501163 -1450110 -1390131 -476395
36887 -476395 103170 -175985 -679715 -666738 -95675 677585 1383323 1791315 1655685 1028349
36877 1028349 325809 -172682 -574496 -873597 -680542 55151 526226 49476 -742672
36868 -742672 -670377 142423 344757 -527599 -1258468 -793880 316208 1116362 1759232 2701541
36858 2701541 3301522 2609360 1048009 -44709 -273839 -338576 -549950 -520045 -315903
36849 -315903 -610475 -1413859 -1734468 -890291 612985 1760081 1945402 1149375 -135288
36840a35288r81712l02784m7797j79346R9053P45058P46639O4767o079P96691
36830G99202R18572k43024q39386M63176J960388J492262j27918o99516k43938
36821C479818l40155r29435o76099J24816q7854j138004j274133k94842K16490
36812i19398q0060K37156J415487J758279N72165n38970l18485L17521J63140
36803B606835m05824n25132k82544j20555o8686j97010n88179n76041M78201J512701
36793A833766P61937j292414k123834q47798N96374P43090O04264J131826J159070
36784B566281k70192j594160r72640O66090J055721J5236p07766l26004K71603
36775G04169L63127K12011J16071o634r7405j7801m519k95995n76894m29300N3276
$$ plain form
36840 -135288 -1117000 -1419784 -1467581 -1646927 -1547874 -802816 -56177 8590 2511 799202
36830 799202 1717774 1474750 635364 1098540 3058928 4551190 4423272 3723756 3479818
36821 3479818 3139663 2210228 1534129 1658945 1571091 433087 -841046 -1135888 -919398
36812 -919398 -999458 -762302 653185 2411464 2983629 2444659 2126174 2443695 2606835
36803 2606835 2201011 1675879 1393335 1272780 1204094 1007084 418905 -157136 321065 1833766
36793 1833766 2595703 1303289 -820545 -1668343 -1071969 -328879 275385 1407211 2566281
36784 2566281 2296089 701929 -270711 395379 1451100 1466336 758570 432566 704169
36775 704169 1067296 1279307 1395378 1388744 1291339 1273538 1269019 973024 396130 -33170 20106
36764B0106N88993J049177J073439K39769q59532q34470M43022J205663K65781
36755C191948j058040q49644N53709J228838N60474k22484k11307M3615k20943
36746C016166p84026r35590m85188J07618L41463K40935K79798O09195O25613
36737C015984j27693q99179n56661N82092R79800J34945p35409o67476j88872
36728A537531J9482K38297O36704M83047n06300j238195p65844L21253J021136
36719A747111J292681J306227O19855o69842j223696l29480O62871K82878p49781
36710B938824p93060Q4178N22032K25163Q5262L59257M07811P0353j06631J13564
36700C906753N06081R53801J252677Q97341l9450n80973l32200k65823r36027
$$ plain form
36764 20106 609099 1658276 2731715 2971484 2111952 1277482 1720504 2926167 3191948
36755 3191948 2133908 1284264 1837973 3066811 3627285 3404801 3193494 3237109 3016166
36746 3016166 2232140 1296550 811362 918980 1260443 1501378 1781176 2390371 3015984
36737 3015984 2888291 1989112 1432451 2014543 2994343 3129288 2393879 1726403 1537531
36728 1537531 1557013 1795310 2432014 2915061 2408761 1170566 404722 725975 1747111
36719 1747111 3039792 4346019 4965874 4296032 3072336 2742856 3405727 3688605 2938824
36710 2938824 2145764 2229942 2751974 2977137 3062399 3421656 3829467 3899820 3793189 3906753
36700 3906753 4412834 5366635 6619312 7516653 7477203 6896230 6564030 6298207 5362180
36691E362180j188223r7336J132413R97308J89779K13635O44092J31344p76878
36682F608314m47396P46952Q47472l72120j120557o33720J2954K27879N12531
36673F382309N96088l61581j359484k28029K521161L430013R81253j918008k062314
36664G981408k47313O25747o8694n21442L24863J543302J815187Q23821o86761
36655A1590118j407565n47923J007127J464742N19243k25323K06694P81135N58455
36646A3946703M19750J181682J614008M01819j099245n06758J728569K634078
36638B0320606J049865o71449q0616K127822L490232L097584K173678K026224
36630C3533946K744316L787013M811405N702820O432563P161860Q165438R555698
$$ plain form
36691 5362180 4173957 4076621 5209034 6206342 6396121 6609756 7253848 7385192 6608314
36682 6608314 6160918 6907870 7755342 7383222 6262665 5628945 5641899 5869778 6382309
36673 6382309 6978397 6616816 5257332 5029303 7550464 10980477 11961730 10043722 7981408
36664 7981408 7734095 8359842 8291148 7769706 8094569 9637871 11453058 12276879 11590118
36655 11590118 10182553 9634630 10641757 12106499 12625742 12400419 12607113 13388248 13946703
36646 13946703 14366453 15548135 17162143 17563962 16464717 15957959 17686528 20320606
36638 20320606 21370471 20699022 20618406 22746228 26236460 29334044 31507722 33533946
36630 33533946 36278262 40065275 44876680 50579500 57012063 64173923 72339361 81895059
36622H1895059J1343367J3661053J6448141J9051787K0984984K3219061K7625233
36615B14228685L4561191M2127000M8483761N3008196N3256522M3044577J8141828
36608E06851760j5549359m3777642n6405269n5605417m9905110m3681642l6177817
36601B05749504k7878838k2037818j9774002j8351322j5611276j2694577j1076140
36594G8325531r960690q250373o605792n848034n307970m315534l574271l624465
36586C0838402l573722k718746j870519j759527j689342j105580q90669j612701
36578A5617596k055097j169392p7063l00720j219635j224144m19325j54031n29926
36569H468263l97038M66363R67751M51706n82809j443402j750327j220954r2834
$$ plain form
36622 81895059 93238426 106899479 123347620 142399407 163384391 186603452 214228685
36615 214228685 248789876 290916876 339400637 392408833 445665355 488709932 506851760
36608 506851760 491302401 447524759 391119490 335514073 285608963 241927321 205749504
36601 205749504 177870666 155832848 136058846 117707524 102096248 89401671 78325531
36594 78325531 68364841 60114468 53508676 47660642 42352672 38037138 34462867 30838402
36586 30838402 27264680 24545934 22675415 20915888 19226546 18120966 17230297 15617596
36578 15617596 13562499 12393107 12316044 12015324 10795689 9571545 9152220 8998189 8468263
36569 8468263 8071225 8537588 9505339 9957045 9374236 7930834 6180507 4959553 4866719
36560D866719N48008J4032p63453m62879N63661Q19265J4959n76529j63395N52410
36550E412798O83839K93229j90937p00778j152059j078822k29452Q47669J245377
36541E130864O20980m41692r23434l32494O88956R58444J51520p43746p01437
36532D407961j881K36158l37280p88792j41162J257783J967873J111445m93201
36523G218904j276715r03084n45618r43128j241014n68686L00840K06551l48980
36514A899070j26331M88821J14237r32722r16640K15087N31620n01096r23093
36505a51047L56449J581110J059935j86733n25564m22356r22152j186562j2885
36496d09805J487663J309678j61247p59379L4934O29800J24065n81057o01630
$$ plain form
36560 4866719 5414727 5428759 4665306 4202427 4766088 5585353 5600312 5023783 4860388 5412798
36550 5412798 6096637 6389866 6198929 5498151 4346092 3267270 3037818 3885487 5130864
36541 5130864 5751844 5310152 4386718 4054224 4743180 5701624 5853144 5109398 4407961
36532 4407961 4406080 4642238 4304958 3516166 3375004 4632787 6600660 7712105 7218904
36523 7218904 5942189 5039105 4493487 3550359 2309345 1740659 2041499 2248050 1899070
36514 1899070 1772739 2261560 2375797 1443075 526435 741522 1273142 772046 -151047
36505 -151047 205402 1786512 2846447 2659714 2134150 1711794 789642 -396920 -409805
36496 -409805 1077858 2387536 2226289 1466910 1501844 2131644 2255709 1674652 1073022
36487A073022j91059J90747M73600M88182P4794l30543k44820k2798j92128l86745
36477I32252o5910L00133K9300m15439k37652J73449L086l87719k11966R6480
36467B16014k49959n83030J48613J094279N81654q53596j012282L57687J063727
36458G63107N1090j008607o30798K08940K4941p19709o21200L61076J023916P16968
36448A69724l3646l88723p9393L91076L13613k14382k24367O00851J044468P6409
36438A655630j265904j244235j24016L14706l25360o74550j15371M03036L66139
36429a009925M78707R45257Q92994J43447k50558R6396K22773k98587n86543k63925
36419C70036j94450o15582m67395M65346P47630j84475p17154K39533J175461
$$ plain form
36487 1073022 881963 1072710 1546310 2034492 2109286 1778743 1533923 1511125 1318997 932252
36477 932252 866342 1166475 1195775 780336 542684 716133 719219 331500 119534 216014
36467 216014 -33945 -616975 -468362 625917 1207571 353975 -658307 -300620 763107
36458 763107 814197 -194410 -825208 -616268 -591327 -1311036 -1932236 -1571160 -547244 169724
36448 169724 136078 -252645 -332038 59038 372651 158269 -66098 534753 1579221 1655630
36438 1655630 389726 -854509 -978525 -663819 -989179 -1663729 -1779100 -1376064 -1009925
36429 -1009925 -531218 414039 1307033 1450480 1199922 1296318 1519091 1220504 633961 370036
36419 370036 175586 -439996 -907391 -442045 305585 121110 -596044 -356511 818950
36410H18950M39255q97458p47084O62443J342064O27899l32420p06770p65272
36401D41607p76126o32000m38468l32314k7162N11822N51265k19203p41019l4736
36391a696334J159254J481444R34972L64967k53205j342156k143969j468272K07635
36382b755664J118950O65027p1119k33988q8977O3908L61654N71991K18422k68273
36372d18069J00503J090202J199104j48185j613288j701795m61299J040358J906283
36363I93814J638053K53043j247543j497266m46782M65067L42529j4202L01046
36354G87759O79073R1452j009738j242667l86988L63957K18871k74214l27038
36345a099533j1705J50430L4440j22553j83035j27297J10160M73562O46601L72847
$$ plain form
36410 818950 1258205 360747 -386337 276106 1618170 2246069 1913649 1206879 441607
36401 441607 -334519 -966519 -1404987 -1737301 -1764463 -1252641 -701376 -920579 -1661598 -1696334
36391 -1696334 -537080 944364 1879336 2244303 1991098 648942 -1495027 -2963299 -2755664
36382 -2755664 -1636714 -971687 -1042806 -1276794 -1365771 -1301863 -940209 -368218 -149796 -418069
36372 -418069 -317566 772636 1971740 1823555 210267 -1491528 -1952827 -912469 993814
36363 993814 2631867 2884910 1637367 140101 -306681 158386 500915 486713 787759
36354 787759 1466832 1558284 548546 -694121 -1081109 -717152 -498281 -772495 -1099533
36345 -1099533 -1111238 -960808 -926368 -1048921 -1231956 -1359253 -1249093 -775531 -128930 243917
36335B43917k10041p49953j013725q58507j58821Q88337J610180J469148P37768
36326A958303J41928m3951l8441J22435N13710O15444k55726j513327j518865
36317a8490K5373J107186N7278j820078j925021n9224J498834J452242Q77507
36308A195607P70750M04689p78430j538695p43274M51553J93396j116533j404078
36299b565015j16849J060725Q55906Q9008R8169P64988R99933M50777j69085k10680
36289A257877J20288J99184j06856k37113K31281P63905M08316p51963j400863
36280D84056p42216K16633k5151j289572j894965r34046O32102J371934J018430
36271a162795L17032q8387j03830P6422K03349J18059n4785m021L18382N44857
$$ plain form
36335 243917 33876 -716077 -1729802 -2588309 -2747130 -1858793 -248613 1220535 1958303
36326 1958303 2100231 2056280 2017839 2140274 2653984 3269428 3013702 1500375 -18490
36317 -18490 6883 1114069 1171347 -648731 -2573752 -2632976 -1134142 318100 1195607
36308 1195607 1966357 2371046 1592616 53921 -689353 -237800 -44404 -1160937 -2565015
36299 -2565015 -2681864 -1621139 -765233 -676225 -578056 186932 1186865 1637642 1468557 1257877
36289 1257877 1378165 1577349 1470493 1233380 1464661 2228566 2636882 1884919 484056
36280 484056 -258160 -41527 -66678 -1356250 -3251215 -4185261 -3553159 -2181225 -1162795
36271 -1162795 -845763 -934150 -1037980 -961558 -758209 -640150 -694935 -698956 -380574 164283
36261A64283L50690j12809l89209j89253L76889Q70439P79141o4017j178360j721224
36251a113430j249685j60085O82455O99181K0605o70023o73812J50715J195688
36242a118391J569124R22966j57632p05796l83286J50936K2905p56339j227105
36233a682618o23849O72688J573020J486715P75484J24982j34689q7738k0056
36224B083939k47758q12433j228738q81151J50078R79610Q88125J70265k69902
36215H32035l0818L79815K62915l76129q23493n36026J70274N20907K66346j20383
36205E45443k71312m13951p37228q17655k55725M96197O42943J85879j47706j5389
36195g88504K12574K37506K32876L22476K74856n0102l85699l88951l5083L54657
$$ plain form
36261 164283 514973 402164 12955 -176298 200591 1071030 1850171 1786154 607794 -1113430
36251 -1113430 -2363115 -2523200 -1840745 -1141564 -1120959 -1790982 -2464794 -2314079 -1118391
36242 -1118391 450733 1373699 1216067 510271 126985 277921 300826 -455513 -1682618
36233 -1682618 -2306467 -1633779 -60759 1425956 2201440 2326422 2191733 2103995 2083939
36224 2083939 1836181 1023748 -204990 -1086141 -936063 43547 931672 1101937 832035
36215 832035 801217 1181032 1443947 1067818 244325 -291701 -121427 399480 665826 545443
36205 545443 274131 -139820 -877048 -1694703 -1950428 -1454231 -811288 -625409 -773115 -788504
36195 -788504 -575930 -338424 -105548 216928 491784 441682 55983 -332968 -368051 -13394
36185a3394L44541j33493m14344K03389J118101P63500r73885j871047l19220
36176a295852J886094J752339n04366j735899n65954Q65244N84407m14862m77723
36167I3428j06765n14146j099201o06798L64208K86560n49373m31589Q73845J663674
36157b6157Q96465m65378j101457r48155o40957l46387K32671J139895J819324
36148E59864J488337R5695j109025p33399P85505J455514N14678m33706o0400
36139B563063M62774m65984j910695j735610j16241P60403K34049j32742L87944
36130D6961M73629o15367j457489p73876M94399Q39996N01035N93462R97338P29057
36120A829145j71718o40987k96487R3662p9851m43071l74604O5524L02545J05081
$$ plain form
36185 -13394 331147 197654 -216690 -13301 1104800 1868300 894415 -976632 -1295852
36176 -1295852 590242 2342581 1838215 102316 -463638 401606 986013 571151 93428
36167 93428 -13337 -527483 -1626684 -2233482 -1869274 -1582714 -2132087 -2563676 -1689831 -26157
36157 -26157 870308 404930 -696527 -1644682 -2285639 -2632026 -2399355 -1259460 559864
36148 559864 2048201 2143896 1034871 301472 1086977 2542491 3057169 2623463 2563063
36139 2563063 3025837 2559853 649158 -1086452 -1202693 -442290 -208241 -340983 46961
36130 46961 520590 -94777 -1552266 -2326142 -1831743 -991747 -490712 102750 1100088 1829145
36120 1829145 1657427 1016440 719953 813615 733764 290693 -83911 -18387 284158 389239
36110C89239l9046M23321J143192J022464k88399j524074j219100K60425J086280
36101A254302L89106p40967r59391l60259Q8082j4502l29982n36913n81852m35599
36091b227975r2824K97478N45385N54530L32304P6262Q6803K43279q6998r93193
36081a264949j312731k9636J841357K110094L25272j506715j576036l83932M63438
36072a333838M15277M0396j62517q3383K42633M77671J92088k75181m1191P31911
36062B03866O82202n08901j119074P2230J564291J226667m15690j099757l87683
36053B18151M6771m69795p08266j51220q0414j096148j710852p80675M76969N13993
36043c741486j5350L92213J377410J429708N75922K19993O05686N45850k43673
$$ plain form
36110 389239 350193 773514 1916706 2939170 2650771 1126697 -92403 168022 1254302
36101 1254302 1643408 902441 -56950 -417209 -329127 -343629 -673611 -1210524 -1792376 -2227975
36091 -2227975 -2320799 -2023321 -1477936 -923406 -591102 -514840 -428037 -184758 -271756 -1264949
36081 -1264949 -2577680 -2607316 -765959 1344135 1669407 162692 -1413344 -1797276 -1333838
36072 -1333838 -918561 -878165 -1040682 -1124065 -881432 -403761 -211673 -486854 -528045 203866
36062 203866 886068 377167 -741907 -669677 894614 2121281 1705591 605834 218151
36053 218151 264922 -204873 -913139 -1064359 -1144773 -2240921 -3951773 -4732448 -4255479 -3741486
36043 -3741486 -3756836 -3364623 -1987213 -557505 18417 238410 844096 1389946 1146273
36034A146273n60437R6008N78952N6624o64925o72094m26746o83926j053404p50696
36024b934371O7346P24315J042662J065633N75061k14750l74495L23412O67074
36015I41887j38309r16067l28299P35694M92422p00707q62045L06691R73212K67372
36005G71851m70309j86730K52002q2200n29843k42834K92130L32562J51514Q9103
35995C77246l48178j237871j411142k41364R55641Q13038R6589L42764J268028
35986F14751J368533M41085l64432o23480r45928j351790j067188o4704O59790
35977a333363N62597J24169j44132j85917Q5508O80243J007057N25890k03424
35968A118628k30750K16867J09150n90896q49959k91883L25940M75093M29349
$$ plain form
36034 1146273 585836 681844 1260796 1317420 652495 -19599 -446345 -1130271 -2183675 -2934371
36024 -2934371 -2867025 -2142710 -1100048 -34415 540646 325896 -48599 274813 941887
36015 941887 803578 -112489 -440788 294906 787328 86621 -775424 -468733 504479 771851
36005 771851 301542 114812 366814 284614 -245229 -488063 -195933 136629 288143 377246
35995 377246 29068 -1208803 -2619945 -2861309 -1905668 -1092630 -996041 -653277 614751
35986 614751 1983284 2424369 2059937 1436457 490529 -861261 -1928449 -1993153 -1333363
35977 -1333363 -770766 -646597 -790729 -976646 -891138 -210895 796162 1322052 1118628
35968 1118628 887878 1104745 1213895 622999 -226960 -518843 -192903 282190 711539
35959G11539L31213p2335n67256n31932n5901J33914j9160J18995M79328K32469
35949G60874o22928j008850n23986j13371m34333p88594l39719O37398J316050
35940a117459J242053L34696j035445j699012o45424J264964J860592M97195r84893
35931b82733q40747L70249J038182P15662K3382n79191q03954k26787Q97989J297031
35921A609083K68195j066683j184387k16233N11378M36559J10271k6115p7853
35912C64215q8561M3923J26977r5973l88731l09486J29283N85452Q50341P24221
35902A941661o2344j197210j614690p58193M35893O56695l9370m79022r5392N17394
35892f94578O76982L82639m8021m07110n24497k87153J42806M56154N29692L82291
$$ plain form
35959 711539 1042752 970417 403161 -128771 -184672 -50758 -69918 49077 528405 760874
35949 760874 137946 -870904 -1394890 -1508261 -1942594 -2731188 -3070907 -2433509 -1117459
35940 -1117459 124594 459290 -576155 -2275167 -2920591 -1655627 204965 702160 -282733
35931 -282733 -1123480 -753231 284951 1000613 1023995 444804 -359150 -585937 312052 1609083
35921 1609083 1877278 810595 -373792 -590025 -78647 357912 468183 442068 364215
35912 364215 275654 319577 446554 350581 -38150 -347636 -218353 367099 1217440 1941661
35902 1941661 1879317 682107 -932583 -1690776 -1254883 -598188 -637558 -1116580 -1211972 -694578
35892 -694578 -17596 365043 317022 -90088 -614585 -901738 -758932 -302778 226914 609205
35882F09205p826m99376o39219j69081M68783N83554J22654k91060j86657K32858
35872B23835M40210K10175k14463m98806o07750o58049m65185K87107J233596
35863d9330J336261K71561q24580q49147l62722n58918j128765p39189N46429
35854b358400J164652O01971J51741N31600O64933j73672q40459l34763K95669
35845b96728k37033j079796o18085P13744J082229J96935m34511m7424M74897
35836b45772L91734J34306J71368K09900k1965k48685k54183j49166J25757O77801
35826G91095R70883K53017j145515j898189j328867j46095O61707Q23962M84153
35817e33849k02576q11486p49163j2363P26576J035409J110848J063469N67356
$$ plain form
35882 609205 601379 102003 -537216 -706297 -237514 346040 468694 177634 -9023 223835
35872 223835 664045 874220 659757 160951 -446799 -1104848 -1570033 -1282926 -49330
35863 -49330 1286931 1558492 733912 -115235 -477957 -1036875 -2165640 -2904829 -2358400
35854 -2358400 -1193748 -591777 -440036 91564 756497 582825 -257634 -592397 -296728
35845 -296728 -533761 -1613557 -2231642 -1517898 -435669 -238734 -673245 -720669 -245772
35836 -245772 145962 280268 451636 661536 639571 390886 136703 -12463 113294 791095
35826 791095 1761978 2014995 869480 -1028709 -2357576 -2503671 -1841964 -1018002 -533849
35817 -533849 -736425 -1547911 -2297074 -2309437 -1582861 -547452 563396 1626865 2194221
35808B194221l89259j069353q49265j03392K73177r458l96380k80852K54638N60453
35798A84530K47433k13744j0613Q07187J132577K30112j079622j343054l47489
35789c92683O87868P53992J29921l17701k34035J22077L85229L59310P1711k22483
35779A343206k80953j99653k69719m87737n19198k40455j1975k14259o84804q36867
35769b402414l37435M70630R41209Q83271P10151P16486N62365j19029q89110
35760E36124r14809j30492O61811Q48572N12248n7595n65125m77427L95870J054967
35750A864144K89592j261311j508538O2343J381099Q05692m71855n24564K37624
35741H74226R7334q37830q57388L06908R47623J67559p89374o22240K26605O39508
$$ plain form
35808 2194221 1804962 735609 -113656 -217048 56129 46671 -349709 -630561 -375923 184530
35798 184530 431963 218219 207606 1014793 2147370 2377482 1297860 -45194 -392683
35789 -392683 295185 1049177 1179098 861397 627362 749439 1134668 1493978 1565689 1343206
35779 1343206 1062253 862600 592881 105144 -414054 -654509 -666484 -880743 -1565547 -2402414
35769 -2402414 -2739849 -2269219 -1328010 -444739 265412 981898 1544263 1425234 536124
35760 536124 -378685 -509177 152634 1001206 1513454 1455859 890734 413307 809177 1864144
35750 1864144 2153736 892425 -616113 -553770 827329 1633021 1161166 636602 874226
35741 874226 971560 133730 -723658 -416750 530873 698432 -90942 -713182 -486577 152931
35731A52931M18461L221l99400o27881l01963N33109J094330P90621N936m68975
35721A200390l46378J14825M97339M10553k21047q52757q06188j99067J79519
35712b2811L0550j06639J45161M10464L02953L0393j82198n83960j228623j398169
35702b602879m51301J051227J795209J232687J00449n80624n20838q3918L10608
35693B50620L94778l626p43284j174011o84508L94510R33648L98031l73801l18010
35683i25653L65084O39340K45160q2786P3386L05335K58924L1628l93191j026920
35673e09693j135490K9842J558557J559191J2269q57001P3060J027341K64219
35664B022295j050218q12053O45883J341248P56142n2896o34778j167151r84282
$$ plain form
35731 152931 571392 574613 175213 -452668 -754631 -221522 872808 1663429 1669365 1200390
35721 1200390 854012 968837 1466176 1876729 1655682 802925 -3263 -202330 -22811
35712 -22811 7739 -98900 46261 456725 759678 790071 607873 23913 -1204710 -2602879
35702 -2602879 -3054180 -2002953 -207744 1024943 1125392 544768 23930 -59988 250620
35693 250620 645398 641772 -101512 -1275523 -1960031 -1565521 -631873 -233842 -607643 -925653
35683 -925653 -560569 78771 323931 241145 314531 619866 878790 910418 517227 -509693
35673 -509693 -1645183 -1615341 -56784 1502407 1514676 657675 730735 1758076 2022295
35664 2022295 972077 160024 805907 2147155 2903297 2850401 2215623 1048472 64190
35655F4190M88429J778179R18151j191856j646971N0360J173389J3023j691889
35646d4995j693867l39553O70393Q00325N08782J0515m37420k03963N98755P86397
35636F55369q5870p67911k33281O43990N31800l05539o77905l36955P6100K65304
35626b34898L08588K3604o43865j079341p59977j02381K11782K35421L79594O22078
35616a039395P77832R47415J051062O10678l37005q80362n25267m6311k25216
35607C33431n66323k40993M45231O35790L77190L34400M62780J05663p64761j380381
35597b57973j203215m18811M57040R02101N85228k13491o76832l99362J33887
35588a091428L83099M46835M74253J85018l81084m80053J49763N43888p9018r55683
$$ plain form
35655 64190 552619 2330798 3248949 2057093 410122 460482 1633871 1646894 -44995
35646 -44995 -1738862 -2078415 -1408022 -607697 -98915 -88400 -525820 -729783 -131028 655369
35636 655369 569499 -198412 -431693 212297 744097 438558 -239347 -576302 -500202 -234898
35626 -234898 73690 97294 -546571 -1625912 -2385889 -2488270 -2276488 -2041067 -1661473 -1039395
35616 -1039395 -261563 685852 1736914 2347592 2010587 1130225 604958 558647 333431
35607 333431 -232892 -473885 -28654 607136 984326 1318726 1781506 1887169 1122408 -257973
35597 -257973 -1461188 -1879999 -1422959 -520858 64370 -149121 -825953 -1225315 -1091428
35588 -1091428 -708329 -261494 212759 397777 16693 -463360 -313597 230291 151273 -804410
35578h04410r28631k05134K89273N95777J249293J671929Q26164o87012j035437
35569I71812R9787R38874K95089p96487r71355n40938m27023l55683L53095J028497
35559E95668M46658r04595j161463O7668R09493O2705j106021o69999P71842R99757
35549A1713k87069r97858o8253P97566j8028j249427o93275J170128J753993K52028
35539F71518j251301r11353N16400J224729Q02648J45055r2313J0680J07654j07789
35529A115928o25362q46436k12970P14746O92759l92605j147762o12603L90527
35520i23778N28043k36941q62684o69612R6103P23868O36879o6523n08368m6599
35510a329612O22591K81730q62428j244670k14181J033384J254291O49558L5054
$$ plain form
35578 -804410 -1733041 -1938175 -1648902 -1053125 196168 1868097 2694261 2007249 971812
35569 971812 1071599 2010473 2305562 1509075 537720 -3218 -430241 -785924 -432829 595668
35559 595668 1042326 137731 -1023732 -956064 -46571 16134 -1089887 -1759886 -988044 11713
35549 11713 -275356 -1273214 -1341467 -543901 -561929 -1811356 -2504631 -1334503 419490 671518
35539 671518 -579783 -1491136 -974736 249993 1052641 1197696 1105383 1116063 1223717 1115928
35529 1115928 490566 -355870 -568840 145906 838665 446060 -701702 -1314305 -923778
35520 -923778 -395735 -632676 -1495360 -2164972 -2068869 -1345001 -708122 -774645 -1283013 -1329612
35510 -1329612 -707021 -425291 -1287719 -2532389 -2746570 -1713186 -458895 190663 225717
35501B25717k47206n5548O21276R53290l9384j536387j424344M66158J659286
35492F22858P41911m30149M3488Q78140J2664j583654j472369Q7318P10161J5951
35482c73681o0033R35955J082589l84219j543938r15877L15072N49123K12547
35473a82462M04941P23966J38225j013475j456335q29989J04134O93057Q74128
35464e43810P41163L90278J5230k79017m93847l87720L46441J316122J516561
35455B621401N93757n52613q59376l13376L09452M67406K08026j73739m67857
35446A833081o64948q42848q42298k91067P02121J237631O51138m24804q13876
35437E44130l99226m2976m1717J86763P36720P52399j64211j096092j056314l52507
$$ plain form
35501 225717 -21489 -77037 544239 1497529 1458145 -78242 -1502586 -1036428 622858
35492 622858 1364769 934620 978108 1856248 1868912 285258 -1187111 -1099793 -389632 -373681
35482 -373681 -433714 502241 1584830 1200611 -343327 -1259204 -944132 -395009 -182462
35473 -182462 222479 946445 1084670 71195 -1385140 -2215129 -2110995 -1417938 -543810
35464 -543810 197353 587631 602861 323844 -170003 -557723 -211282 1104840 2621401
35455 2621401 3215158 2662545 1803169 1489793 1799245 2266651 2474677 2300938 1833081
35446 1833081 1168133 325285 -517013 -808080 -105959 1131672 1782810 1358006 544130
35437 544130 144904 101928 60211 246974 983694 1736093 1571882 475790 -580524 -933031
35427i33031R514k40668m94808k41711L96667R49395J018597N40305j02686l34854
35417E66720O5543P31552J041665O16340l75799j234378j275530o08077n7344
35408e29308l7585o211M78256Q12139L17830m03554k69161M45774M39795m35288
35398H12687p97556N7344R55162O28172m12083q01703l56770n3832l46046n83058
35388h97683j66473N32716P35474K99408j77239k00096K358q4936l86976k77989
35378f21436L78755P98468L22266n75519r47389o78146l88046k78734N7762O97518
35368a234501J079502Q20411K26154j63671r3996L36864O98462M89094j32716
35359B025603k35629N57110J095556J42095j544386j974195p89561K10868j59990
$$ plain form
35427 -933031 -923517 -1164185 -1658993 -1900704 -1504037 -554642 463955 1004260 901574 566720
35417 566720 632263 1363815 2405480 3021820 2646021 1411643 136113 -471964 -529308
35408 -529308 -566893 -573104 -94848 717291 1035121 631567 362406 808180 1247975 812687
35398 812687 15131 72475 1027637 1655809 1243726 442023 85253 31421 -314625 -897683
35388 -897683 -1064156 -531440 204034 503442 326203 126107 128465 43529 -343447 -621436
35378 -621436 -242681 555787 878053 302534 -644855 -1323001 -1711047 -1989781 -1932019 -1234501
35368 -1234501 -154999 665412 891566 727895 633899 970763 1669225 2158319 2025603
35359 2025603 1789974 2347084 3442640 3584735 2040349 66154 -723407 -512539 -672529
35350f72529p72428j66338J104463J448561O78992r382j04487l35747j081238
35341H9867j508755q37913L91363R86038N87556j30486n28032o31244o69254n66883
35331b817743k07457J93361L79585M47559N29460M06009K0543K6905R12140J758092
35321A648454J095389q32733j985402j229376J75651N90382J84696j2371k1505
35312c86815l64984n52647J55767J075411R49012R6563r1063M01898K14439q45420
35302F52161j251794k99182O38870L09612m47275j02952J185226J809513Q71269
35293C365448q02755j685780j119055J09071O54985J30381n88935p51807o97608
35284a386055q49490p01834R9732O11318L3839n39168K78088J493759J017111
$$ plain form
35350 -672529 -1444957 -1611295 -506832 941729 1620721 1611339 1506852 1171105 89867
35341 89867 -1418888 -2256801 -1865438 -879400 -291844 -422330 -950362 -1581606 -2250860 -2817743
35331 -2817743 -3025200 -2831839 -2452254 -2004695 -1475235 -1069226 -1048683 -1021778 -109638 1648454
35321 1648454 2743843 1911110 -74292 -1303668 -1128017 -537635 -352939 -365310 -386815
35312 -386815 -751799 -1304446 -1148679 -73268 875744 972307 881244 1283142 1497581 652161
35302 652161 -599633 -898815 -259945 49667 -397608 -500560 684666 2494179 3365448
35293 3365448 2562693 876913 -242142 -133071 521914 652295 63360 -688447 -1386055
35284 -1386055 -2235545 -2937379 -2837647 -2226329 -2192490 -2731658 -2453570 -959811 57300
35275E7300p21827j156396K20529R99655K7551n79417P90936K188937J168571
35266B995839j143819j770473l92082O26522J30633n28967j73407M57399K41066
35257D42711n97556j035409o24079K33357Q68285R13421N39375J61411j40942
35248G60574n70740r22271o24882K44102P75473M98062L3764l4831q9417n91441
35238e21607j082828q75010j09611N86388R35909R22313N18881M4490O0475M25364
35228I04764L13569l54981n87627j7968L30879j75948n68770M2945Q25716O13707
35218A326286j55945l86438k42168n31792r67018p01531L559K92086L52424Q67953
35208a42584J306048N91438p42835r61093K31258J196998Q24692r4707m18074
$$ plain form
35275 57300 -664527 -1820923 -1600394 -600739 -573188 -1152605 -361669 1827268 2995839
35266 2995839 1852020 81547 -310535 315987 446620 -82347 -255754 201645 442711
35257 442711 -154845 -1190254 -1814333 -1580976 -712691 200730 740105 901516 760574
35248 760574 189834 -732437 -1357319 -1113217 -337744 160318 194082 159251 69834 -521607
35238 -521607 -1604435 -2479445 -2589056 -2002668 -1066759 -144446 374435 418925 479400 904764
35228 904764 1218333 863352 275725 257757 588636 412688 -156082 -113137 712579 1326286
35218 1326286 1170341 783903 541735 9943 -957075 -1658606 -1655047 -1362961 -1010537 -142584
35208 -142584 1163464 1754902 1012067 50974 282232 1479230 2303922 2209215 1791141
35199A791141k05834j03787k30227l32391l47413l18608k17179r1206m3949o1403
35189a60856j47950l58776l88037K83131J330184J498497L61261p39072n61481
35180A116901J65125R3963m54510k99582K38812j32335j128473j098759J03360
35171a395498O55104l17230j347267r48737L71607J304214J467303J061515J52029
35162A003040p64452o95072L84038J081175N16037l83053m47679j3089M6060j4148
35152G12857M92901J053964N80508o53706j181808m89801L04649K14041k97255
35143G36350l24534K135q2929n13881l35538P03530J385904O00329q17358r50864
35133D03144M55278J422865N30305r71926j025670K24491R18267M29990r9362
$$ plain form
35199 1791141 1585307 1481520 1251293 918902 571489 252881 35702 -55504 -99453 -160856
35189 -160856 -308806 -667582 -1055619 -772488 557696 2056193 2417454 1678382 1116901
35180 1116901 1282026 1375989 921479 621897 860709 728374 -400099 -1498858 -1395498
35171 -1395498 -740394 -1057624 -2404891 -3353628 -2982021 -1677807 -210504 851011 1003040
35162 1003040 238588 -456484 -72446 1008729 1524766 1141713 694034 680945 727005 712857
35152 712857 1205758 2259722 2840230 2186524 1004716 514915 819564 1033605 736350
35143 736350 411816 413951 331022 -182859 -518397 185133 1571037 2171366 1354008 403144
35133 403144 858422 2281287 2811592 1839666 813996 1038487 1956754 2386744 2287382
35124B287382j48537o34275j720391j810538m0019J756285J305772p61150j675210
35115a440681l35392J407898J507692K34491p51550p22697k95401j17832j66088
35106f79560k23431k25662j7450N61728J134647R63572K4045p10380n69163j52261
35096A06085k63195n07167o6798N86347K64611p24889o95890O58571J424217L30603
35086A112495j194440j207432j00606M03057K8280j74281j2708k08527n83127
35077a937289j49212R63470J453434R11624L16147J95929j13100r25590j381821
35068f66408q17584J79526O83793M97064j00470p75585j006541m11291N13692
35059a903804Q04344L16935k27788m40215m89114k41753N79793J376189J145084
$$ plain form
35124 2287382 2138845 1504570 -215821 -2026359 -2066378 -310093 995679 234529 -1440681
35115 -1440681 -1776073 -368175 1139517 1374008 622458 -100239 -395640 -513472 -679560
35106 -679560 -902991 -1128653 -1146103 -584375 550272 1513844 1537889 827509 258346 106085
35096 106085 -157110 -664277 -731075 -144728 119883 -605006 -1300896 -642325 781892 1112495
35086 1112495 -81945 -1289377 -1389983 -986926 -958646 -1132927 -1145635 -1354162 -1937289
35077 -1937289 -2086501 -1123031 330403 1242027 1558174 1754103 1641003 715413 -666408
35068 -666408 -1483992 -1304466 -620673 -123609 -224079 -999664 -2006205 -2417496 -1903804
35059 -1903804 -1099460 -782525 -1010313 -1450528 -1939642 -2181395 -1601602 -225413 919671
35050I19671R9906n12382k98559N802J80863P16762J159613K64641j585117k141990
35040a190790m96682J328130J257826j3710n50679p7015L15797K54828J65156
35031I92861K2030l85521m89741K91174J205207R32327m88160j617438j425477
35022i62738l01337O45307P01975J30435q8914N40155J106284M39342q55117r37664
35012D17728L94114J156056K63517p64255m68090J01979n40236j440910p59175
35003a639272R05065J298270J22269o35510L8432Q67304N96477k88984p44381
34994E19670n90089j90837J75039K26642j59301n39354m13998j7535J81012L36097
34984d72654O16823L98156o23018j205335j65852J341203J180712l95907j009136
$$ plain form
35050 919671 1019577 507195 208636 214438 395301 1112063 2271676 2536317 951200 -1190790
35040 -1190790 -1687472 -359342 898484 884774 334095 257080 572877 827705 992861
35031 992861 1014891 629370 139629 430803 1636010 2568337 2080177 462739 -962738
35022 -962738 -1264075 -618768 83207 213642 124728 664883 1771167 2210509 1355392 417728
35012 417728 811842 1967898 2231415 1467160 999070 1101049 560813 -880097 -1639272
35003 -1639272 -734207 564063 686332 50822 89254 956558 1553035 1264051 519670
34994 519670 -70419 -261256 -86217 140425 -18876 -558230 -972228 -989763 -808751 -472654
34984 -472654 144169 542325 -80693 -1286028 -1451880 -110677 1070035 674128 -335008
34975c35008J11963J052211M58342m75931l41578K35604R6321l63804j87580L03636
34965E54176K23222k30919k75635m433m0873k65002r0097L63936M19693q4975
34955E69093o64744q44627l91126O21170J461623J170072o2417p92621l46775
34946G19648Q1553n91148j344540n92413J055742J478124K59534p26555k51774
34937H8171N59388K35079p85782j019840j42154Q14750R85223M41370l02812p68395
34927A04998o19743N1883N97292M72908k7221j76025J30255K63440j53976p10310
34917f6499q48072n88281l07557j29336R3894L82567N71102N74699M43607K06886
34907C33010j10562l79805m75258l91887r3732N08891J148174J118455J56377
$$ plain form
34975 -335008 -223045 829166 1287508 811577 469999 705603 801924 438120 250540 554176
34965 554176 777398 546479 270844 266411 225538 -39464 -129561 234375 654068 569093
34955 569093 -95651 -940278 -1331404 -710234 751389 1921461 1859044 1066423 719648
34946 719648 801201 210053 -1134487 -1726900 -671158 806966 1066500 339945 88171
34937 88171 647559 882638 96856 -922984 -1065138 -250388 734835 1176205 873393 104998
34927 104998 -514745 -462862 134430 607338 580117 404092 534347 797787 643811 -66499
34917 -66499 -914571 -1502852 -1810409 -1939745 -1845851 -1463284 -892182 -317483 126124 333010
34907 333010 222448 -157357 -632615 -1024502 -1118234 -609343 538831 1657286 1813663
34898A813663q65782q83744j72253j4110p30358j108249k71748Q92377J007024
34889c33180J50101m50270j78687M86562R39141R50104M17781m87077j067653
34880D26822q20751k26652l661P3476N43072Q26706o9883j469168j394137M75185
34870a638991J908930J134902p17696j417007o55112K12478N19127O43131N25370
34861E15132l25824j361321j232080J33141J146156Q00987J2725N004N03396M72448
34851F69764k19742q97631j204159j109895l24352J148337K174071J483287m37788
34842A281892j610627j007929K93150Q12539N08804K38665K36382R2472k34383
34833F10965l54728k24126j80643k73138k17349M2145L22854O30579R61171Q60188
$$ plain form
34898 1813663 947881 64137 -108116 -122226 -852584 -1960833 -2232581 -1340204 -333180
34889 -333180 -183079 -633349 -812036 -325474 613667 1563771 1981552 1494475 426822
34880 426822 -393929 -620581 -624242 -550766 -7694 819012 749129 -720039 -2114176 -1638991
34870 -1638991 269939 1404841 687145 -729862 -1384974 -1172496 -653369 -10238 515132
34861 515132 189308 -1172013 -2404093 -2270952 -1124796 -323809 -311084 -306080 197316 669764
34851 669764 450022 -447609 -1651768 -2761663 -3086015 -1937678 236393 1719680 1281892
34842 1281892 -328735 -1336664 -1043514 -230975 277829 516494 752876 845348 610965
34833 610965 256237 32111 -148532 -421670 -639019 -596874 -274020 356559 1317730 2177918
34823B177918j3459r61929q24371L72624J238050P84893m34287j293336j379787
34814c33684q95646r7246N77849N36410j49971n28144o459P41503P73783K16757
34804H35152j44550j01180J58J14896M40391P38259N66771N6597k87802m13512
34794A805180o27581q42031o63579j46942K44758L54886L63673K46608j10219
34785F24753m01114k34607J51041K42144J56539L60511O10300J67021q49166j304999
34775d77577n75968N52978Q95750K29919o43862q00931P938J109684J438463O29423
34765B365817n47827j154621j101590p48023r2712Q13147J199100M27503q04006
34756C56788j218624o59579O1914O25992J167777J154106k1154j412503j316565
$$ plain form
34823 2177918 2164459 1202530 378159 750783 1988833 2773726 2339439 1046103 -333684
34814 -333684 -1229330 -1326576 -748727 -212317 -362288 -890432 -896891 -155388 618395 835152
34804 835152 690602 589422 589580 704476 1144867 1883126 2449897 2506494 2218692 1805180
34794 1805180 1177599 335568 -328011 -474953 -230195 124691 488364 734972 624753
34785 624753 223639 -10968 140073 382217 538756 899267 1509567 1676588 827422 -477577
34775 -477577 -1053545 -500567 395183 625102 -18760 -819691 -811753 297931 1736394 2365817
34765 2365817 1817990 663369 -438221 -1186244 -1278956 -465809 733291 1160794 356788
34756 356788 -861836 -1521415 -1459501 -833509 334268 1488374 1467220 54717 -1261848
34747a261848J19899R18721K54672m94529k67637J12692j66049l60217K18620
34738i25676P30132L61250j19428J71223N84126K89344o6775K63109L89953o41987
34728A035271j672386r99265O62114J102030N0381o34541r5204M88300K29074
34719A65774k07021j91855j44459l02816j03736M96642N38574l00206q42538p8196
34709i69837J294435J826218J070733k70592j284578j401216o50503J95469L07576
34700A17705j29591k05274K49533M19355l3593l58248o0911K00697k00882o96239
34690f97448m32824L01949N12796k9829n82797n03521J23898P95009R94591M50200
34680I32024n41052j150219q25639j5187L13882j15376n48288k39266M73735N71958
$$ plain form
34747 -1261848 -1141949 -223228 31444 -463085 -730722 -618030 -784079 -1144296 -925676
34738 -925676 -195544 165706 46278 217501 801627 1090971 1024196 1287305 1677258 1035271
34728 1035271 -637115 -1636380 -974266 127764 178145 -456396 -551600 -63300 165774
34719 165774 -41247 -233102 -377561 -680377 -784113 -287471 251103 -49103 -891641 -969837
34709 -969837 324598 2150816 3221549 2950957 1666379 265163 -385340 -189871 117705
34700 117705 -11886 -217160 32373 451728 418135 59887 -1024 199673 -1209 -697448
34690 -697448 -1130272 -828323 -315527 -345356 -928153 -1431674 -1307776 -512767 481824 932024
34680 932024 390972 -759247 -1584886 -1600073 -1286191 -1401567 -1949855 -2189121 -1715386 -1143428
34670a143428j56946o16108J17334J254041J175861k28247j279768q76118J08146
34661a645233M43559K83440K52699N4474n86404o89235M87837J575798P99360
34652I76295r96714j347562k677P63983n2906p20531M5862R20194M24354n27638
34642e17340l35410N80545O65814k07509q38205p04927l49595j70143p2155m454
34632a953379R4622M83579J023190R87582J58982o12181o34174l22764k01609
34623i76152O3281P46276J160570O85540j63504o27601p66288p60941k50301O43885
34613b45235Q25820p9130p65160k57856M31242J37348l61051J24238Q66966N29744
34603A206926l07936k03556M55544K22836o27258o02314J89552K83744l60459
$$ plain form
34670 -1143428 -1300374 -1916482 -1799148 -545107 630754 402507 -877261 -1753379 -1645233
34661 -1645233 -1201674 -918234 -665535 -611061 -1197465 -1886700 -1398863 176935 976295
34652 976295 -20419 -1367981 -1370658 -606675 -659581 -1380112 -1334250 -414056 10298 -517340
34642 -517340 -852750 -272205 393609 186100 -652105 -1357032 -1706627 -1876770 -1948925 -1953379
34632 -1953379 -1858757 -1375178 -351988 635594 794576 182395 -451779 -774543 -976152
34623 -976152 -912871 -166595 993975 1679515 1516011 888410 122122 -638819 -889120 -245235
34613 -245235 580585 501455 -263705 -521561 -90319 47029 -314022 -189784 677182 1206926
34603 1206926 898990 695434 1150978 1373814 746556 144242 333794 617538 257079
34594B57079m18354J02212j01373q60229n83377O62869R60825o2058n09022L52133
34584a99295Q33890P4450l65892M11323P77828l73472j323984m58803Q06459N01948
34574F84452m50699m860J290210J224084l29332j383568j117242o30853n52300
34565a270108k36322M40933N47864j59986o03299o6338P14274P14086J1623m56874
34555c64147n1023Q87017J308232N79568n90593r09598k92015N8773l44106m78385
34545a96277K93020R35829M36439m81423o14254j39104J18570J89940L30986J8549
34535H92275q58455r72496M57201J758420R99847q16306j117796K76476J064058
34526A683224J29628j148176j406744q71144j14676O96691R77710Q9242j100441
$$ plain form
34594 257079 -161275 -59063 -160436 -1020665 -1604042 -941173 19652 -42406 -551428 -199295
34584 -199295 634595 709045 343153 754476 1532304 1158832 -165152 -623955 182504 684452
34574 684452 233753 228893 1519103 2743187 2413855 1030287 -86955 -717808 -1270108
34565 -1270108 -1506430 -1065497 -517633 -677619 -1280918 -1347256 -632982 81104 92727 -364147
34555 -364147 -415170 471847 1780079 2359647 1769054 859456 567441 626214 282108 -196277
34545 -196277 96743 1032572 1469011 987588 373334 234230 352800 542740 873726 892275
34535 892275 33820 -938676 -481475 1276945 2276792 1460486 342690 619166 1683224
34526 1683224 1812852 664676 -742068 -1613212 -1727888 -1031197 -53487 35755 -1064686
34517a064686q86471O78336J689972J211820K86223j98266n89892r25272m46904
34508b45140N68101N78339o69077j336248l36142R25001Q91181J39419j03781
34499D11653r0630n94807j154779q85671n0647N41119P72273P27786R5969p88242
34489a015976n95762R31582J868106O79595j248418j493717r1241Q38159L67511
34480B39839l47537k89485J55153L37618L01464K78846K38762J25638j11589n83523
34470C45186j000776o71068L42639Q17233R3123o31777j8895J145495J007020
34461A428180m53437j303258m67043Q98969J174706K24964q48616j106733n87706
34452a039974j19297l06475n88887N7304J234140J187733m50139j515059l73659
$$ plain form
34517 -1064686 -1951157 -1272821 417151 1628971 1915194 1716928 1127036 201764 -245140
34508 -245140 322961 901300 232223 -1104025 -1440167 -515166 376015 515434 411653
34499 411653 321023 -273784 -1428563 -2314234 -2364881 -1823762 -1051489 -323703 -227734 -1015976
34489 -1015976 -1611738 -680156 1187950 1867545 619127 -874590 -965831 -127672 239839
34480 239839 -107698 -397183 -242030 95588 397052 675898 914660 1040298 928709 345186
34470 345186 -655590 -1326658 -984019 -166786 -73663 -705440 -724335 421160 1428180
34461 1428180 974743 -328515 -795558 103411 1278117 1503081 654465 -452268 -1039974
34452 -1039974 -1159271 -1465746 -2054633 -1997329 -763189 424544 -25595 -1540654 -1914313
34443a914313J341902J154444l20587n29108O37301P17368r87553k108009j073493
34434c082048N41079Q59979M62300O66747J108213Q54102L24661K72903J71736
34425B179672o03537j149734m10383P90587R03470M7237n21391n93691q02120
34416a59890q62368n8446Q90482N72266n96422p44292L64301Q21942k45864j164089
34406a182380m57307P83771Q00280k9155o5621Q22178J209848M73154m59544p18864
34396A176360m88435k09462M8145J33762k74821r45500j087812m30598L97714
34387a680647Q42307J009003R59545L13751q59203j557914j060528l5164L92798
34378a676052J85533R0822K34379J33817q9341K36540R44930R25625j51026j082077
$$ plain form
34443 -1914313 -572411 582033 261446 -267662 369639 1087007 99454 -2008555 -3082048
34434 -3082048 -2540969 -1680990 -1218690 -551943 556270 1410372 1735033 2007936 2179672
34425 2179672 1576135 426401 16018 806605 1710075 1757312 1235921 642230 -159890
34416 -159890 -1022258 -1080704 -190222 382044 -214378 -958670 -594369 227573 -18291 -1182380
34406 -1182380 -1639687 -855916 -55636 -84791 -150412 671766 1881614 2354768 1895224 1176360
34396 1176360 687925 478463 526608 660370 385549 -559951 -1647763 -2078361 -1680647
34387 -1680647 -838340 170663 1130208 1443959 584756 -973158 -2033686 -2068850 -1676052
34378 -1676052 -1490519 -1399697 -1165318 -1031501 -1120842 -884302 60628 986253 835227 -246850
34368b46850p83117J68796M66623q4480n72043m53022r8712M9067N2229P7391
34358a424118N3576q657K06044Q55415J445825J216253J49742p17170m47777M15100
34348A744233L45699r80385j870228q42136J048719J460534K7818j218953q32604
34339a117303L03016P55898N04329K13748o7843l85568k17463M83496O46382k83618
34329H35074j104153o16705L77767M08257k55655l03463K46169L39569M6057L31110
34319C04027R12726N03505p48928j188658l24943M42347K29331j53686j8104J25377
34309H2994L4052L95736J140433R38608n30173j557038r07245K70336M13032r1208
34299A89527n6750L24375J64957l06487k87483Q2927K64280N08660J013639Q42401
$$ plain form
34368 -246850 -1029967 -861171 -394548 -479028 -1051071 -1504093 -1602805 -1553738 -1501509 -1424118
34358 -1424118 -1370542 -1379199 -1173155 -317740 1128085 2344338 2494080 1776910 1329133 1744233
34348 1744233 2089932 1109547 -760681 -1602817 -554098 906436 934254 -284699 -1117303
34339 -1117303 -814287 -58389 445940 659688 591845 206277 -11186 472310 1118692 835074
34329 835074 -269079 -885784 -508017 -99760 -355415 -658878 -412709 -73140 -27083 304027
34319 304027 1216753 1720258 971330 -217328 -542271 -99924 129407 -24279 -42383 82994
34309 82994 117046 512782 1653215 2591823 2061650 504612 -402633 -132297 280735 189527
34299 189527 132777 457152 622109 315622 28139 111066 375346 884006 1897645 2740046
34289B740046n91048j833474j142225O91312J304821J87012r25299r36324n80444
34280a085623n34473l37354K91562P41805P08759O75406P23560K84887m44342
34271A024187l48234O68855J048613j68204j679286j633651j55664R36822M56917
34262A50355r61520j750751j005183N91540J370857O42920k39426K77704J423006
34253D99502J046980q70744j758671k64156J588608J486729K00721j18690M57716
34244B267995K01797r32948j194508j56969N35813j0708n86823j34707N48167
34235E37109M09415j45256l33837m69791j035202j336732n09551Q46850J390355
34226f46640R09336K53893j51295m61823m61853J46517O79011J62235q64784p83939
$$ plain form
34289 2740046 2148998 315524 -826701 -135389 1169432 1356444 431145 -505179 -1085623
34280 -1085623 -1620096 -1957450 -1665888 -924083 -215324 460082 1183642 1468529 1024187
34271 1024187 675953 1344808 2393421 2225217 545931 -1087720 -1243384 -306562 150355
34262 150355 -811165 -2561916 -3567099 -2975559 -1604702 -961782 -1201208 -923504 499502
34253 499502 1546482 675738 -1082933 -1347089 241519 1728248 1928969 1810279 2267995
34244 2267995 2469792 1536844 342336 185367 721180 710472 123649 -11058 537109
34235 537109 946524 801268 467431 -2360 -1037562 -2374294 -2883845 -2036995 -646640
34226 -646640 262696 516589 365294 -96529 -558382 -411865 267146 429381 -435403 -1219342
34216a219342N36384J216680J77127j030021m72311J206115J719184M60462q64948
34207A729330r25417l94216l62116n58200j71608N16097N74129N0975r6303L38409
34197G01080M22160k94928q38143k54565P43054O39995o43189j499064q12631
34188a836231N88487J205703Q45175N16221P58151R94085N87160k09217o51498
34179B798036m25557J08372L64253P7039m48609o28011k92828K7694k25509q86122
34169D68758j330724j256614p19750K67313J434985J833886P57475r15264j444233
34160i04168n24126L27743O7587n14249m27423r5518k14823k30476N63343J339913
34150f12197Q62254l28218o44297n407K40643j85580j46808N08697L61089r62000
$$ plain form
34216 -1219342 -682958 533722 710849 -319172 -791483 414632 2133816 2594278 1729330
34207 1729330 803913 409697 47581 -510619 -682227 -166130 407999 458974 362671 701080
34197 701080 1123240 828312 -9831 -264396 478658 1118653 475464 -1023600 -1836231
34188 -1836231 -1247744 -42041 803134 1319355 2077506 3071591 3658751 3449534 2798036
34179 2798036 2372479 2480851 2845104 2922143 2473534 1845523 1552695 1580389 1354880 468758
34169 468758 -861966 -2118580 -2838330 -2571017 -1136032 697854 1455329 540065 -904168
34160 -904168 -1428294 -1100551 -1032964 -1547213 -1974636 -2070154 -2284977 -2515453 -1952110 -612197
34150 -612197 250057 -78161 -722458 -727865 -487222 -672802 -819610 -310913 50176 -911824
34140i11824j575450p3917K050040K299505M87598j355029j729007r17434R5654
34131a629864O52856N10166q2311m37475k29727O4533Q1726K53424P49567N98064
34121E30959q25667k115516j377940P85028J763199O67324m01959L45840J648154
34112A019422J249745n84374j545051p41014K79765J49149m28342j83028O19656
34103a64072P60728M0319n79989n82650m65650n69904m15181K87736Q13629L88080
34093d86954n39211q37696k76125K72646J77201j89797j99916J79840N64520P00257
34083f35235N83252L89525M11185O92003P41619J52989n43956m42669K39830K67577
34073A856120o11426r64264J34597J307051O84996j152191j787353m22978J036570
$$ plain form
34140 -911824 -2487274 -2561191 -511151 1788354 2275952 920923 -808084 -1725518 -1629864
34131 -1629864 -977008 -466842 -549153 -986628 -1216355 -1151822 -1070096 -816672 -67105 530959
34121 530959 -294708 -2410224 -3788164 -3003136 -1239937 -572613 -974572 -628732 1019422
34112 1019422 2269167 1684793 139742 -601272 -321507 -172358 -600700 -783728 -164072
34103 -164072 596656 636975 56986 -525664 -991314 -1561218 -1976399 -1688663 -875034 -486954
34093 -486954 -1026165 -1863861 -2139986 -1867340 -1690139 -1879936 -2079852 -1900012 -1335492 -635235
34083 -635235 -51983 337542 748727 1440730 2182349 2335338 1791382 1348713 1588543 1856120
34073 1856120 1244694 280430 415027 1722078 2407074 1254883 -532470 -955448 81122
34064H1122Q20493l95293r35040n65531j90916k6819L63858O63596R7864q36794
34054i23460o07062Q99714J705180M85106j318315j475794j09605P79631L71791
34045a92814k32010k55867l07413p13100n80948N27943J428368R67658k46385
34036C95432r14943q63524o24043j78296N50265Q28030K04485k98658L30164J161554
34026E90466O87782n12946n98525L85735N51826n20171r75423J64129J326995
34017A099868R43424k56544p52783m57789j49435n825Q2365j06750l72098R4487
34007A18920J125836J141607n08570k074542j706088j12883O05942p4685q31080
33998b315543n75662N10129J567520J684907N15714r64819j200849k29687J87938
$$ plain form
34064 81122 901615 506322 -428718 -994249 -1185165 -1211984 -848126 -184530 -86666 -923460
34054 -923460 -1530522 -630808 1074372 1559478 241163 -1234631 -1344236 -564605 -192814
34045 -192814 -424824 -680691 -988104 -1701204 -2282152 -1754209 -325841 641817 395432
34036 395432 -519511 -1383035 -2007078 -2185374 -1635109 -807079 -602594 -901252 -571088 590466
34026 590466 1278248 765302 166777 552512 1104338 584167 -391256 -227127 1099868
34017 1099868 2043292 1786748 1033965 576176 426741 420916 503281 396531 24433 118920
34007 118920 1244756 2386363 1877793 -196749 -1902837 -2015720 -1409778 -1484463 -2315543
33998 -2315543 -2891205 -2381076 -813556 871351 1387065 422246 -778603 -1008290 -820352
33989h20352n69579p74450O48295J888053J059837n45029o08900K66340j80076
33980C64139j613945j521067L65240J484539P09914o5850M56103Q09620k88744
33971F99949j394717o98179R36330J346233K92929n84526l64889K22204K34789
33962F90123k75438n52545q2328P38090Q58572j14940j082275p13899O18696J248417
33952A332473N26477m71322o88640k98968J12605L93201M65674J64184k47358
33943A288326l06124k05788m26810o02337j7903Q35773P15015l08743q47603m35227
33933c11421n5231j61777j8899N11750M15351n49633j161335p36796r5033K12148
33923a950876P77035J601101J452665M6089j032290p64531j96062k64958j51516
$$ plain form
33989 -820352 -1389931 -2164381 -1516086 371967 1431804 886775 277875 544215 364139
33980 364139 -1249806 -2770873 -2405633 -921094 -211180 -277030 179073 988693 699949
33971 699949 -694768 -1392947 -456617 889616 1182545 598019 233130 455334 690123
33962 690123 414685 -137860 -220188 517902 1376474 1261534 179259 -534640 84056 1332473
33952 1332473 1858950 1387628 698988 400020 512625 905826 1371500 1535684 1288326
33943 1288326 982202 776414 349604 -252733 -270636 565137 1280152 971409 123806 -311421
33933 -311421 -366652 -528429 -547328 -35578 379773 -169860 -1331195 -2067991 -2163024 -1950876
33923 -1950876 -1173841 427260 1879925 1926014 893724 129193 -66869 -331827 -483343
33914d83343P34205J171563L15956m78163j5217M22878o29460j932830j506298
33905b400709n4344L04673l65491l14242O01844R73620O87793Q86570J319163
33896A638877N60670j045038j401782l4997J050114N11879n50322o98156q3071
33887e1826M86977P31044M99150k92965q72292k72294Q75196Q46839n33671j516599
33877a00441j123512l82794k46202j31879N43302J044262O21281j89832n69511
33868e35326o02234o45294n63293k69745k7773K31186P67322J013200J94890q24159
33858a261226k74189J433801J639094n00682k235872j178619J120735J712885
33850D55927N92271m4618L74318M75853j81580n90018n14150p85129j237053o50198
$$ plain form
33914 -483343 250862 1422425 1738381 1260218 1245001 1667879 1038419 -894411 -2400709
33905 -2400709 -2455053 -2150380 -2515871 -2830113 -2228269 -1254649 -566856 319714 1638877
33896 1638877 2199547 1154509 -247273 -282270 767844 1279723 729401 31245 -51826
33887 -51826 435151 1166195 1665345 1372380 500088 227794 1102990 1949829 1416158 -100441
33877 -100441 -1223953 -1606747 -1852949 -1984828 -1441526 -397264 224017 34185 -535326
33868 -535326 -1137560 -1782854 -2346147 -2615892 -2643665 -2412479 -1645157 -631957 -437067 -1261226
33858 -1261226 -1535415 -101614 1537480 1036798 -1199074 -2377693 -1256958 455927
33850 455927 1048198 1003580 1377898 1853751 1672171 1082153 568003 -217126 -1454179 -2104377
33840b104377Q40215J432261M36820n64125k22642O39240O71450O6489k62994
33831I32337l36845n71474n75498O8966N67217r226r11440o29970N94986R60057
33821H9110k5920p17988r3385M85173l73603j462040o91844J385170K083115N53370
33811A231158j045472r37507j36239k78959r10650o37818L31002P12851L74275
33802a297359J51104O2138l84457n70861M64373J853784J696494J03706q20537
33793A258385l67330j58403r70439j181890K47509J578154R54429o05743r93178
$$ plain form
33840 -2104377 -1264162 168099 604919 40794 -181848 457392 1128842 1195331 932337
33831 932337 595492 24018 -551480 -482514 84703 75477 -835963 -1465933 -870947 89110
33821 89110 63190 -654798 -748183 -263010 -636613 -2098653 -2790497 -1405327 677788 1231158
33811 1231158 185686 -751821 -888060 -1167019 -2077669 -2715487 -2384485 -1671634 -1297359
33802 -1297359 -1146255 -1084117 -1468574 -2039435 -1575062 278722 1975216 2078922 1258385
33793 1258385 891055 732652 -237787 -1419677 -1172168 405986 1360415 754672 -238506
$$ [...]
##END NTUPLES=NMR SPECTRUM
##END=
