##TITLE=31Pdec_76-2024
 CDCl3, 24 sc
 11.9.2024
##JCAMPDX= 6.0         $$ Bruker NMR JCAMP-DX V2.0
##DATA TYPE= NMR SPECTRUM
##DATA CLASS= NTUPLES
##ORIGIN= UXNMR, Bruker Analytische Messtechnik GmbH
##OWNER= root
$$ XWIN-NMR		Version 3.5
$$ Wed Sep 11 14:00:24 2024 Russian Standard Time (UT+4h)  she@DPX200
##.OBSERVE FREQUENCY= 81.013821
##.OBSERVE NUCLEUS= ^31P
##.ACQUISITION MODE= SIMULTANEOUS
##.ACQUISITION SCHEME= undefined
##.AVERAGES= 24
##.DIGITISER RES= 17
##SPECTROMETER/DATA SYSTEM= spect
##.PULSE SEQUENCE= zgpg30
##.SOLVENT NAME= CDCl3
##.SHIFT REFERENCE= (INTERNAL, CDCl3, 0, 198.062)
##AUDIT TRAIL= $$ (NUMBER, WHEN, WHO, WHERE, WHAT)
$$ ##TITLE= Audit trail, XWIN-NMR		Version 3.5
$$ ##JCAMPDX= 5.01
$$ ##ORIGIN= Bruker BioSpin GmbH
$$ ##OWNER= she
$$ F:/spectra/data/she/nmr/P31/2/pdata/1/auditp.txt
$$ ##AUDIT TRAIL=  $$ (NUMBER, WHEN, WHO, WHERE, WHAT)
(   1,<2024-09-11 13:59:24.76 +0400>,<she>,<DPX200>,
      <created by zg, POWCHK disabled, PULCHK disabled
       configuration hash MD5:
       00 E9 B6 7A A2 85 ED C7 34 08 36 98 17 FE 4E 26
       data hash MD5: 32K
       94 97 A5 86 89 FC C5 DF 0D FB 02 F0 8B 00 FF CA>)
(   2,<2024-09-11 13:59:27.14 +0400>,<she>,<DPX200>,
      <Start of raw data processing
       efp BC_mod = 2 LB = 1.5 FT_mod = 6 PKNL = 1 PHC0 = 2715.623 PHC1 = 11.48747 SI = 64K 
       data hash MD5: 64K
       CE 10 A6 CC 8E EA 1D 9F 09 79 EE 5F E9 B6 FF FA>)
(   3,<2024-09-11 13:59:44.68 +0400>,<she>,<DPX200>,
      <pk PHC0 = 2.733918 PHC1 = 0 
       data hash MD5: 64K
       1E 86 F5 DB CD DC 33 50 FA 08 E5 95 92 40 3E 1D>)
(   4,<2024-09-11 13:59:56.50 +0400>,<she>,<DPX200>,
      <abs ABSG = 5 
       data hash MD5: 64K
       3D CA F5 B9 73 02 EE 4B 9A 72 A7 7A 22 47 4E A8>)
$$ ##END=
$$ 
$$ hash MD5
$$ C2 66 3A 90 4A 1B 72 1D 01 18 01 9E FF 6B D3 51
##$RELAX= 
##$RELAX= 
##$RELAX= 
##$RELAX= 
##$RELAX= 
##$RELAX= 
##$RELAX= 
##$RELAX= 
$$ Bruker specific parameters
$$ --------------------------
##$DU= <F:/spectra>
##$EXPNO= 2
##$NAME= <P31>
##$PROCNO= 1
##$TYPE= <nmr>
##$USER= <she>
##$AMP= (0..31)
100 100 100 100 100 100 100 100 100 100 100 100 100 100 100 100 100 100 
100 100 100 100 100 100 100 100 100 100 100 100 100 100 
##$AQSEQ= 0
##$AQ_mod= 1
##$AUNM= <au_zg>
##$AUTOPOS= <>
##$BF1= 81.014009
##$BF2= 200.13
##$BF3= 200.13
##$BF4= 200.13
##$BF5= 200.13
##$BF6= 200.13
##$BF7= 200.13
##$BF8= 200.13
##$BYTORDA= 1
##$CFDGTYP= 0
##$CFRGTYP= 5
##$CHEMSTR= <none>
##$CNST= (0..31)
1 1 145 1 1 1 1 1 1 1 1 1 1 1 1 1 1 1 1 1 1 1 1 1 1 1 1 1 1 1 1 1 
##$CPDPRG= <waltz16>
##$CPDPRG1= <>
##$CPDPRG2= <waltz16>
##$CPDPRG3= <>
##$CPDPRG4= <mlev>
##$CPDPRG5= <mlev>
##$CPDPRG6= <mlev>
##$CPDPRG7= <mlev>
##$CPDPRG8= <mlev>
##$CPDPRGB= <>
##$CPDPRGT= <>
##$D= (0..31)
0 1 0 0 0 0 0 0 0 0.06 0 0.03 2e-05 3e-06 0 0 0.0002 0 0 0 0 0 0 0 0 0 
0 0 0 0 0 0 
##$DATE= 1726048764
##$DBL= (0..7)
120 120 120 11 120 120 24 19 
##$DBP= (0..7)
150 150 150 150 150 150 150 150 
##$DBP07= 0
##$DBPNAM0= <>
##$DBPNAM1= <>
##$DBPNAM2= <>
$$ [...]
##$SUBNAM3= <"">
##$SUBNAM4= <"">
##$SUBNAM5= <"">
##$SUBNAM6= <"">
##$SUBNAM7= <"">
##$SUBNAM8= <"">
##$SUBNAM9= <"">
##$SW= 400.765351723535
##$SWIBOX= (0..15)
0 1 3 0 0 0 0 0 0 0 0 0 0 0 0 0 
##$SW_h= 32467.5324675325
##$TD= 32768
##$TD0= 1
##$TE= 0
##$TE2= 300
##$TE3= 300
##$TEG= 300
##$TL= (0..7)
0 120 53 12 22 120 120 120 
##$TP= (0..7)
150 150 150 150 150 150 150 150 
##$TP07= 0
##$TPNAME0= <>
##$TPNAME1= <>
##$TPNAME2= <>
##$TPNAME3= <>
##$TPNAME4= <>
##$TPNAME5= <>
##$TPNAME6= <>
##$TPNAME7= <>
##$TPOAL= (0..7)
0.5 0.5 0.5 0.5 0.5 0.5 0.5 0.5 
##$TPOFFS= (0..7)
0 0 0 0 0 0 0 0 
##$TUNHIN= 0
##$TUNHOUT= 0
##$TUNXOUT= 0
##$USERA1= <user>
##$USERA2= <user>
##$USERA3= <user>
##$USERA4= <user>
##$USERA5= <user>
##$V9= 5
##$VALIST= <valist>
##$VCLIST= <CCCCCCCCCCCCCCC>
##$VD= 0
##$VDLIST= <DDDDDDDDDDDDDDD>
##$VPLIST= <PPPPPPPPPPPPPPP>
##$VTLIST= <TTTTTTTTTTTTTTT>
##$WBST= 1024
##$WBSW= 4
##$XGAIN= (0..3)
0 0 0 0 
##$XL= 0
##$YL= 0
##$YMAX_a= 12580
##$YMIN_a= -12283
##$ZGOPTNS= <>
##$ZL1= 120
##$ZL2= 120
##$ZL3= 120
##$ZL4= 120
##$ABSF1= 198.0616
##$ABSF2= -202.7028
##$ABSG= 5
##$ABSL= 3
##$ALPHA= 0
##$AQORDER= 0
##$ASSFAC= 0
##$ASSFACI= 0
##$ASSFACX= 0
##$ASSWID= 0
##$AUNMP= <proc_1d>
##$AZFE= 0.1
##$AZFW= 0.5
##$BCFW= 0
##$BC_mod= 2
##$BYTORDP= 0
##$COROFFS= 0
##$CY= -3
##$DATMOD= 1
##$DC= 0
##$DFILT= <>
##$DTYPP= 0
##$F1P= 0
##$F2P= 0
##$FCOR= 1
##$FTSIZE= 65536
##$FT_mod= 6
##$GAMMA= 0
##$GB= 0
##$INTBC= 1
##$INTSCL= 9.790993e-09
##$ISEN= 30
##$LB= 1.5
##$LEV0= 0
##$LPBIN= 0
##$MAXI= 10000
##$MC2= 0
##$MEAN= 0
##$ME_mod= 0
##$MI= 50
##$NCOEF= 0
##$NC_proc= -5
##$NLEV= 6
##$NOISF1= 182.463
##$NOISF2= 159.3651
##$NSP= 0
##$NTH_PI= 0
##$NZP= 0
##$OFFSET= 198.0616
##$PC= 4
##$PHC0= 2718.357
##$PHC1= 11.48747
##$PH_mod= 1
##$PKNL= yes
##$PPARMOD= 0
##$PSCAL= 0
##$PSIGN= 0
##$REVERSE= no
##$SF= 81.0140089999434
##$SI= 65536
##$SIGF1= 159.3651
##$SIGF2= -187.1042
##$SINO= 113.3802
##$SIOLD= 16384
##$SREGLST= <1H.CDCl3>
##$SSB= 0
##$STSI= 65536
##$STSR= 0
##$SW_p= 32467.5324675325
##$SYMM= 0
##$S_DEV= 0
##$TDeff= 32768
##$TDoff= 0
##$TI= <>
##$TILT= no
##$TM1= 0
##$TM2= 0
##$TOPLEV= 0
##$USERP1= <user>
##$USERP2= <user>
##$USERP3= <user>
##$USERP4= <user>
##$USERP5= <user>
##$WDW= 1
##$XDIM= 65536
##$YMAX_p= 449793851
##$YMIN_p= -6768444
$$ End of Bruker specific parameters
$$ ---------------------------------
##NTUPLES= NMR SPECTRUM
##VAR_NAME=  FREQUENCY,     SPECTRUM/REAL,   SPECTRUM/IMAG
##SYMBOL=    X,             R,               I
##VAR_TYPE=  INDEPENDENT,   DEPENDENT,       DEPENDENT
##VAR_FORM=  AFFN,          ASDF,            ASDF
##VAR_DIM=   65536,         65536,           65536
##UNITS=     HZ,            ARBITRARY UNITS, ARBITRARY UNITS
##FACTOR=    0.49542278885378, 1,            1
##FIRST=     16045.7642231865, 0,            0
##LAST=      -16421.768244346, 0,            0
##MIN=       -16421.768244346, -6768444,     0
##MAX=       16045.7642231865, 449793851,    0
$$ Real data points
##PAGE= N=1
##DATA TABLE= (X++(R..R)), XYDATA
$$ [...]
39081 -53609 391 -143266 -393785 -523181 -439826 -236139 -32276 104146 128349 42279
39071 42279 -53848 -38590 91671 232200 304444 304715 245626 147555 74594 77568 110934 109961
39059 109961 129616 269315 459647 488936 291069 54602 -31834 -8411 -28655 -140867
39049 -140867 -293596 -448684 -562965 -546194 -374804 -189020 -147314 -224527 -266998 -201436
39039 -201436 -69611 98934 306515 491048 546065 462032 353529 325202 378903 456384
39029 456384 511831 544934 605021 732632 858653 829498 598640 316303 149444 105419
39019 105419 128097 238517 424495 515744 382992 174179 115443 148357 45290 -149920
39009 -149920 -124628 217613 596573 772377 809912 796491 622342 254642 -54990 -102966
38999 -102966 -51064 -139848 -285834 -267203 -143038 -143403 -243282 -200101 14987 152056 64274
38988 64274 -129204 -278739 -327821 -184733 227299 719410 915367 689554 298882 -1012
38978 -1012 -215631 -392405 -441700 -366394 -408019 -701993 -966191 -814253 -279541 234235
38968 234235 469123 526812 576514 600796 513050 353309 248124 249761 296181 299214 224862
38957 224862 96748 -50784 -201036 -325428 -361282 -278375 -147165 -54930 34812 221266
38947 221266 455722 545081 424259 267787 227074 205441 44749 -180264 -238099 -54879
38937 -54879 212118 381410 379457 202415 -84888 -309025 -304904 -111475 63065 98181 78111
38926 78111 126149 225206 251249 119702 -132376 -360064 -395557 -173135 210266 570495
38916 570495 747169 645266 278942 -154545 -367162 -284311 -166978 -272329 -482146 -478176
38906 -478176 -224881 -11292 -2407 -33943 52140 129184 8878 -253207 -459133 -526818 -465420
38895 -465420 -231966 165717 508127 542330 306143 75003 -16565 -102144 -294588 -467954
38885 -467954 -439386 -239314 -67705 -40785 -94628 -119211 -90209 -50982 -31551 -26247 -24491
38874 -24491 -26827 -35833 -61201 -135842 -290234 -491134 -641561 -675850 -622328 -531498 -389799
38863 -389799 -179056 19642 93949 64775 59052 102160 80334 -34699 -79042 64561 244038
38852 244038 225760 47832 2555 250737 602343 738456 551710 202121 -94115 -248785
38842 -248785 -291921 -252578 -107020 140611 372788 431485 289498 78290 -80099 -186464
38832 -186464 -270467 -292887 -232334 -171962 -170559 -120996 102584 394150 492757 324234 98524
38821 98524 20904 60729 79059 43918 12686 5950 13635 53326 115596 113448 -2074 -122451
38809 -122451 -95724 64758 203506 248018 284176 376514 434031 336792 121661 -59243 -139298
38798 -139298 -194355 -278057 -293355 -114083 193316 370215 234236 -103084 -342091 -295365
38788 -295365 -35837 228433 356997 350770 290524 238535 180873 62404 -102570 -189128 -100702
38777 -100702 69132 120956 23322 -10691 199472 533085 690632 551083 295171 166882
38767 166882 205575 250579 153994 -54263 -198698 -142897 55156 197609 178081 109683 159338
38756 159338 297134 319380 127137 -136102 -286101 -346902 -495715 -789384 -1047044 -1036096
38746 -1036096 -727784 -332796 -91490 -48326 -50130 29656 106472 -12066 -342390 -636662
38736 -636662 -638860 -371150 -87382 23208 -5162 -43150 -53343 -106342 -260092 -459480 -547196
38725 -547196 -400292 -105707 42418 -166606 -569578 -763275 -578570 -285765 -231484 -398062
38715 -398062 -476860 -292475 40081 351708 594382 729861 649712 349739 62269 43184
38705 43184 257955 417156 336865 155598 143106 360110 587041 592089 402579 249148
38695 249148 269151 371497 428916 474743 588090 684239 611654 424637 339747 392053 366800
38684 366800 164094 -4437 49624 169502 106828 -51269 -1745 289474 525827 525209 444214
38673 444214 468462 523415 437816 210641 -48607 -307748 -563054 -696303 -572081 -252286
38663 -252286 49000 233431 399611 618875 763309 661131 357737 92697 1828 -45090
38653 -45090 -231626 -501859 -616678 -480087 -241222 -31483 208503 514743 692315 542232
38643 542232 196372 -22935 -43028 -86109 -264398 -403473 -357990 -258040 -292776 -435788
38633 -435788 -547880 -606574 -666226 -699840 -642067 -515710 -386877 -267191 -164457 -132613
38623 -132613 -159297 -115921 49725 186320 152496 39657 8213 16976 -71859 -208690 -224813
38612 -224813 -143976 -172061 -364877 -536846 -537408 -412746 -256061 -105880 -42067 -160274 -363041
38601 -363041 -389049 -173680 9705 -84054 -335542 -469097 -455205 -486081 -629236 -736565
38591 -736565 -693730 -555621 -387152 -142471 199415 496831 575494 458543 350257 376953
38581 376953 441677 393860 265279 220745 290207 293402 95988 -175544 -287037 -189747 -34200
38570 -34200 57847 94217 111486 126905 195554 362453 529773 526177 364351 278356 411357
38559 411357 593966 558291 289982 35584 -5330 121523 239824 269827 295508 421057
38549 421057 601315 672854 571613 433350 396183 389592 262164 55598 -45002 -16822
38539 -16822 -26115 -113342 -102413 69489 177194 45031 -139310 -78041 204682 427342 466755
38528 466755 464586 543710 643526 662556 589520 458876 313213 230106 260614 322374 266160
38517 266160 64951 -155793 -271981 -256068 -148218 -41460 -60677 -226672 -368320 -312016
38507 -312016 -137589 -88286 -236094 -414953 -504726 -589517 -766369 -964719 -1054789 -1012333
38497 -1012333 -886858 -714039 -544806 -461885 -475848 -482213 -402984 -303775 -297801 -392145 -491392
38486 -491392 -502176 -390024 -192854 -18795 28647 -47000 -164376 -289826 -433065 -523865
38476 -523865 -447362 -243525 -107003 -110514 -96088 44653 154417 48670 -164436 -218034
38466 -218034 -66455 88050 119929 112719 145900 153457 70338 -32815 -51207 25368 161323
38455 161323 356260 592827 778869 832367 781878 710863 640074 536950 412352 325543
38445 325543 292031 255870 170491 46663 -109916 -343477 -655830 -903459 -901244 -665155
38435 -665155 -449148 -452120 -561257 -509094 -241162 33919 168119 261698 440412 608713
38425 608713 587945 414528 320202 422230 578450 583135 404880 185165 66177 66864 103434
38414 103434 100101 64628 41529 21871 -24421 -32761 111332 354734 442882 232790 -55713
38403 -55713 -59107 305136 772518 1047178 1038871 828676 574338 445782 490414 552411 470149
38392 470149 330969 340645 456265 403433 113318 -127686 -98408 28263 -33478 -265882
38382 -265882 -429289 -410362 -262948 -27603 238812 342518 134627 -216777 -390480 -337455
38372 -337455 -285405 -314161 -229584 46253 249645 128388 -186935 -381411 -385030 -375585 -434241
38361 -434241 -442008 -332424 -243020 -320988 -485751 -492609 -220374 165238 371093 294777 129102
38350 129102 101115 173375 132663 -51695 -153018 -33810 131979 129573 27552 16642 39948
38339 39948 -139244 -515200 -763423 -669517 -414746 -310194 -416229 -566340 -629145 -579594
38329 -579594 -405344 -126297 126378 210978 155918 115860 151580 177051 127872 46931 -25567
38318 -25567 -109384 -172520 -98149 129958 313251 251233 14811 -139625 -108620 -35292 -42881
38307 -42881 -47206 68112 228422 275094 219889 216099 293716 306532 184892 68968 90975
38296 90975 162992 120987 -16393 -99765 -112639 -201041 -418875 -598324 -541689 -244740 128672
38285 128672 415541 545377 538800 483284 470907 510495 520525 421450 205527 -67340 -281048
38274 -281048 -300007 -102887 126598 173739 72032 56611 203985 308339 214380 79848
38264 79848 136324 338420 457552 421149 335331 235492 55217 -165587 -269444 -213924 -127854
38253 -127854 -97901 -76133 -45061 -97926 -279384 -484371 -580375 -518508 -302451 6728 234737
38242 234737 221134 46896 -47432 -16610 -66768 -281120 -442151 -374781 -229514 -223113 -306362
38231 -306362 -329502 -355696 -521343 -711409 -688674 -486537 -364857 -385706 -333128 -96419
38221 -96419 139077 166512 2734 -219013 -402054 -457218 -317842 -75905 68825 77153
38211 77153 116862 270510 399680 404180 398893 472399 468884 229038 -92907 -196434 -47850
38200 -47850 101956 87938 10057 24445 129802 210459 171776 -5311 -251244 -425697 -430880
38189 -430880 -322884 -239528 -219403 -174971 -47810 97749 156097 85984 -80616 -272944
38179 -272944 -413596 -476422 -523559 -628836 -754253 -757154 -538286 -149956 240818 466052
38169 466052 462650 327551 255944 362915 569098 704644 689803 546485 290898 -51640
38159 -51640 -338731 -380950 -180575 25366 44632 -45653 -45401 88377 231796 309063 373239
38148 373239 469267 539246 505066 363253 157916 -71229 -269525 -362005 -335924 -292461 -344441
38137 -344441 -471545 -537984 -457049 -284477 -140497 -97118 -165331 -330939 -546007 -719493
38127 -719493 -781360 -748547 -677614 -565312 -363343 -99576 88976 90246 -51398 -175281
38117 -175281 -156245 669 177866 220659 28454 -367070 -798302 -1062452 -1053373 -817392
38107 -817392 -502668 -253658 -129834 -108679 -153100 -240621 -315318 -283748 -135908 -17519
38097 -17519 -64413 -189997 -189234 -68355 -87817 -394404 -785712 -980512 -970455 -913050 -801740
38086 -801740 -505377 -98086 134575 88213 8034 146712 430690 606102 579153 451999
38076 451999 311950 156607 1054 -85310 -72004 -21418 -38731 -195870 -461487 -665697
38066 -665697 -615012 -332947 -117202 -228428 -551688 -705224 -492618 -114147 108049 88024
38056 88024 -16952 -55443 -18239 40232 101086 167807 215209 205103 148815 120031 178399
38045 178399 286739 346600 341352 396999 631261 958536 1136564 1036783 791856 627705
38035 627705 623722 709366 817193 908230 881711 635059 266445 61210 156256 327840 271757
38024 271757 27345 -78545 86993 259429 154865 -134064 -296624 -241927 -159813 -175961
38014 -175961 -173380 -21629 193255 286054 214164 83770 -22137 -106092 -172323 -185916 -130467
38003 -130467 -41168 41867 121629 232411 385739 519278 511763 302280 7302 -154019
37993 -154019 -99804 9535 -36551 -264339 -543536 -769167 -893440 -834208 -530233 -109163
37983 -109163 168355 212181 219503 386522 614841 643422 406212 106282 -47905 -39562 33910
37972 33910 105078 159875 214144 309683 453748 537746 417800 116549 -166177 -298037 -339515
37961 -339515 -343229 -192530 187523 583766 698226 554105 457101 549409 653703 607538
37951 607538 481162 344841 88208 -325530 -646894 -644859 -472510 -445919 -562212 -544279
37941 -544279 -314686 -97453 -29623 3278 61092 -12012 -290662 -569632 -650226 -619571 -653550
37930 -653550 -727748 -734107 -714632 -731668 -637310 -253901 276627 592541 545606 295047 -11986
37919 -11986 -373500 -700817 -747283 -430898 -33897 103493 -22997 -150285 -126358 -57207
37909 -57207 -103935 -276088 -454157 -531205 -488263 -360601 -168380 91407 373940 555847
37899 555847 549976 442711 429365 585245 769370 784787 570525 211570 -154830 -388299
37889 -388299 -385991 -174661 65655 155166 93298 30174 68526 160628 216536 247348 339489
37878 339489 505754 633473 615042 479641 325199 141865 -188519 -672988 -1082490 -1145466
37868 -1145466 -833883 -379190 -33166 107678 72181 -75929 -270266 -452043 -580953 -619540
37858 -619540 -532975 -341634 -127666 64176 265423 447850 447923 174517 -179262 -325981
37848 -325981 -263443 -256459 -424676 -574246 -511637 -311557 -155059 -84420 -59863 -99564 -198358
37837 -198358 -232823 -116002 53602 156951 260923 469027 650826 552404 169809 -192315
37827 -192315 -272976 -106794 120196 321040 529896 759016 926318 928797 768338 581225
37817 581225 492784 448686 292096 34208 -101986 -299 144922 104612 -38303 -31156
37807 -31156 146697 268464 217207 114664 76407 68962 62023 109990 200140 199317 42768 -167507
37795 -167507 -316517 -378577 -317693 -71976 280789 533263 635423 779846 1055043 1208776
37785 1208776 976523 513471 244848 331990 520734 530640 386168 292958 340396 435711
37775 435711 460057 389076 261900 95754 -117265 -329249 -422777 -349923 -240980 -262353
37765 -262353 -379231 -395518 -243128 -71365 3219 62874 204974 353852 395663 369838
37755 369838 371014 369716 296541 214036 230361 311257 347624 343259 356044 316381 111542 -179738
37743 -179738 -346906 -339547 -302186 -312735 -292850 -209166 -158475 -190769 -228160 -225786 -241520 -276979
37731 -276979 -226466 -73838 29381 -10325 -83380 -78933 -76648 -179660 -277221 -156677 202037
37720 202037 588733 783964 711506 430839 101025 -90595 -82416 3716 46680 108033 307951
37709 307951 569601 650106 445390 131879 -50745 -72386 -103727 -271758 -481438 -508597
37699 -508597 -278302 -7979 13782 -205217 -339906 -161240 158101 281477 152554 20948
37689 20948 65508 195710 258667 255021 255861 248058 190219 134854 159224 213172 161570 -24374
37677 -24374 -228080 -357063 -441231 -507115 -459898 -213652 103212 222753 56113 -182435
37667 -182435 -243268 -132329 -33076 -28962 -52792 -63638 -100146 -157102 -180729 -215146 -373976
37656 -373976 -603983 -666250 -471026 -265663 -329541 -608052 -825496 -859992 -803242 -707511
37646 -707511 -500254 -173621 120123 227197 148958 15043 -27486 80928 227525 188424
37636 188424 -107634 -420314 -447357 -201609 24366 46100 -56475 -174720 -327717 -496105
37626 -496105 -508093 -246669 150780 435947 510275 440118 306817 168107 106633 182332
37616 182332 335738 416162 318286 75359 -155837 -203283 -35668 179953 244815 152934
37606 152934 61786 47264 17209 -105925 -253047 -313855 -260104 -121569 38166 88349 -73217
37595 -73217 -334857 -440535 -309603 -117621 1236 111188 236366 233394 83572 41347
37585 41347 221706 281523 -126203 -742157 -956142 -606178 -108873 200092 407254 605846
37575 605846 593603 246448 -132684 -156983 141598 429521 541354 547586 457030 178828
37565 178828 -193446 -340666 -99958 263947 323074 -24876 -453239 -600274 -455747 -270801
37555 -270801 -162652 1197 278540 427315 205056 -224216 -435989 -275707 -2285 115775
37545 115775 98292 79466 81524 89434 148340 238014 218963 54740 -62492 38875 272994
37534 272994 456489 558687 624868 595843 407819 165539 19512 -35370 -56103 31042
37524 31042 285975 543073 612934 611900 783573 1031119 977908 547886 147661 131110 364046
37513 364046 504345 478787 446698 447448 345810 83628 -220469 -436599 -554248 -624890 -662297
37502 -662297 -627345 -474002 -205195 103545 350339 478446 483846 383697 228573 101712
37492 101712 21923 -104121 -315670 -440840 -286889 27438 152075 -29472 -236170 -193668
37482 -193668 10494 134313 155714 219387 329906 346290 252892 215932 330763 464895
37472 464895 416566 156011 -127581 -198354 -11096 219393 261303 182480 269060 561128
37462 561128 677035 287132 -398131 -865343 -926845 -833186 -804091 -768442 -623536 -448227
37452 -448227 -316699 -138309 139833 349175 309683 100782 -59599 -116871 -180611 -280518
37442 -280518 -302853 -170523 48395 225148 269765 153558 -71737 -271915 -325630 -235386
37432 -235386 -104573 -29777 -60911 -213434 -438158 -615785 -663712 -615250 -522877 -353864
37422 -353864 -94292 123922 177906 194473 412555 781171 937532 689368 293692 87801
37412 87801 43626 -72639 -252333 -277967 -163261 -213730 -553463 -876933 -848472 -547345
37402 -547345 -311561 -275698 -281594 -176294 10092 166172 205476 71918 -206046 -453583
37392 -453583 -479771 -294924 -90149 -309 -4783 -50269 -121309 -177848 -176176 -169177 -222900 -224731
37380 -224731 9328 387002 557588 405489 268894 460465 802430 922239 830858 848898
37370 848898 1038412 1097955 863525 559554 423059 371297 228120 57767 50806 206140
37360 206140 328751 283822 105122 -102879 -250026 -283281 -221901 -147316 -102429 -46580 47520
37349 47520 122238 112045 25246 -88424 -171495 -139492 50943 277678 346302 268688 270331
37338 270331 418501 448112 138498 -313078 -531951 -457808 -340029 -328281 -349498 -353344 -378651
37327 -378651 -356241 -151341 115091 83691 -347058 -789155 -838895 -599064 -492136 -673831
37317 -673831 -890971 -886064 -697542 -509528 -396823 -331840 -335943 -484273 -759264 -989042
37307 -989042 -992892 -772866 -501319 -303626 -131353 88209 269146 274233 158023 112829
37297 112829 153042 64091 -236254 -483712 -395525 -85256 64760 -101494 -344574 -360675
37287 -360675 -114412 193237 350333 271957 18380 -255987 -423613 -487393 -527404 -558488
37277 -558488 -516948 -381915 -210300 -33428 176660 395692 504969 441379 324315 341841
37267 341841 531393 741848 807892 710270 557226 445059 364169 249167 108644 58669
37257 58669 185744 408909 550492 540584 474499 456108 472209 459476 408109 333507 220177
37246 220177 82853 28609 147948 360563 473416 400577 235397 91958 -23834 -142567
37236 -142567 -226888 -221943 -158486 -123632 -153032 -220305 -312313 -439182 -572348 -644093 -622357
37225 -622357 -533128 -406853 -266771 -176334 -215946 -375778 -536879 -598229 -564888 -483633 -377047
37214 -377047 -288596 -284519 -318409 -200293 156510 534515 635145 466386 314777 338182
37204 338182 411802 427218 492015 681678 800672 619514 241869 6257 55093 193335
37194 193335 173320 -41535 -305537 -440044 -339803 -59572 184890 213244 89785 33934
37184 33934 130625 252552 261723 141607 -76777 -349158 -537219 -469675 -170389 116222
37174 116222 212946 185024 143292 41932 -178756 -389671 -412199 -287113 -212241 -246500 -262804
37163 -262804 -195862 -153463 -227864 -337651 -335648 -187977 13723 150528 140133 -29029 -267463
37152 -267463 -430798 -450721 -398479 -383107 -414703 -417894 -373604 -385850 -555950 -802689 -882205
37141 -882205 -646671 -247214 5820 -17741 -160414 -222493 -193051 -164238 -126147 19027
37131 19027 277043 516376 603770 504438 261177 -36150 -258426 -305480 -206288 -113178 -174990
37120 -174990 -419079 -728622 -914799 -861382 -640595 -439162 -338000 -245901 -98479 3971
37110 3971 -29183 -89094 -27632 76186 21864 -180528 -320497 -339655 -420191 -638819 -769407
37099 -769407 -588764 -214381 39498 48908 -23313 46898 334342 709638 897564 682095
37089 682095 177259 -184359 -75588 356281 669267 633496 425219 338293 443010 555495
37079 555495 451015 85408 -332775 -491312 -253018 221222 659914 932228 1049368 1009717
37069 1009717 794965 499335 306423 290713 335891 286873 116788 -67788 -116335 69308
37059 69308 435787 761072 832001 673922 525111 551701 672036 707034 613137 481735
37049 481735 366594 225158 40356 -90489 -55202 109887 227877 179402 36468 -60942
37039 -60942 -110739 -218967 -376450 -419255 -273772 -98058 -65915 -125823 -117230 -36337 -21155
37028 -21155 -131685 -310934 -510396 -670082 -628147 -289630 117427 219983 -2007 -154779
37018 -154779 16155 268152 247504 18225 -57361 153056 410891 457428 274919 -6081
37008 -6081 -258171 -376922 -309914 -125434 45072 149897 210529 197377 59997 -107358
36998 -107358 -97007 143259 397639 424818 222895 -22775 -165679 -177421 -74310 110964
36988 110964 294705 374065 314485 161762 -25127 -199513 -291928 -226123 -13106 212629
36978 212629 309125 275288 236256 272596 319531 273947 147972 38603 -28139 -117469 -239284
36967 -239284 -298949 -253372 -212935 -295275 -455447 -566065 -597745 -593778 -523260 -325164 -88067
36956 -88067 -7511 -116081 -207668 -107847 104292 232678 211391 104330 -55843 -290905
36946 -290905 -564058 -754478 -760397 -585792 -346388 -214182 -285888 -448974 -457129 -220770
36936 -220770 60110 158166 119399 143167 238539 226774 83958 28004 170986 308424 219588
36925 219588 11460 -40650 108492 250510 245411 151534 45899 -66005 -127458 -34728 146395
36914 146395 158661 -118691 -467926 -607055 -539290 -453797 -383354 -188791 143924 421915
36904 421915 507259 473200 425189 333135 152212 -23304 -70684 -27467 -32568 -116260 -172268
36893 -172268 -127611 -28952 55287 129122 228697 340416 395051 329871 156464 -16347 -45516
36882 -45516 122822 389888 575968 547163 287312 -87666 -363822 -365605 -136034 76915
36872 76915 100238 52787 180674 520410 864567 1058445 1174021 1331126 1479105 1466260
36862 1466260 1258344 980049 756228 589521 402606 158494 -77765 -198642 -182794 -136368
36852 -136368 -157110 -187024 -94355 102216 221461 177221 108465 148447 189031 42508 -230011
36841 -230011 -352950 -208707 11201 93461 78615 128791 235000 221289 13156 -243290
36831 -243290 -361834 -319536 -233628 -201361 -220372 -235936 -212473 -161269 -132845 -185772 -336206
36820 -336206 -527360 -667885 -718399 -732804 -796554 -925935 -1047943 -1082179 -1013271 -863869
36810 -863869 -632602 -314455 25571 271626 382754 440856 518509 550739 427249 188796
36800 188796 14521 -14601 -22565 -131237 -249231 -204553 -38500 7457 -165529 -340965
36790 -340965 -264782 3005 153228 8251 -299659 -540901 -645176 -677387 -663139 -567575
36780 -567575 -423631 -349087 -384697 -406805 -292004 -122346 -113046 -332703 -612640 -781196
36770 -781196 -870208 -987115 -1081386 -1005124 -776066 -594662 -554798 -496084 -232724 187393
36760 187393 546244 681721 562644 251580 -78481 -185038 18138 312650 402451 265901
36750 265901 135009 145072 182481 108960 -34341 -123631 -125083 -85328 -45838 -45824 -128195 -261875
36738 -261875 -323742 -239599 -104133 -97446 -304558 -643201 -926161 -979315 -769353 -451791
36728 -451791 -230268 -138576 -33927 165860 336978 306038 73150 -198965 -367407 -415506
36718 -415506 -415165 -427388 -407586 -211304 217587 656870 745505 385341 -119398 -412675 -453106
36707 -453106 -421590 -402505 -337772 -220968 -139823 -130663 -139286 -129605 -112687 -79389 -22846 -15080
36695 -15080 -139334 -349234 -504652 -535669 -462079 -281923 11754 304808 409999 284466
36685 284466 83058 -42131 -95869 -167349 -295042 -420185 -400735 -103968 395966 752231
36675 752231 652445 203171 -160792 -170603 52884 288616 488937 660723 700683 534830
36665 534830 282055 106450 12095 -64724 -74935 49697 202758 190108 -25325 -313630
36655 -313630 -560672 -707606 -672031 -427617 -143760 -40847 -77305 31204 415540 836065
36645 836065 952205 690248 256594 -107972 -284089 -267604 -136493 -11388 32626 18289
36635 18289 -4051 -46294 -150301 -294896 -402658 -435240 -419943 -369748 -237510 8420 297097
36624 297097 494774 523204 395530 148959 -182253 -506097 -677602 -645182 -536268 -501844
36614 -501844 -516411 -448529 -304598 -250416 -365118 -527071 -612954 -669598 -780964 -878809 -827167
36603 -827167 -638627 -477923 -464695 -554040 -593055 -448388 -129743 172848 263240 202110
36593 202110 266477 555004 793281 698784 399505 259403 374761 504514 467104 329128
36583 329128 174129 -39168 -296748 -448849 -441811 -441016 -588102 -797053 -923123 -980699 -1048688
36572 -1048688 -1096967 -1062972 -985821 -911289 -773588 -535311 -341342 -345849 -460949 -472405 -352954
36561 -352954 -255604 -222550 -128058 54710 142494 -3735 -259761 -384367 -296110 -114596
36551 -114596 9618 26574 -9805 -2789 106596 280690 413728 427086 319054 135709
36541 135709 -57865 -177874 -154606 326 177649 237371 103507 -167115 -389943 -385510
36531 -385510 -165896 53884 91966 -1461 -53702 -14068 23681 -2781 -67204 -159834 -299983
36520 -299983 -428189 -435365 -339761 -291592 -347486 -392820 -374744 -456943 -795512 -1262776 -1555837
36509 -1555837 -1531162 -1293570 -996917 -712022 -488555 -394148 -436430 -535800 -619395 -680375
36499 -680375 -722150 -711740 -620712 -462199 -263293 -45827 147737 258890 272156 235594
36489 235594 199018 157810 75620 -57931 -205444 -307638 -335149 -325465 -345674 -394865 -380390
36478 -380390 -239991 -50966 59177 91272 163723 308500 383870 253479 -19595 -235895
36468 -235895 -279180 -202667 -119886 -85707 -91394 -111085 -115911 -74439 15019 89298 55000 -106531
36456 -106531 -281282 -322120 -222116 -127873 -135536 -144052 -8736 206389 277277 137775 -4896
36445 -4896 47640 216562 285219 216697 173327 251730 361572 393163 365309 339902 294124
36434 294124 173781 23297 -31264 70858 253711 396720 466374 526574 614005 631824
36424 631824 422110 -29362 -506976 -744699 -680902 -487821 -366469 -374596 -446132 -497033
36414 -497033 -483550 -412811 -328808 -260686 -185661 -83389 -3799 -1409 -13829 81340 263281
36403 263281 341967 196089 -74307 -313634 -510166 -699049 -764668 -537276 -84593 270409
36393 270409 288574 60905 -143377 -182112 -124002 -101146 -166435 -271576 -321014 -254329 -114349
36382 -114349 -20192 -37368 -90169 -46998 109009 242919 228334 112596 68348 174355 301901
36371 301901 264005 34837 -250932 -489595 -697312 -905093 -1086256 -1228142 -1348387 -1371955
36361 -1371955 -1143089 -692659 -353025 -400230 -661599 -710808 -419332 -62970 123539 205669
36351 205669 279542 244765 35654 -163860 -183314 -162312 -306008 -478974 -369292 -5485
36341 -5485 234346 170862 57746 147993 311704 283954 80701 -78181 -140526 -264317 -516332
36330 -516332 -741170 -768253 -605421 -378364 -175469 -1338 170738 330071 393146 262327
36320 262327 -34656 -303946 -358689 -206969 7226 208459 420747 613077 662936 522684
36310 522684 308394 157832 89762 65778 93872 178749 246616 228584 169158 144556 114763
36299 114763 -20336 -235737 -381738 -378101 -283217 -149729 44643 255900 304113 78718
36289 78718 -256547 -399065 -231978 84237 325655 403980 349281 209067 26883 -135491
36279 -135491 -223133 -240766 -258760 -345365 -469347 -484348 -277805 44824 217935 125695 -40604
36268 -40604 -47048 52625 27369 -140510 -207123 -46347 156808 208247 194050 285280 409886
36257 409886 356912 134346 -25120 -19109 -8829 -135560 -300675 -344851 -303002 -328303 -431994
36246 -431994 -450101 -274212 -11647 123875 34002 -186345 -374097 -462617 -496030 -499643 -411191
36235 -411191 -193242 45496 147422 120716 146791 333816 556629 611315 461145 244181
36225 244181 78703 -42455 -170539 -306639 -419239 -489203 -488147 -355788 -70211 258315
36215 258315 432472 356704 154810 45185 104286 209411 217947 126532 19467 -55079 -81437
36204 -81437 -20582 127998 244751 203276 68648 47417 202206 349558 317214 181575
36194 181575 132948 196073 238293 219208 263245 443443 622732 599392 352054 64046 -74639
36183 -74639 -36634 61085 101174 83470 114255 276019 504923 626100 539747 348535 244897
36172 244897 265908 225774 -55899 -496709 -796358 -738449 -381865 52575 394579 577782
36162 577782 577748 412533 182460 8522 -82564 -150725 -226893 -275169 -265534 -206560 -103346
36151 -103346 34217 131489 87422 -98824 -314324 -463669 -533696 -522746 -423355 -307864
36141 -307864 -298216 -385696 -413592 -324319 -273030 -358863 -392133 -144009 256432 429616 256843
36130 256843 47885 120637 402130 563872 422796 87742 -201875 -270803 -107181 123989
36120 123989 200258 58395 -132795 -176361 -83313 -34342 -141639 -332674 -459730 -446022
36110 -446022 -311903 -120495 67496 210320 286661 293368 251830 208219 194879 185403 127627
36099 127627 37214 12358 121967 315450 479436 552098 546161 496862 436578 392806 358141
36088 358141 283250 153199 49037 65320 171394 227163 151142 4401 -122195 -235165
36078 -235165 -391509 -569702 -673244 -663834 -612152 -581195 -525722 -378795 -200257 -136772 -219945
36067 -219945 -307816 -288655 -253249 -358234 -575607 -717489 -698575 -621988 -572663 -487701 -323183
36056 -323183 -202247 -241473 -319921 -203016 129377 447074 566432 520719 407085 242320
36046 242320 58597 -17048 69805 147376 -638 -327586 -546545 -472082 -218171 -29623
36036 -29623 -30475 -190373 -432499 -673410 -809017 -776646 -647462 -584115 -668213 -802105 -811628
36025 -811628 -629648 -355087 -144324 -74267 -111630 -180548 -232909 -265660 -298005 -333318 -330234
36014 -330234 -229980 -49590 68544 -27271 -306689 -550435 -587754 -478651 -380435 -293409
36004 -293409 -78766 268925 527664 515288 340015 255933 324604 362023 219950 -16549
35994 -16549 -164070 -172806 -143902 -172691 -258496 -345650 -373886 -288407 -83497 120533 104405
35983 104405 -254994 -796505 -1141867 -1014303 -497247 46196 303545 241389 41797 -103559
35973 -103559 -116351 -35852 29922 1694 -63660 -13924 179094 307994 163312 -154893 -319198
35962 -319198 -186840 40543 137300 154966 256595 392929 366549 171694 36895 87698
35952 87698 166838 86773 -100778 -228044 -289589 -422729 -655642 -849841 -905460 -865420 -762790
35941 -762790 -516451 -99406 285215 355159 65057 -349865 -649479 -789789 -832781 -799101
35931 -799101 -687811 -529472 -322388 -18316 313367 427729 205839 -55005 92144 655513
35921 655513 1124682 1079213 665508 324580 244454 296242 367187 479723 610646 639014
35911 639014 518094 333722 168596 55496 59914 223193 398944 348679 73115 -136722
35901 -136722 -76881 116009 215094 239961 361345 580938 711450 639985 441747 241119
35891 241119 102788 60397 119628 212935 258105 277189 357064 478569 495299 322792 56774
35880 56774 -148988 -248165 -287040 -287045 -223128 -101989 6874 37894 -5635 -78790 -173756 -330601
35868 -330601 -544779 -700423 -664388 -451855 -228535 -121188 -91752 -31974 98547 283971
35858 283971 507542 699035 709584 476318 168621 22241 43457 33973 -85940 -163451
35848 -163451 -84911 18345 -30001 -169253 -187363 -36087 96654 30510 -212640 -476850
35838 -476850 -634442 -642058 -511831 -291564 -58922 98337 115960 -2413 -159799 -230819
35828 -230819 -199043 -191819 -316325 -496292 -558615 -465886 -358017 -349644 -395644 -401945 -363970
35817 -363970 -316777 -236096 -99064 9005 -27251 -176918 -274471 -224833 -109839 -70811 -163998
35806 -163998 -350305 -542418 -632818 -565001 -424742 -379449 -473552 -565663 -527739 -410445 -325351
35795 -325351 -266827 -182235 -133153 -206773 -301493 -206613 64973 208744 -9596 -452708 -776611
35784 -776611 -803316 -628349 -438378 -342808 -348497 -387975 -363936 -230231 -38524 118691 189983
35773 189983 172625 84916 -34602 -139210 -211635 -249430 -212009 -66103 96986 105841 -63897
35762 -63897 -215019 -176020 -31527 4695 -129361 -310242 -411144 -385677 -221360 40673
35752 40673 257631 299004 215032 172851 223399 252478 172197 36560 -63657 -111635 -125452
35741 -125452 -90399 23284 212969 416360 505134 369098 84609 -84233 12636 182474
35731 182474 146884 -28035 -11376 265874 453950 286954 -6236 -16715 272979 487178
35721 487178 378176 118010 31284 201830 432961 519504 464400 414030 430942 413059 279756
35710 279756 151716 212286 412787 481624 277658 -1590 -41980 254400 712838 1055763
35700 1055763 1079408 792287 456030 368466 528455 642956 538431 393174 438867 613924
35690 613924 701061 658198 579870 434135 104998 -328849 -601008 -568614 -331761 -36658
35680 -36658 248035 441416 444103 292613 161192 138488 129395 27972 -144868 -325079 -484793
35669 -484793 -559913 -437383 -117315 207237 328741 222928 10520 -196409 -337503 -371175
35659 -371175 -297621 -189799 -133056 -137522 -139905 -82586 15173 49795 -81513 -351792 -594970
35648 -594970 -681810 -661569 -651911 -647059 -560451 -424258 -391544 -524473 -715224 -844966 -900971
35637 -900971 -911653 -885754 -841762 -783818 -641037 -364919 -85832 3228 -56273 -9453 228843
35626 228843 422980 362371 163878 77985 155445 270982 339683 338278 233036 63080 -13429
35615 -13429 65757 114722 -45759 -291770 -381268 -339000 -380214 -495633 -428005 -110922 164674
35604 164674 151061 -24071 -92947 -34733 -24435 -98651 -85676 133165 443044 618460 550700
35593 550700 324319 116888 55469 151775 337326 526287 642897 638478 530098 407173
35583 407173 363977 433283 588801 756701 802871 602812 203813 -157426 -301975 -317766
35573 -317766 -413688 -621884 -782570 -794865 -735422 -724536 -800985 -933531 -1037973 -987973 -735447
35562 -735447 -414284 -194696 -58168 121117 299658 291896 96708 -48925 -24934 2246
35552 2246 -108076 -220484 -166377 -40675 -40068 -157716 -261659 -342043 -434922 -416397 -160907
35541 -160907 156649 222769 50383 -15123 195389 449028 496962 415945 399107 428988 373027
35530 373027 255450 207946 224419 165777 -15671 -213361 -316662 -302022 -196020 -65084
35520 -65084 -20478 -114735 -247063 -287757 -280249 -384333 -614334 -784466 -761671 -633908 -544714
35509 -544714 -480317 -345076 -175437 -128978 -257703 -413188 -429834 -332153 -287489 -367379 -424271
35498 -424271 -254918 126124 445967 462974 258998 147967 290161 517848 604186 571493
35488 571493 578738 584610 358362 -124162 -511749 -462862 -72767 265404 350834 318098 314003
35477 314003 283613 169911 105367 212017 338855 226660 -100703 -327190 -258470 -54890
35467 -54890 26659 -41162 -111386 -119733 -127000 -166427 -207025 -254538 -346069 -429686 -381644 -190770
35455 -190770 -18183 -4817 -94676 -121378 -20058 116368 165645 104803 19014 10441 87599
35444 87599 144147 81549 -58227 -147980 -152816 -145132 -127509 8002 261878 419191 305964
35433 305964 39787 -149627 -252584 -411926 -587322 -565213 -327669 -132052 -125580 -135457
35423 -135457 9587 183182 187876 81507 35181 17617 -103751 -250428 -225022 -75123
35413 -75123 -55671 -209172 -288871 -179223 -103443 -268961 -547380 -684302 -635558 -509726
35403 -509726 -344954 -154523 -66167 -185731 -390447 -465273 -402100 -374897 -455681 -549937 -593450
35392 -593450 -609489 -563318 -373321 -123574 -67993 -312189 -631978 -733776 -609048 -512836
35382 -512836 -629137 -849887 -894487 -624598 -235474 -91069 -317255 -624434 -648059 -405571
35372 -405571 -235509 -305155 -423901 -415040 -409557 -579845 -775857 -689286 -298831 94228 257521
35361 257521 238023 167135 65248 -84380 -222586 -276498 -253034 -207646 -181087 -195010 -239457
35350 -239457 -249995 -180078 -104846 -151002 -303453 -393580 -317229 -156333 -40202 4658 17074
35339 17074 27046 72748 169815 211636 60446 -176530 -164357 190920 477440 251469 -332196
35328 -332196 -681250 -536940 -248396 -204884 -334381 -366291 -319430 -422748 -682827 -846750
35318 -846750 -789639 -678775 -690555 -765991 -751088 -642714 -574497 -625733 -738743 -795387 -718242
35307 -718242 -526286 -333121 -256060 -287792 -295018 -184437 -24470 58254 63562 107326 228614
35296 228614 310376 246386 109793 59956 111805 113499 -16776 -137865 -59015 187985 358781
35285 358781 277977 20281 -210226 -300125 -282744 -237856 -197950 -135105 -10839 143349 198821
35274 198821 44852 -250656 -471839 -491334 -406203 -385353 -462538 -558775 -623658 -632005 -501951
35263 -501951 -177277 213163 434792 426986 376375 458159 624619 729091 755007 807831 930543
35252 930543 1031655 988478 764582 446904 209407 194027 363953 513375 491746 379406
35242 379406 355461 427417 419248 249204 92706 175938 465967 668233 535888 115569
35232 115569 -329803 -583574 -616821 -508210 -313707 -67663 127804 113876 -159440 -506039
35222 -506039 -625632 -401470 -43948 122433 14417 -129869 -50421 223892 432713 404540
35212 404540 215152 31459 -83930 -165544 -240194 -304239 -344625 -324862 -218871 -114018
35202 -114018 -178564 -425404 -606255 -487474 -164264 65248 90218 56618 67421 49243
35192 49243 -28429 -34063 94372 177249 21162 -291357 -498048 -475106 -329156 -228192 -255115
35181 -255115 -377499 -459237 -353436 -79125 148481 150121 -21431 -198095 -311089 -376978
35171 -376978 -377890 -313606 -290655 -379766 -440538 -282098 28177 217227 174520 75509 105105
35160 105105 239321 358170 411500 395843 301062 160445 53378 5341 -18122 1396 115962
35149 115962 244018 188259 -95886 -395118 -501831 -454408 -409213 -402704 -375950 -331600 -314060
35138 -314060 -298947 -244087 -203936 -257339 -349655 -337832 -193952 -63492 -110956 -368520 -718360
35127 -718360 -964854 -961353 -740385 -491103 -350022 -267399 -149897 -51022 -90581 -236409
35117 -236409 -323547 -290355 -250316 -301885 -400973 -473159 -529631 -591834 -601553 -516366 -438085 -521328
35105 -521328 -747618 -888363 -744653 -382473 -80093 -47880 -229585 -379567 -308951 -50645
35095 -50645 187359 212595 17980 -211999 -281667 -184676 -90161 -116882 -195729 -210113 -181838
35084 -181838 -203166 -250589 -222695 -138345 -122490 -182310 -182023 -90083 -63189 -192921 -342825
35073 -342825 -355784 -262033 -143692 43888 334107 569476 573684 412643 276560 184684
35063 184684 36009 -114056 -100223 34420 41353 -154160 -320171 -257673 -63160 59286
35053 59286 63170 11255 -72486 -155141 -131090 34158 185680 154100 -10454 -109461 -54392
35042 -54392 64909 133573 119578 48482 -28599 -49988 -11808 -16767 -175936 -452241 -660404
35031 -660404 -637780 -385945 -51085 199593 287897 251153 178229 122356 85032 69765 104171
35020 104171 187855 249441 189640 -23944 -301878 -485242 -494815 -436189 -491961 -680057 -807551
35009 -807551 -728073 -540609 -421534 -360267 -222491 -2355 178125 273891 314039 231452
34999 231452 -55778 -391505 -491716 -364295 -326806 -502022 -610552 -452026 -287598 -454380
34989 -454380 -821827 -966207 -757059 -445177 -238869 -110283 -12308 1124 -82908 -186750
34979 -186750 -264263 -304127 -236276 -31049 148305 132939 72170 294125 802219 1183462
34969 1183462 1113446 716361 314276 46366 -118529 -192483 -180499 -160797 -194545 -232953
34959 -232953 -217565 -182606 -174760 -176894 -185506 -239996 -303269 -268284 -179027 -266402 -617810 -978126
34947 -978126 -1065927 -941587 -835423 -728819 -396107 155623 573369 570356 256540 -40590
34937 -40590 -139353 -85748 9527 80657 94098 40354 -37962 -61384 7229 104734 122796 50144
34925 50144 30614 209694 528886 774715 866319 974081 1259680 1600914 1722841 1563224
34915 1563224 1358408 1355067 1563722 1839897 2102470 2383168 2695960 2942433 2989157 2825979
34905 2825979 2595217 2421685 2254337 1959792 1551378 1202977 1019233 931815 868901 861042
34895 861042 883831 778950 505015 313644 436683 683659 615919 113200 -474083 -760844
34885 -760844 -686786 -398583 -21947 329534 517189 509780 440483 420312 406968 352912 343633
34874 343633 452857 573246 545480 383574 231477 151971 91209 8970 -81609 -170166 -229174
34863 -229174 -174064 32164 253237 281965 78129 -183084 -295423 -180430 103699 407387
34853 407387 559588 500193 347958 258120 237107 194953 140906 183062 338373 497550 605329
34842 605329 723045 863686 921136 845469 743433 695812 609851 398308 196107 215670
34832 215670 437704 626700 645428 589618 600284 710987 926865 1289015 1759014 2157687
34822 2157687 2337911 2350155 2337352 2326321 2226291 1986460 1648524 1279978 968634 851429
34812 851429 1003233 1281875 1424876 1351998 1244588 1248916 1232885 980989 555047 278884
34802 278884 346130 590696 716085 647771 553755 565777 604473 512901 281150 61372 -21073
34791 -21073 5244 42739 66959 113441 159202 118295 -27017 -180516 -263101 -312385 -386664
34780 -386664 -441300 -400059 -311942 -324427 -493785 -711419 -836944 -828692 -723524 -570804 -433308
34769 -433308 -387891 -454567 -546631 -549467 -456901 -396181 -491723 -703120 -827117 -701961 -405636
34758 -405636 -191252 -208479 -363170 -487733 -543824 -562076 -481956 -212611 183587 527559
34748 527559 738510 868384 934970 895846 801736 781231 824068 779168 641155 615238 769191
34737 769191 850672 655302 382674 359266 539748 592784 428949 316096 425669 563437
34727 563437 486009 266915 174092 307498 513901 600058 512935 336665 193098 144697
34717 144697 165613 206752 260197 321078 339189 290931 248617 270412 276698 180429 91327 199460
34705 199460 469410 665377 700590 724120 798441 753206 499037 249961 235239 370592
34695 370592 426392 372916 336835 343833 347186 411165 601315 752572 623302 271110 13075
34684 13075 -8685 30742 -27419 -108623 -111670 -95599 -130752 -161863 -163234 -254113 -492742 -699078
34672 -699078 -666752 -452365 -276207 -209830 -145456 -37429 10929 -75614 -212093 -242626 -100447
34661 -100447 124622 239547 114496 -145032 -262548 -116383 78808 45708 -173934 -293949
34651 -293949 -214945 -165261 -351854 -655385 -790895 -653755 -388576 -195454 -175844 -306719
34641 -306719 -454047 -441710 -202777 142754 413051 536733 556104 521001 457405 390743
34631 390743 312493 167493 -35747 -159046 -98284 37999 67201 16790 75381 250755
34621 250755 309619 148315 -4166 77269 259745 259256 71275 -66064 -66989 -67754 -104299 -23694
34609 -23694 193810 296917 110970 -180564 -287470 -187579 -54022 59808 229736 425885
34599 425885 508460 459842 421976 473471 533630 521600 461057 386510 288124 202636 224491
34588 224491 352941 437664 353909 145044 -73690 -262489 -431240 -545310 -546518 -425365
34578 -425365 -211966 56899 310659 446041 422811 315956 216825 127427 8902 -111839
34568 -111839 -155148 -93567 849 10318 -126970 -331944 -418758 -291299 -92675 -44421 -138618
34557 -138618 -154382 -20210 51566 -80833 -207272 -61413 244439 355712 187498 14931
34547 14931 40433 150854 188362 205669 291680 334198 165508 -142969 -318692 -210475 46719
34536 46719 196067 119017 -70220 -157428 -62536 73714 92280 70086 239200 635843 991999
34525 991999 1056140 876359 655043 463871 259671 72248 -18504 -41525 -84414 -102278
34515 -102278 47281 368912 688336 870141 933264 925662 835974 678560 526191 395654
34505 395654 228507 49538 6033 154781 337806 395662 403021 542484 807321 994203
34495 994203 984030 880689 825996 782053 578998 156383 -295790 -474850 -272897 71466
34485 71466 196196 1600 -264823 -326027 -162206 75401 294963 478073 572773 545339
34475 545339 483465 482421 473381 342310 177708 179691 322674 352964 174005 -16905 -75006
34464 -75006 -127518 -274145 -316751 -54243 321618 433211 240891 60960 86211 187888
34454 187888 225604 254530 313496 263269 9163 -288917 -403731 -325222 -212992 -160942 -145506
34443 -145506 -127021 -72297 56167 213544 242782 55162 -217087 -367812 -355681 -270891
34433 -270891 -135985 91198 346748 468728 390025 183901 -81141 -375678 -593887 -597554
34423 -597554 -439557 -360615 -453976 -496446 -269826 73303 164802 -106009 -465498 -605838
34413 -605838 -488866 -262193 -47374 77056 10897 -271430 -580351 -626655 -339488 23870
34403 23870 162447 66742 -22697 37907 113453 -421 -283083 -507411 -523828 -419593 -364242
34392 -364242 -374098 -304011 -56168 271774 480236 480664 371021 299607 303809 312628 259842 132530
34380 132530 -57705 -258908 -343767 -212016 33786 138694 6442 -147270 -73295 164979
34370 164979 284055 178187 42857 74669 207760 224205 20836 -309232 -589308 -694101
34360 -694101 -628544 -514065 -450362 -385828 -205941 48799 181453 102604 -33385 -41242 56813
34349 56813 110234 62455 -29911 -127075 -218481 -250543 -179767 -77453 -54572 -97002 -106857 -100807
34337 -100807 -211885 -456430 -649520 -639299 -513884 -466686 -529364 -557694 -449615 -259839
34327 -259839 -92902 11174 44831 -22710 -186163 -333252 -333687 -209658 -131394 -199845 -307397
34316 -307397 -291192 -176417 -160903 -355636 -635740 -784105 -717050 -531149 -376855 -320673
34306 -320673 -300054 -200353 -7637 130086 56468 -191864 -418026 -483451 -390343 -169828
34296 -169828 148059 427351 479501 317909 200454 307431 524096 657991 703263 733095
34286 733095 701322 561810 444961 475456 523343 389113 139252 -19553 -105949 -267464
34276 -267464 -377090 -135465 376824 666207 495629 215306 218962 411621 485337 423219
34266 423219 395149 374571 224833 34782 15943 131749 148370 22133 -59704 -15297 34322
34255 34322 16488 -5612 -21985 -100572 -184259 -111526 101165 239507 229850 253316 413813
34244 413813 535611 453084 289678 240029 234180 62787 -244232 -410721 -296454 -94316
34234 -94316 -82477 -300536 -546826 -631401 -554245 -441822 -371413 -313178 -237925 -198154 -236981
34223 -236981 -276036 -200039 -34251 72653 47589 -30180 -63644 -41842 12374 87093 137138
34212 137138 96263 -29154 -169744 -310009 -476180 -595544 -535136 -340073 -253276 -380851
34202 -380851 -493037 -312531 112776 484648 611623 524934 309362 12436 -280971 -444112
34192 -444112 -422723 -278443 -116267 -16969 5908 40253 185258 351702 280738 -93850
34182 -93850 -430912 -351802 46760 307474 226926 73383 125745 276484 264550 98876
34172 98876 22552 147715 329011 380459 268986 87252 -56682 -104142 -69598 -15276 25425
34161 25425 75846 137406 134578 6601 -171300 -230676 -81257 198299 436800 506712 400000
34150 400000 218832 106040 151893 331476 521907 600210 550907 467771 415828 320829 87785
34139 87785 -175409 -212907 16170 200588 82812 -135836 -60306 298798 523636 421138
34129 421138 296397 434805 646700 613429 437835 477439 748466 884209 687794 375107
34119 375107 189011 84755 -51824 -131556 -21116 185428 269052 178278 41500 -58680
34109 -58680 -154863 -255711 -289218 -213501 -87614 -7317 -30727 -160724 -328896 -406496 -321016
34098 -321016 -174010 -153373 -293892 -407532 -311618 -62072 123199 138826 92454 125725
34088 125725 235134 329038 389911 478480 591330 622395 513120 368529 346336 454170
34078 454170 527907 417199 137003 -183154 -446359 -633151 -723863 -657533 -420819 -140553
34068 -140553 -129 -38525 -106985 -80792 -40871 -146064 -380041 -571888 -660552 -762134
34058 -762134 -915797 -942770 -698269 -336517 -142769 -159968 -163863 -3883 194355 205073
34048 205073 -34503 -378067 -611863 -627660 -518252 -485679 -587377 -634493 -463878 -235513
34038 -235513 -247084 -464891 -507447 -195254 135952 76674 -272414 -418303 -115027 365733
34028 365733 623356 568346 385752 229427 108535 9604 -31878 -20651 -65152 -265267
34018 -265267 -555318 -736106 -686260 -481353 -267791 -92039 69377 180136 173818 91186
34008 91186 48754 59371 23539 -71197 -98206 -8647 53280 -32274 -153868 -125954 32341
33997 32341 136254 115651 105225 245504 502456 708525 721823 543008 317165 205304
33987 205304 229981 287608 314573 337088 324814 150891 -189994 -458485 -423198 -144114 150352
33976 150352 369918 557129 663445 575121 349565 197845 208472 289718 401611 612193
33966 612193 861674 911025 661923 350407 272893 449127 692577 893981 1073878 1225079
33956 1225079 1262582 1131257 882066 645689 550711 609426 666918 556525 334194 238123
33946 238123 367007 542396 576214 521326 519390 535083 431263 233880 124049 183206 319594
33935 319594 457886 638393 876664 1055995 1050507 897820 778197 829723 1008562 1133213
33925 1133213 1073492 893230 771464 779364 800559 701093 499654 309805 187173 118064
33915 118064 102848 151452 224773 269558 294881 342237 408101 472440 566892 713667 816397
33904 816397 732356 481414 286260 343487 597118 786735 710783 421940 159864 93221
33894 93221 149489 135568 6267 -70533 60371 337438 560892 610585 529296 449880 493638
33883 493638 673464 840716 806384 578259 379250 343797 316101 92550 -238282 -396356
33873 -396356 -309793 -201411 -246641 -331090 -235049 62314 359897 460059 354723 209613
33863 209613 185873 273833 336914 333682 398290 619546 847976 871211 709892 565962 527667
33852 527667 530908 593018 837539 1225854 1489171 1445076 1213841 1007148 861671 715694
33842 715694 603831 606145 698895 818851 1005854 1317672 1650045 1818444 1827068 1906889 2243908
33831 2243908 2781211 3343504 3862508 4384716 4886808 5186013 5097685 4662114 4143207 3764843
33821 3764843 3501816 3195179 2820292 2516752 2346546 2158385 1773883 1236202 789545
33812 789545 636096 761390 976957 1098336 1091351 1053513 1045864 986036 768694 449592 201449
33801 201449 96327 52274 2338 -25459 -31303 -86995 -174481 -132237 110130 364432 406927
33790 406927 287973 250349 379953 513547 504103 416880 398183 459753 480399 377465 215809
33779 215809 155652 308936 625487 912122 991929 859032 658275 509035 381270 169558
33769 169558 -135051 -401379 -507972 -488436 -461181 -435200 -291204 7353 294037 385687
33759 385687 316875 276943 363503 519213 672003 792700 825606 716649 534854 432273
33749 432273 454908 517059 577813 691294 843287 901213 804200 664911 601104 596877 614753
33738 614753 702047 865284 958456 840525 573350 342098 237565 222812 253069 311275
33728 311275 361355 374893 397115 513913 756079 1068573 1345829 1477728 1418040 1249410
33718 1249410 1142770 1219609 1460504 1718384 1788275 1544171 1105333 790635 778248 892923
33708 892923 883722 788414 784797 804234 638945 383817 370455 628575 829017 850984 959407
33697 959407 1252625 1398697 1192797 950685 1002736 1170087 1135869 1011299 1094843 1323449
33687 1323449 1408001 1317962 1212256 1077196 857371 762271 989934 1300200 1326339 1173275
33677 1173275 1220533 1453243 1526076 1431551 1536823 1917884 2192834 2132536 1975813 1995966
33667 1995966 2140317 2229779 2191606 2009615 1737955 1589721 1713939 1914802 1917171 1823925
33657 1823925 1916329 2112012 2109262 1994727 2158550 2622865 3018171 3229629 3469746 3691018
33647 3691018 3596059 3325218 3427880 3956801 4274968 4023157 3638993 3629945 3944215 4352176
33637 4352176 4836042 5293508 5471640 5518657 5986619 6967801 7870985 8371280 8870627 9654141
33627 9654141 10372872 10837075 11548639 12896377 14551585 16205837 18156280 20622276 23326396
33618 23326396 26355414 30529854 36272021 43120299 51076114 61256183 74389836 90081971
33610 90081971 108592340 131670059 160446535 194980583 237877633 294309907 362205431
33603 362205431 423036988 449793851 428833190 371850497 304341451 245093118 198664305
33596 198664305 162575657 134703878 113487677 96515063 82005404 69978617 60614958
33589 60614958 52908137 45875543 39735009 34926979 31019792 27403863 24196723 21715753
33581 21715753 19744175 17933369 16341044 15065175 13879974 12652796 11614840 10871948
33573 10871948 10152146 9330794 8668399 8239871 7697197 6924921 6357052 6251627 6184694
33564 6184694 5712956 5076421 4760764 4737226 4629182 4355836 4139524 4050654 3947747 3760465
33554 3760465 3529173 3266331 3006200 2867442 2882621 2909550 2855669 2809137 2818954 2766806 2601245
33543 2601245 2463823 2425694 2336790 2099797 1853514 1715581 1585536 1375389 1188151 1091177
33533 1091177 972771 815583 836930 1127043 1409868 1423131 1300555 1303275 1387290 1330849
33523 1330849 1115915 897190 739922 652218 727791 987842 1215835 1207945 1054552 929996
33513 929996 778584 510254 340428 555485 1013692 1254788 1108611 865949 815963 920770
33503 920770 1012675 1037366 1000005 891918 783641 826099 1057175 1315871 1406493 1264238
33493 1264238 959818 654437 535572 655642 829685 820155 611573 369084 164120 -69702
33483 -69702 -314953 -430426 -396770 -394906 -516214 -553815 -248230 335950 830568 947980
33473 947980 743521 498484 432253 557362 746948 868753 856776 725610 567838 500424
33463 500424 548231 599391 542010 420011 369037 429138 538064 679425 867213 978859
33453 978859 818522 423867 105194 55460 105160 13220 -178940 -274458 -247266 -218621 -222572
33442 -222572 -226889 -299856 -510437 -715802 -697758 -493794 -355895 -379056 -403111 -301084 -125306
33431 -125306 82781 384348 737727 909784 750260 427858 247526 303698 428183 438195
33421 438195 339609 282226 358419 473869 449559 247228 7426 -166697 -324741 -472377
33411 -472377 -426620 -62333 418667 704104 776008 840468 922418 846827 608888 407919
33401 407919 255210 -79457 -588835 -859282 -618636 -160236 55088 -19287 -126721 -182747
33391 -182747 -278012 -336698 -164604 168740 332714 180365 -67361 -144943 -28920 160805
33381 160805 336604 430359 376307 207903 55463 -16485 -59599 -96515 -67565 22655 53252
33370 53252 -30898 -108596 -54647 74008 128315 75166 23522 90348 308980 620379 893366
33359 893366 1001519 935366 799023 672763 555769 473111 517617 696572 840209 785893
33349 785893 585495 404422 273211 91428 -141607 -261054 -138746 163549 483549 711916
33339 711916 827820 870067 905808 952652 920327 729168 497635 465670 662493 794988
33329 794988 592550 157204 -180795 -282373 -297236 -369149 -439894 -399847 -276329 -167347
33319 -167347 -77210 71599 289727 465790 476457 327994 172534 157754 244855 227799
33309 227799 -8823 -307224 -413972 -303337 -185970 -198907 -248512 -201669 -61194 138232
33299 138232 437324 799896 986298 793433 378853 141412 253641 471952 460016 170306
33289 170306 -163749 -314742 -254400 -115196 -40120 -63199 -97653 -38010 120343 273340
33279 273340 318663 262649 225006 344993 659812 1058576 1377663 1553708 1664336 1842899
33269 1842899 2220327 2914077 3907137 4872520 5288450 4898332 3990341 3091145 2457169
33260 2457169 2004248 1629170 1360999 1204017 1064066 898602 775146 721688 666697 581829
33250 581829 535857 545461 523620 453286 460329 610260 769299 791725 730186 720715 748044 678757
33238 678757 484765 298345 252909 358618 516949 587811 479779 254269 110609 190202
33228 190202 410127 542032 430040 100483 -281030 -511525 -484862 -299087 -171806 -187331
33218 -187331 -208595 -116139 -26166 -131460 -393653 -556984 -453868 -157279 164142 395732
33208 395732 461431 312516 17591 -223890 -248396 -82898 109356 208398 228268 251337
33198 251337 311893 361035 346341 301816 313611 392662 439242 359943 166898 -60297 -236150
33187 -236150 -261831 -67845 249061 431063 329196 106078 38255 170077 315721 363946
33177 363946 384431 411923 336288 118641 -39346 90480 441462 700986 686429 548014
33167 548014 537933 655596 631630 281148 -217850 -489834 -379948 -102355 44787 -1662
33157 -1662 -93045 -98498 -7389 117554 172569 58387 -184181 -335971 -232185 5293 111748
33146 111748 21766 -96680 -126756 -118852 -99624 12227 203977 277364 108892 -134423 -202140
33135 -202140 -94073 -27128 -122114 -277862 -338854 -248157 -25600 275548 539327 607168
33125 607168 411828 74803 -184134 -254654 -236016 -300200 -453583 -489547 -228832 236266
33115 236266 623900 774106 779733 799909 858211 876322 812001 689048 551355 451115 432795
33104 432795 472534 475124 374178 194001 -9153 -196567 -307392 -262948 -74998 128123
33094 128123 250768 326412 392178 364299 160741 -113746 -248552 -188654 -100221 -154275 -327221
33083 -327221 -450203 -416953 -317737 -356404 -605207 -864578 -862010 -600830 -370454 -343737 -329570
33072 -329570 -73214 339044 594041 597385 561002 644965 743605 686238 457446 141313 -182972
33061 -182972 -406009 -419002 -293556 -279036 -482734 -682302 -615332 -346988 -162231 -165381
33051 -165381 -202839 -170357 -170299 -292447 -422168 -397191 -249236 -156408 -207997 -337669 -469342
33040 -469342 -609215 -767380 -883210 -890360 -809294 -718688 -658269 -607022 -537830 -439312 -294070
33029 -294070 -101829 66071 106474 12161 -103531 -152436 -169857 -200293 -169727 -1378 186133
33018 186133 168438 -70292 -280563 -288383 -241819 -375352 -635417 -727342 -501657 -113655
33008 -113655 209822 382498 386884 177945 -204116 -542509 -630120 -504370 -363121 -279693
32998 -279693 -145257 107142 368529 488787 437894 291622 156204 142581 294814 478184
32988 478184 457786 184844 -97671 -145369 -12025 69957 13903 -82758 -152912 -214123 -242132
32977 -242132 -203242 -208918 -400278 -637319 -566089 -117818 298305 289498 -18543 -191194 -53289
32966 -53289 198128 356716 412866 414623 372202 340924 398455 485612 437802 224790 1118
32955 1118 -130653 -239452 -378355 -449793 -378073 -284295 -340241 -514003 -590269 -425250 -103741
32944 -103741 141256 128845 -106037 -320744 -297451 -88341 58972 44279 47458 235661
32934 235661 475903 500231 290186 118678 197543 422905 524045 378655 118287 -38397
32924 -38397 -2479 134615 232631 241873 190542 84410 -91365 -273512 -336335 -257877 -175781
32913 -175781 -199714 -246711 -164450 33239 167762 118996 -50977 -202210 -260932 -238904 -175289
32902 -175289 -95902 -663 132084 316507 520117 649591 586930 287712 -115141 -358748
32892 -358748 -302448 -118888 -113736 -343840 -553318 -526149 -336991 -164801 -31504 118701
32882 118701 219293 162932 7229 -96654 -135533 -204645 -278811 -217487 -6205 193900
32872 193900 261083 206942 44807 -232155 -491735 -496001 -208192 98016 160156 23359
32862 23359 -106630 -172701 -266827 -405410 -476441 -397988 -209691 -5189 146949 222126 241375
32851 241375 248103 251368 219632 149520 86122 49407 10519 -22394 25353 184652 372243
32840 372243 480202 463978 304001 -10771 -382217 -589457 -491533 -188604 104058 275169
32830 275169 328273 271949 138547 58241 164875 427840 679023 796527 775490 645758
32820 645758 425051 151416 -116914 -326832 -408452 -288249 -5476 254281 355417 385620
32810 385620 509956 713467 844445 866730 876792 874618 727657 418581 139210 36680
32800 36680 13896 -100340 -296539 -426386 -421303 -345117 -273926 -234966 -239954 -271944 -234524
32789 -234524 -10989 375845 709710 752623 489645 172228 78876 239702 443734 509389
32779 509389 458872 397550 340458 258935 209197 272226 402500 470432 443921 413853 454056
32768 454056 562822 710222 817556 731494 381340 -54946 -313171 -364547 -392088 -455964
32758 -455964 -419084 -250831 -147473 -228222 -330800 -265207 -88487 39615 109209 178729
32748 178729 177462 2029 -270374 -456956 -506521 -500889 -472382 -378292 -222996 -69772 39724
32737 39724 77843 10833 -104004 -92654 123088 369207 426440 315755 217377 186188 135639
32726 135639 46869 -6682 -17582 -43919 -71168 -49097 -40485 -148391 -310321 -350312 -232430
32715 -232430 -90311 -21427 -30147 -138549 -335830 -441198 -272667 30472 120177 -72734
32705 -72734 -236127 -154940 -15130 -70984 -249354 -298738 -168813 -24386 25277 27075 62245
32694 62245 154229 264036 304370 213239 48852 -78972 -182439 -352730 -520928 -468570
32684 -468570 -162939 124860 166353 51009 -34147 -111029 -300451 -552960 -703290 -703313 -624693
32673 -624693 -518485 -429818 -443927 -542244 -515291 -208956 222188 485457 496172 385693
32663 385693 258957 134504 46184 14583 -11562 -19042 144882 501221 729491 514809
32653 514809 23066 -273983 -204029 -12222 101410 205789 344843 370563 214756 55485
32643 55485 51358 117695 102998 2024 -122129 -243733 -299360 -205813 -65238 -143142 -501986
32632 -501986 -852128 -918133 -762384 -580697 -376900 -58276 300928 528995 593074 562173
32622 562173 430452 188046 -15615 -11703 118334 123114 -77358 -315714 -439154 -467689
32612 -467689 -473166 -464394 -434400 -396273 -335105 -222131 -92333 -14386 17858 62128 97656
32601 97656 35534 -120677 -237252 -218217 -125600 -81661 -110673 -127349 -55368 71755 124425
32590 124425 424 -256713 -494802 -622104 -680599 -719897 -687104 -528670 -339166 -295196
32580 -295196 -449462 -663934 -738532 -569081 -232629 30317 -1779 -282935 -516026 -517626
32570 -517626 -461747 -606401 -874781 -934481 -669302 -329941 -164598 -118489 -6288 192601
32560 192601 351001 387302 302439 101094 -188795 -447957 -522918 -359348 -44808 253219
32550 253219 382363 318627 225494 313322 578952 770096 681828 398269 144030 -8667
32540 -8667 -140047 -254336 -238077 -58279 166930 351269 543619 755080 819948 592773
32530 592773 223300 49049 184630 369186 301360 9251 -232739 -280658 -255515 -301935
32520 -301935 -369842 -315573 -121935 85574 200215 224869 220943 241094 306170 381961 372038
32509 372038 190559 -133983 -451736 -598623 -510497 -262833 -25340 56593 -16874 -109947
32499 -109947 -109645 -40510 13883 49738 134815 300382 517300 745822 926550 963206 828157
32488 828157 662605 637110 707280 653499 396776 119284 -1379 -19293 -55245 -41525 176763
32477 176763 543317 796294 795987 685672 665634 734127 744725 642336 538825 570323 742542
32466 742542 917948 932566 745473 490533 347622 347243 358022 299084 280576 440144 698466
32455 698466 819855 720565 567882 511673 459653 248808 -55292 -210521 -142704 -74772
32445 -74772 -252987 -651098 -1015266 -1133827 -1005496 -796815 -688272 -725192 -785698 -729376
32435 -729376 -576418 -460979 -402365 -257546 25060 237616 145249 -181461 -424994 -398876
32425 -398876 -226782 -131191 -177709 -281681 -360573 -390067 -356229 -235557 -32317 195293
32415 195293 357310 383014 265385 71260 -84653 -88335 99452 370623 511317 404557
32405 404557 181846 69115 79103 -2591 -279158 -547170 -544476 -263658 106562 427148
32395 427148 635748 639153 391123 38871 -198482 -285953 -345303 -400678 -339633 -129093 111409
32384 111409 270907 319309 219527 -41482 -313727 -381852 -255504 -166641 -212261 -208914 -11898
32373 -11898 214211 200772 -75335 -384095 -491693 -321509 22408 289983 248914 -80189
32363 -80189 -432584 -605475 -639804 -638413 -567903 -360061 -74062 170377 309845 291003 62098
32352 62098 -260226 -383041 -176485 112863 179875 75174 93921 344720 650862 824517
32342 824517 831752 724866 602639 598457 723653 773471 584119 320959 277950 437025 503543
32331 503543 382083 309009 421844 484723 227153 -234860 -522347 -449329 -197162 -70940
32321 -70940 -183533 -365006 -345014 -54666 261659 306328 70388 -203804 -368745 -489266
32311 -489266 -587973 -502836 -136628 308712 514322 381210 60322 -269920 -517255 -626131
32301 -626131 -567277 -382211 -149368 83607 271084 327101 220024 79729 80855 205703
32291 205703 248417 108436 -36024 39941 268768 343956 139600 -79847 6514 328858
32281 328858 501910 342911 108023 112972 283894 265689 -90304 -525778 -672566 -428610
32271 -428610 -12937 270656 296960 187678 126529 119111 15406 -212543 -360177 -260279
32261 -260279 -33695 82525 58654 48568 119770 203840 269669 343472 377353 294840 157367
32250 157367 95332 91143 35637 -23210 68988 273835 382648 372354 445686 635289 676639
32239 676639 427242 128952 47702 90839 16939 -169664 -287555 -295535 -290320 -288249 -235889
32228 -235889 -152849 -54116 176723 602948 989326 993906 605651 183701 41682 157813
32218 157813 301180 280478 47545 -298601 -569135 -640645 -566037 -468179 -369989 -225842
32208 -225842 -61499 48040 104626 165544 225552 237140 215472 213325 237116 293586 440115
32197 440115 647656 706704 468865 124209 6858 130969 155542 -147477 -611785 -941443
32187 -941443 -1052101 -1025131 -891764 -639886 -359369 -217671 -279852 -433169 -505261 -422853
32177 -422853 -246765 -66998 104226 289191 414800 346369 111294 -37274 89620 350538
32167 350538 451986 334175 208596 240109 368503 451059 421457 288122 118235 39950
32157 39950 124796 260221 276907 194920 178528 250655 255446 139899 54879 88726 102988
32146 102988 -34065 -212769 -236024 -97805 35985 48295 -49588 -196662 -331892 -411186
32136 -411186 -456372 -537872 -647335 -660346 -501319 -273881 -138359 -113135 -85894 13380 134733
32125 134733 198827 214100 288025 508303 795367 927729 792702 559722 478894 544950
32115 544950 531570 354543 192023 188090 248323 245817 247568 378438 591586 736550 767937
32104 767937 748241 718450 685385 661972 615168 463468 228723 77949 90418 105799 -41988
32093 -41988 -260139 -354826 -348187 -404847 -498708 -410842 -81109 261598 383773 289279 117158
32082 117158 -41477 -145049 -157914 -108433 -104869 -204533 -317869 -304981 -135188 81603 194860
32071 194860 144385 33395 52963 272899 535090 636276 582787 545876 580410 543225 334637
32060 334637 80565 -14110 98608 302205 463919 501224 368621 97302 -161267 -228120
32050 -228120 -65979 182168 337449 347497 308428 350255 500969 645292 619981 371871
32040 371871 29410 -198046 -206969 -80769 28067 80363 166076 325241 429982 331140
32030 331140 86952 -72991 -29769 93982 137935 128767 204956 394579 589211 710303
32020 710303 787767 862874 898717 822468 623757 396455 282103 339321 460719 478581 373787
32009 373787 293787 318591 324055 179976 -19498 -79200 -3045 587 -187032 -450202 -617550
31998 -617550 -651745 -610949 -530020 -405326 -232354 -17904 196322 320163 301053 224666
31988 224666 233395 329324 361385 235894 30632 -142500 -270051 -359805 -344487 -180883 18081
31977 18081 74298 -43717 -188944 -212786 -101597 64118 216348 339728 444270 523822
31967 523822 535626 429957 221424 18628 -55473 15904 126901 169444 153463 181741 307715
31956 307715 450858 476849 344876 146851 10834 -4325 64678 115183 45093 -142193
31946 -142193 -293149 -242526 -19862 166596 191074 158613 222804 353303 399608 321972 221200
31935 221200 157129 71200 -85963 -254212 -338706 -324733 -278523 -263016 -270335 -225314 -67076
31924 -67076 159064 322728 343462 264077 170870 105204 81584 101989 97080 -45104 -308105
31913 -308105 -502524 -492654 -370929 -294205 -254510 -156497 -19506 69705 114127 125248 -21049
31902 -21049 -406347 -805375 -874438 -606870 -339259 -277497 -282514 -182977 -26609 85167 162769
31891 162769 197630 94138 -118416 -214333 -78519 96758 89274 -50032 -143850 -168950 -192292
31880 -192292 -175699 -64723 35628 -9771 -137747 -182901 -131794 -94985 -97316 -90647 -113118
31869 -113118 -230449 -362372 -380096 -357368 -504591 -827237 -1048540 -940089 -589494 -278805
31859 -278805 -198107 -315253 -438314 -378899 -123308 151503 281749 292228 291954 270821 139818
31848 139818 -68886 -205617 -212317 -187748 -226108 -312292 -390519 -413331 -304778 -10028 366400
31837 366400 583626 501135 231877 5566 -78582 -120897 -263661 -493703 -624881 -510473
31827 -510473 -254497 -121831 -221283 -397556 -486861 -524170 -583825 -574414 -383705 -124552 -21668
31816 -21668 -105286 -220779 -303091 -419185 -539592 -495676 -224173 115988 331220 373590
31806 373590 314974 271542 356767 569660 735508 703174 573200 552520 616831 542135 267231
31795 267231 -22413 -195276 -296504 -326101 -185683 56314 135765 -32554 -229920 -339786
31785 -339786 -568802 -1022948 -1355734 -1177213 -621378 -159572 16265 72796 100228 -4966
31775 -4966 -221634 -342937 -321681 -370179 -594419 -780028 -679261 -311755 141272 551941
31765 551941 825875 857275 679542 527331 571527 685527 638848 439116 294602 279734
31755 279734 240267 58333 -162916 -263536 -258867 -299980 -456732 -638745 -721383 -673556 -549519
31744 -549519 -416624 -323298 -295170 -316890 -336584 -329182 -340852 -424267 -540818 -588889 -533667
31733 -533667 -434938 -319662 -114455 221546 561523 718483 674651 598307 611801 641596
31723 641596 559110 398814 340117 478903 690751 749048 546898 186318 -124309 -245350
31713 -245350 -209723 -180698 -285600 -464764 -514393 -323872 -42872 60634 -93478 -317166
31703 -317166 -402066 -354675 -323721 -373554 -427773 -402264 -297271 -156640 -6560 148394 298294
31692 298294 396232 358423 152563 -105511 -242266 -252796 -306198 -444739 -444682 -144805 234186
31681 234186 345150 204685 144785 300271 456067 454458 435883 535469 615239 496625 251871
31670 251871 56509 -82249 -240971 -364888 -355982 -271949 -230602 -207412 -133358 -102559 -245851
31659 -245851 -451233 -456859 -216620 54457 214365 347511 531141 661310 620703 469971
31649 469971 352665 298949 221030 54044 -162037 -313210 -303892 -153251 7470 80328
31639 80328 115292 212718 353576 429273 414204 387080 380654 330517 194408 18096 -141203
31628 -141203 -261913 -309001 -236813 -72487 88589 196528 274053 314286 255251 100027
31618 100027 -32975 -48780 -1227 -8183 -77011 -84415 64306 296530 426930 361112 213344
31607 213344 169355 250821 308840 258435 187531 176567 161116 91670 87376 255403 465230
31596 465230 514995 454840 506039 678408 724149 518501 248822 126225 108542 44850 -53385
31585 -53385 -41030 134907 358097 462452 372668 165272 13874 21700 114451 174494 238991
31574 238991 416262 618721 584339 238162 -142635 -242686 -65789 132016 164097 52256
31564 52256 -81219 -145551 -133399 -109998 -135412 -189144 -225307 -282907 -427771 -580306 -544928
31553 -544928 -259484 108748 363221 449012 382922 167876 -139180 -403916 -549147 -610047
31543 -610047 -599677 -454797 -188161 47444 139603 137176 118718 87836 82054 215922 495722
31532 495722 741693 815614 779251 718454 593730 409798 336010 460013 589268 514909
31522 514909 326098 233167 216286 106279 -94842 -244196 -331327 -454648 -580463 -583185
31512 -583185 -477628 -359306 -178315 138207 391425 280789 -116054 -371567 -278493 -69690
31502 -69690 13881 32668 79808 35454 -182040 -383458 -388305 -338167 -461422 -673631 -694075
31491 -694075 -478199 -267586 -235407 -313974 -380377 -406418 -382681 -264736 -68518 90479
31481 90479 118085 34691 -86845 -210429 -324262 -387957 -342097 -170448 57572 213029
31471 213029 198431 26375 -208607 -435121 -640402 -794531 -809974 -633076 -335619 -50176
31461 -50176 167183 341585 449685 379688 95985 -200968 -204819 150482 564817 697322
31451 697322 560488 446400 492164 531057 433387 357881 483476 665235 607988 302443
31441 302443 34980 -19621 27237 38215 51631 134398 217019 194958 82706 -26653 -79049
31430 -79049 -82960 -88966 -168989 -329390 -440128 -359128 -129062 74615 189796 311832 483572
31419 483572 614466 644730 617381 541558 368460 167896 134390 317559 519924 567994
31409 567994 517353 484756 465309 455071 568698 851274 1116255 1156253 999558 788831
31399 788831 534290 186133 -152954 -303526 -238643 -58189 192796 493002 709747 715971
31389 715971 609224 607857 745864 864439 885566 877552 840014 655484 328963 85190 114712
31378 114712 341996 538258 579457 521959 492763 568556 721592 844494 846870 728198 540718
31367 540718 327993 147857 90042 182151 323358 400395 422222 445808 427667 274185 7084
31356 7084 -241471 -380690 -411593 -367010 -307587 -326309 -433569 -484844 -352293 -120456 22603
31345 22603 30326 -15606 -91303 -212646 -281404 -163543 93151 318418 467016 578814 524082
31334 524082 95771 -578072 -1008642 -882263 -412215 -25800 100665 60386 -26709 -94403
31324 -94403 -110369 -138051 -303265 -572439 -703233 -557576 -323218 -260907 -356841 -402032 -307308
31313 -307308 -149083 13316 164548 223242 97194 -153433 -355593 -429606 -445720 -486995
31303 -486995 -551684 -574007 -471124 -214823 83200 242171 243397 273789 434394 555130
31293 555130 469660 330216 401928 627835 685702 477720 284684 359373 600570 744165
31283 744165 692770 525270 324048 141100 51390 105187 251316 378933 410232 323782
31273 323782 144532 -52737 -181427 -206684 -123722 106019 489133 866627 989842 797751
31263 797751 509476 362149 345788 277456 56934 -239053 -453606 -461003 -243345 62871
31253 62871 252884 265093 249698 348756 480816 453624 232219 -36948 -234390 -353060
31243 -353060 -381951 -271194 -70868 34692 -63414 -233335 -250923 -75268 113565 135730
31233 135730 -8452 -180988 -255664 -193933 -19218 224262 468647 606197 534656 265905
31223 265905 -29919 -154530 -73619 70792 153808 202721 299933 433006 525012 554177 531848
31212 531848 393977 54564 -405929 -726900 -712425 -428237 -118529 4279 -134918 -463876
31202 -463876 -776340 -841120 -610057 -290331 -133392 -174723 -236258 -148828 79839 276426
31192 276426 244340 -33895 -297067 -220699 190515 556814 589645 457914 501436 710363
31182 710363 761964 527943 248464 159313 208716 228550 156307 -13038 -278740 -520716
31172 -520716 -544205 -378759 -334957 -598138 -947835 -1067662 -963864 -857783 -810327 -714022
31162 -714022 -570191 -503723 -521582 -492345 -381232 -309215 -351935 -443501 -503369 -515256 -463738
31151 -463738 -328415 -164959 -82863 -128834 -266317 -429294 -504231 -343491 49254 411906
31141 411906 481429 318370 198246 229164 281949 255138 162011 -34034 -390838 -750633
31131 -750633 -817195 -573772 -365576 -426034 -556170 -448838 -126640 149126 250668 253947
31121 253947 249479 285001 416869 627792 742676 594589 246451 -81687 -257615 -281019
31111 -281019 -149694 145260 497090 703597 645161 371585 23907 -259351 -391660 -386823
31101 -386823 -351837 -373717 -434735 -473825 -469662 -415473 -298293 -175899 -181171 -353378 -546503
31090 -546503 -600701 -514708 -352159 -107971 175263 281573 36837 -403094 -698389 -735921
31080 -735921 -674613 -593052 -360461 62136 436506 521573 375260 223543 142398 35151
31070 35151 -143761 -313801 -411248 -470653 -529664 -545174 -461549 -323456 -267067 -387910 -632864
31059 -632864 -838442 -876110 -749764 -563822 -435377 -435261 -547259 -653854 -628562 -486737
31049 -486737 -372151 -341713 -267985 -58081 138529 110105 -90916 -203213 -131357 -54251
31039 -54251 -114013 -206151 -185251 -98613 -59403 -17404 157006 418883 551407 418033 85573
31028 85573 -297449 -619180 -790688 -747769 -532574 -289884 -109013 80615 387200 764337
31018 764337 1023255 1038515 865502 627407 366165 78513 -161340 -241519 -180982 -135194
31008 -135194 -183118 -217180 -123321 31168 104057 93757 103106 124383 15434 -293477 -685581
30997 -685581 -967765 -1002459 -743804 -270865 201544 473060 555683 623572 756360 852642
30987 852642 808818 640311 397583 117874 -94399 -107016 49757 194885 270258 413290
30977 413290 656875 778582 619995 353510 211985 137561 -26771 -153552 8913 357414
30967 357414 489451 270948 1870 -72292 -74971 -165171 -205049 -14106 268579 365451 274190
30956 274190 222149 272410 240629 7557 -307622 -528704 -607198 -573886 -439684 -209009
30946 -209009 83506 376187 568176 539306 281904 -20626 -175636 -220238 -326477 -476512
30936 -476512 -433444 -103385 259210 337215 115250 -173718 -363866 -467910 -532553 -534064
30926 -534064 -418773 -163222 182541 452667 443019 136606 -214268 -353393 -306884 -266768
30916 -266768 -263256 -157053 60337 190431 112506 -48513 -122881 -93027 3025 184315 402052
30905 402052 456886 224906 -123649 -298585 -218489 -20873 177245 354355 472435 481015
30895 481015 429322 411073 391861 242963 -41098 -303547 -422043 -410805 -318639 -175965
30885 -175965 -65068 -80093 -164963 -140383 45525 237384 312217 343874 420959 439924 234189
30874 234189 -158921 -497490 -584889 -445246 -279039 -290706 -506369 -718089 -674463 -366296
30864 -366296 -40381 110143 154985 253944 395081 425744 272564 18435 -195025 -262647
30854 -262647 -174125 -52865 -66853 -227518 -359701 -344019 -276990 -288923 -329511 -283983 -195935
30843 -195935 -190562 -241089 -200174 -34791 142869 263461 357198 428802 427843 345830 211769
30832 211769 9375 -261751 -473619 -485446 -357624 -279282 -292133 -269137 -162027 -60502
30822 -60502 13607 140819 274037 211685 -81818 -329682 -263628 58386 383210 564800
30812 564800 600853 511343 348130 232832 236693 288281 303958 311065 332076 274821 95380
30801 95380 -39593 54533 289531 398497 291516 133237 68104 49265 -16771 -104210 -123204
30790 -123204 -54062 39872 93729 103609 128790 231885 398565 538090 580388 533786 438523
30779 438523 336587 303257 394863 516003 474686 260468 126113 259468 509781 615918
30769 615918 588859 648394 858369 1070164 1195290 1277684 1285932 1100642 778680 583915
30759 583915 632871 706586 550120 195013 -155466 -412308 -609063 -737582 -750668 -670724
30749 -670724 -551075 -368232 -73441 283509 590216 800920 936659 995390 960584 867424
30739 867424 763178 628063 430105 232036 137519 139362 125944 49415 -8927 27939 109493
30728 109493 113116 -13160 -187421 -253785 -114915 153686 330971 251128 -8895 -188413
30718 -188413 -105333 177794 454076 574609 510385 274408 -111662 -546228 -827867 -804233
30708 -804233 -542594 -279745 -179528 -203489 -247451 -310446 -440502 -583768 -618311 -525057
30698 -525057 -412032 -370689 -415543 -552361 -758787 -878918 -712517 -294947 56848 94551
30688 94551 -72915 -156406 -51010 113763 212892 262611 346207 522613 785487 1017763
30678 1017763 1033989 779900 449454 290913 337909 441952 503085 517602 457902 301801
30668 301801 166880 209850 367772 403247 264363 196460 390340 693962 816584 698091
30658 698091 532147 499793 600930 696540 630818 371322 94970 52254 272895 497242
30648 497242 474875 226287 -68270 -292434 -378613 -232504 112748 366524 250963 -126399
30638 -126399 -396189 -416983 -402597 -522843 -628040 -492735 -142389 214793 450102 563210
30628 563210 574065 521139 508226 612714 768626 836658 757857 558404 261868 -94360
30618 -94360 -400910 -557911 -595349 -599904 -544319 -323404 36836 349918 490349 517260 518946
30607 518946 462331 293915 83612 -63200 -171159 -330267 -497415 -514638 -339773 -121422
30597 -121422 -2558 27503 32113 11248 -22690 17373 137504 146571 -113880 -474465 -598032
30586 -598032 -456483 -414213 -728379 -1162513 -1270635 -939217 -459272 -138509 -39082 -68737
30576 -68737 -128644 -131033 -20575 161672 325536 460107 620425 790610 882229 871733 799958
30565 799958 627443 270735 -161168 -360404 -177330 159181 317788 245130 130002 105234
30555 105234 167216 312416 542460 743702 751478 572389 403357 389061 469855 501630 426746
30544 426746 293134 187008 173365 237976 285406 259827 239947 318018 422066 401091 277680
30533 277680 244065 368226 476452 414002 272365 235987 315129 369031 326300 248067 197706
30522 197706 152902 46952 -154205 -388164 -480828 -278421 133963 433064 388884 138495
30512 138495 8648 106857 228765 166320 -37103 -185215 -174831 -76790 -31278 -112928 -261200
30501 -261200 -317729 -180286 51781 138592 -46091 -356356 -522467 -439147 -248162 -134103
30491 -134103 -110416 -59072 67049 179973 207543 207233 258047 311615 257870 107558 -2202
30480 -2202 20436 145478 304376 428259 408984 180425 -128567 -291648 -297501 -377475 -614444
30469 -614444 -732158 -472817 -26766 170364 -4369 -255186 -292881 -127944 66744 150223
30459 150223 24427 -330356 -747775 -979838 -985470 -946722 -929593 -735341 -225798 379449
30449 379449 718754 704080 557992 506785 590089 724750 803355 740454 547558 373096
30439 373096 377930 556304 729727 710584 446803 54766 -249402 -316441 -220731 -185710 -295561
30428 -295561 -369778 -212056 105903 330438 331959 197647 68240 19938 79703 215362
30418 215362 309803 265563 137945 60629 58438 56799 52111 111069 191212 138427 -80219 -295183
30406 -295183 -355819 -286653 -143995 114500 476191 730571 676647 407732 201177 152900
30396 152900 112744 -7286 -66915 68823 285961 351678 209969 18989 -66737 -29988
30386 -29988 81319 234808 381099 430892 336484 163130 28190 -16167 -8269 -5048 -22259
30375 -22259 -41758 -50885 -69918 -144388 -295454 -470869 -569372 -528678 -368047 -140640 106694
30364 106694 299883 324299 114391 -257587 -624786 -840204 -830771 -607564 -289935 -57288
30354 -57288 22861 85591 294915 619700 889494 1023653 1060510 997415 791632 525853
30344 525853 363060 282274 68148 -343256 -714684 -836547 -808948 -820290 -824396 -666918
30334 -666918 -404961 -246699 -238460 -247842 -214292 -182230 -111197 98099 370551 480989 353708
30323 353708 129178 -101318 -387839 -669797 -682490 -286664 268952 585077 518034 229681
30313 229681 -62140 -250060 -333690 -384060 -482690 -619807 -693724 -653804 -569329 -512603 -468121
30302 -468121 -410148 -363790 -325648 -237088 -108249 -46240 -75959 -66368 60399 187523 202209
30291 202209 189393 252027 269474 62648 -276868 -469322 -439436 -386186 -432664 -439635 -259322
30280 -259322 12292 166339 143292 41141 -55546 -130933 -159037 -79955 125702 388416
30270 388416 597627 692477 704347 703729 705140 657386 546735 457793 474422 550499 543495 368657
30258 368657 81230 -169223 -234091 -70723 191610 351735 370958 429079 646579 843763
30248 843763 745635 383159 90606 79803 201970 199440 30991 -157849 -265253 -308538
30238 -308538 -334211 -353132 -335515 -225417 -18531 144996 70020 -240638 -524228 -547458
30228 -547458 -369564 -203534 -107311 21298 191264 261315 166651 26265 -51686 -119345
30218 -119345 -230550 -263814 -75649 234229 405573 371928 343559 469381 593764 492962
30208 492962 231235 92370 201442 396994 477839 401150 206471 -74413 -349251 -460667
30198 -460667 -362996 -196701 -97953 -58610 -74515 -270099 -692136 -1094774 -1156922 -876349
30188 -876349 -546823 -363372 -256492 -128229 -34909 -56704 -146687 -199704 -162880 -21588
30178 -21588 214176 457689 584224 565755 467981 297308 -4451 -364643 -540231 -382959
30168 -382959 -38720 218401 272605 209176 155710 168695 222062 244440 208759 194249 273560
30157 273560 346195 235910 -16007 -142444 -25271 105050 -14984 -324243 -567812 -659007
30147 -659007 -709486 -776680 -792795 -731997 -674401 -681998 -725235 -742200 -695637 -594114 -514916
30136 -514916 -542571 -620093 -564098 -322879 -92961 -41647 -50947 65679 208017 108945 -231380
30125 -231380 -488724 -416278 -98294 215727 339687 209468 -78894 -273316 -218578 -112616
30115 -112616 -261869 -564036 -562966 -138986 198129 -40832 -639079 -958934 -756817 -371646
30105 -371646 -161624 -103407 -15573 103725 117584 -25200 -241530 -409139 -423754 -235563
30095 -235563 82383 341794 387010 226699 -4581 -174086 -206237 -71583 191143 449894
30085 449894 566580 546642 530195 575692 531706 248773 -122046 -230774 18213 302799
30075 302799 302352 108474 13406 29576 -82388 -351979 -509763 -437387 -378360 -513148 -594548
30064 -594548 -282398 321225 766777 819896 662178 549246 529589 551011 614917 705857
30054 705857 715410 565306 335673 181796 168248 240855 309285 294008 133062 -172161 -501027
30043 -501027 -661999 -564146 -352026 -303359 -521407 -767912 -711982 -340588 18048 116200
30033 116200 65553 92921 180458 132148 -97394 -346050 -482998 -520953 -503341 -457908 -464524
30022 -464524 -583326 -682943 -522344 -75384 372084 522738 342728 -16248 -416468 -756485
30012 -756485 -923107 -859277 -632986 -362067 -120188 46321 102198 81505 71217 85279
30002 85279 60038 21415 109144 343925 524737 493920 367050 334681 361134 284212 119745
29991 119745 31598 48026 54975 57785 180534 362894 339700 48474 -192893 -113598 91690
29980 91690 19492 -366948 -679149 -615035 -301604 -63998 -31117 -86435 -101451 -71261 -30454
29969 -30454 47399 199016 357411 373584 195868 -21856 -74900 38112 118982 58288 466
29958 466 127324 373511 505448 442382 328890 268828 164015 -78279 -303674 -245117 115473
29947 115473 459498 466234 171270 -75448 6622 346262 641984 713650 658875 660777 740464
29936 740464 777853 716231 630231 600439 635974 738873 919903 1090033 1054481 729371 302412
29925 302412 63186 97689 242373 311606 262833 143010 -10146 -169804 -296846 -359662
29915 -359662 -341098 -220364 -5718 205925 273165 150110 -59450 -206467 -214512 -96713
29905 -96713 67130 143880 22545 -252360 -466017 -424485 -156317 115175 190406 52783
29895 52783 -174228 -376925 -524333 -601826 -533381 -253081 136138 379238 327886 114533
29885 114533 -30454 -66326 -110104 -180023 -171528 -88196 -74011 -154389 -162712 -31768 54834
29874 54834 -41368 -164413 -116666 8594 -1087 -104681 -104493 -42604 -165273 -472774 -630610
29863 -630610 -435238 -98313 77459 83204 99619 192603 299465 384227 420647 316944 38391
29852 38391 -255649 -362859 -294644 -244408 -325779 -468435 -557335 -557930 -502763 -446680 -437674 -465918
29840 -465918 -458096 -381229 -315493 -350351 -439985 -436148 -244481 96970 440701 581199 378905
29829 378905 -63165 -423989 -491494 -407025 -454251 -668082 -817893 -740560 -501877 -229011
29819 -229011 20247 183971 187060 85689 50627 106500 48329 -248080 -571392 -606761 -344045
29808 -344045 -77866 -32010 -144465 -222864 -162042 21519 238302 353639 274634 79601
29798 79601 -22203 64022 185576 148617 -1878 -42923 93433 204076 106353 -77931
29788 -77931 -65524 221598 586568 843666 1005210 1134972 1183953 1093779 942578 831767
29778 831767 702215 435795 104986 -69931 -39248 -26074 -235568 -590240 -838873 -829710
29768 -829710 -595094 -255344 67820 304111 480808 665493 813750 770637 514434 298503
29758 298503 401589 778929 1105584 1149612 958861 682476 388359 131184 42652 197514
29748 197514 444550 512899 300572 -29185 -251517 -300200 -257153 -203272 -155435 -119347 -118437
29737 -118437 -147631 -150129 -72391 85446 291617 515147 706275 788345 721719 550822 341125
29726 341125 104871 -146600 -318569 -308960 -169234 -79138 -127827 -215861 -219455 -157316 -128592
29715 -128592 -169285 -255585 -384854 -553583 -688277 -692394 -559323 -378973 -241481 -174699
29705 -174699 -148289 -99253 4164 82780 -2472 -254740 -474651 -490745 -390248 -391084 -530387
29694 -530387 -636440 -600968 -510273 -465848 -430182 -335720 -234063 -236519 -368667 -555465 -695511
29683 -695511 -696602 -509455 -201365 54919 139471 100431 61446 64877 70948 62857 67526 94399
29671 94399 133068 204409 340011 500032 571211 474349 249663 25632 -84122 -64045 -1772
29660 -1772 -3961 -89630 -180693 -211208 -211286 -244550 -289804 -244230 -49224 231358 472946 597097
29648 597097 601153 518986 398282 311234 330923 452378 560459 535629 394624 262632 191137
29637 191137 92207 -90813 -246653 -247498 -168773 -193912 -310292 -280117 29057 438240 673148
29626 673148 663430 519286 320701 79168 -141080 -209032 -47943 300520 717477 1058935
29616 1058935 1218852 1221057 1204434 1235450 1193254 949842 611998 434773 492918 577138 458464
29605 458464 156046 -101384 -108520 147953 481169 638558 511512 239135 56835 43995
29595 43995 87873 82799 52510 42156 1243 -134925 -295384 -294836 -23638 408230 737108
29584 737108 780611 617897 499749 560210 681055 685334 570950 451489 352313 221114
29574 221114 95028 74907 128222 92498 -87613 -280773 -367094 -365278 -321681 -238713 -172540
29563 -172540 -226394 -363236 -402957 -310917 -301121 -505534 -720992 -682847 -453136 -316452 -378800
29552 -378800 -484101 -469498 -300439 -915 342737 536140 441380 186352 30228 33420
29542 33420 45639 -6662 -52129 -99051 -265585 -509348 -570460 -319174 27963 182939 120851
29531 120851 -6292 -141594 -319281 -474713 -456617 -231918 47113 197782 166403 47278
29521 47278 -6681 83605 241367 312273 239610 109226 15651 -31081 -47896 -32295 -7301
29510 -7301 -2091 51147 267551 590891 767255 640996 355874 152854 91520 97563 152757
29499 152757 262351 331663 272149 177348 206243 323546 338279 186195 -3799 -124241
29489 -124241 -194727 -238991 -230864 -200458 -234132 -316461 -313305 -166086 23602 143499 167834
29478 167834 68962 -194940 -519969 -653712 -486848 -220779 -98601 -74644 77801 400649
29468 400649 691749 812160 869753 1026646 1250461 1362106 1272993 1070575 869643 669195
29458 669195 414669 155688 41827 130083 277335 300035 193690 104771 115581 164765
29448 164765 176752 154939 121685 70215 13891 -10093 -23144 -93964 -201674 -214715 -67361
29437 -67361 140070 282576 351375 380273 344234 236406 145711 130064 90239 -94357 -364313
29426 -364313 -552134 -606119 -601031 -568307 -473827 -347781 -279795 -280484 -288300 -309142 -393802 -477565
29414 -477565 -428437 -292154 -296625 -533040 -806372 -898406 -806033 -603506 -269051 152586
29404 152586 381783 183918 -234205 -388670 -113118 251658 335062 172314 26280 -24601
29394 -24601 -99339 -219255 -246964 -129712 -2951 15842 -17080 -17863 -48673 -198585 -358291
29383 -358291 -291025 48586 410904 538307 450326 346607 311318 259313 153109 106121
29373 106121 199131 309542 242823 -4115 -218013 -215453 -35204 139807 185724 112289 -22050
29362 -22050 -187222 -354333 -455280 -439233 -362848 -353873 -450078 -526472 -439531 -209215 11015
29351 11015 116573 107812 -25988 -335705 -753285 -1023537 -936144 -589367 -298314 -247369
29341 -247369 -347232 -436078 -475193 -479289 -387010 -144921 130561 230645 121690 13945 92343
29330 92343 272851 348246 333685 493223 947761 1395174 1392009 882564 274663 -44714
29320 -44714 -102072 -158665 -304597 -406145 -363775 -216279 -12347 220659 363730 265242
29310 265242 -21472 -239352 -249874 -175814 -119373 51277 440847 823669 868875 595722
29300 595722 345180 316885 380451 360109 258920 143227 39368 37178 273406 679666
29290 679666 941137 867901 651806 587750 678530 701902 560775 370099 264682 297927
29280 297927 473713 712702 841173 769318 616673 510086 363739 67140 -212769 -194416
29270 -194416 94876 343396 397103 386647 403406 378880 350611 498766 790166 929064
29260 929064 825722 735972 687665 186006 -1068748 -2460547 -3000857 -2497904 -1687749 -1222606
29250 -1222606 -1032453 -771687 -398975 -76432 139827 238289 145655 -74773 -148962 40023
29240 40023 219251 122766 -68253 10015 330645 508028 362255 125207 49683 105436
29230 105436 159887 215828 318061 389385 323504 155997 17284 -28922 -4592 70619 187997
29219 187997 303095 374490 440198 571512 738822 798917 659902 414972 254377 253992 306661
29208 306661 275645 158315 56655 38231 99420 229696 405038 514841 417785 127872
29198 127872 -147152 -224626 -135160 -29252 22985 52558 87569 141198 253985 428008 545220
29187 545220 468240 213568 -75663 -305953 -465376 -506964 -362772 -101794 81351 102109
29177 102109 84969 157561 272988 331924 359582 422927 453924 318579 41141 -186414 -236241
29166 -236241 -168693 -91169 3368 191012 469916 728164 844979 788015 620449 438840
29156 438840 305933 234466 225965 298650 451289 616403 695064 651972 548916 470321 438038
29145 438038 415570 375012 329997 301803 275993 210437 86067 -59949 -156232 -150667 -48072
29134 -48072 87558 164644 126901 12082 -69875 -52905 455 -30837 -180137 -366703 -509004
29123 -509004 -588724 -580147 -409165 -66157 288791 434444 308145 54388 -142488 -206564
29113 -206564 -154206 -25980 112801 167632 90430 -46276 -98639 16238 251556 479260
29103 479260 582440 514879 314608 87532 -30253 64345 354736 654217 701303 396478
29093 396478 -56704 -336701 -353463 -315570 -403287 -506932 -423905 -219968 -183290 -407914
29083 -407914 -622997 -526797 -144427 257366 488106 526150 392901 123985 -149615 -260469
29073 -260469 -187320 -73285 -32771 -29445 33452 187993 387483 542215 566390 472317 401595
29062 401595 449185 479681 286495 -55819 -211829 -38759 194828 188155 8168 -90782
29052 -90782 -75675 -96724 -150497 -91763 40470 18151 -203033 -387177 -389107 -355805 -413881
29041 -413881 -405233 -147115 233786 477242 573934 705385 861540 804322 447386 29225
29031 29225 -188762 -215264 -202862 -175111 -41865 179874 326712 291429 153270 48595
29021 48595 -23207 -179313 -443926 -648184 -608156 -366920 -169696 -186705 -341128 -442254
29011 -442254 -404589 -275943 -128502 -18244 -4785 -100464 -205838 -189829 -46861 96177
29001 96177 134941 78452 -20864 -143738 -273110 -348509 -306260 -151554 28933 120139 63301
28990 63301 -76541 -150516 -91903 -23191 -112033 -316796 -383710 -154456 207816 387523 265915
28979 265915 8591 -175142 -249732 -297635 -348712 -369238 -387384 -498566 -690483 -762546 -538558
28968 -538558 -124683 179299 240918 228542 327194 469242 477656 364645 300774 328031 302014
28957 302014 144739 -25085 -86426 -90777 -139616 -203977 -194427 -137372 -144043 -229797 -290645 -272812
28945 -272812 -260504 -345325 -473091 -489391 -325955 -84698 88658 172929 250918 335260 322076
28934 322076 174881 49168 107569 272017 316511 183481 28719 -62303 -193170 -408091
28924 -408091 -528771 -400668 -157798 -54400 -124323 -195353 -178750 -144819 -133136 -86037 5149
28913 5149 56187 36148 22145 69908 151442 245661 353980 392995 229290 -103381 -357759
28902 -357759 -338748 -112107 127426 276379 321647 259355 159364 202660 476616 791572
28892 791572 878293 736892 607701 604711 587045 446073 310839 337490 453359 488492 463955
28881 463955 541941 715851 769708 608091 437482 482500 648178 645449 400460 144686
28871 144686 78649 131351 136784 88901 79692 97248 65754 31583 113807 265118 273593 62966
28859 62966 -170056 -205176 -49507 154948 332790 447744 402306 162324 -78657 -71403
28849 -71403 145158 261782 107103 -133716 -192278 -60124 66098 79554 54380 82622
28839 82622 156838 223895 255692 241460 182895 128894 162439 314767 516562 656444 672498
28828 672498 582294 455925 378318 405851 519926 629396 654593 617627 619770 709891 801832
28817 801832 761294 569659 360968 284114 358325 474952 504941 387436 159648 -60351
28807 -60351 -156132 -126418 -90175 -133929 -191704 -141914 11841 148377 202656 224590 249628
28796 249628 221774 94583 -82435 -235509 -339522 -356100 -198310 133856 452553 551183
28786 551183 451959 361861 386978 418259 326620 147657 5517 -58543 -100307 -166833 -250674
28775 -250674 -323361 -356845 -327343 -239313 -129132 -18778 95691 170433 84760 -225648 -620853
28764 -620853 -838985 -759002 -519096 -345699 -330064 -412043 -503125 -538446 -464671 -303990 -225314
28753 -225314 -412611 -805761 -1083242 -989797 -604601 -205139 36848 103433 -16600 -309677
28743 -309677 -595347 -637135 -457934 -341679 -425624 -493010 -317973 -25050 109181 68425
28733 68425 50098 92467 43108 -107190 -156858 -32570 68538 -1637 -111889 -105517 -86794
28722 -86794 -238490 -482444 -557405 -389568 -183012 -139303 -245877 -362337 -391005 -331172
28712 -331172 -252275 -237400 -299246 -356600 -338359 -275351 -232673 -205376 -161802 -137227 -185423
28701 -185423 -276387 -339499 -366403 -368641 -286793 -73444 173286 311098 371891 518401 775826
28690 775826 972681 987860 904023 855959 857865 844703 769515 603770 355640 136788 81813
28679 81813 143062 107037 -108202 -319985 -342944 -228828 -113440 20606 243439 457862
28669 457862 498940 397358 335350 368033 393306 391106 472757 651397 769695 736969 660399
28658 660399 642241 615216 512241 451364 574188 796998 920092 939704 1040447 1258329
28648 1258329 1360137 1161277 808384 590454 553951 484400 259901 42085 36249 187458
28638 187458 245919 92088 -120748 -155739 55190 361420 535336 454837 201702 -8853
28628 -8853 -37403 51137 116413 152941 255697 395443 402591 241642 140057 306847 627337
28617 627337 797069 707180 542446 514501 645490 832475 994863 1104013 1146172 1105448
28607 1105448 956570 687739 379182 214718 315466 576727 770757 799880 737280 634433
28597 634433 447066 190623 10764 4809 85429 120221 110961 122983 118809 6859 -170860
28586 -170860 -239749 -111491 92243 185103 136189 97610 224824 502535 763867 869285
28576 869285 827161 718436 561696 334979 104298 10043 89457 213490 263070 285750
28566 285750 395801 578945 691025 629030 434128 241423 174883 255523 359090 310920
28556 310920 92948 -90434 -41580 175583 320114 289911 217694 238775 315494 366205 432047
28545 432047 577667 704533 633889 375669 159129 141826 217798 205654 114293 77054 88367
28534 88367 -5658 -242532 -454927 -520878 -536173 -613040 -649517 -477557 -150923 115701 252718
28523 252718 373209 513456 561374 490968 450133 515239 544607 402667 172510 7242
28513 7242 -87726 -169425 -185036 -67978 89225 148866 148197 217751 334680 362975 316582 368921
28501 368921 577283 787450 857746 814921 742853 675320 651302 716008 793668 708724 423012
28490 423012 119860 -37584 -94796 -145175 -130415 26400 191389 144117 -78569 -171758
28480 -171758 26499 265723 168980 -264099 -593742 -431516 104911 536846 578747 393890
28470 393890 271552 241708 163361 55295 91227 286944 434097 404440 320828 340468 446805
28459 446805 560580 684569 801112 781011 564039 310098 192001 139311 -16022 -223950
28449 -223950 -278031 -157718 -60483 -61049 23575 326958 679658 812717 704710 573930 565256
28438 565256 571370 386515 -23519 -442463 -601950 -450593 -183509 10298 140887 283780
28428 283780 369277 288160 157028 235287 526802 698879 524696 202053 48088 49066 -35101
28417 -35101 -224245 -280050 -117878 37503 5911 -83787 -39298 82877 118128 108169 224914
28406 224914 436362 509943 379061 265895 336818 434402 311390 -7180 -282600 -402800
28396 -402800 -465565 -543396 -560656 -447556 -264311 -107475 -7486 23502 -46875 -193354 -314880
28385 -314880 -361550 -383148 -392040 -310129 -151700 -108664 -280598 -436183 -276309 109988 302787
28374 302787 89238 -294786 -535450 -617178 -683170 -724641 -634191 -461616 -382521 -432097 -459586
28363 -459586 -358375 -183015 -17820 119337 200510 154712 -20371 -220236 -368337 -487559
28353 -487559 -579092 -555182 -395669 -260433 -299597 -420548 -407218 -241320 -130397 -202353
28343 -202353 -347734 -428146 -479365 -596453 -745073 -831393 -874727 -950949 -1009869 -919122 -688585
28332 -688585 -483999 -377090 -239177 31068 302719 361436 192935 -7490 -82044 -58866
28322 -58866 -54161 -118501 -208113 -252720 -221946 -149937 -110262 -158424 -298829 -499536 -705731
28311 -705731 -837663 -835007 -733486 -643193 -616653 -602463 -570299 -587142 -680545 -717340 -561302
28300 -561302 -303494 -170440 -207279 -226453 -114308 -16158 -112416 -341309 -483788 -454653
28290 -454653 -374203 -373919 -441445 -460406 -326018 -21414 356594 648948 763709 745501 673769
28279 673769 532954 271657 -26710 -153988 -13365 230175 311228 148702 -88054 -182169
28269 -182169 -78037 120285 296952 413527 467379 437972 328414 225645 234848 329976
28259 329976 339065 139914 -166287 -349955 -313925 -184680 -125575 -136568 -104603 -11868 1752
28248 1752 -181082 -464117 -591407 -406184 -26675 263345 297231 178230 142044 290924
28238 290924 502219 603154 580123 556596 588161 573563 410003 162296 -198 7677 145569
28227 145569 352641 567351 650555 457763 66219 -208220 -147019 107762 253572 207167
28217 207167 125754 113534 117691 124605 243543 507164 752365 813976 719834 587789 443049
28206 443049 266691 128581 109098 133294 42972 -170122 -347699 -404342 -447055 -589242
28196 -589242 -747187 -725766 -476108 -179179 -50996 -111050 -184729 -122668 37626 157652
28186 157652 188511 192365 192796 115977 -82822 -329351 -521745 -625639 -620834 -466062 -225887
28175 -225887 -127704 -318587 -605238 -623655 -289548 90852 219070 153617 151316 286410
28165 286410 391239 328938 161449 24193 -33816 -21125 80132 258290 379336 284222
28155 284222 7304 -206942 -167813 58028 274695 398350 455127 419288 238697 11112
28145 11112 -68337 6475 5906 -194765 -398289 -351832 -92451 137046 206919 160452 48594
28134 48594 -100567 -206671 -221436 -243671 -368203 -476529 -387851 -171518 -68273 -126090
$$ [...]
##END NTUPLES=NMR SPECTRUM
##END=
