##TITLE=31Pdec_76-2022
 CDCl3, 24 sc
 19.9.2022
##JCAMPDX= 6.0         $$ Bruker NMR JCAMP-DX V2.0
##DATA TYPE= NMR SPECTRUM
##DATA CLASS= NTUPLES
##ORIGIN= UXNMR, Bruker Analytische Messtechnik GmbH
##OWNER= root
$$ XWIN-NMR		Version 3.5
$$ Mon Sep 19 13:53:51 2022 Russian Standard Time (UT+4h)  she@DPX200
##.OBSERVE FREQUENCY= 81.013821
##.OBSERVE NUCLEUS= ^31P
##.ACQUISITION MODE= SIMULTANEOUS
##.ACQUISITION SCHEME= undefined
##.AVERAGES= 24
##.DIGITISER RES= 16
##SPECTROMETER/DATA SYSTEM= spect
##.PULSE SEQUENCE= zgpg30
##.SOLVENT NAME= DMSO
##.SHIFT REFERENCE= (INTERNAL, DMSO, 0, 248.564)
##AUDIT TRAIL= $$ (NUMBER, WHEN, WHO, WHERE, WHAT)
$$ ##TITLE= Audit trail, XWIN-NMR		Version 3.5
$$ ##JCAMPDX= 5.01
$$ ##ORIGIN= Bruker BioSpin GmbH
$$ ##OWNER= she
$$ F:/spectra/data/she/nmr/P31/1/pdata/1/auditp.txt
$$ ##AUDIT TRAIL=  $$ (NUMBER, WHEN, WHO, WHERE, WHAT)
(   1,<2022-09-19 13:53:02.64 +0400>,<she>,<DPX200>,
      <created by zg, POWCHK disabled, PULCHK disabled
       configuration hash MD5:
       00 E9 B6 7A A2 85 ED C7 34 08 36 98 17 FE 4E 26
       data hash MD5: 32K
       3E E6 5E B3 0B 97 FB 95 C9 C4 8A D1 C8 77 9C 3C>)
(   2,<2022-09-19 13:53:11.95 +0400>,<she>,<DPX200>,
      <Start of raw data processing
       efp BC_mod = 2 LB = 1 FT_mod = 6 PKNL = 1 PHC0 = -10292.1 PHC1 = 149.8566 SI = 64K 
       data hash MD5: 64K
       41 4D 19 95 58 85 F2 E2 CA 0C 88 15 50 24 D7 C6>)
(   3,<2022-09-19 13:53:26.82 +0400>,<she>,<DPX200>,
      <pk PHC0 = 5.059352 PHC1 = 0 
       data hash MD5: 64K
       69 F6 80 D0 10 72 11 63 8C 59 55 EE 64 51 7E 3C>)
(   4,<2022-09-19 13:53:31.48 +0400>,<she>,<DPX200>,
      <abs ABSG = 5 
       data hash MD5: 64K
       9F 20 E4 2F BB 16 C8 85 0F 44 A3 45 27 B3 82 A0>)
$$ ##END=
$$ 
$$ hash MD5
$$ 19 12 67 79 1D 02 CE 0B AA E0 5C 20 FE 9E D0 70
##$RELAX= 
##$RELAX= 
##$RELAX= 
##$RELAX= 
##$RELAX= 
##$RELAX= 
##$RELAX= 
##$RELAX= 
##$RELAX= 
$$ Bruker specific parameters
$$ --------------------------
##$DU= <F:/spectra>
##$EXPNO= 1
##$NAME= <P31>
##$PROCNO= 1
##$TYPE= <nmr>
##$USER= <she>
##$AMP= (0..31)
100 100 100 100 100 100 100 100 100 100 100 100 100 100 100 100 100 100 
100 100 100 100 100 100 100 100 100 100 100 100 100 100 
##$AQSEQ= 0
##$AQ_mod= 1
##$AUNM= <au_zg>
##$AUTOPOS= <>
##$BF1= 81.014009
##$BF2= 200.13
##$BF3= 200.13
##$BF4= 200.13
##$BF5= 200.13
##$BF6= 200.13
##$BF7= 200.13
##$BF8= 200.13
##$BYTORDA= 1
##$CFDGTYP= 0
##$CFRGTYP= 5
##$CHEMSTR= <none>
##$CNST= (0..31)
1 1 145 1 1 1 1 1 1 1 1 1 1 1 1 1 1 1 1 1 1 1 1 1 1 1 1 1 1 1 1 1 
##$CPDPRG= <waltz16>
##$CPDPRG1= <>
##$CPDPRG2= <waltz16>
##$CPDPRG3= <>
##$CPDPRG4= <mlev>
##$CPDPRG5= <mlev>
##$CPDPRG6= <mlev>
##$CPDPRG7= <mlev>
##$CPDPRG8= <mlev>
##$CPDPRGB= <>
##$CPDPRGT= <>
##$D= (0..31)
0 1 0 0 0 0 0 0 0 0 0 0.03 2e-05 3e-06 0 0 0 0 0 0 0 0 0 0 0 0 0 0 0 0 
0 0 
##$DATE= 1663581182
##$DBL= (0..7)
120 120 120 11 120 120 24 19 
##$DBP= (0..7)
150 150 150 150 150 150 150 150 
##$DBP07= 0
##$DBPNAM0= <>
##$DBPNAM1= <>
##$DBPNAM2= <>
$$ [...]
##$SUBNAM3= <"">
##$SUBNAM4= <"">
##$SUBNAM5= <"">
##$SUBNAM6= <"">
##$SUBNAM7= <"">
##$SUBNAM8= <"">
##$SUBNAM9= <"">
##$SW= 501.771253377433
##$SWIBOX= (0..15)
0 1 3 0 0 0 0 0 0 0 0 0 0 0 0 0 
##$SW_h= 40650.406504065
##$TD= 32768
##$TD0= 1
##$TE= 0
##$TE2= 300
##$TE3= 300
##$TEG= 300
##$TL= (0..7)
0 120 53 12 22 120 120 120 
##$TP= (0..7)
150 150 150 150 150 150 150 150 
##$TP07= 0
##$TPNAME0= <>
##$TPNAME1= <>
##$TPNAME2= <>
##$TPNAME3= <>
##$TPNAME4= <>
##$TPNAME5= <>
##$TPNAME6= <>
##$TPNAME7= <>
##$TPOAL= (0..7)
0.5 0.5 0.5 0.5 0.5 0.5 0.5 0.5 
##$TPOFFS= (0..7)
0 0 0 0 0 0 0 0 
##$TUNHIN= 0
##$TUNHOUT= 0
##$TUNXOUT= 0
##$USERA1= <user>
##$USERA2= <user>
##$USERA3= <user>
##$USERA4= <user>
##$USERA5= <user>
##$V9= 5
##$VALIST= <valist>
##$VCLIST= <CCCCCCCCCCCCCCC>
##$VD= 0
##$VDLIST= <DDDDDDDDDDDDDDD>
##$VPLIST= <PPPPPPPPPPPPPPP>
##$VTLIST= <TTTTTTTTTTTTTTT>
##$WBST= 1024
##$WBSW= 4
##$XGAIN= (0..3)
0 0 0 0 
##$XL= 0
##$YL= 0
##$YMAX_a= 4484
##$YMIN_a= -5132
##$ZGOPTNS= <>
##$ZL1= 120
##$ZL2= 120
##$ZL3= 120
##$ZL4= 120
##$ABSF1= 248.5645
##$ABSF2= -253.2056
##$ABSG= 5
##$ABSL= 3
##$ALPHA= 0
##$AQORDER= 0
##$ASSFAC= 0
##$ASSFACI= 0
##$ASSFACX= 0
##$ASSWID= 0
##$AUNMP= <proc_1d>
##$AZFE= 0.1
##$AZFW= 0.5
##$BCFW= 0
##$BC_mod= 2
##$BYTORDP= 0
##$COROFFS= 0
##$CY= -3
##$DATMOD= 1
##$DC= 0
##$DFILT= <>
##$DTYPP= 0
##$F1P= 0
##$F2P= 0
##$FCOR= 1
##$FTSIZE= 65536
##$FT_mod= 6
##$GAMMA= 0
##$GB= 0
##$INTBC= 1
##$INTSCL= 6.834604e-11
##$ISEN= 30
##$LB= 1
##$LEV0= 0
##$LPBIN= 0
##$MAXI= 10000
##$MC2= 0
##$MEAN= 0
##$ME_mod= 0
##$MI= 50
##$NCOEF= 0
##$NC_proc= -7
##$NLEV= 6
##$NOISF1= 182.463
##$NOISF2= 159.3651
##$NSP= 0
##$NTH_PI= 0
##$NZP= 0
##$OFFSET= 248.5645
##$PC= 4
##$PHC0= -10287.04
##$PHC1= 149.8566
##$PH_mod= 1
##$PKNL= yes
##$PPARMOD= 0
##$PSCAL= 0
##$PSIGN= 0
##$REVERSE= no
##$SF= 81.0140089999694
##$SI= 65536
##$SIGF1= 159.3651
##$SIGF2= -187.1042
##$SINO= 113.3802
##$SIOLD= 16384
##$SREGLST= <1H.CDCl3>
##$SSB= 0
##$STSI= 65536
##$STSR= 0
##$SW_p= 40650.406504065
##$SYMM= 0
##$S_DEV= 0
##$TDeff= 32768
##$TDoff= 0
##$TI= <>
##$TILT= no
##$TM1= 0
##$TM2= 0
##$TOPLEV= 0
##$USERP1= <user>
##$USERP2= <user>
##$USERP3= <user>
##$USERP4= <user>
##$USERP5= <user>
##$WDW= 1
##$XDIM= 65536
##$YMAX_p= 326471198
##$YMIN_p= -12694063
$$ End of Bruker specific parameters
$$ ---------------------------------
##NTUPLES= NMR SPECTRUM
##VAR_NAME=  FREQUENCY,     SPECTRUM/REAL,   SPECTRUM/IMAG
##SYMBOL=    X,             R,               I
##VAR_TYPE=  INDEPENDENT,   DEPENDENT,       DEPENDENT
##VAR_FORM=  AFFN,          ASDF,            ASDF
##VAR_DIM=   65536,         65536,           65536
##UNITS=     HZ,            ARBITRARY UNITS, ARBITRARY UNITS
##FACTOR=    0.620285442955139, 1,           1
##FIRST=     20137.2065510682, 0,            0
##LAST=      -20513.1999529968, 0,           0
##MIN=       -20513.1999529968, -12694063,   0
##MAX=       20137.2065510682, 326471198,    0
$$ Real data points
##PAGE= N=1
##DATA TABLE= (X++(R..R)), XYDATA
$$ [...]
40103b999878J187914J730549Q60832N41272Q20650M68273j87364n865L29691
40094B746074n52959j742403j262921M19178J158720P05540L88055K1850j381554
40085D99580k467435r73701J894873K521861N09218p56520K86151J273019M79835
40076C266881m63086k5653N83274J13847m83264m45346r54615k421673k666571
40067c496206k11333K733784L040465R10293q36628n90467Q07601J796097J532273
40058E685879K13281j033884j175342n77735l63788n28892k62616L5322o62528
40049A329697j371010K2722K611562K615717q02625l327799j571889J725404J906963
40040C138742n93123j478062M71944J959061O84608j509297k026624j082982l99766
$$ y = [-2999878, -1811964, -81415, 779417, 1320689, 2141339, 2609612, 2422248, 2416383, 2746074, 2193115, 450712, -812209, -393031, 765689, 1471229, 1859284, 1881134, 499580, -1967855, -2941556, -1046683, 1475178, 1984396, 1227876, 1514027, 2787046, 3266881, 2803795, 2778142, 3361416, 3475263, 2991999, 2546653, 1592038, -829635, -3496206, -3707539, -973755, 2066710, 2977003, 2140375, 1549908, 2357509, 4153606, 5685879, 5899160, 4865276, 3689934, 3112199, 2748411, 2219519, 1956903, 1992225, 1329697, -41313, -18591, 2592971, 5208688, 4406063, 1078264, -493625, 1231779, 3138742, 2545619, 1067557, 1539501, 3498562, 4183170, 2673873, 647249, -435733, -835499]
40031h35499m59682o97134j012196j476953j333007K09569K375061L215929J845659
40022A831747m30621j556644q83490M63785J064823N22882n85789j407803j271816
40013b252926j02550J250056J663000J087732N76553N97209L35160o13478j079358
40004A461398j39330R48815L56463j421109k143071r69955Q09801J994380K448073
39995C345465J899762m4566k240082k467448m66489J244456O61623j056048j464461
39986e87788k15388Q79968O43166K0571M94034J699095J488772j103660l597526
39977b78756k436308J987044M782382K551589j970320l550946j218061J486015
39969A352639J958450Q95221m39341j777824k320403r54207J190236J396619n15433
$$ y = [-835499, -1295181, -1992315, -3004511, -4481464, -5814471, -5604902, -3229841, -13912, 1831747, 1401126, -155518, -1039008, -575223, 489600, 1012482, 426693, -981110, -2252926, -2355476, -1105420, 557580, 1645312, 2221865, 2819074, 3154234, 2540756, 1461398, 1322068, 2270883, 2627346, 1206237, -936834, -1906789, -1096988, 897392, 3345465, 5245227, 5200661, 2960579, 493131, 26642, 1271098, 1932721, 876673, -587788, -803176, 76792, 719958, 740529, 1234563, 2933658, 4422430, 3318770, -278756, -2715064, -728020, 4054362, 6605951, 4635631, 1084685, -133376, 1352639, 3311089, 4206310, 3766969, 1989145, -331258, -1285465, -95229, 1301390, 785957]
39960G85957j659980o92326J66005p91159j711252m09246J822671K149104L32561
39951g665j300857j017028Q52563K704365K830079Q40443j375867j486519O9665
39942B109179O02541o59102j421430k52797J093257P57551m08278q68248q62105
39933I0568r94712o83924O6727l07585k081381k814225j049809J001365J047614
39924e725362N17945J710803L367206K683039J58270j262891r00033o22382j017256
39915a090661p15230N34794J155327L78641p61499j209391q00804L06764J402198
39906g99861J130607n59269j411870J33532K140314J753688n94039k148550j858823
39897b214271o76296R68417K869482L287700R41490j954540k117888n3612J085525
$$ y = [785957, -874023, -1566349, -1400344, -2191503, -3902755, -4312001, -2489330, -340226, -7665, -1308522, -2325550, -1472987, 1231378, 4061457, 4901900, 3526033, 2039514, 2109179, 2711720, 2052618, 631188, 378391, 1471648, 2229199, 1820921, 952673, 90568, -904144, -1588068, -1521341, -1828926, -3910307, -6724532, -7774341, -6772976, -5725362, -5207417, -3496614, -129408, 2553631, 2711901, 1449010, 548977, -73405, -1090661, -1805891, -1271097, -115770, 262871, -498628, -1708019, -2508823, -2202059, -799861, 330746, -228523, -1640393, -1506861, 633453, 2387141, 1793102, -355448, -2214271, -2890567, -1922150, 947332, 4235032, 5176522, 3221982, 1104094, 1050482, 2136007]
39888B136007P54509R74227J483868j94716l354576l790721m04120K517542J771613
39879A893633k51367k03793R53836O57624m55546k31277P21425K19874j382817
39870A921592j790192p07515j4770l11397j99502Q03797J182027k3830j422177
39861e61967j066879R04374K333052J587345m24287j240970k8834J091794k747
39852B590881k004505j792114P32796K153674O00182j514872j396419N3646L30306
39843b46425n53168p59801l9349L97452N39016J284333J965882R64569j241393
39834B311116k273215j316001P2164Q73110J686189K316586J160845j684649l321232
39825a75087j935456L65876P49506k16227j89934P14630M29113j083251j595927
$$ y = [2136007, 2890516, 3864743, 5348611, 5153895, 1799319, -1991402, -2395522, 122020, 1893633, 1642266, 1438473, 2392309, 3049933, 2594387, 2363110, 3084535, 3304409, 1921592, 131400, -576115, -590885, -902282, -1101784, -297987, 884040, 860210, -561967, -1628846, -724472, 1608580, 3195925, 2771638, 1530668, 1501834, 2593628, 2590881, 586376, -1205738, -472942, 1680732, 2280914, 766042, -630377, -576731, -246425, -799593, -1559394, -1598743, -1201291, -662275, 622058, 2587940, 3552509, 2311116, 37901, -1278100, -1205936, -332826, 1353363, 3669949, 4830794, 3146145, -175087, -2110543, -1744667, -995161, -1211388, -1401322, -686692, -257579, -1340830, -2936757]
39816b936757m37863N01708J60260j58505M13257P08800J00476O6532J387136
39807a94956K181892R32602p34659q22479m27009j355950k129887j83572L059050
39798C25032L575304J011971p10382L89586J706669Q68549p03478r53727n25905
39789D983619o96325q32039k39209p8437j131513j863716r31676M43799O97499
39780C52002L94528M39602J04630r45562j058453N24106J618030N98247n56537
39771A470593K95479J526726O90411j009776j057710k72071r41173k210934j775114
39762c283569n06221o98976j202247N54643K893482J936877j288210j856563Q42057
39753b608727K174171M14042o19645J080056K043388q2060k067921r76730N84667
$$ y = [-2936757, -3374620, -2872912, -2712652, -2871157, -2457900, -1749100, -1648624, -1582092, -194956, 1986936, 2919538, 2184879, 1362400, 935391, -420559, -2550446, -2734018, 325032, 3900336, 4912307, 4201925, 4591511, 6298180, 7166729, 6463251, 5509524, 4983619, 4287294, 3455255, 3216046, 3137609, 2006096, 142380, -789296, -345497, 352002, 746530, 1186132, 1290762, 345200, -713253, -189147, 1428883, 2027130, 1470593, 1766072, 3292798, 3983209, 2973433, 1915723, 1643652, 702479, -1508455, -3283569, -3789790, -4488766, -5691013, -5136370, -2242888, -306011, -1594221, -3450784, -2608727, -434556, -20514, -640159, 439897, 2483285, 2401225, 333304, -643426, -58759]
39744e8759n28375k013106j34065L382986L676034K33775k682101k397720o22901
39735a144232J09372l17087m61033M40085J586734J430253k80871j469613k30378
39726c36770J930780J832977m10676j446953k45288K93527j332131k382283o17862
39717b714679J908882K510735J812397J182769k31757k629477l190414m07019
39709a758563K330638J548500p60657o91465J151226J463421J81987l00856N79
39700C164810m68645p28241Q86750K321650N94175k329875k178192J70230J74049
39691A606711j949545j316676K504754L805110K33775k961874j506434J295758
39683A711579P86107j470647j347014O42841J123802N8378m3172O48798k30203
$$ y = [-58759, -587134, -2600240, -2734305, 648681, 4324715, 4558490, 1876389, -521331, -1144232, -1034860, -1351947, -1812980, -1372895, 213839, 1644092, 1363221, -106392, -336770, 1594010, 3426987, 3016311, 1569358, 1324070, 1617597, 285466, -2096817, -2714679, -805797, 1704938, 3517335, 4700104, 4468347, 1838870, -1351544, -1758563, 572075, 2120575, 1359918, 668453, 1819679, 3283100, 3465087, 3164231, 3164810, 2696165, 1967924, 2854674, 5176324, 5770499, 3440624, 1262432, 1432662, 1606711, -342834, -1659510, 845244, 4650354, 4884129, 1922255, 415821, 1711579, 2497686, 1027039, -319975, 322866, 1446668, 1505046, 1461874, 2110672, 1880469]
39674A880469k362229k783477p13009J344901J584536Q95579M51695M761o56363
39665c53137o83388L77696J457807J205504k86114j563074j478502n82428m87277
39656b392913j466199j497646R00721L609066L121836j92166k123306p89554O64376
39647a65785m55793j618461P99473N004999N685824J538335l118716m353641k745495
39638E70740q78017J67392N77514M17935r5359l74559l75110n12687l70076Q87014
39628A4787K471916K295640L2081k018261k074376j080451o20235m26675M48483
39619i57091J453782J381764M27384l37091p82980j338692j491210n19267P52255
39610a411146Q57564R7333N8767Q32530R22270J57228K08685J364980J361995
$$ y = [1880469, -481760, -3265237, -3978246, -2633345, -1048809, -153230, 298465, 303226, -353137, -1036525, -658829, 798978, 2004482, 1718368, 155294, -1323208, -1905636, -2392913, -3859112, -5356758, -4456037, -846971, 2274865, 2082699, -40607, -830161, -165785, -621578, -2240039, -1440566, 3564433, 9250257, 10788592, 7669876, 3316235, 570740, -307277, -139885, 437629, 855564, 760205, 385646, 10536, -502151, -872227, 14787, 2486703, 4782343, 4814424, 2796163, 721787, -358664, -978899, -1405574, -957091, 496691, 1878455, 2305839, 1968748, 1185768, -152924, -1644134, -2163401, -1411146, -553582, -456249, -397482, 435048, 1357318, 1514546, 1723231, 3088211, 4450206]
39601D450206r19821k866913j646977J307913K203301M08245j031518l63806N54537
39592B095167j68635j367107j044112L03654O83707k23197q87421l89632O22451
39583c75125J240852J227608P02772l5794l81705J02995J095074J828018J703962
39574G108657L83836j863393l476817k612491J64095J657367J10901j907254r81480
39565a416579J856122K373728m90333k937435j992164L17171N33027r52856j044872
39556c754191R86498K613756K010174K65717q32500j084678r95076k85045J295660
39547B20315K594258K018614k31608k050967j845497k86803Q14173P74338L75483
39538B382306K00664k07565j078450j397333l28222R53908M56599j541894k322106
$$ y = [4450206, 3530385, 663472, -983505, 324408, 2527709, 2935954, 1904436, 1540630, 2095167, 1926532, 559425, -484687, -181033, 502674, 279477, -607944, -997576, -375125, 865727, 2093335, 2796107, 2760313, 2378608, 2481603, 3576677, 5404695, 7108657, 7492493, 5629100, 2152283, -460208, -296113, 1361254, 1472155, -435099, -1416579, 439543, 2813271, 2322938, -614497, -2606661, -2289490, -1756463, -2709319, -3754191, -2767693, -153937, 1856237, 2121954, 1289454, 204776, -790300, -1075345, 220315, 2814573, 4833187, 4601579, 2550612, 705115, 418312, 1232485, 2006823, 2382306, 2582970, 2375405, 1296955, -100378, -428600, 525308, 981907, -559987, -2882093]
39529b882093m04836K148949K492302Q61420k02649J21002J6072j546363k739974
39520b136170j542827J112502K561185J906805N75147j79625n36964q66975r29166
39511c6088p28536p19280o38020M20911K091990K491630R79299m10756J11165
39502C562315J174113M29831j408773j516086L38324J131642o77383k700187k399193
39493b065397p77136k00746o00026l98297K80230K50219J71862J587228L306421
39484A554358K252411j412386l467880j592196R97064M14942j994925k164408
39476e413020j4926O81105j094029j752712P47423L077953J678687j469846j918738
39467e478103M91043K119447J672628J308296J647464M86061k270230l010005
$$ y = [-2882093, -3286929, -1137980, 1354322, 2215742, 2013093, 2134095, 2150167, 603804, -2136170, -3678997, -2566495, -5310, 1901495, 2476642, 2297017, 1760053, 893078, -36088, -764624, -1483904, -2121924, -1701013, 390977, 2882607, 3861906, 3451150, 3562315, 4736428, 5166259, 3757486, 2241400, 2579724, 3711366, 3033983, 333796, -2065397, -2842533, -3043279, -3643305, -4041602, -3761372, -3511153, -3339291, -1752063, 1554358, 3806769, 2394383, -1073497, -2665693, -1668629, -1253687, -3248612, -5413020, -5427946, -4746841, -5840870, -7593582, -6846159, -3768206, -2089519, -3559365, -5478103, -4987060, -2867613, -1194985, 113311, 1760775, 2246836, -23394, -3033399]
39459c033399k24786K124953M59163k528999k018334J334915K730662Q78788o62079
39450i39116K87128J623283J145935l25859j306812j819011j923876r90377L94606
39441c854099N17710m54259l45978J253712K131362J330407N50179M94617m44169
39432A179482k227244j960199R87900K732296Q36696j381641l05148J885034J170810
39423B917986j323502j622692K7514P6780j562530j461002Q21721J731737q1793
39414d75781j550366m55983J361249J588367O01018m27858j381428j858075r49962
39405c548819M97547L09732j305750j467751Q23643K861093K336057M56436n34855
39396D27333m27003j78151k20822p87253j810685j865644K85157K734071K240854
$$ y = [-3033399, -3258185, -1133232, -674069, -3203068, -5221402, -3886487, -1155825, -277037, -939116, -651988, 971295, 2117230, 1791371, 484559, -1334452, -3258328, -4248705, -3854099, -3336389, -3790648, -4136626, -2882914, -751552, 578855, 1129034, 1623651, 1179482, -1047762, -3007961, -2020061, 712235, 1548931, 167290, -137858, 1747176, 2917986, 1594484, -28208, -694, 76086, -1486444, -2947446, -2125725, -393988, -475781, -2026147, -2482130, -1120881, 467486, 1068504, 640646, -740782, -2598857, -3548819, -3051272, -2741540, -4047290, -5515041, -4691398, -1830305, 505752, 962188, 427333, 330, -177821, -398643, -1185896, -2996581, -4862225, -4577068, -1842997, 397857]
39387C97857m49961j000201J676946L321573J104304j921386k108966q51762j158118
39378i89714k136474j281347N08349Q42901O43290K211706M063474K767619q17112
39369E812692k272055o30642L43663j250774k391708n62024J867361J456600j010405
39360A362708k075845p11082R39938J105456L01472k07034j23249O0899l1935
39351F21328l76367p58314r53356p16155J58162J418196K107277J410951r0683
39342B821039q81321n77634m65508j318983j953895j135695J85502J63879j072978
39333d235594j543183k15390J752006K634096J949605O30541O1080O81885J162133
39324B877179j64612k541368l022677o16575J669255R35285j164572r14269J693570
$$ y = [397857, -52104, -1052305, 624641, 3946214, 5050518, 3129132, 1020166, 168404, -989714, -3126188, -4407535, -3899186, -3056285, -2412995, -201289, 3862185, 6629804, 5812692, 3540637, 2909995, 3253658, 2002884, -388824, -950848, 916513, 2373113, 1362708, -713137, -1424219, -484281, 621175, 922647, 715613, 592364, 653263, 621328, 244961, -513353, -1466709, -2182864, -2024702, -606506, 1500771, 2911722, 2821039, 1939718, 1362084, 896576, -422407, -2376302, -3511997, -3326495, -3162616, -4235594, -5778777, -5994167, -4242161, -1608065, 341540, 972081, 1033161, 1715046, 2877179, 2712567, 171199, -2851478, -3468053, -1798798, -863513, -2028085, -2942354, -1248784]
39315a248784L101814J767315l5903n01537q06821j980227k450071q42474J193416
39306a803272J342619J02148m07433J84283O12866N51026P35468R60187J69377
39297B447269j366204j855169m18692J645221K505769J724088J81842j082852
39289C781272j584224j474286j194780q39061m6968J154187J892785J462217L19680
39280C470822o58869j354370j879287j569733J6477J501036R39626j227325k395378
39271c157001j414410L7703N21304J005043K371290K925453R51786j716599j798226
39262b73657L62780J124486q18003k428231j081328J618583K587492J505830J95088
39253B793040m63577p45421n43518J66293L01517q29098j908490j493051m96895
$$ y = [-1248784, 1853030, 3620345, 3584442, 3082905, 2276084, 295857, -2154214, -2996688, -1803272, -460653, -358505, -765938, -581655, 31211, 582237, 1317705, 2277892, 2447269, 1081065, -774104, -1192796, 452425, 2958194, 4682282, 4864124, 3781272, 2197048, 722762, -472018, -1311079, -1358047, -203860, 1688925, 3151142, 3470822, 2811953, 1457583, -421704, -1991437, -1974960, -473924, 465702, -761623, -3157001, -4571411, -4533708, -4012404, -3007361, -636071, 2289382, 3241168, 1524569, -273657, 89123, 1213609, 395606, -2032625, -3113953, -1495370, 1092122, 2597952, 2793040, 2329463, 1584042, 1040524, 1206817, 1508334, 679236, -1229254, -2722305, -3219200]
39244c219200n50805r07896K70934K208180K212021O0423j452314q45465K01683
39235b022439K29966K36622J068190J316012j24771j548143q76241Q48555Q57664
39226a4585j193305k717805j797370M27322J388407K06100j304743p10800J958682
39217c758097L756331K269261j037614k478125r26413J066215J213209K85463
39209C90230Q738K82153M4602o01565p75324l86149k4944J9251j87968l77382
39199a608358J19650J564741K618157J628816n98341j449176m07973K49349m76323
39190A640542o00033Q85768J568417l09521k190242r14417K050866K720540N25084
39181E377004j462812j415835m65451Q3407J78425j83156r35510j008039J53917
$$ y = [-3219200, -3770005, -4677901, -4406967, -2198787, 13234, 73657, -1378657, -2224122, -2022439, -1792473, -1555851, -487661, 828351, 703580, -844563, -1720804, -872249, -14585, -1207890, -3925695, -5723065, -5295743, -3907336, -3701236, -5005979, -5716779, -3758097, -1766, 2267495, 1229881, -1248244, -2174657, -1108442, 104767, 390230, 398968, 681121, 725723, 124158, -651166, -1037315, -1062259, -1043008, -1230976, -1608358, -1488708, 76033, 2694190, 4323006, 3724665, 2275489, 1867516, 2116865, 1640542, 1040509, 1926277, 3494694, 3185173, 994931, 80514, 2131380, 4851920, 5377004, 3914192, 2498357, 2032906, 2116313, 2294738, 2111582, 1176072, 168033, 321950]
39172C21950P71873q63169k911804k068720J297873L461612K731305J060319Q560
39163C809799j216812k753347k661611j98933K288634K567716J405809O36832
39155C878087L67340j81127p21384n22335J59868O02188O43231L22495m85112
39146D063251j442793j864411j826159j858324j416812M83062K796559K903112
39138A837485M13806j732554j309677J40216K5072j271069j235672Q69157K981011
39129G17775K880812N32934k088732k771540j032091J226863J647248K56199o43640
39120G25828K61602J551239J329632j51413j224356j091016k50102N22914N92817
39111B267145l94047j796614k057846m76219J567753K027908N67878j114506j200838
$$ y = [321950, 1093823, 230654, -2681150, -4749870, -3451997, 9615, 2740920, 3801239, 3809799, 2592987, -160360, -2821971, -3020904, -732270, 1835446, 3241255, 3878087, 4245427, 4064300, 3342916, 2820581, 2980449, 3582637, 4225868, 4548363, 4063251, 2620458, 756047, -1070112, -2928436, -4345248, -3862186, -1065627, 1837485, 2251291, 518737, -790940, -650724, -625652, -1896721, -3132393, -2263236, 717775, 3598587, 4131521, 2042789, -728751, -1760842, -533979, 1113269, 1369468, 725828, 987430, 2538669, 3868301, 3716888, 2492532, 1401516, 1151414, 1674328, 2267145, 1873098, 76484, -1981362, -2457581, -889828, 1138080, 1705958, 591452, -609386]
39102f09386L15293J528519O36618j667627k524198m83117K179966K329049L59117
39093B064234n85122N33509J403779M35431r03898j070084j002992j816108k267385
39084c208636r18811Q99402Q66766o46251j151997K41173J887095K158387J092316
39075A219444m20092j490630j333009O9266J375305J163694k22405j134428p84305
39066a557160P6166N04101L42631j58321p55670j064284o45172N09013J769173
39057i79523K149499R71577j202228k470934j456741O73620J361155J02644r03301
39048a754232k32374N77974k74674j732586j537819J27771J022848M03575j01463
39039c500980O85048J781038J760811P30702j49696k22794J80574K99135l12922
$$ y = [-609386, -294093, 1234426, 1871044, 203417, -2320781, -2803898, -623932, 1705117, 2064234, 1479112, 2012621, 3416400, 3851831, 2947933, 1877849, 874857, -941251, -3208636, -4127447, -3228045, -2361279, -3007530, -4159527, -3918354, -2031259, 127128, 1219444, 799352, -691278, -2024287, -1955021, -579716, 583978, 361573, -772855, -1557160, -1480994, -976893, -634262, -792583, -1548253, -2612537, -3257709, -2748696, -979523, 1169976, 2141553, 939325, -1531609, -2988350, -2314730, -953575, -850931, -1754232, -1986606, -1408632, -1683306, -3415892, -4953711, -4825940, -3803092, -3399517, -3500980, -2815932, -1034894, 725917, 1456619, 1306923, 1084129, 1264703, 1563838, 1250916]
39030A250916j278275j645981r38970K90237J232851J633355J421120L26263j338953
39021I52563k222039j325382N17934J523494J045199j0206n30765k19682L81383
39012A12499L02943q58446j867067q16937J961123L287625R73985k798993l912530
39003c615798j451437J736582L240165L360886K954062J581928r83132l276753
38995C546503l661553k282195m24380J106024J971812J687885L04960q80252n63392
38986H05412P70350J239113j98441k492616l536094k169241O97441K776354K496562
38977C88840N51865r77280r99995k38537L02539N46466N84069J2627r40140p94200
38967a563746J122519K785257J648867j467264k880957r62356J623356J818831
$$ y = [1250916, -27359, -1673340, -2612310, -2322073, -1089222, 544133, 1965253, 2291516, 952563, -1269476, -2594858, -2076924, -553430, 491769, 481563, -49202, -268884, 112499, 415442, -443004, -2310071, -3127008, -1165885, 2121740, 3095725, 296732, -3615798, -5067235, -3330653, -90488, 3270398, 6224460, 7806388, 6823256, 3546503, -115050, -2397245, -2821625, -1715601, 256211, 1944096, 2249056, 1368804, 805412, 1575762, 2814875, 2616434, 123818, -3412276, -5581517, -4884076, -2107722, 388840, 940705, -36575, -1036570, -1275107, -972568, -426102, 157967, 170594, -769546, -1563746, -441227, 2344030, 3992897, 2525633, -355324, -1317680, 305676, 2124507]
38959B124507L46574n7658Q21393O78852j092086k123653r11082N48786k30187
38950A05446k192908k042935R45805L636827L012175j40331k469902k124502m58077
38941a728402K00886m90571q35906K72340J674286J544277L1456q76907r0893
38932b99434J216468J380816K96386r56455j631171j679336j274841p31633m05048
38923d084248j46424N61836J527784J724162P53579m26089p78600k87267O42004
38914e13263J673599J937467M75202j861256k592789q41443J220744J410899L15239
38905A224399m00273n53831n39667J73649J501656J671472R8648p92354N02635
38896B886334J165858j601222m904328l667262J294771M035097K255179p2820
$$ y = [2124507, 2471081, 2413423, 3234816, 3913668, 2821582, 697929, -213153, 335633, 105446, -2087462, -4130397, -3184592, 452235, 3464410, 3324079, 854177, -1270325, -1728402, -1527516, -2018087, -2853993, -2581653, -907367, 636910, 668366, -208541, -299434, 917034, 2297850, 2594236, 1637781, 6610, -1672726, -2947567, -3679200, -4084248, -4230672, -3668836, -2141052, -416890, 336689, -89400, -868000, -1155267, -513263, 1160336, 3097803, 3573005, 1711749, -881040, -1722483, -501739, 909160, 1224399, 824126, 270295, -269372, -95723, 1405933, 3077405, 3176053, 2383699, 2886334, 4052192, 2450970, -2453358, -6120620, -4825849, -790752, 1464427, 1391607]
38888A391607K11795J037000j82259j960440j714894L2177J162879J166209O09341
38879A753415l86016j350899j275398n48817p57931j547135o24646J887675K575438
38870b74314J03093j992965m89325K524853K837181M8091k607018k757883p82822
38861c391109J469117K005390J62261j971695j429414J430168L070913J995727
38853C341358N89016N27747J93928j392050k087173p12794K60564q42906j594449
38844a716759j3713J389815J02561j466437m3454K653724K862401R26469k18176
38835D476431l07842q31960j158607k27759K20881j235926j993675K06962K175145
38826A323650K61997k565256j334244J933453J553019j426929q45900L178604
$$ y = [1391607, 1603402, 2640402, 2458143, 497703, -1217191, -1185014, -22135, 1144074, 1753415, 1367399, 16500, -1258898, -1807715, -2565646, -4112781, -4737427, -2849752, -274314, -171221, -2164186, -2653511, -128658, 2708523, 2756614, 149596, -2608287, -3391109, -1921992, 83398, 245659, -1726036, -3155450, -1725282, 1345631, 3341358, 3930374, 4458121, 4652049, 3259999, 1172826, 460032, 720596, -122310, -1716759, -1730472, -340657, -238096, -1704533, -1747987, 905737, 3768138, 4694607, 4476431, 4168589, 3336629, 2178022, 1950263, 2171144, 935218, -1058457, -851495, 1323650, 1585647, -979609, -2313853, -380400, 1172619, -254310, -1100210, 2078394]
38818B078394L697061j182737m770957k616727J237648K048374J040376N35307
38810B066739p54159l176764k978988J432459N155671L597553p15265k726380
38802A900866k164753j586632r12384J014838K432948J225195q00744p20391N02205
38793H91148J37618j180578r37579K30292l97385k350173k150357J197877M495659
38784f3478M571887J647206j717772l050005j488240J400932K613032Q31037k004781
38775B739818l184033k152859n8317J959212K801242J595161o51692j363101J53081
38766A838512J461378O93129p26966q50562l55675o50242r79000p6557R94700
38757A348717M17259j133712j325264M84665K653657L286988J556307j847248
$$ y = [2078394, 5775455, 4592718, -178239, -2794966, -1557318, 491056, 1531432, 2066739, 1312580, -1864184, -4843172, -3410713, 1744958, 5342511, 4627246, 1900866, -263887, -1850519, -2762903, -1748065, 684883, 1910078, 1109334, 388943, 891148, 1028766, -151812, -1089391, -859099, -1256484, -3606657, -5757014, -4559137, -63478, 4508409, 6155615, 4437843, 1387838, -100402, 1300530, 3913562, 4744599, 2739818, -444215, -2597074, -2655391, -696179, 2105063, 3700224, 3048532, 1685431, 1838512, 3299890, 3993019, 3266053, 2415491, 2059816, 1409574, 430574, 354017, 1348717, 1765976, 632264, -693000, -208335, 2445322, 5732310, 7288617, 5441369]
38749E441369m489393m012151j213534O21388L36471K02699J460560J966226L42844
38740F56479j002847J02648J673537R41898j090174j924812j791593j927635j185510
38731e548009J511684L552197J982341j232088j883612r6672N33733o16537o70872
38722b467835J071298J881179N73937o59683l12403L68554L60930N01686J107627
38713B425290R85294j82382j051791r25455m63189K01816J492334K373354J155389
38704F010660j296290j995260j14468J761585J352640o74131k357916k625397
38696F1423j429697L38047R89805m3988q61291K51423J735055J105964o50850
38687A495891o01409R27624Q55227j009908j397221N99454J679275j05457k094339
$$ y = [5441369, 951976, -3060175, -4273709, -3652321, -3315850, -3113151, -1652591, 313635, 656479, -346368, -243720, 1429817, 2371715, 1281541, -643271, -2434864, -4362499, -5548009, -4036325, -484128, 1498213, 266125, -1617487, -1714159, -1180426, -1796963, -2467835, -1396537, 484642, 1058579, 398896, 86493, 455047, 815977, 1317663, 2425290, 3410584, 3228202, 2176411, 1250956, 787767, 989583, 2481917, 4855271, 6010660, 4714370, 2719110, 2604642, 4366227, 5718867, 5044736, 2686820, 61423, -1368274, -1030227, -40422, -84410, -945701, -694278, 1040777, 2146741, 1495891, 894482, 1822106, 2677333, 1667425, 270204, 869658, 2548933, 2443476, 349137]
38678C49137j465651N81140J418639Q40492J04193l46012k70901Q42147K020951
38669D074135J171499j242591j827017N81546K510848R78061k001103k871466
38661A373912j753114r08672l54888J194014K555401J255493j987087l468532
38653b093473j481803J565236K488687Q49886j269018j672804n1370J658687J263101
38644A257129q53012j967121p83411P21502M63514o28679n64077L54533N35491
38635a464131J35505M02441Q80942J20263j264163j118903O06956J507703M95888
38626C02501o05548j38101R16219P66371n33219j562701j541069p43065K48094
38617b890518Q18876N57735r8695j23289O68397J243054R55884N64731Q29412
$$ y = [349137, -1116514, -535374, 883265, 1723757, 1827950, 1481938, 1211037, 2053184, 4074135, 5245634, 4003043, 2176026, 2757572, 5268420, 6246481, 4245378, 1373912, -379202, -1287874, -1642762, -448748, 2106653, 3362146, 1375059, -2093473, -3575276, -2010040, 478647, 1328533, 59515, -1613289, -1664659, -5972, 1257129, 404117, -1563004, -2346415, -1624913, -1161399, -1790078, -2354155, -1999622, -1464131, -1328626, -926185, -45243, 75020, -1189143, -2308046, -1701090, -193387, 302501, -303047, -441148, 475071, 1241442, 708223, -854478, -2395547, -3138612, -2890518, -2071642, -1513907, -1612602, -1735891, -1067494, 175560, 1131444, 1696175, 2525587]
38608B525587J077467L80326n79348m22489L85343k26583k633002m213699k671834
38599f378232N72394K079057Q71733p49164p78622K87084J329870K377123L164542
38590B775785K103471j090481l313716j530721K315640L009679r12283m813272
38582a455898l997984K73807K895668J569939j068730j637700n2779J396932J535487
38573e41258J276599J330700O58852j573922l519255k332105J412842L399438
38565A11891J105799k384746k426459P47092K560083N89174k540872l224895j210992
38556f673925J171075K147765J684995P95683N17835Q26749N36517p52469j313875
38547a059650K65419K089943J174738j610150k240092K66630K082307N54631j656961
$$ y = [2525587, 3603054, 3983380, 3404032, 2981543, 3366886, 3140303, 507301, -3706398, -6378232, -5805838, -3726781, -2855048, -3604212, -4382834, -4095750, -2765880, -388757, 2775785, 4879256, 3788775, 475059, -1055662, 1259978, 4269657, 3357374, -1455898, -5453882, -5180075, -2284407, -714468, -1783198, -3420898, -3473677, -2076745, -541258, 735341, 2066041, 2724893, 1150971, -2368284, -4700389, -3287547, 111891, 1217690, -1167056, -3593515, -2846423, -286340, 302834, -2238038, -5462933, -6673925, -5502850, -3355085, -1670090, -874407, -356572, 470177, 1006694, 254225, -1059650, -794231, 1295712, 2470450, 860300, -1379792, -1113162, 969145, 1523776, -133185]
38538a33185j016030J302896J602593n15737k054017j420961j17664K16515j67371
38529b302961k77433L25198J524600K576670K277823M89002j025812p13755M00945
38520C274277J12157j633740k600013j442172N74040J356267L79627j019998j153948
38511b153503K20547J400457O52700j169158j251915J215740L402732K614747
38503D932347R7738j042823m33031k48312j100439j188859J23558Q20239m58529
38494A501889j929669j277207P75788J525104K14601j086801o57554N32273N49286
38485A47710n11881p34852N65454J561926M95600j615185k240549p49662J026951
38476b054488J535123J158496Q47581O48169K69735q6145j69063p6844J69439
$$ y = [-133185, -1149215, 153681, 1756274, 1240537, -813480, -2234441, -2352105, -2135590, -2302961, -2580394, -2255196, -730596, 1846074, 4123897, 4612899, 3587087, 2873332, 3274277, 3386434, 1752694, -847319, -2289491, -1715451, -359184, 20443, -999555, -2153503, -1932956, -532499, 120201, -1048957, -2300872, -1085132, 2317600, 4932347, 5030085, 3987262, 3554231, 3305919, 2205480, 1016621, 1140179, 1960418, 1501889, -427780, -1704987, -929199, 595905, 810506, -276295, -933849, -401576, 147710, -364171, -1099023, -533569, 1028357, 1523957, -91228, -2331777, -3081439, -2054488, -519365, 639131, 1486712, 2134881, 2404616, 2318471, 2149408, 2072564, 2242003]
38467B242003N68587O27427N6162k47102M73229Q56155q84559l369630l196219
38458b873947k65053J494882J42487j187818L91387K614746J928946n56332j136208
38449E53090L42576P97098n90459j459517o26942N17699J072233J518593J379430
38440C503801m68845k721629k460762J53947J464030k61839k266686j674812O09490
38431d123305K169221K486902K029480M00083k160098l365197j619147J090472
38423c091589J521710l44640j455123l7455K223104K616371N96353j925671k726106
38414b623046j367395O03636J465272J130569P35709P64828O02226m6777n07126
38405G57896k92233J31711J99692k8115l47445o82247n90054M14623J645294J535651
$$ y = [2242003, 2810590, 3438017, 3494179, 3247077, 3720306, 4576461, 3691902, 322272, -2873947, -3139000, -1644118, -1501631, -2689449, -2298062, 316684, 2245630, 1689298, 553090, 895666, 1692764, 1102305, -357212, -984154, -466455, 605778, 2124371, 3503801, 3034956, 313327, -2147435, -1993488, -529458, -791297, -3057983, -4732795, -4123305, -1954084, 532818, 2562298, 2962381, 802283, -2562914, -4182061, -3091589, -1569879, -1914519, -3369642, -3407097, -1183993, 1432378, 2028731, 103060, -2623046, -3990441, -3386805, -1921533, -790964, -55255, 709573, 1311799, 1265022, 757896, 465663, 597374, 797066, 768951, 421506, -260741, -850795, -436172, 1209122, 2744773]
38395B744773k08108j793820j473508L03689J609439J296162r1717j181680j044460
38386A60770M6799Q52644M77362n56461r84651m00031L99301M54667n17071j918041
38376a984712k322689n57513K360777L476182J509356r67989r33401P12296Q38914
38367B131221p63079j354339j97614L08914p84268j117073O05024J939025P95340
38358A563151q74945m22903R66437M76971j362125j571800K29495J234107l0874
38349B07514j670245j621946m64616R3537j25389O8389J116987J825486Q08634
38340B38351j403373k341002m82601K255523K500204p609j893117r58566Q05359
38331a286831N88407j042237j630826q42314k28350m6671P53295J802919J457661
$$ y = [2744773, 2536665, 742845, -730663, -426974, 1182465, 2478627, 2386910, 1205230, 160770, 207569, 1060213, 1537575, 981114, -3537, -403568, -4267, 450400, -66671, -1984712, -4307401, -4864914, -2504137, 972045, 2481401, 1513412, 580011, 1292307, 2131221, 1368142, 13803, -183811, 125103, -659165, -1776238, -1171214, 767811, 1563151, 688206, 265303, 1231740, 1708711, 346586, -1225214, -995719, 238388, 207514, -1462731, -3084677, -3549293, -3455756, -3581145, -3512756, -2395769, -570283, 238351, -1165022, -3506024, -3988625, -1733102, 767102, 759493, -1133624, -2092190, -1286831, -698424, -1740661, -3371487, -4213801, -4442151, -4488822, -3735527, -1932608, -474947]
38322d74947j92793j053136k43748P05288N62034J74209N50304R72294L65499
38313A365004o49731m79709J134301K539359J945736n39617k741527k553307l76656
38304c56147J255792R01070o5440P3630N02767o04605k505022k363020M76839
38295b684136L032740K484968k38009j902856r88449R17496J361653j44642j690694
38286A48071j332904L32331Q68492m05255j093700O25278K638428J673777j514232
38277A940286k901137j090067R22649O74745m61392n70278n89864j794210k443788
38268f313056l41131K806372L228747P64271q58613L09527J857220J234638m02225
38259B285750n78532L79011J64509j531418k409871j051114R72356J277458k38706
$$ y = [-474947, -667740, -1720876, -1964624, -1259336, -697302, -523093, 27211, 999505, 1365004, 715273, 235564, 1369865, 3909224, 5854960, 5315343, 2573816, 20509, -356147, 899645, 1800715, 1735275, 1808905, 2311672, 1707067, -797955, -3160975, -2684136, 348604, 2833572, 2595563, 692707, -295742, 621754, 1983407, 1838765, 148071, -1184833, -852502, 15990, -389265, -1482965, -857687, 1780741, 3454518, 1940286, -960851, -2050918, -1128269, -453524, -914916, -1485194, -2075058, -3869268, -6313056, -6654187, -3847815, -619068, 145203, -713410, -403883, 1453337, 2687975, 2285750, 1707218, 2086229, 2250738, 719320, -1690551, -2741665, -1769309, -491851, -730557]
38250g30557j510872j010068O03031J600808J310512O09217M41294M97117j34810
38241A675672j350619j942435j276348j48275N63736J185031K196556K680321
38233C583639J354832j081566k390939j819498q78996n49389J82884J727982K067785
38224B196734j64785k500727j620343J367838K133890m20964k609895j719454
38216c337706L41616R07630O43884J135604J317609k77608j851427q00342J462289
38207d58451J258362j300067k282735l28146J249998J62309j061391M59485K859960
38198E59324K342301p48525k305605m26733K214052K419849L52628j665915k355023
38189C86353k031794j088820M06622J770323J788060L05816j100105q50785O26379
$$ y = [-730557, -2241429, -3251497, -2648466, -1047658, 262854, 872071, 1313365, 1810482, 1675672, 325053, -1617382, -2893730, -3042005, -2478269, -1293238, 903318, 3583639, 4938471, 3856905, 1465966, -353532, -1232528, -1781917, -1599033, 128949, 2196734, 2031949, -468778, -2089121, -721283, 1412607, 991643, -1618252, -3337706, -2996090, -2088460, -1444576, -308972, 1008637, 731029, -1120398, -1920740, -458451, 799911, -500156, -2782891, -3111037, -1861039, -1698730, -2760121, -2300636, 559324, 2901625, 2153100, -152505, -579238, 1634814, 4054663, 4407291, 2741376, 386353, -1645441, -2734261, -2327639, -557316, 1230744, 1536560, 436455, -414330, 212049]
38180B12049J492619R53033N2805j84014k01296p56935j348227r38057L32082
38171c85941J315312J438541J086182O41935J07246m66029r27234j188221r14567
38162G07224K80554J692020J667295k5102j264684n92845K63531q16374k296159
38153c84540r46301K560619L709899N78188l149727l214376j98981K006139J238097
38144B199017j250885k764449j488757J845047L810930J600009k763769l971019
38136b783876m28623L157494K281316j151798k184681r3128J509197O21417j011301
38127h3983j476462r10291J44053J547921K257975J002500j085017j167277J087413
38118A316832K562100J182429j058638j305539p6237m862j479569k033930j37099
$$ y = [212049, 1704668, 2657701, 2710506, 2526492, 2325196, 1568261, 220034, -718023, -385941, 929371, 2367912, 3454094, 4096029, 4203275, 3737246, 2810012, 1621791, 707224, 987778, 2679798, 4347093, 4321991, 3057307, 2464462, 2727993, 1911619, -384540, -1330841, 1229778, 4939677, 5517865, 2368138, -846238, -1045219, 960920, 2199017, 948132, -1816317, -3305074, -1460027, 2350903, 3950912, 1187143, -2783876, -3212499, -55005, 2226311, 1074513, -1110168, -1203296, 305901, 927318, -83983, -1560445, -2470736, -2326683, -778762, 1479213, 2481713, 1396696, 229419, 1316832, 3878932, 5061361, 4002723, 2697184, 2620947, 2616085, 1136516, -897414, -1034513]
38109a034513K394407K678032M29534j811815j946650o71568P757l12764l44356
38100f11936M45665J048961Q52296N22504K83230o96960k079375j723943R04678
38091a054880K822364J510263j002100j098590P92321J159258p32754j924911
38083D70971q56165N07605M81334M1167J41674o9247p93195l82873J553304K613866
38073C708441J211858p75432j074008l42396j83855j99286L85865L62743j204824
38064A889106k237680m79989K296088K418045k01788k193528j899983q98204l27220
38055a635153P47093K543291L281150J944494p9105j256892j727547j912889j416279
38046D88163l71509P5366k70063p1726J110225J798400J169903N12650O56066
$$ y = [-1034513, 1359894, 4037926, 4467460, 2655645, 708995, 37427, 45184, -267580, -611936, -166271, 882690, 1734986, 2257490, 2540720, 1843760, -235615, -1959558, -1054880, 1767484, 3277747, 2275647, 1177057, 1969378, 3128636, 2395882, 470971, -385194, 122411, 603745, 644912, 786586, 717339, -75856, -458729, 1094575, 3708441, 4920299, 4144867, 3070859, 2728463, 2544608, 2345322, 2731187, 3093930, 1889106, -348574, -828563, 1467525, 3885570, 3683782, 1490254, -409729, -1307933, -1635153, -888060, 1655231, 4936381, 6880875, 6801770, 5544878, 3817331, 1904442, 488163, 116654, 192020, -78043, -149769, 960456, 2758856, 3928759, 4441409, 5097475]
38037E097475K29757j524462k456464p42107J424648P37415j758659j950235P64764
38028a77868K214857j98153l547214l801588j307918P38137J161762J184335J264080
38019b469570P12543J4054N48400J805905J604748k54108j110742N49803K454858
38010C855891J732979q39304j948101l63245J625312J427878p54773k528282k135652
38001G2703k53375Q24619j96861j908430j769656N30724K463916K004838K49748
37992B018226m85623j2010k3703j159930k113720j615238R5539J818373K408498
37983I30412J487197O3657j18180J124506J723666L65484j098463m15950J074046
37974E136375K62536k438952l240674q78114J290106N37692j172322o57962J495412
$$ y = [5097475, 5327232, 3802770, 1346306, 604199, 2028847, 2766262, 1007603, -942632, -177868, 2036989, 1838836, -1708378, -5509966, -6817884, -6079747, -4917985, -3733650, -2469570, -1757027, -1742973, -1194573, 611332, 2216080, 1961972, 851230, 1401033, 3855891, 5588870, 4749566, 2801465, 2438220, 4063532, 5491410, 4736637, 2208355, 72703, -180672, 643947, 447086, -1461344, -3231000, -2700276, -236360, 1768478, 2018226, 1532603, 1520593, 1496890, 336960, -1776760, -3391998, -3296459, -1478086, 930412, 2417609, 2481266, 2363086, 3487592, 5211258, 5576742, 4478279, 4062329, 5136375, 5398911, 2959959, -280715, -1158829, 131277, 668969, -503353, -1161315, 334097]
37965C34097K149753L08960j908420k255656n02787J813684K576016Q68152j543327
37956A840472j775722L19293J669493M39648j253728q45908O74456P06680p72459
37947A002225j690398j297515m14631P19614K140629K530501O90868j886461k588555
37938g93723j367482k29565L94627J727203L310471K966049O27095r09545j30748
37929E594382R68458J52710j788954k580663j618535j51897N66219K03882p45903
37920E99699j274359p43500K94707Q94642J089808J370285J264133M5781j461129
37911B080067j655453o37611k8198l56820o03352l23948j21707O5543R09995J763683
37901A092199J122929o93696j697549j318695q02773l21902J262598L185373K774868
$$ y = [334097, 2483850, 2792810, 884390, -1371266, -1874053, -60369, 2515647, 3383799, 1840472, 64750, 384043, 2053536, 2493184, 1239456, 393548, 1068004, 1774684, 1002225, -688173, -1985688, -2400319, -1680705, 459924, 2990425, 3681293, 1794832, -793723, -2161205, -2390770, -1996143, -268940, 3041531, 6007580, 6634675, 5725130, 5594382, 6562840, 6715550, 4926596, 2345933, 727398, 575501, 1141720, 1345602, 599699, -674660, -1418160, -1123453, -228811, 860997, 2231282, 3495415, 3541196, 2080067, 424614, -212997, -241195, -598015, -1201367, -1525315, -1647022, -1581479, -671484, 1092199, 2215128, 1521432, -176117, -1494812, -2297585, -2619487, -1356889, 1828484, 4603352]
37892D603352o5224j789801m78337J092336M1232j949304j601152O57256J726264
37883B236622O84591o20763r73324q87933p51100l17034J36403Q6543o5205L24729
37873a46471P81752M77781k74795o36098n84534m35910l7732L50604k62890j609904
37863b378197j475404J106936L564770K998445L35354j277090j108745j017253
37855G48816j658013j571906j37932J216544J284112N83691J62299M06065J191529
37846B225205J913078J515865k50728k044958k621344k471699k335041j322573
37838e392195J336972L783214L440167R02534p87497m99083M0277l68795q11171
37829A644423m53482J33156M22954O44042O47586k729o70408l81819J57830m30876
$$ y = [4603352, 4538128, 2748327, 2269990, 3362326, 3403558, 1454254, -146898, 510358, 2236622, 2921213, 2300450, 1327126, 439193, -311907, -628941, -492538, -405995, -471200, -146471, 635281, 1113062, 838267, 202169, -382365, -818275, -856007, -505403, -768293, -2378197, -3853601, -2746665, 818105, 3816550, 4151904, 2874814, 1766069, 748816, -909197, -2481103, -2619035, -1402491, -118379, 465312, 627611, 1033676, 2225205, 4138283, 5654148, 5403420, 3358462, 737118, -1734581, -4069622, -5392195, -4055223, -272009, 3168158, 4070692, 3283195, 2784112, 2824389, 2455594, 1644423, 1190941, 1324097, 1747051, 2391093, 3038679, 3035950, 2365542, 1983723, 2141553, 1710677]
37819A710677j356062n69121J424053J833454K02765o16358P55776J847290N57485
37810E789959j296415j048529O62037J438276R29012M11929J8038r25832j722306
37801D256169j066464M55480R05827j00583r71850o49985J45446M25654L03054
37792C702748L72282N69965J87257j097812k307835j715037R26568L051547J769501
37783E459184k022885l886169j223143L258089M956630K879955p6610j335324
37775H009727j003959l86893j54331l55579q99847j518564j891006j875296j242594
37766a318342K65149J941324K063749R6445j787527j100542J364881K315690N20043
37757D360870j549655j516126m55534o79203j716197j124432J151900K153414
$$ y = [1710677, 354615, -214506, 1209547, 3043001, 3245766, 2629408, 3385184, 5232474, 5789959, 4493544, 3445015, 4107052, 5545328, 6474340, 6886269, 6904307, 5978475, 4256169, 3189705, 3645185, 4551012, 4450429, 3478579, 2828594, 2974040, 3399694, 3702748, 4075030, 4644995, 4832252, 3734440, 1426605, -288432, 638136, 3689683, 5459184, 3436299, -449870, -1673013, 1585076, 6541706, 9421661, 9345051, 8009727, 7005768, 6618875, 6464544, 6108965, 5209118, 3690554, 1799548, -75748, -1318342, -1053193, 888131, 2951880, 3048325, 1260798, 160256, 1525137, 3840827, 4360870, 2811215, 1295089, 839555, 160352, -1555845, -2680277, -1528377, 625037]
37749F25037M26176j454237p02441J374730J535609k00172p93225O19039J364993
37740B795509j4490j172156r2053J266038L32252j507633j255288M61394N26782
37731A340355j031937q66943J827705L367796J024548k808650l946501j678421
37723b772048J251307K366709J459998r3289p54450j93927L19165k61033q73025
37714D49407J4856J327274O07590j573013j696918J211735L509132K175602q73743
37705E151922k140550j602234j480826j929523j254995N54124J567756R25621
37697b08705k37295p61747n40180J64414R42225J047547K06401q01261j235247
37688a423848j239370q61521L54097J790058J588514m33398j608921j27047J944830
$$ y = [625037, 1051213, -403024, -1105465, 269265, 1804874, 1604702, 811477, 1430516, 2795509, 2781019, 1608863, 1516810, 2782848, 3115100, 1607467, 352179, 813573, 1340355, 308418, -558525, 1269180, 4636976, 5661524, 2852874, -1093627, -2772048, -1520741, 845968, 2305966, 2212677, 1458227, 1264300, 1583465, 1322432, 449407, 464263, 1791537, 2399127, 826114, -870804, 340931, 3850063, 6025665, 5151922, 3011372, 1409138, -71688, -2001211, -3256206, -2702082, -1134326, -208705, -446000, -1207747, -1747927, -1583513, -641288, 406259, 612660, -188601, -1423848, -2663218, -3524739, -3170642, -1380584, 207930, -225468, -1834389, -1961436, -16606]
37679a6606J745522L2678l50200Q82975J526085Q49951L03343M59422K60620n36178
37669E157612q35832m14342k76701n74864m16121J01471o7918p04574m98788L77937
37659A847880L56172n44322m53579R50612J466439n6610j606697j027214Q28037
37650A760718J665289J005849K32987M17658J444387K462389K184817k59438l667517
37641G247139m943291k323237K068636M119030K112052j533510k900644n77592
37633C268583K881350L459220j4815m193384m579446o24292L451058L357237m89155
37624F516356l631344k728234Q00076K757058J353792q39826p69608P44988O32019
37615D835277j204924j514591P84395K261734K97248k381759j751586J246366
$$ y = [-16606, 1728916, 1761594, 1411394, 2294369, 3820454, 4670405, 4973748, 5433170, 5693790, 5157612, 4321780, 3907438, 3630737, 3055873, 2639752, 2741223, 2673305, 1968731, 1469943, 1847880, 2204052, 1659730, 1206151, 2156763, 3623202, 3566592, 1959895, 932681, 1760718, 3426007, 4431856, 4664843, 5082501, 6526888, 8989277, 11174094, 10914656, 7247139, 2303848, -19389, 2049247, 6168277, 8280329, 6746819, 3846175, 3268583, 6149933, 9609153, 9594338, 5400954, 821508, 197216, 3648274, 7005511, 6516356, 2885012, 156778, 956854, 3713912, 5067704, 4227878, 3458270, 4203258, 4835277, 3630353, 2115762, 2900157, 5161891, 5459139, 3077380, 1325794, 2572160]
37607B572160K431982R21224l45041J771K34750l80179k58505Q24894P25754r96796
37597E732014j705100j62195J106423J29737j079709j20832J578208J286772m33311
37588F332007r96235j68043J61894l09746p4466R91056J210312J45230n49734
37579F742275O3146P16262J71136p78680p03798K01863N18641k19436q46855j86524
37569E678030J374536K418274K272745J502626N91482p77218k452714k980897
37561G626864j430981P18454J276055M72639L88342J404675J574970l4135j691067
37552A0305816j631818l77088O42642J024358R03773K23542m41845J6282J310900
37543A1976562J692487P81555L71431J206234J423136p534q55745Q13778K908574
$$ y = [2572160, 5004142, 5925366, 5580325, 5582096, 5816846, 5436667, 5178162, 6003056, 6728810, 5732014, 4026914, 3864719, 4971142, 5100879, 4021170, 3900338, 5478546, 6765318, 6332007, 5335772, 5167729, 5329623, 5019877, 4945411, 5936467, 7146779, 7292009, 6742275, 6805421, 7521683, 7692819, 6914139, 6210341, 6412204, 6930845, 6711409, 5864554, 5678030, 7052566, 9470840, 11743585, 13246211, 13837693, 13060475, 10607761, 7626864, 6195883, 6914337, 8190392, 8663031, 9051373, 10456048, 12031018, 11996883, 10305816, 8673998, 8296910, 8939552, 9963910, 10867683, 11091225, 10649380, 10665662, 11976562, 13669049, 14450604, 14822035, 16028269, 17451405, 17443871, 16588126, 17401904, 20310478]
37534B0310478K269434l28018j594875r66448o58693j087732k98573J729210K211903
37525B1586686K24090j318943k12655J546043J240633p3427M22364K387988K760984
37516B8563763O81105j166204o60779R19969J353898P10998M86321Q90550R24760
37507C2704381M44251K41524L32677K6677k90457N49845K046867K058045J84761
37498C8298571j081815l3865J623769J806529J548479K699779L953098K739191
37490E1553736N3988n48805J443164K892193K365006K078143L503365M925478
37482F8266268M924550M686322N034955M648535L269954L176639N040437N874325
37474A04921985M014937K630839M703591P802367Q118348O878409P811980J0312733
$$ y = [20310478, 22579912, 22251894, 20657019, 19690571, 19031878, 17944146, 17645573, 19374783, 21586686, 21810776, 20491833, 20279178, 21825221, 23065854, 22992427, 23414791, 25802779, 28563763, 29244868, 28078664, 27417885, 28337854, 29691752, 30402750, 30889071, 31779621, 32704381, 33148632, 33390156, 33722833, 33749510, 33459053, 34008898, 36055765, 38113810, 38298571, 37216756, 37182891, 38806660, 40613189, 42161668, 44861447, 48814545, 51553736, 51607724, 51058919, 52502083, 55394276, 57759282, 59837425, 63340790, 68266268, 73190818, 77877140, 82912095, 87560630, 90830584, 94007223, 99047660, 104921985, 108936922, 111567761, 116271352, 124073719, 132192067, 139070476, 146882456, 157195189]
37466A57195189J0564564Q464581P952516J0413002J2777217J2873805J2140387
37459B32381261J1937257J1295378R813090R219256J0338066J1349615J0553690
37452C06887613Q449005O027348L450040J268342L88850l3069k096012n764215
37444C18577902q597317r519423r968893j0636023j0423718r708193j0912935
37437B48811400j4051900j5330847j2621238r077455q498818j0018615j0551052
37430A68661475r885200r702858r553179p784717n373349n039260o945824q501788
37422A05875300q230648o954893n382138l452801k104596k763152m623844n035688
37414F7327540l233121j382799j239866j994250k324491k460964k951563l134664
$$ y = [157195189, 167759753, 176224334, 184176850, 194589852, 207367069, 220240874, 232381261, 244318518, 255613896, 265426986, 274646242, 284984308, 296333923, 306887613, 315336618, 321363966, 324814006, 326082348, 326471198, 326438129, 324342117, 318577902, 309980585, 300461162, 290492269, 279856246, 269432528, 259724335, 248811400, 234759500, 219428653, 206807415, 197729960, 189231142, 179212527, 168661475, 158776275, 149073417, 139520238, 131735521, 126362172, 121322912, 114377088, 105875300, 97644652, 90689759, 85307621, 81854820, 79750224, 76987072, 72363228, 67327540, 64094419, 62711620, 61471754, 59477504, 57153013, 54692049, 51740486, 48605822]
37406D8605822k332023j334944j283456j916149k179722j902945j677302j574084
37398C4405197j161117n43755l01202m57795n26362o13682j378695k535171k542632
37389B4344786o83667J397786J512416j47640j378450j164713p35606j022563
37381B2122349j091350k53878K29695n81632j053390M99037K301780J238572k115466
37372B1295717l973243k912000j395426j040116j94918K077818L249346J234803
37364A8341981j794082k533974j241048j96158M39119J630233J981735n15645
37356A6112161l891434l727661K49618L072921J278949k583815l916765j862127
37348D731847Q57214J908814J156155k05039o51170N72548K154007J618541j310955
$$ y = [48605822, 46273799, 44938855, 43655399, 41739250, 39559528, 37656583, 35979281, 34405197, 33244080, 32700325, 32399123, 31941328, 31414966, 30801284, 29422589, 26887418, 24344786, 23661119, 25058905, 26571321, 26423681, 25045231, 23880518, 23144912, 22122349, 21030999, 20777121, 21006816, 20425184, 19371794, 19870831, 22172611, 23411183, 21295717, 17322474, 14410474, 13015048, 11974932, 11780014, 13857832, 17107178, 18341981, 16547899, 14013925, 12772877, 12576719, 13015838, 14646071, 16627806, 16112161, 12220727, 8493066, 8742684, 11815605, 13094554, 10510739, 6593974, 4731847, 5589061, 7497875, 8654030, 8448991, 7797821, 8370369, 10524376, 12142917, 10831962]
37339A0831962l538614k290099J066905K684166J134330j220562j760712p51393
37331F155983k29849r22402j505980p78208N45411R14358K88852J69234J070203
37322E707602J409052k7865j765310j574663J7732M19890r10774j527853J19150
37313A866961K185544K220588O45147k99901J56226Q48832P46133r2186j150305
37304G127039j790521j428756m11510n3253q08818j354888o81009J00647l03615
37295C95316q12937L80000K396031K556081M85197j362990j510352j049897q17689
37286F58760J59353K054249K697702O42580k156176k834605j378988P5022M51965
37277C69862K42003j44429m86391m1987J343807K206978J402358J37091K4432
$$ y = [10831962, 7293348, 5003249, 6070154, 8754320, 9888650, 8668088, 6907376, 6155983, 5926134, 5003732, 3497752, 2719544, 3264955, 4179313, 4468165, 4637399, 5707602, 7116654, 7088789, 5323479, 3748816, 3766548, 4186438, 3275664, 1747811, 1866961, 4052505, 6273093, 6918240, 6618339, 6774565, 7623397, 8369530, 8277344, 7127039, 5336518, 3907762, 3496252, 3442999, 2634181, 1279293, 598284, 698931, 395316, -417621, -37621, 2358410, 4914491, 5399688, 4036698, 2526346, 1476449, 658760, 818113, 2872362, 5570064, 6212644, 4056468, 1221863, -157125, -82103, 369862, 611865, 467436, -18955, -60942, 1282865, 3489843, 4892201, 5029292, 5053724]
37268E053724J85978j171154l163015l183859j048489Q72474J510118J888782
37260I44559K042322P56054j084145p60155J518641K075282l28979k145049r71035
37251B047495M00429p38831j775621N22569L393110J922489k478531l683874l76050
37242g66815K262242J100101o53848K54631J760931N82376k158503k942884j094207
37233a655976J012978J418786J0947k131483l157117j651974J313970K995570
37225a844299K642747K075171J844703J12870l039415l917028o71903K854386
37217E7232K394448l62383q46746J066026J628424J8998m56627J861020M415045
37208I775437M492923K314342o83435l366642m103466j891871Q64526K68942l188814
$$ y = [5053724, 5239702, 4068548, 905533, -2278326, -3326815, -2454341, -944223, 944559, 2986881, 3742935, 2658790, 1898635, 3417276, 5492558, 5163579, 3018530, 2047495, 2447924, 1709093, -66528, 456041, 3849151, 5771640, 3293109, -390765, -766815, 1495427, 2595528, 1941680, 2196311, 3957242, 4539618, 2381115, -561769, -1655976, -642998, 775788, 786735, -1344748, -4501865, -6153839, -4839869, -1844299, 798448, 2873619, 4718322, 4831192, 1791777, -2125251, -2797154, 57232, 2451680, 2089297, 1242551, 2308577, 3937001, 3955999, 3499372, 5360392, 9775437, 14268360, 16582702, 15899267, 12532625, 8429159, 6537288, 7401814, 7670756, 4481942]
37199D481942m382318r55555K819790K321377p05389j427899N59149J423501l05346
37190C829252j807075r39368P31635J101372O61145O89733O35107n07239j684856
37181B709706j036094R57826J826857P12092m47418m6892O89117j95648k028025
37172C141521k252513k28889J717317J455877m28757k038834k559389k142464
37164c336131p26540J483509L135027K860979R69562j093768k433231k787445
37156a928038j810653J68344J372955M39800j320155j452558R2682J100751P80185
37147b556687Q14428K064506K683550R71491j711793k613788j080469J088085
37139c40677K017498J305195j76557j020083l61015J035552J376116R0032j339953
$$ y = [4481942, 99624, -855931, 1963859, 4285236, 3579847, 2151948, 2711097, 4134598, 3829252, 2022177, 1082809, 1814444, 2915816, 3576961, 4266694, 4901801, 4394562, 2709706, 1673612, 2631438, 4458295, 5170387, 4722969, 4676077, 5365194, 5169546, 3141521, 889008, 660119, 2377436, 3833313, 3404556, 1365722, -1193667, -3336131, -4062671, -2579162, 555865, 3416844, 4386406, 3292638, 859407, -1928038, -3738691, -3570347, -2197392, -1757592, -3077747, -4530305, -4437623, -3336872, -2556687, -1742259, 322247, 3005797, 3977288, 2265495, -348293, -1428762, -340677, 1676821, 2982016, 2805459, 1785376, 1424361, 2459913, 3836029, 3926061, 2586108]
37130B586108j386416l55626M45063M27999j72380r34497j162494j60763J558550
37121H45544K373994J664844N88607q5929j206621k909005l028352k27394K762547
37112G78235K126242j392326l145641j150234J331729R82118q62233r23540Q15583
37103a440067J558473L67296n81009L62947J837389J635512k34264j905164k159115
37094e58002j364033l79436L23363N63400M67503O46662J480342K173574J561195
37085D914568L8422o16093R6764M14132q89853k250600j656154M7817O17202K43059
37075I59264Q34265J805620M07674k943298l792191k76771L171530K114065j100318
37066A179840j248523J353607J787270r45514k270902R0532K218812N65726k232494
$$ y = [2586108, 1199692, 844066, 1289129, 1717128, 1544748, 610251, -552243, -713006, 845544, 3219538, 4884382, 5472989, 5387060, 4180439, 1271434, -1756918, -1984312, 778235, 2904477, 1512151, -1633490, -2783724, -1451995, -469877, -1332110, -2255650, -1440067, 118406, 485702, -95307, 267640, 2105029, 3740541, 3506277, 1601113, -558002, -1922035, -2301471, -1978108, -1414708, -947205, -300543, 1179799, 3353373, 4914568, 4952990, 4336897, 4433661, 4847793, 3957940, 1707340, 51186, 99003, 716205, 959264, 1793529, 3599149, 4006823, 1063525, -2728666, -3005437, 166093, 2280158, 1179840, -68683, 1284924, 3072194, 2126680, -144222, -53690, 2165122, 2730848, 498354]
37057D98354j859410P71158J480051l56668j473985m48106M96289j95348q62978
37048a950643L40504K380076K767323O60604k385331l857572k304740R77683K550368
37039h21728O73291j898840j177290K265518L749396J232446j836398j996888
37031A89507o83951q84397j812061q08305J293583J229617q33415j120168J448551
37022a981039L179409J526140q45148n40057J210040J048648q44412j351627L29412
37013A731366J596402N72373j557990k674042j946898K55328K685983L407269
37005D069791J656739n64510q96731l09813j642474m468561m859375j271790K705528
36996e581196L339643J537856L14816J12303m11425r35707j78903J089701R52288
$$ y = [498354, -1361056, -589898, 890153, 533485, -940500, -1388606, -892317, -1087665, -1950643, -1610139, 769937, 3537260, 4197864, 1812533, -2045039, -4349779, -3372096, -821728, -148437, -2047277, -3224567, -959049, 2790347, 4022793, 2186395, 189507, -494444, -1378841, -3190902, -3999207, -2705624, -1476007, -2309422, -3429590, -1981039, 1198370, 2724510, 1879362, 1339305, 2549345, 3597993, 2753581, 1401954, 1731366, 3327768, 3900141, 2342151, -331891, -2278789, -2023461, 662522, 4069791, 5726530, 5162020, 4265289, 3955476, 2313002, -2155559, -7014934, -8286724, -5581196, -2241553, -703697, -388881, -276578, -688003, -1623710, -1802613, -712912, 239376]
36987B39376l36069q80706n84112j036709k071755j594427O12497J906503P55383
36978b990019q51998n19100J030659J389417J72155n77071O68936K865786L511500
36969D700265J476535j427208k178278j75411J849563J501770n1577m10348j40601
36960E144710j565762l911629l542006J42575K854950J431795j541025j802052
36952b788444M35900J614942M45622r66360q88346J45343J094251J621716J445862
36943B160486M36182n77196o70683l07990m75836q29233l86607M53182M88073
36934B90378j14872k29361L395m53408j123098l83023J557357K417790J138375
36925C103533p34397j597040j641174j365133l24800J444257K482746J718866
$$ y = [239376, -96693, -977399, -1561511, -2598220, -4669975, -6264402, -5651905, -3745402, -2990019, -3842017, -4361117, -3330458, -1941041, -1768886, -2345957, -1677021, 1188765, 4700265, 6176800, 4749592, 2571314, 2395903, 4245466, 5747236, 5695659, 5285311, 5144710, 3578948, -332681, -3874687, -3732112, -877162, 554633, -986392, -2788444, -2352544, -737602, -291980, -1258340, -2146686, -2001343, -907092, 714624, 2160486, 2596668, 2019472, 1348789, 1040799, 564963, -264270, -650877, -197695, 290378, 175506, -53855, -50460, -503868, -1626966, -2009989, -452632, 1965158, 3103533, 2369136, 772096, -869078, -2234211, -2559011, -1114754, 1367992, 3086858]
36917C086858L794j180794j418296r92634j27382N77411K27822r78549j617452
36908b419222r86856O7741Q24312J584985K200319J554222l74126j733235j397246
36899f79106n89870m85054j11724J463521K719148J874920Q7757k39377O29756
36890D669971L90602j249776k044060q39114Q79484J547361J343608Q29821j48028
36881E379869j337455j619938o77265K11938o2466r31468j140968l88326O32785
36872F6706J153391R30872M33065L84371O18359k5724j722260k532048r70040
36863a663308J113243O47851j916472k840439n68467J940657J648123m01540j253320
36854c293672l40134O09526N82011J4144o19849j039424o04347P87910J814558
$$ y = [3086858, 3090652, 1909858, 491562, -501072, -628454, -51043, 176779, -801770, -2419222, -3406078, -3338337, -2514025, -929040, 1271279, 2825501, 2451375, 718140, -679106, -1268976, -1754030, -1865754, -402233, 2316915, 4191835, 4279592, 4040215, 4669971, 5060573, 3810797, 1766737, 927623, 1807107, 3354468, 4698076, 5527897, 5379869, 4042414, 2422476, 1745211, 1957149, 1894683, 963215, -177753, -566079, 66706, 1220097, 2150969, 2584034, 2968405, 3586764, 3561040, 1838780, -693268, -1663308, -550065, 97786, -1818686, -4659125, -5227592, -3286935, -1638812, -2040352, -3293672, -3633806, -3024280, -2442269, -2428125, -3047974, -4087398, -4691745, -3903835, -2089277]
36845b089277J282186M075l71226K13703N75517M65764N52768N90638l65591j841377
36835i82820k023047m72106R70963Q13605j598K69685J503281J991855R48911
36826C018729n37617j170723j052810j026257j032215k35019J097815J156568
36818B18471q55905k664865j336864K348431M151610J774948k059163l336477
36810a759814j715577K01254J028470J415183J509695N37546r47641j062695L92775
36801d00804J161969j37830j785531j446253N02731J646897P11897j207849k098843
36792c053616q37290J850771L523317J992034j854892m070696j862361K721061
36784a591672M824130K415007j617275l276052j880767J79200R33850O00537K00353
$$ y = [-2089277, -807091, -803016, -1174242, -960539, -385022, 80742, 633510, 1224148, 858557, -982820, -3005867, -3477973, -2507010, -1693405, -1695003, -1425318, 77963, 2069818, 3018729, 2481112, 1310389, 257579, -768678, -1800893, -2035912, -938097, 218471, -637434, -3302299, -4639163, -2290732, 1860878, 3635826, 1576663, -1759814, -3475391, -3274137, -2245667, -830484, 679211, 1216757, 269116, -793579, -400804, 761165, 623335, -1162196, -2608449, -2105718, -458821, 253076, -954773, -3053616, -3890906, -2040135, 1483182, 3475216, 1620324, -2450372, -4312733, -1591672, 3232458, 5647465, 4030190, 754138, -1126629, -947429, -13579, 586958, 787311]
36775G87311m6001l81539n77631k66295K02378J09713n24627r34413p06226j79339
36765b516669K78987O21718O53926R9346o30608o46425J20668P74874R14243J058492
36755G28552J203167M59756j052431j646019o79179J8070q67402j480817L07423
36746c008880K795198K560441o690j086300L96951R88331j492519m076299l102016
36737f031783K84295K188128J630129Q34344Q67657L85616j190026k145800j045748
36728d223188J091561K198179J564455P9114j090526j396106r80460l46704J52504
36719b951171N35900Q28967P94947L01676l83709r11352j052150n13016O90245
36710b659663J535978Q00260r99966j765996o59774O38909O09138K85456J301486
$$ y = [787311, 741310, 359771, -217860, -484155, -281777, -172064, -696691, -1631104, -2337330, -2516669, -2237682, -1615964, -962038, -862692, -1493300, -2139725, -2019057, -1244183, -329940, 728552, 1931719, 2391475, 1339044, -306975, -986154, -968084, -1835486, -3316303, -3008880, -213682, 2346759, 2340069, 1253769, 1650720, 2639051, 1146532, -2929767, -6031783, -5747488, -3559360, -1929231, -1094887, -227230, 158386, -1031640, -3177440, -4223188, -3131627, -933448, 631007, 710121, -380405, -1776511, -2756971, -3103675, -2951171, -2415271, -1586304, -791357, -489681, -873390, -1784742, -2836892, -3349908, -2659663, -1123685, -323425, -1323391, -3089387, -3749161, -3110252, -2501114, -2215658, -914172]
36701i14172K825125K625714N22837j421905j889336j432488p44797J22707O73702
36692C67387J17262r93800j083135O5251R74930Q99761O82718O90653J9901j321975
36682D18953j603577j51018J014471J46408j268018p30604J275367K028074P58353
36673A888409m77772k57708K90895j55110q32971l32725R56869J374486L97719
36664B852092q18057j189753q66576m70292j35464K22129L84376K39851K55430
36655D73736P78406J192145P20428r7482Q025Q36071O67909r15562j927853j039038
36645F96785J4740p56371j873457n43052K264257K671418R9360j470368J57957
36636A261269J873637O78459j173466l18225J469394J64064l125692l310656L64272
$$ y = [-914172, 1910953, 4536667, 5059504, 3637599, 1748263, 315775, -429022, -306315, 367387, 484649, -509151, -1592286, -1527035, -552105, 347656, 1030374, 1721027, 1740928, 418953, -1184624, -1335642, -321171, -174763, -1442781, -2173385, -898018, 1130056, 1888409, 1410637, 1152929, 1443824, 1288714, 455743, 123018, 1079887, 2454373, 2852092, 2034035, 844282, -22294, -492586, -628050, -405921, -21545, 218306, 473736, 1252142, 2444287, 3164715, 3067233, 3075258, 3911329, 4579238, 3663676, 1735823, 696785, 711525, -44846, -1918303, -2461355, -197098, 2474320, 2573680, 1103312, 1261269, 3134906, 3813365, 2639899, 2321674, 3791068, 3955132, 829440, -2481216, -2116944]
36627b116944K866291J412608m73065N80413K167168P22374k027795j903304P91193
36618B018939K018423N72652q17301p71680j096894k504984k622235j16469K390747
36609i28802J897963o50075j953489q94615O71577R24876O0889n53069m1935J138221
36599c28459J594850N74536q69592j154934m42059j54293l14289M47399J800074
36590A153233J389809j054870k177159J06967K751001J870716j101232j610798
36582A327667P11386J557297r39723l159459j766195J255654J917191r7147j863849
36573a057178j603615l5938J507815K039617Q47587j449461k500982q52406J656852
36564a447709K092623M42755p46526m21615k10600j185904j864743o94306J180290
$$ y = [-2116944, 749347, 2161955, 1688890, 2269303, 4436471, 5158845, 3131050, 1227746, 2018939, 4037362, 4610014, 3792713, 3021033, 1924139, -580845, -3203080, -3319549, -928802, 969161, 319086, -1634403, -2529018, -1857441, -932565, -871676, -1424745, -1466680, -328459, 1266391, 1840927, 971335, -183599, -625658, -779951, -1094240, -646841, 1153233, 2543042, 1488172, -688987, -582020, 2168981, 4039697, 2938465, 1327667, 2039053, 3596350, 2656627, -502832, -2269027, -1013373, 903818, 806671, -1057178, -2660793, -2696731, -1188916, 850701, 1698288, 248827, -2252155, -3104561, -1447709, 644914, 1087669, 341143, -80472, -291072, -1476976, -3341719, -4036025, -2855735]
36555b855735J326858n47616k151641j617437K01118J037736K59330m05674N08979
36546d244082J873426J533420k32019p69292R49730K465094J377287j022361j790043
36537A41160p39124j92299r07666j145726m3005Q64158M01758l75412l65309l26371
36527b687836r96011j205251J18643J593301J371319M07401J056552K883688K847769
36518E389575J28009k109370j225343R14194P06890j848779l254110j645793P81482
36509b163245J232811R0701k76351P98708J625725Q39362q48810j799860j256275
36500a757234K99346J767978K113102J044226p11503k138309k742462k242634
36492d367490k67530K445169L382647Q90388k745680l417163q42585Q03800q30120
$$ y = [-2855735, -1528877, -2076493, -4228134, -5845571, -5644453, -4606717, -4347387, -4753061, -4244082, -2370656, -837236, -1069255, -1838547, -888817, 1576277, 2953564, 1931203, 141160, -597964, -790263, -1697929, -2843655, -2886660, -2022502, -1620744, -1996156, -2361465, -2687836, -3683847, -4889098, -4770455, -3177154, -1805835, -1398434, -341882, 2541806, 5389575, 5517584, 3408214, 2182871, 3097065, 3803955, 1955176, -1298934, -2944727, -2163245, -930434, -839733, -1116084, -317376, 1308349, 2147711, 1298901, -500959, -1757234, -1457888, 310090, 2423192, 3467418, 2755915, 617606, -2124856, -4367490, -4635020, -2189851, 1192796, 2083184, -662496, -4079659, -4922244, -4118444, -4948564]
36483d948564k525137n42023L275770M104342J298355j077700m52941J374400
36475E06502J928741J127329j80263j617545k167828n61804K021336K468493K92844
36466C817805j243371k25142Q14798p05054k830533k138274P30054K194433J138464
36457A553180l15978p53540q21576q25302j10126Q91964P37615m84981j080098
36448a208842n56176j86398m22724j82046P37777R90517K82971K74238J692413
36439A421730K699667J616769m88871j540283j382084j333183j769208j699443
36431b474906l65058J687885K874199J746010j260808l328875k009926J368612
36423a762867K945564J404764m90604l56550M67928j52085j304349p48882J157810
$$ y = [-4948564, -7473701, -8015724, -4739954, -635612, 662743, -414957, -867898, 506502, 2435243, 3562572, 3382309, 1764764, -403064, -964868, 1056468, 3524961, 3817805, 2574434, 2349292, 3164090, 2459036, -371497, -2509771, -1779717, 414716, 1553180, 1237202, 483662, -337914, -1163216, -1273342, -381378, 356237, -128744, -1208842, -1765018, -1951416, -2374140, -2556186, -1818409, -827892, -544921, -270683, 1421730, 4121397, 5738166, 5249295, 3709012, 2326928, 993745, -775463, -2474906, -2839964, -1152079, 1722120, 3468130, 2207322, -1121553, -3131479, -1762867, 1182697, 2587461, 2096857, 1740307, 2208235, 2056150, 751801, 2919, 1160729]
36414A160729K074111J253151o3414j089691j841990j681648r8744J437028R56885
36405B106417r20591j868238j483574j278327j289939J1122K111982K278514O2673
36396b69961j349706O1028K033109J767463R5858n10131J29749N22165K63306
36387B742880k59259j285179k429242j781263J089215L005353J189722k100602
36379A71625k460356K55561K228865J687691M79197k36285j454537k820203k004921
36370d153363R42657K554892J111069p64050p05873j52272p22486p03465J417451
36361a175440L035379J169764k140661k561698p1979J599222J211764J047019
36353B113370J829884J305429j182059k830225j742348J75631N03794k66388n00544
$$ y = [1160729, 3234840, 4487991, 4424577, 3334886, 1492896, -188752, -287496, 1149532, 2106417, 1185826, -682412, -2165986, -3444313, -4734252, -4723130, -2611148, -332634, -269961, -1619667, -1558639, 474470, 2241933, 2337791, 1827660, 1957409, 2479574, 2742880, 2483621, 1198442, -1230800, -3012063, -1922848, 1082505, 2272227, 171625, -2288731, -2033170, 195695, 1883386, 2362583, 2126298, 671761, -2148442, -4153363, -3210706, -655814, 455255, -308795, -1014668, -1166940, -1889426, -2592891, -1175440, 1859939, 3029703, 889042, -1672656, -1744635, -145413, 1066351, 2113370, 3943254, 5248683, 4066624, 1236399, -505949, -330318, 173476, -92912, -593456]
36344e93456l07648o45371j237999j189979m73968M39007J223121J192616k09808
36335a803485j687415r60047J586355K541918L77696j794857p16349J988369K349541
36326A881726J28679j155147K02035J890635J425838o03336k066465j987539p18412
36317a001986R50345J887502J132518p53681j826319j047005L54237N19902o83111
36308d67598j681651j210372L18188J459830J429295Q30018N00964J25542r86395
36299C17821j901207o90017K177556L190632M45463k864015k432761Q25649K019270
36290A088391l15024k125424l98507K142557J574648j041755j696695R8625R55678
36281B82494o17970j973546p62902J517856K101613Q31745m66530r73034j162829
$$ y = [-593456, -901104, -1546475, -2784474, -3974453, -4448421, -4009414, -2786293, -1593677, -1803485, -3490900, -4450947, -2864592, -322674, 55022, -1739835, -2456184, -467815, 1881726, 2010405, 855258, 1057293, 2947928, 4373766, 3770430, 1703965, -283574, -1001986, -51641, 1835861, 2968379, 2214698, 388379, -658626, -304389, 215513, -467598, -2149249, -3359621, -3041433, -1581603, -152308, 677710, 1178674, 1304216, 317821, -1583386, -2273403, -95847, 3094785, 3540248, 676233, -1756528, -930879, 1088391, 773367, -1352057, -1750564, 391993, 1966641, 924886, -771809, -673184, 282494, -335476, -2309022, -3071924, -1554068, 547545, 1379290, 912760, -60274, -1223103]
36272a223103r66264K66370K060464K819421J909690M98191j60145k48366n85924
36263D370334j142309j249691r02223q77703j449220j740017q92079M83584Q09024
36254b590300k79757j003605M11400K962744L629177J356275j190880j130738
36246B164316O36218J005367m82506j194581n3390N96449p33487j635779J94746
36237D97353K392081J150298k389960l398458p80820J291883K52553j080327J40166
36228a925231J808924P32141j692767j856076O4007R27189K97528O50283K144379
36219A150377J898603o55455k104645n21867J277230M48336j233768o74963J121361
36210G05209Q01472j557395k475224p18592Q92648K30978q92047p4916J574797
$$ y = [-1223103, -2189367, -1922997, 137467, 2956888, 4866578, 5364769, 5204624, 4956258, 4370334, 3228025, 1978334, 1076111, 198408, -1250812, -2990829, -3882908, -3399324, -2590300, -2870057, -3873662, -3462262, -499518, 3129659, 4485934, 3295054, 2164316, 2800534, 3805901, 3323395, 2128814, 2075424, 2671873, 1938386, 302607, 497353, 2889434, 4039732, 1649772, -1748686, -2529506, -1237623, -985070, -2065397, -1925231, -116307, 615834, -1076933, -2933009, -2869002, -1941813, -1644285, -994002, 1150377, 3048980, 2393525, 288880, -232987, 1044243, 1492579, 258811, -416152, 705209, 1506681, -50714, -2525938, -3244530, -2351882, -2120904, -3012951, -3087867, -1513070]
36201a513070J302433o50198j174790R00850K735202J384070j974503l562971
36193b552977j946724N79670J549241J161423O96111K1343j481655k693215j809508
36184f476291O14891J952946J196905K32069O28454J277511O74504k76674J49185
36175b6500J272073Q25652j331109k707665j737049K26989J210905J105472P44158
36166d17074O8480j207188k115510j402598M12278J537435J352135Q49323O39909
36157b82810K03100m91760m04159O12645R11391m76182j843951j111461Q94694
36148a988493J594829M69635o51681q52548j003056j162126j07244J610728J298849
36139g91107j385583k632902N7309L264660K249446j666138k861179N6258K403849
$$ y = [-1513070, -210637, -860835, -2035625, -1134775, 1600427, 2984497, 1009994, -2552977, -4499701, -3920031, -2370790, -1209367, -513256, -491913, -1973568, -4666783, -6476291, -5861400, -3908454, -2711549, -2479480, -1851026, -573515, 100989, -175685, -26500, 1245573, 2071225, 740116, -1967549, -3704598, -3477609, -2266704, -1161232, -417074, -348594, -1555782, -3671292, -5073890, -4661612, -3124177, -1772042, -922719, -282810, -79710, -571470, -975629, -362984, 548407, 72225, -1771726, -2883187, -1988493, -393664, 75971, -575710, -1428258, -2431314, -3593440, -3700684, -2089956, -791107, -2176690, -4809592, -4752283, -1487623, 761823, -904315, -3765494, -3709236, -1305387]
36130a305387R44907j460821r84596J277861J819423M55061j76469N77220P17621
36121A864820o01991j786005j675147j146116j119538j035507k45869O60663R06643
36112d178047P15795N95157M55036K62038N56215J345779J434672J16280j196373
36103A06552o46274J065187J257544p75931k362945j180550J289951J932874M94371
36094A180779n07198O3645O19379L4743n58573k27776N5933l09100m6082J256138
36084A561888J405770o93061k002849L75768L775128L257481o50865k534068m79934
36075D015258J375282o209k016585j517077L0110n6579q54493k77567N60060m23202
36065H28998j849724r84448J195486J319186p83581j922394p35277P92289J116657
$$ y = [-1305387, -360480, -1821301, -2805897, -1528036, 291387, 746448, 569979, 1147199, 1864820, 1262829, -523176, -2198323, -3344439, -4463977, -5499484, -5745353, -5084690, -4178047, -3462252, -2867095, -2412059, -2150021, -1593806, -248027, 1186645, 1302925, 106552, -539722, 525465, 1783009, 1007078, -1355867, -2536417, -1246466, 686408, 1180779, 673581, 737226, 1356605, 1391348, 832775, 604999, 660932, 351832, 305750, 1561888, 2967658, 2274597, 271748, 647516, 4422644, 7680125, 7029260, 4495192, 4015258, 5390540, 5384331, 3367746, 1850669, 1880779, 1824200, 969707, 692140, 1252200, 828998, -1020726, -2005174, -809688, 509498, -274083, -2196477, -2931754, -2139465, -1022808]
36056a022808Q81213N09724n57165j594081p75458J450516K126518Q1746k166718
36047a066513k085785l66796Q48633R29408N46506J83704J10051M96354P31656
36038C27218J4714r06928l76239J296477J728116M5674j637085j422697j31581
36029a062331P07764J189956J731828J484976j6084j318453j129164m25259n63400
36020E99833q31812n0215Q43234K99840q63885o62354O37742J027817K82137J62355
36010A444692J058826J182994l49077k065646k540682k084380j235669K14629
36002d374313J587365R81972j638177k931139j80975M264324N271154J536817
35994D517028k633874k946109l34666J070980k16796j597125o82617J277080J544314
$$ y = [-1022808, -141595, 368129, -189036, -1783117, -2558575, -1108059, 1018459, 1100205, -1066513, -3152298, -3519094, -2670461, -1741053, -1194547, -1010843, -900792, -404438, 327218, 341932, -564996, -941235, 355242, 2083358, 2129032, 491947, -930750, -1062331, -354567, 835389, 2567217, 4052193, 4036109, 2717656, 1588492, 1163233, 599833, -231979, -282194, 561040, 860880, -3005, -665359, -27617, 1000200, 1282337, 1444692, 2503518, 3686512, 3337435, 1271789, -1268893, -3353273, -4588942, -4374313, -2786948, -1804976, -3443153, -6374292, -6555267, -2290943, 2980211, 4517028, 1883154, -1062955, -1397621, -326641, -543437, -2140562, -2823179, -1546099, -1785]
35985a785k063r27517p9897P59950j71237j710948j380615R27262K639208J855450
35975A907808m88642k210796k370227j466824j95557R31404J300262P13145O9549
35966a809878M75270J552311J656057J57411j471583j561387m19285L82483K86836
35957g51765P2273J94214K51290K12640P06516J608726J707471N01729q78322
35948C624772j343512j219889j085679o46177N8500j25009j383598j628240M89136
35939c259696K582061J472786j626645k304679N47862K966576J725980j299832
35931H04413k435941j253496l945J48232q4269k0658L29394Q60961J153641M39257
35921f2411r90385j406976J9911J694165J828967R41901M84087L15295m22236
$$ y = [-1785, -3848, -931365, -1011262, -251312, -422549, -2133497, -3514112, -2586850, 52358, 1907808, 1419166, -791630, -3161857, -4628681, -4824238, -3892834, -2592572, -1879427, -1809878, -1334608, 217703, 1873760, 2031171, 559588, -1001799, -1421084, -1038601, -751765, -679492, -485278, -233988, -21348, 685168, 2293894, 4001365, 4503094, 3624772, 2281260, 1061371, -24308, -670485, -611985, -736994, -2120592, -3748832, -3259696, -677635, 795151, -831494, -3136173, -2588311, 378265, 2104245, 804413, -1631528, -2885024, -2888969, -2740737, -2825006, -2845664, -2516270, -1655309, -501668, -62411, -1052796, -2459772, -2439861, -745696, 1083271, 2025172, 2509259, 2824554, 2402318]
35912B402318j037021k65563J135406J152312l64063j500051j155669j80133L52636
35903E40172J99075o51375j826789j936994m036K482721K910002J037916q14021
35894A936671j175462q66375p75704n70363k71225p68048j772107j489913M14304
35885e338222J684798Q48778l16327L67158J922206J843557K6779j402987j426231
35876a790491q33209j9822J364233K514917J791421m24661j520428l78113Q03600
35867A507447n3494j540352j039051R11250J289970o55453k202477j400799Q0335
35858c102624q2427j151667q33016Q57565J835506J463238J148080J408807J013156
35849B556618l65962j164930o35317j83150o61731o44531Q01205J813991N74913
$$ y = [2402318, 1365297, 1099734, 2235140, 3387452, 3023389, 1523338, 367669, 187536, 540172, 739247, 87872, -1738917, -3675911, -3679947, -1197226, 1712776, 2750692, 1936671, 761209, -105166, -880870, -1451233, -1722458, -2490506, -4262613, -5752526, -5338222, -3653424, -2804646, -3120973, -2753815, -831609, 1011948, 1038727, -364260, -1790491, -2623700, -2643522, -1279289, 1235628, 3027049, 2602388, 1081960, 703847, 1507447, 1453953, -86399, -1125450, -214200, 1075770, 420317, -1782160, -3182959, -3102624, -3185051, -4336718, -5169734, -4312169, -2476663, -1013425, 134655, 1543462, 2556618, 2190656, 1025726, 390409, 207259, -454472, -1099003, -297798, 1516193, 2091106]
35840B091106j345994j223981N34115J266501L65505l44801j42866k22272q66973
35831A10340p64644L52308J015241N90937J24570M6117m96530j386758j228225
35822a636644j07747M5193j060351j095349Q78439K307862J147766p09399o21977
35813h52207M74620M9690j401112j212628P59969J760069N51070p56494n5160
35804f82183J819087K529891J225580p80094j576113n40318R07310O51808j520108
35795B034860l309567k642093j80681J855930K362540J575194j81330k161647
35787f46794k588041o07317J668300J449646o00131j096166R33939K402137P75455
35778A691028k077830k580972m31923J352391Q28637n45423m14084J125425J816048
$$ y = [2091106, 745112, -478869, 55246, 1321747, 1687252, 1342451, 1199585, 977313, 110340, -654304, -301996, 713245, 1304182, 1428752, 1474869, 978339, -408419, -1636644, -1744391, -1699198, -2759549, -3854898, -2976459, -668597, 479169, -230230, -852207, -377587, -327897, -1729009, -2941637, -2181668, -421599, 129471, -627023, -682183, 1136904, 3666795, 4892375, 4112281, 2536168, 1995850, 2903160, 3554968, 2034860, -1274707, -3916800, -4097481, -2241551, 120989, 1696183, 1514853, -646794, -3234835, -3842152, -2173852, -724206, -1324337, -2420503, -1486564, 915573, 1691028, -386802, -2967774, -3399697, -2047306, -1218669, -1764092, -2178176, -1052751, 763297]
35769G63297M44432j473110j741252l87272O68524N35937K95180O22030L80115
35760A07881j097718j995734m18828K179822K513467K12311j518727n51760J228914
35751F59628R52210j069107k027001o21692J432814J908686P20235m36413l27948
35742A191412O78416J495767J528991P61062n64564j654158j337900K75215J020789
35733C395030o39514k645283j628800J696184K738235j73091k797513j308555
35725a363307J764866J699527r60892j871489k46568O08366k13652K05527K546637
35716B169015L111736r244l199398k718437j17632J038403O95652Q51366J078599
35707B900060l42525k285974j893025O23125J917966M67023j461384j365670M15948
$$ y = [763297, 1207729, -265381, -2006633, -2393905, -1725381, -1189444, -894264, -272234, 107881, -989837, -2985571, -3404399, -1224577, 1288890, 1501201, -17526, -569286, 659628, 1611838, 542731, -1484270, -2105962, -673148, 1235538, 1955773, 1519360, 1191412, 1869828, 3365595, 4894586, 5655648, 5091084, 3436926, 2099026, 2374241, 3395030, 2755516, 110233, -1518567, 177617, 2915852, 2742761, -54752, -1363307, 401559, 2101086, 1140194, -731295, -977863, -369497, -583149, -377622, 2169015, 5280751, 5271507, 2072109, -646328, -763960, 274443, 970095, 1821461, 2900060, 2557535, 271561, -1621464, -998339, 919627, 1386650, -74734, -1440404, -1024456]
35698a024456J964802K199995J218764l53282j575505j684773q97097j38133J22504
35689a67181J63760K41470K40420R3456j8251P9602L50428M65082l8196j036616
35679C73974j461547n63896O41009N34139n27797n36120R69552K030939J305748
35670B766001r8823q43225j283469j834482j512393J61563J642618J553967P28182
35661A279939L96370K03913k34903L2256J080230R32636r39573j593667P76473
35652A933674K909654J175491k194162k474413k67870k04807k537167k357178
35644d016778J913325N279109L657202m01124k275966j468999k73252L11356L11884
35635C036757p71200k425788k440050k78960J213984m9276j959868j538059N50648
$$ y = [-1024456, 940346, 3140341, 4359105, 4005823, 2430318, 745545, -151552, -289685, -167181, -3421, 238049, 478469, 571925, 553674, 633276, 983704, 1448786, 1410590, 373974, -1087573, -1651469, -1010460, -476321, -1004118, -1540238, -570686, 1460253, 2766001, 2667178, 1823953, 540484, -1293998, -2806391, -2644828, -1002210, 551757, 1279939, 1676309, 1880222, 1645319, 1677575, 2757805, 3690441, 2750868, 1157201, 1933674, 4843328, 6018819, 3824657, 1350244, 1082374, 877567, -1659600, -4016778, -2103453, 3175656, 6832858, 6431734, 4155768, 2686769, 2413517, 2724873, 3036757, 2265557, -160231, -2600281, -2879241, -1665257, -1714533, -3674401, -5212460, -4661812]
35626d661812J633570J240587P82690N97018P9331m86514n99571p31827q68969
35617c015497K68334K387776K435017q29876l504582j594585K540519L228143
35609A915249j54877k619235j220519J379673J824675M25464q34133j330247j219522
35600a833472m33967L52101k4573r65659m01720J721989K728969J195307p81805
35591A557170q29206L78495P97332J68777l79746m66365m00668q4416M67048M29578
35581A637999o19100j613232j316468N8492J504761K513298K742487J582757o55422
35572E835572k112836j387566M65178J203567J69274j285196j653609o36018Q48526
35563A446892J271529j64046k093424j942029P17198K944768J982278j033035
$$ y = [-4661812, -3028242, -1787655, -1004965, -407947, -328616, -815130, -1414701, -2146528, -3015497, -2747163, -359387, 2075630, 1245754, -2258828, -3853413, -1312894, 1915249, 1760372, -858863, -2079382, -699709, 1124966, 1550430, 716297, -613950, -1833472, -2267439, -1915338, -1939911, -2905570, -3307290, -1585301, 1143668, 2338975, 1557170, 727964, 1106459, 1903791, 2072568, 1692822, 1226457, 825789, 741373, 1208421, 1637999, 1018899, -594333, -1910801, -1852309, -347548, 2165750, 4908237, 6490994, 5835572, 3722736, 2335170, 2800348, 4003915, 4173189, 2887993, 1234384, 598366, 1446892, 2718421, 2554375, 460951, -1481078, -763880, 2180888, 4163166, 3130131]
35555C130131k695490j916144p00551n01506j86710J494750L270037K772717q0281
35546D586953k596061k362766M4770J897667J472207l08415j479808j443492j012883
35537a201828o71416q5168P12821J036825P57667N22673M21476j27634p16038
35528F49378O244J729814K002429q8249j780135m89492J899470J597943j262036
35519D265366k818032j360825M87314K31568j082924j379419p81170m51712k68163
35510c157997L67138R32970Q34895P46347J239500J369889L33718p35306m62990
35501A468164M49200N23971k5980j94887l73341j272415j753654m93333J057244
35492f15031N21105j161522r22561J102306J493523n18714j396803O95869K477148
$$ y = [3130131, 434641, -1481503, -2182054, -2683560, -2870270, -1375520, 1894517, 4667234, 4586953, 1990892, -371874, -327104, 1570563, 3042770, 2734355, 1254547, -188945, -1201828, -1873244, -1958412, -1245591, -208766, 548901, 1071574, 1493050, 1365416, 649378, 655622, 2385436, 4387865, 4299616, 2519481, 2029989, 3929459, 5527402, 4265366, 1447334, 86509, 573823, 805391, -277533, -1656952, -2438122, -2889834, -3157997, -2790859, -1857889, -1022994, -276647, 962853, 2332742, 2666460, 1931154, 1468164, 1917364, 2441335, 2415355, 2220468, 1847127, 574712, -1178942, -1672275, -615031, -93926, -1255448, -2178009, -1075703, 417820, -100894, -1497697, -801828, 1675320]
35483A675320R44810j533417j203776R41299J268545l02434p60206M58740R36513
35474B425394r813l80052M19204M98850p67719j521158q55939j51146l4798O33321
35464B56144J694544J105749j173247k201936p07983P40794K15014m93290K77429
35455b86782P72162m90772j251531M33744J835761j90822l174378k424796J280070
35446c497344K913573J221997j33690N47151O66175j128817k333759j315554n1366
35437c111634o5186J79863J525584J746172l44673k029317r74646Q49335Q31229
35428a393273K99645J638158L305326K095709j127329k381929p06329P64128K3763
35419B517869j235858j102042k87419j44609k85558K01179Q15767N19299m23984
$$ y = [1675320, 2620130, 1086713, -117063, 824236, 2092781, 1790347, 1030141, 1488881, 2425394, 2415581, 2035529, 2454733, 2953583, 2185864, 664706, -191233, -342379, -377177, 256144, 1950688, 3056437, 1883190, -318746, -1026729, -285935, -70921, -564211, -286782, 485380, -5392, -1256923, -823179, 1012582, 821760, -2352618, -4777414, -3497344, -583771, 638226, 504536, 1051687, 1717862, 589045, -1744714, -3060268, -3111634, -3176820, -2996957, -1471373, 274799, -69874, -2099191, -3073837, -2224502, -1393273, -1093628, 544530, 3849856, 5945565, 4818236, 2436307, 1729978, 2494106, 2517869, 1282011, 179969, -107450, -252059, -537617, -336438, 479329, 998628, 574644]
35410E74644q38843m32330r8924m17531o44728K47022J758459J997290K07161
35401B352220j683885j355693N57892J232017k64292j780414j503233l36560J77121
35392b604827J91488L85395L57021j97611m17401j3957k93066j652424j992203
35383f237585J27722K530101K297262K16299n32480Q00385J881791R76206j243587
35374H16114l172625l431691j293554J901393K863272L58296k212951j174344
35366e346090J908381K712234R57552K56719J606132J995637J55841j198721m34514
35357B613171J67628j159546k375357j405398J90833K09337m03877K75706J563894
35348c23609J695359R51857M71069k45786j850687k859227j744492Q7519L33694
$$ y = [574644, -264199, -696529, -795453, -1212984, -1857712, -1610690, 147769, 2145059, 2352220, 668335, -687358, -129466, 1102551, 838259, -942155, -2445388, -2781948, -2604827, -2413339, -2027944, -1670923, -1868534, -2285935, -2299892, -2592958, -4245382, -6237585, -6109863, -3579762, -1282500, -1066201, -1598681, -798296, 1083495, 2059701, 816114, -2356511, -5788202, -7081756, -5180363, -2317091, -1958795, -4171746, -5346090, -3437709, -725475, 232077, 488796, 2094928, 4090565, 4246406, 3047685, 2613171, 2780799, 1621253, -754104, -2159502, -1968669, -1759332, -2163209, -1887503, -323609, 1371750, 2323607, 2794676, 2548890, 698203, -2161024, -3905516, -3817997, -3484303]
35339c484303l99110J33305J625906J567005m37731j760029o67984J317500J861392
35330b44049Q71982J27242P47719J796405J341015j055008l210783k690077j71572
35321b487126J254390M49547l97583L28067J070459K20455p42262J50670J677607
35312A524224J396320k12250p44242O0144M28769o0801l93463p72359k045974
35303h19632k908289j218830J895101K878873J069478m76330j75445m0960j185039
35294i81073j154550J664062M214982K763954j285020l119574j194725J127504
35286B035560P07636j431460k291071j066985M41055P72274N01177O80213Q80817
35277A229216N9403j161981r22558Q13728J621406J72527j552501j443502p34238
$$ y = [-3484303, -3883413, -3750108, -2124202, -557197, -994928, -2754957, -3422941, -2105441, -244049, 627933, 755175, 1502894, 3299299, 4640314, 3585306, 374523, -2315554, -2487126, -1232736, -783189, -1180772, -852705, 217754, 438209, -304053, -153383, 1524224, 2920544, 2708294, 1964052, 2024196, 2452965, 2392164, 1998701, 1226342, -819632, -3727921, -4946751, -3051650, -172777, 896701, 420371, 244926, 203966, -981073, -2135623, -471561, 3743421, 6507375, 5222355, 2102781, 908056, 2035560, 2743196, 1311736, -979335, -2046320, -1605265, -832991, -331814, 348399, 1229216, 1288619, 126638, -795920, 17808, 1639214, 1811741, 259240, -1184262, -1918500]
35268a918500j624864k937617j630232J924752L869730K393942n5668q32238j97212
35259a007907N95499J263826J332364q0624j975809j847501K63365J158134m42363
35250g41016j577820m6627J732507R31705p48388j96734J524088J098135j112281
35241H63569j635201K10326J346555Q4471j600731j651635n89526K45766M59077
35232b267329j05209j472212k432622j595867J30761M83849m85117l19338J761778
35223f301306L427385K763413P26222r04359j639730j381095J38695J865603J793223
35214D88051N8659p88383J07615L64691j277886k126450J66680L101559K694556
35205B789092m18956k118928j098388k8141n14239q67728J62182R27096j01273
$$ y = [-1918500, -3543364, -6480981, -8111213, -6186461, -2316731, 77211, 21543, -810695, -1007907, -412408, 851418, 2183782, 2103158, 127349, -1720152, -1456787, -298653, -741016, -2318836, -2365463, -632956, 298749, -449639, -646373, 877715, 1975850, 863569, -771632, -561306, 785249, 869720, -731011, -2382646, -2972172, -2726406, -2267329, -2372538, -3844750, -6277372, -7873239, -7742478, -7258629, -7743746, -8063084, -6301306, -2873921, -110508, 615714, -288645, -1928375, -3309470, -3170775, -1305172, 488051, 546710, -241673, -134058, 230633, -1047253, -3173703, -3007023, 94536, 2789092, 2370136, 251208, -847180, -875321, -1389560, -2257288, -2095106, -1168010, -1269283]
35196a269283j520979j316783r1542K32822l21781j20483J065324J587062O32438
35187a123205m37134k05143O41740L94873j043525j821396n66647J721043K772733
35178C33339J640806m53438j765604j832625j357112q36304J3418J393225K491443
35169c72852K027247l3468j770824j159589J274212K633447J095163j753504l009791
35160a069959k009678l74181P49947J521322J758228P96929o36104p23464M95603
35151E08643P91230n47521j167347M82138K222436J518744l75074o46844M18083
35142C204488M83235l79115k10024M92865o67537k899795k371410J290485L259527
35133B202719O56116k734417k242790O70490J382932m37030j186810J15487O64367
$$ y = [-1269283, -2790262, -4107045, -4198587, -3965765, -4287546, -4408029, -3342705, -1755643, -1123205, -1560339, -1765482, -1123742, -728869, -1772394, -3593790, -4160437, -2439394, 333339, 1974145, 1520707, -244897, -2077522, -3434634, -4270938, -4257520, -2864295, -372852, 1654395, 1620927, -149897, -1309486, -35274, 2598173, 3693336, 1939832, -1069959, -3079637, -3453818, -2703871, -1182549, 575679, 1372608, 736504, 13040, 508643, 1299873, 752352, -414995, 67143, 2289579, 3808323, 3433249, 2786405, 3204488, 3687723, 3308608, 3098584, 3591449, 2923912, 24117, -2347293, -1056808, 2202719, 2858835, 124418, -2118372, -1447882, -64950, -501980, -1688790, -1573303, -908936]
35124i08936o28129j149628N80865K029287P61596j457500j269428J331740L132865
35115B422732J987263r49171k949503k384829P9851K066871J606801o93558k152910
35106i66453j237997N56775R01904j48519m52088J025796K689468K360972J4353
35097D744211k150288k161406l56165J199736J158515J57217n98099j142174k119033
35088a267486k914410k065630K60451J838509J241967j95869l92177N51071Q20268
35079b123306k64906j330700q94103Q05661K128883J645791n19562k522224k282644
35070e357110K60664K686980K579603K63540j647406j277063O90690K178806J956551
35061B335255N35128o16424m65765O99931J575337J065882p29333k612441l153546
$$ y = [-908936, -1537065, -2686693, -2105828, -76541, 685055, -772445, -2041873, -710133, 2422732, 4409995, 3460824, 511321, -1873508, -1793657, 273214, 1880015, 1186457, -966453, -2204450, -1647675, -745771, -894290, -1346378, -320582, 2368886, 4729858, 4744211, 2593923, 432517, 76352, 1276088, 2434603, 2591820, 1993721, 851547, -1267486, -4181896, -6247526, -5987075, -4148566, -2906599, -3102468, -3494645, -2943574, -2123306, -2388212, -3718912, -4613015, -3807354, -1678471, -32680, -552242, -3074466, -5357110, -5096446, -2409466, 170137, 433677, -1213729, -2490792, -1800102, 378704, 2335255, 2870383, 2253959, 1788194, 2488125, 4063462, 5129344, 4400011, 1787570, -1365976]
35052a365976j715678P92016K276907J391868p72785j779796p92599O05562Q15267
35043e45214J22647m47626p90073j170647j218313o94779k48929k10586K16029
35034d987491J227709J315579k71523j383775J92139K782143K733800j21291k152431
35025f65141j312945M53280J037662J113211J630866J340294p75817k746328k005844
35016a930762P05736K311976J535353j04722r53597q65409l30274K81286M32841
35007A082428l03613j434157j858622j119787J68077J006263Q33449O2582q3996
34998a647376R71901J889446R06943j227837j733920P7226J368121o0233k300203
34989a755932k208469n0098J335989Q90557R0944q4793k61761p77802j001616
$$ y = [-1365976, -3081654, -2289638, -12731, 1379137, 606352, -1173444, -1966043, -1360481, -545214, -422567, -870193, -1660266, -2830913, -4049226, -4744005, -4992934, -5203520, -4987491, -3759782, -2444203, -2715726, -4099501, -3907362, -1125219, 1608581, 1487290, -665141, -1978086, -1524806, -487144, 626067, 2256933, 3597227, 2821410, 75082, -1930762, -1225026, 1086950, 2622303, 2517581, 1563984, 698575, 368301, 649587, 1082428, 778815, -655342, -2513964, -3633751, -3465674, -2459411, -1625962, -1563380, -1647376, -675475, 1213971, 2120914, 893077, -840843, -763617, 604504, 544271, -1755932, -3964401, -4014499, -2678510, -1787953, -1697009, -1781802, -2043563, -2821365, -3822981]
34980c822981p14147l38990J51639Q93278J098677K30026l86745O81881K184083
34971b3279J719882l07762j166094j63335N56708n1502m06546M48628J120526
34962A727226N82440j65494m07168r60622j809048j325732N55112J266401l86969
34953i23854j935495j108108P46143J490436J659591K253178J837842o54590k623291
34944G41852j314598J179898P88264j937900k738753o22064R14180N285r11894
34935c895730J62190J496630J002914l90176q35614m79369l27982l09959j61343
34926c738439l75625q27971k93381J360530K394421J845071R27659N49043k39630
34917A601678j678196j686240Q39925L217493K282197r22399k619221j528734
$$ y = [-3822981, -4537128, -4876118, -4724479, -3831201, -2732524, -2502498, -2889243, -2207362, -23279, 1696603, 1388841, 222747, 59412, 616120, 564618, 158072, 606700, 1727226, 2309666, 2144172, 1737004, 776382, -1032666, -2358398, -1803286, -536885, -923854, -2859349, -3967457, -3221314, -1730878, -71287, 2181891, 4019733, 3365143, 741852, -572746, 607152, 1395416, -542484, -3281237, -3903301, -2989121, -2983836, -3895730, -3733540, -2236910, -1233996, -1624172, -2459786, -2939155, -3267137, -3577096, -3738439, -4114064, -4942035, -5235416, -3874886, -1480465, 364606, 1292265, 1841308, 1601678, -76518, -1762758, -922833, 2294660, 4576857, 3654458, 1035237, -493497]
34909d93497K01993P90111P13859P55866P00179N19324P88802J197857L63921
34900E538415j961327l807637l163431n18122J671577J770445N45344j12914M03552
34891C65902Q65295K05796p46362n05148O73991J178516O66450L99231O79453
34882C783124J88148j276640j780390m64229N25017n69836j841458n62575K197366
34873A98527K890205O43035j922251k715650k177166j257862j18514Q43537J027892
34864b588247R76475J550238J802697J45707k325295k508992K04608K896552L296632
34855C450375K223686R94714n84900k252170k265339l30818R47959k58071j997753
34846g2317j466178Q91733K496887K285140J011890o34288j999988j936308n40254
$$ y = [-493497, -291504, 498607, 1212466, 1968332, 2668511, 3187835, 3976637, 5174494, 5538415, 3577088, -230549, -3393980, -3912102, -2240525, -470080, 75264, -37650, 365902, 1231197, 1436993, 690631, 185483, 859474, 2037990, 2704440, 3103671, 3783124, 3971272, 2694632, 914242, 450013, 975030, 405194, -1436264, -1998839, 198527, 3088732, 3731767, 1809516, -906134, -3083300, -4341162, -4459676, -3616139, -2588247, -1611772, -61534, 1741163, 1886870, -438425, -2947417, -2742809, 153743, 3450375, 5674061, 6668775, 6083875, 3831705, 1566366, 1235548, 2183507, 1925436, -72317, -1538495, -646762, 1850125, 4135265, 5147155, 4512867, 2512879, 576571, 36317]
34837C6317m0488j620107k863718j107731K037972K748451O79828q82614k76692
34828a288782P10056O23901M97609J155855J352289J38719j200304j189204m08174
34819C91965k44077p47420r85813m83674N89502J687042J829760N15192r49972
34810A602505o16286J113561J560506k87252j948623j006922J324258K101651
34802C843398P95733n80588p18105k94157k41992n74593j083701j746774k116940
34793b717719j455886Q8963J257457J107571K15765K0987J063277K142665J536373
34784C259453p90258k670825k126065Q5391J394545P93334j53071K3687O32501
$$ y = [36317, -4171, -1624278, -4487996, -5595727, -3557755, -809304, -129476, -1012090, -1288782, -578726, 45175, 542784, 1698639, 3050928, 3189647, 1989343, 800139, 391965, 147888, -599532, -1585345, -2069019, -1479517, 207525, 2037285, 2552477, 1602505, 986219, 2099780, 3660286, 3373034, 1424411, 417489, 1741747, 3843398, 4639131, 4058543, 3340438, 3046281, 2804289, 2229696, 1145995, -600779, -2717719, -4173605, -4084642, -2827185, -1719614, -1503849, -1482862, -419585, 1723080, 3259453, 2469195, -201630, -2327695, -2242304, -847759, -54425, -207496, -183809, 448692]
$$ [...]
##END NTUPLES=NMR SPECTRUM
##END=
