##TITLE=31Pdec_75-2024
 CDCl3, 24 sc
 11.9.2024
##JCAMPDX= 6.0         $$ Bruker NMR JCAMP-DX V2.0
##DATA TYPE= NMR SPECTRUM
##DATA CLASS= NTUPLES
##ORIGIN= UXNMR, Bruker Analytische Messtechnik GmbH
##OWNER= root
$$ XWIN-NMR		Version 3.5
$$ Wed Sep 11 14:08:52 2024 Russian Standard Time (UT+4h)  she@DPX200
##.OBSERVE FREQUENCY= 81.013821
##.OBSERVE NUCLEUS= ^31P
##.ACQUISITION MODE= SIMULTANEOUS
##.ACQUISITION SCHEME= undefined
##.AVERAGES= 24
##.DIGITISER RES= 17
##SPECTROMETER/DATA SYSTEM= spect
##.PULSE SEQUENCE= zgpg30
##.SOLVENT NAME= CDCl3
##.SHIFT REFERENCE= (INTERNAL, CDCl3, 0, 198.062)
##AUDIT TRAIL= $$ (NUMBER, WHEN, WHO, WHERE, WHAT)
$$ ##TITLE= Audit trail, XWIN-NMR		Version 3.5
$$ ##JCAMPDX= 5.01
$$ ##ORIGIN= Bruker BioSpin GmbH
$$ ##OWNER= she
$$ F:/spectra/data/she/nmr/P31/2/pdata/1/auditp.txt
$$ ##AUDIT TRAIL=  $$ (NUMBER, WHEN, WHO, WHERE, WHAT)
(   1,<2024-09-11 14:08:00.18 +0400>,<she>,<DPX200>,
      <created by zg, POWCHK disabled, PULCHK disabled
       configuration hash MD5:
       00 E9 B6 7A A2 85 ED C7 34 08 36 98 17 FE 4E 26
       data hash MD5: 32K
       2A 7D E1 32 E8 3F 04 25 85 BC 3E 56 71 F6 21 38>)
(   2,<2024-09-11 14:08:02.59 +0400>,<she>,<DPX200>,
      <Start of raw data processing
       efp BC_mod = 2 LB = 1.5 FT_mod = 6 PKNL = 1 PHC0 = 2718.357 PHC1 = 11.48747 SI = 64K 
       data hash MD5: 64K
       9E 88 67 15 89 BC 9F F6 25 01 33 86 36 6C 4E 42>)
(   3,<2024-09-11 14:08:19.12 +0400>,<she>,<DPX200>,
      <pk PHC0 = -2.575494 PHC1 = 0 
       data hash MD5: 64K
       A3 3C 30 7C DB FC AB 8D 4F 93 EB CA D3 71 60 D6>)
$$ ##END=
$$ 
$$ hash MD5
$$ EB 10 C0 E0 17 91 13 49 FB CF 5A 06 FB D1 B3 18
##$RELAX= 
##$RELAX= 
##$RELAX= 
##$RELAX= 
##$RELAX= 
##$RELAX= 
##$RELAX= 
##$RELAX= 
$$ Bruker specific parameters
$$ --------------------------
##$DU= <F:/spectra>
##$EXPNO= 2
##$NAME= <P31>
##$PROCNO= 1
##$TYPE= <nmr>
##$USER= <she>
##$AMP= (0..31)
100 100 100 100 100 100 100 100 100 100 100 100 100 100 100 100 100 100 
100 100 100 100 100 100 100 100 100 100 100 100 100 100 
##$AQSEQ= 0
##$AQ_mod= 1
##$AUNM= <au_zg>
##$AUTOPOS= <>
##$BF1= 81.014009
##$BF2= 200.13
##$BF3= 200.13
##$BF4= 200.13
##$BF5= 200.13
##$BF6= 200.13
##$BF7= 200.13
##$BF8= 200.13
##$BYTORDA= 1
##$CFDGTYP= 0
##$CFRGTYP= 5
##$CHEMSTR= <none>
##$CNST= (0..31)
1 1 145 1 1 1 1 1 1 1 1 1 1 1 1 1 1 1 1 1 1 1 1 1 1 1 1 1 1 1 1 1 
##$CPDPRG= <waltz16>
##$CPDPRG1= <>
##$CPDPRG2= <waltz16>
##$CPDPRG3= <>
##$CPDPRG4= <mlev>
##$CPDPRG5= <mlev>
##$CPDPRG6= <mlev>
##$CPDPRG7= <mlev>
##$CPDPRG8= <mlev>
##$CPDPRGB= <>
##$CPDPRGT= <>
##$D= (0..31)
0 1 0 0 0 0 0 0 0 0.06 0 0.03 2e-05 3e-06 0 0 0.0002 0 0 0 0 0 0 0 0 0 
0 0 0 0 0 0 
##$DATE= 1726049279
##$DBL= (0..7)
120 120 120 11 120 120 24 19 
##$DBP= (0..7)
150 150 150 150 150 150 150 150 
##$DBP07= 0
##$DBPNAM0= <>
##$DBPNAM1= <>
##$DBPNAM2= <>
##$DBPNAM3= <>
##$DBPNAM4= <>
##$DBPNAM5= <>
##$DBPNAM6= <>
##$DBPNAM7= <>
##$DBPOAL= (0..7)
0.5 0.5 0.5 0.5 0.5 0.5 0.5 0.5 
##$DBPOFFS= (0..7)
$$ [...]
##$SUBNAM2= <"">
##$SUBNAM3= <"">
##$SUBNAM4= <"">
##$SUBNAM5= <"">
##$SUBNAM6= <"">
##$SUBNAM7= <"">
##$SUBNAM8= <"">
##$SUBNAM9= <"">
##$SW= 400.765351723535
##$SWIBOX= (0..15)
0 1 3 0 0 0 0 0 0 0 0 0 0 0 0 0 
##$SW_h= 32467.5324675325
##$TD= 32768
##$TD0= 1
##$TE= 0
##$TE2= 300
##$TE3= 300
##$TEG= 300
##$TL= (0..7)
0 120 53 12 22 120 120 120 
##$TP= (0..7)
150 150 150 150 150 150 150 150 
##$TP07= 0
##$TPNAME0= <>
##$TPNAME1= <>
##$TPNAME2= <>
##$TPNAME3= <>
##$TPNAME4= <>
##$TPNAME5= <>
##$TPNAME6= <>
##$TPNAME7= <>
##$TPOAL= (0..7)
0.5 0.5 0.5 0.5 0.5 0.5 0.5 0.5 
##$TPOFFS= (0..7)
0 0 0 0 0 0 0 0 
##$TUNHIN= 0
##$TUNHOUT= 0
##$TUNXOUT= 0
##$USERA1= <user>
##$USERA2= <user>
##$USERA3= <user>
##$USERA4= <user>
##$USERA5= <user>
##$V9= 5
##$VALIST= <valist>
##$VCLIST= <CCCCCCCCCCCCCCC>
##$VD= 0
##$VDLIST= <DDDDDDDDDDDDDDD>
##$VPLIST= <PPPPPPPPPPPPPPP>
##$VTLIST= <TTTTTTTTTTTTTTT>
##$WBST= 1024
##$WBSW= 4
##$XGAIN= (0..3)
0 0 0 0 
##$XL= 0
##$YL= 0
##$YMAX_a= 4442
##$YMIN_a= -8347
##$ZGOPTNS= <>
##$ZL1= 120
##$ZL2= 120
##$ZL3= 120
##$ZL4= 120
##$ABSF1= 0
##$ABSF2= 0
##$ABSG= 0
##$ABSL= 0
##$ALPHA= 0
##$AQORDER= 0
##$ASSFAC= 0
##$ASSFACI= 0
##$ASSFACX= 0
##$ASSWID= 0
##$AUNMP= <proc_1d>
##$AZFE= 0.1
##$AZFW= 0.5
##$BCFW= 0
##$BC_mod= 2
##$BYTORDP= 0
##$COROFFS= 0
##$CY= -3
##$DATMOD= 1
##$DC= 0
##$DFILT= <>
##$DTYPP= 0
##$F1P= 0
##$F2P= 0
##$FCOR= 1
##$FTSIZE= 65536
##$FT_mod= 6
##$GAMMA= 0
##$GB= 0
##$INTBC= 1
##$INTSCL= 9.790993e-09
##$ISEN= 30
##$LB= 1.5
##$LEV0= 0
##$LPBIN= 0
##$MAXI= 10000
##$MC2= 0
##$MEAN= 0
##$ME_mod= 0
##$MI= 50
##$NCOEF= 0
##$NC_proc= -7
##$NLEV= 6
##$NOISF1= 182.463
##$NOISF2= 159.3651
##$NSP= 0
##$NTH_PI= 0
##$NZP= 0
##$OFFSET= 198.0616
##$PC= 4
##$PHC0= 2715.781
##$PHC1= 11.48747
##$PH_mod= 1
##$PKNL= yes
##$PPARMOD= 0
##$PSCAL= 0
##$PSIGN= 0
##$REVERSE= no
##$SF= 81.0140089999434
##$SI= 65536
##$SIGF1= 159.3651
##$SIGF2= -187.1042
##$SINO= 113.3802
##$SIOLD= 16384
##$SREGLST= <1H.CDCl3>
##$SSB= 0
##$STSI= 65536
##$STSR= 0
##$SW_p= 32467.5324675325
##$SYMM= 0
##$S_DEV= 0
##$TDeff= 32768
##$TDoff= 0
##$TI= <>
##$TILT= no
##$TM1= 0
##$TM2= 0
##$TOPLEV= 0
##$USERP1= <user>
##$USERP2= <user>
##$USERP3= <user>
##$USERP4= <user>
##$USERP5= <user>
##$WDW= 1
##$XDIM= 65536
##$YMAX_p= 485793242
##$YMIN_p= -11781913
$$ End of Bruker specific parameters
$$ ---------------------------------
##NTUPLES= NMR SPECTRUM
##VAR_NAME=  FREQUENCY,     SPECTRUM/REAL,   SPECTRUM/IMAG
##SYMBOL=    X,             R,               I
##VAR_TYPE=  INDEPENDENT,   DEPENDENT,       DEPENDENT
##VAR_FORM=  AFFN,          ASDF,            ASDF
##VAR_DIM=   65536,         65536,           65536
##UNITS=     HZ,            ARBITRARY UNITS, ARBITRARY UNITS
##FACTOR=    0.49542278885378, 1,            1
##FIRST=     16045.7642231865, 0,            0
##LAST=      -16421.768244346, 0,            0
##MIN=       -16421.768244346, -11781913,    0
##MAX=       16045.7642231865, 485793242,    0
$$ Real data points
##PAGE= N=1
##DATA TABLE= (X++(R..R)), XYDATA
$$ [...]
44180 -2696001 -1955924 -680263 58621 210510 377985 661917 791724 1031617 1852120
44171 1852120 2803515 2839959 1867505 894772 452016 5937 -675062 -798930 53059 825305
44161 825305 276372 -1309457 -2659128 -3221933 -3349768 -3170152 -2391739 -1192170 -369644
44152 -369644 -436729 -1141562 -1916919 -2311599 -2081418 -1411622 -962282 -1169124 -1665044 -1964316
44142 -1964316 -2429552 -3716886 -5401895 -6175832 -5575233 -4577345 -4151039 -4086208 -3718419
44133 -3718419 -3005751 -2269041 -1541843 -901428 -892297 -1776435 -2713099 -2570596 -1419351 -394918
44123 -394918 -120171 -130965 6477 -58064 -630601 -1162976 -1014933 -582308 -838085 -1880330
44113 -1880330 -2716355 -2589334 -1835274 -1181678 -832885 -669515 -789733 -1198324 -1299540
44104 -1299540 -483033 833816 1485954 1021207 211726 -157559 -343069 -972948 -1828044
44095 -1828044 -2026393 -1307627 -483447 -433530 -1041821 -1406060 -999358 -383562 -559999 -1586233
44085 -1586233 -2215901 -1369731 271872 927000 52459 -894841 -513261 603447 831780
44076 831780 -203630 -1372675 -1737845 -1425556 -900364 -446155 -468993 -1286117 -2342178
44067 -2342178 -2569468 -1894448 -1508108 -2167927 -3057391 -2949161 -1814483 -587321 125302
44058 125302 375327 321074 54959 -249736 -571637 -1168233 -2006027 -2442802 -2048548 -1368858
44048 -1368858 -1208775 -1496364 -1616022 -1569444 -1857082 -2292014 -1978072 -723153 419294
44039 419294 467114 -317201 -1059544 -1480059 -1827218 -2013985 -1598467 -613193 190988 142999
44029 142999 -620226 -1407477 -1763316 -1827822 -2002572 -2429074 -2819106 -2728021 -2002612 -1042996
44019 -1042996 -587139 -1027412 -1853299 -2033717 -1208846 -270574 -348830 -1382809 -2258171
44010 -2258171 -2304195 -1913147 -1515022 -829441 306382 1143931 937387 179436 -29732
44001 -29732 418072 670764 448375 450427 1033892 1510913 1225018 497132 -62664 -484820
43991 -484820 -1013445 -1305863 -847933 115286 782585 801817 462157 -6714 -655807 -1272872
43981 -1272872 -1271006 -453925 501372 723413 172971 -310350 12795 955090 1623247 1349549
43971 1349549 297081 -799940 -1321598 -1153958 -623943 -245148 -394187 -977161 -1437939
43962 -1437939 -1293171 -627133 90001 522433 569349 179296 -491456 -875146 -518687 174636
43952 174636 326695 -180881 -493777 -54266 568709 542357 -109286 -803437 -1363298 -2021089
43942 -2021089 -2716157 -3049991 -2878517 -2442126 -1941635 -1392994 -842985 -370901 33990
43933 33990 291738 132056 -441379 -826699 -467576 339243 806994 709238 511452 533781
43923 533781 591340 494970 326424 107638 -303493 -890688 -1502051 -2207748 -3107585 -3774180
43913 -3774180 -3536181 -2445597 -1309132 -563029 185035 1179114 1795091 1313956 -112251
43904 -112251 -1770728 -3196054 -4164417 -4356680 -3666583 -2563491 -1602921 -818668 -38131
43895 -38131 587969 933130 1358059 2095479 2503421 1826159 568435 153318 1098199 2406524
43885 2406524 3010487 2960845 2750507 2235270 950999 -882975 -2348194 -2731904 -2076804
43876 -2076804 -969478 -86759 209257 124905 186659 568608 864838 692005 208122 -232330
43866 -232330 -596182 -935097 -912622 -130225 1118966 1920194 1675287 674068 -303698
43857 -303698 -682399 -413650 39632 -10095 -866333 -2016541 -2580341 -2262326 -1553936 -911292
43847 -911292 -154832 1025394 2286849 2789459 2077872 523505 -1074710 -2080449 -2252556
43838 -2252556 -1725331 -943296 -476543 -665347 -1318339 -1778940 -1456980 -483943 215671
43829 215671 -204272 -1477559 -2368769 -2079814 -1235146 -1084162 -1900562 -2695505 -2559148
43820 -2559148 -1746147 -1141131 -1056338 -1040917 -748039 -498457 -826380 -1740361 -2673236 -3103925
43810 -3103925 -3046468 -2866890 -2744164 -2502474 -1999630 -1442259 -1103390 -895531 -565600 -253462
43800 -253462 -413171 -1067287 -1598603 -1568253 -1340455 -1472531 -1790946 -1614191 -755388 232655
43790 232655 763027 647062 -122787 -1352944 -2284903 -1993994 -586958 561281 322783
43781 322783 -837453 -1628472 -1692734 -1798502 -2357410 -2638111 -1814269 -197865 1087278
43772 1087278 1375885 939809 324436 -320565 -1110289 -1911583 -2261208 -1858467 -1014692
43763 -1014692 -446561 -567475 -1082552 -1360122 -1101193 -535426 -69390 96143 78840 213845
43753 213845 760326 1527849 1894348 1429003 420749 -461653 -940832 -1253751 -1606811
43744 -1606811 -1937127 -2214345 -2504317 -2636555 -2297902 -1631749 -1232371 -1273959 -1179104 -555980
43734 -555980 60539 -17124 -536847 -706922 -429866 -335242 -628696 -692198 9792 1235527
43724 1235527 2325592 2720127 2070642 525595 -944458 -1282099 -716095 -609931 -1487952
43715 -1487952 -2069670 -1021027 1073329 2488489 2598503 2199853 1890411 1421663 743514
43706 743514 424334 596411 531460 -150014 -725335 -486589 166873 520515 753350 1443179
43696 1443179 2356138 2724788 2455285 2082260 1693491 944837 151029 235858 1252075
43687 1252075 1921715 1221683 -288532 -1332105 -1534843 -1499211 -1650544 -1749484 -1468791
43678 -1468791 -900570 -433431 -408862 -844832 -1309148 -1248091 -648884 -117592 -50207 -73247
43668 -73247 303516 822006 832628 346822 125407 679471 1653750 2288646 2144910 1335614
43658 1335614 367008 -221112 -323866 -344052 -572541 -714666 -428886 -75328 -304079 -1023535
43648 -1023535 -1515166 -1597983 -1853535 -2456897 -2623545 -1733554 -355016 478621 546115 364717
43638 364717 221235 -9274 -262751 -198949 254306 755057 963902 744156 54832 -898779
43628 -898779 -1482675 -1146434 -208819 329098 -86240 -989294 -1612512 -1809846 -1998167 -2418460
43618 -2418460 -2778978 -2612127 -1800239 -701459 168714 508300 292150 -364784 -1194079
43609 -1194079 -1714841 -1576957 -1080130 -965417 -1447767 -1821196 -1374510 -374268 309708
43600 309708 310476 -5477 -246595 -395265 -541809 -693113 -847539 -890116 -511415 364574
43590 364574 1241229 1633482 1772439 2062163 2026781 727392 -1670120 -3684244 -4223887
43581 -4223887 -3701282 -3027678 -2317304 -1232853 31588 906749 1244593 1308529 1230401
43572 1230401 1028004 892589 919932 814493 399793 162410 688684 1728756 2401044
43563 2401044 2235407 1519082 736432 176746 -10549 116883 237706 210559 418114 1184738
43553 1184738 2058007 2281772 1843168 1369052 1058348 496381 -384048 -962833 -869434 -615014
43543 -615014 -866968 -1529397 -1940512 -1708278 -1065606 -597782 -766500 -1486067 -2117701 -2141934
43533 -2141934 -1790598 -1648597 -1751006 -1656386 -1385865 -1524560 -2170015 -2543629 -2103324 -1418896
43523 -1418896 -1346523 -1762442 -1761763 -925560 151193 575701 85476 -720215 -964029 -439069
43513 -439069 51242 -366867 -1428199 -2055099 -1935933 -1937720 -2602851 -3145440 -2641345 -1461796
43503 -1461796 -629367 -341297 -163906 -228316 -971391 -1830356 -1544426 -36027 1170089
43494 1170089 912919 -176647 -829997 -868117 -935007 -1123274 -916400 -337973 -178479 -834884
43484 -834884 -1603206 -1542716 -661173 218535 624742 989491 1889382 3073516 3607654 2927213
43474 2927213 1443818 88635 -450487 -15687 1050899 1979257 1995888 1067001 10029
43465 10029 -444831 -454903 -595868 -914128 -945645 -477929 214819 749286 782650 39649
43455 39649 -1190445 -1819572 -1034724 463650 1179878 838587 686618 1486019 2256367
43446 2256367 1703891 106329 -1104555 -1179042 -634410 -269185 -368911 -808255 -1278837
43437 -1278837 -1354747 -787865 200336 1171595 1890021 2242770 2047132 1396367 978009 1480810
43427 1480810 2707152 3723461 3886146 3336256 2531559 1737070 1041682 517831 235134
43418 235134 258025 561385 819565 562399 -151798 -566157 -238059 88015 -651200 -2225780
43408 -2225780 -3220238 -2873336 -1959526 -1481689 -1292490 -677712 247709 594309 19052
43399 19052 -768542 -995340 -797896 -892214 -1544849 -2226092 -2263880 -1582262 -676319 -32054
43389 -32054 202081 69993 -279809 -445973 13752 895567 1260721 540765 -540723 -787653
43379 -787653 -129179 355722 50943 -395506 -197454 402164 639434 362464 48067 46242
43369 46242 366966 923301 1444100 1419622 708998 -33584 -145144 51983 -259514 -1054287
43359 -1054287 -1442876 -1043559 -544962 -649830 -1209606 -1775601 -2297395 -2741049 -2620092
43350 -2620092 -1608406 -253474 603881 886611 1119490 1429732 1462900 1238959 1273284
43341 1273284 1648483 1703409 1047685 310516 344927 1046325 1522373 1276378 720363 528415
43331 528415 872078 1352517 1419076 803469 -263899 -1222044 -1656084 -1565664 -1142609 -553817
43321 -553817 -135937 -440873 -1599241 -2803294 -2984112 -2023544 -800881 -5644 518148
43312 518148 1094299 1532077 1533830 1292253 1155848 1026088 649081 314936 663263 1759177
43302 1759177 2833014 3090475 2516859 1784689 1541269 1831105 2121824 1930922 1443751
43293 1443751 1298643 1689352 2051120 1866355 1354232 975434 712963 435401 547246
43284 547246 1417366 2355664 2146981 709826 -681973 -1068310 -823873 -680350 -648400
43275 -648400 -488457 -431331 -648027 -634785 -1202 605724 322514 -495082 -692454 -85702
43265 -85702 251342 -345317 -1163250 -1274558 -877397 -806471 -1163466 -1163031 -277520 975653
43255 975653 1538348 948154 -78152 -230858 1065172 2917523 3828607 3346445 2507371
43246 2507371 2465092 3085619 3312843 2667031 1796056 1487073 1658615 1648042 1170707 539258
43236 539258 18563 -542082 -1261515 -1820227 -1869491 -1598270 -1428612 -1265515 -612730 502049
43226 502049 1312179 1272220 689766 47498 -717049 -1659459 -2068284 -1165413 560150 1597478
43216 1597478 1125974 -222925 -1437957 -2160059 -2324656 -1614408 14012 1734312 2556673
43207 2556673 2476484 2314212 2512876 2701132 2470842 1976794 1532758 1093927 529365 129982
43197 129982 374129 1199155 1907730 1986805 1753329 1873941 2372229 2548148 1985506 1199195
43187 1199195 942960 1192110 1295977 973901 589436 414379 187867 -398710 -1246207
43178 -1246207 -2132157 -3041095 -3902890 -4362169 -4187871 -3654885 -3144578 -2581236 -1672435
43169 -1672435 -564393 190562 329906 187932 225206 499378 707520 605632 279497
43160 279497 19557 -31021 1524 76091 573955 1911582 3749966 4983170 4758725 3270905
43150 3270905 1380677 -247172 -1437809 -2306551 -3073509 -3803592 -4098695 -3416941 -1961495
43141 -1961495 -750268 -365283 -161899 652389 1657641 1814083 1106935 592619 859347
43132 859347 1444608 1896912 2381360 2876191 2748930 1766260 797347 784118 1484022 1891191
43122 1891191 1525707 670017 -332069 -1273501 -1730654 -1252620 -38214 1050107 1300312
43113 1300312 712816 -243215 -1112951 -1665504 -1933239 -2167377 -2589968 -3099669 -3276483
43104 -3276483 -2679368 -1171648 858840 2540511 3064517 2448179 1615874 1503979 2177547
43095 2177547 2946803 3135932 2541796 1397718 225518 -417716 -387242 -102406 -14829
43086 -14829 -35333 235993 832971 1342055 1482209 1404329 1316318 1110221 569528 -192321
43076 -192321 -712386 -623423 -19262 682924 1156047 1275329 896717 -48633 -1036458 -1069976
43066 -1069976 57121 992512 249097 -1671402 -2646378 -1661527 -45999 575096 422009
43057 422009 672382 1351002 1444525 684809 -104937 -340804 -205085 141172 752888 1187063
43047 1187063 665156 -758220 -2075757 -2657441 -2890383 -3240536 -3503515 -3317773 -2695432
43038 -2695432 -1767111 -714059 -145033 -688728 -1924073 -2570499 -2050301 -991460 40193
43029 40193 1147985 2021552 1626914 -123752 -1586936 -1409459 -359779 67485 -73457
43020 -73457 206426 668225 75029 -1618959 -2969348 -3068343 -2472798 -1898698 -1299772 -589016
43010 -589016 -83525 234285 876784 1786641 2020281 1007529 -644201 -2050978 -3001624
43001 -3001624 -3568200 -3567971 -3021892 -2534724 -2602768 -2962350 -3073499 -2819608 -2348616 -1693087
42991 -1693087 -946076 -390614 -120007 56985 134255 -85682 -295812 213353 1331723
42982 1331723 1843201 1021820 -226070 -639657 -398195 -635582 -1557182 -2145764 -1690558
42973 -1690558 -623785 333917 1049812 1684870 2124052 2114205 1675496 1070021 482592 -101591
42963 -101591 -741226 -1324347 -1564777 -1316066 -824822 -431908 -74028 540098 1271706 1609733
42953 1609733 1506079 1534225 1959270 2309996 2255198 2195560 2430559 2446695 1800059 1098649
42943 1098649 1159334 1595741 1258915 -119726 -1687155 -2753298 -3365811 -3638732 -3494157
42934 -3494157 -3205699 -3285863 -3590423 -3355713 -2430591 -1715388 -1970649 -2783852 -3117838 -2430030
42924 -2430030 -943674 751305 2059091 2682383 2802936 2732455 2401150 1583982 552153
42915 552153 -77728 -158687 -78038 -1231 240741 442074 43317 -855456 -1286421 -639005
42905 -639005 539870 1349442 1517744 1213854 563108 -158193 -458347 -304092 -329338 -859445
42895 -859445 -1285868 -997606 -394972 -276134 -636916 -836086 -691154 -668827 -1058877 -1543732
42885 -1543732 -1607485 -1019238 12297 926443 1251343 1144710 1176223 1423169 1296170 508246
42875 508246 -426659 -1045856 -1568921 -2136530 -2190321 -1384377 -424450 -63451 152526 1058443
42865 1058443 2241216 2448534 1430366 207406 -442572 -662926 -699929 -564692 -641362
42856 -641362 -1475404 -2648061 -2929025 -1978657 -948531 -907983 -1559745 -2088604 -2482026
42847 -2482026 -3282568 -4541905 -5650262 -5907270 -4944592 -3030554 -1210294 -539430 -826844
42838 -826844 -760759 326059 1510424 1616423 805482 126697 34370 155825 158664 19811
42828 19811 -388319 -1214159 -2130951 -2501709 -2080020 -1170549 -190477 553086 814263 586063
42818 586063 239809 111622 63501 -200884 -565604 -657250 -415288 -73914 307249 844546
42808 844546 1423183 1727121 1695453 1600021 1640056 1723203 1636983 1232022 520381 -213826
42798 -213826 -556293 -429329 -216839 -201684 -167839 126608 399398 179148 -577656 -1605673
42788 -1605673 -2722235 -3601127 -3566835 -2354341 -814689 -29695 153643 830978 2330485
42779 2330485 3789627 4571143 5004343 5290560 4758480 3014428 1019134 30045 -24170
42770 -24170 -110690 -362409 102306 1599460 3145284 3651040 3117672 2251979 1510638 1006622
42760 1006622 876344 1139261 1439095 1472007 1540175 2144766 3053825 3339395 2534319 1322955
42750 1322955 780523 1193574 1935855 2320349 2228866 1958293 1763608 1638981 1410561 1010884
42740 1010884 685696 774390 1161970 1194210 445612 -601470 -1043989 -640114 23936 394998
42730 394998 459270 343219 8477 -428460 -609787 -464656 -315417 -152291 558676 1813967
42720 1813967 2459369 1484816 -441721 -1675979 -1691642 -1522629 -2084005 -3050516 -3704288
42711 -3704288 -3971884 -4073932 -3895994 -3416794 -3212059 -3706268 -4227559 -3675948 -2094232
42702 -2094232 -758153 -515849 -769252 -527978 110366 215390 -497190 -1227936 -1284528
42693 -1284528 -1041896 -1253190 -1836818 -1996887 -1406220 -589801 -57987 263539 481920
42684 481920 309376 -287347 -578181 46634 1023455 1264670 701660 301958 527022 728607
42674 728607 395433 104362 604663 1597022 2188512 2179360 2080084 1983346 1271098 -306320
42664 -306320 -1871401 -2218645 -1165880 256953 918867 598839 -138263 -736596 -1038261
42655 -1038261 -1075667 -951759 -991010 -1498574 -2091751 -1798027 -367136 931990 616074
42646 616074 -1071322 -2367572 -2152245 -1019218 -54337 433215 516379 17271 -899725
42637 -899725 -1265562 -456550 651586 709060 -199213 -722624 -231656 447698 430452 -135646
42627 -135646 -757984 -1461694 -2353871 -2995533 -2918507 -2379230 -1961933 -1693249 -1157468 -342572
42617 -342572 230287 240744 -65839 -363603 -697597 -1245443 -1884722 -2243046 -2116307 -1708106
42607 -1708106 -1451252 -1588593 -1873058 -1723515 -819257 436889 1193621 975364 138184
42598 138184 -572986 -796512 -728195 -633632 -496957 -271309 -232477 -796439 -1992259 -3281757
42588 -3281757 -3925503 -3487950 -2127570 -566384 359849 400256 106389 128141 414589
42579 414589 460905 203348 88471 207903 50591 -592443 -1140606 -1146809 -1142114 -1873435
42569 -1873435 -3090277 -3855595 -3831118 -3470815 -3078859 -2527779 -1914034 -1604752 -1466803
42560 -1466803 -920021 -46335 242636 -378921 -909766 -371895 804916 1548372 1686148
42551 1686148 1753744 1704383 984067 -185860 -744312 -230878 655479 1211732 1497161 1534247
42541 1534247 766258 -881877 -2182550 -1915262 -622991 -7430 -688103 -1584490 -1618612
42532 -1618612 -1005542 -470985 -115180 253281 313547 -356977 -1357785 -1793063 -1500452
42523 -1500452 -1226296 -1449107 -1685035 -1268898 -311742 543569 973146 1089456 897221
42514 897221 202610 -830706 -1495286 -1249688 -429084 100394 -22868 -311532 -249234 -89606
42504 -89606 -433673 -1190304 -1534673 -1026278 -232355 80472 -99359 -364819 -766190 -1622824
42494 -1622824 -2615459 -2881393 -2175925 -1272519 -936511 -1064841 -1151070 -1040078 -782649 -236422
42484 -236422 600999 1174049 912979 91035 -400219 -142526 363023 386220 -232320 -1037986
42474 -1037986 -1468572 -1329181 -900828 -611582 -593288 -679675 -799244 -1039610 -1268166 -1169269
42464 -1169269 -881449 -1044819 -1796535 -2286324 -1840227 -1113834 -1191464 -1821887 -1646555 -283676
42454 -283676 886145 511766 -923398 -1758341 -1199722 -67125 384061 -117145 -736368
42445 -736368 -619273 113389 597519 363451 -184281 -604115 -1130057 -1954255 -2335984 -1417295
42435 -1417295 285904 1339217 1408037 1632895 2645118 3433924 2917118 1593664 639174
42426 639174 141516 -614392 -1606436 -2055953 -1804232 -1588895 -1843884 -2153863 -2114041 -1931407
42416 -1931407 -1844359 -1573998 -758419 441128 1470279 1892986 1660187 1139233 941405
42407 941405 1413427 2208662 2616132 2356853 1811020 1473578 1478285 1661817 1810359 1827458
42397 1827458 1870799 2213740 2704644 2592883 1368268 -368577 -1450275 -1526114 -1289076
42388 -1289076 -1274416 -1138416 -404472 696922 1556904 1911644 1836005 1416516 885971 763025
42378 763025 1329397 2091606 2186911 1290210 -145364 -1423879 -2112572 -2177094 -1941466 -1821072
42368 -1821072 -1830230 -1508961 -644596 153906 99702 -624281 -941982 -266121 705201 900303
42358 900303 214333 -492652 -551224 -176738 8098 -225872 -536243 -418694 325775 1367404
42348 1367404 1993056 1667769 623616 -245651 -262152 362931 898786 975873 808029 645540
42338 645540 427055 54950 -362783 -728302 -1103141 -1441444 -1484092 -1176862 -881911 -823892
42328 -823892 -616127 187695 1266644 1828001 1675844 1368085 1203541 703766 -542589
42319 -542589 -2052945 -3023824 -3432823 -3932317 -4676032 -4872510 -3794562 -1873890 -410765
42310 -410765 -291997 -1271333 -2453547 -3137767 -3077234 -2292390 -1069996 -78813 -4119 -826388
42300 -826388 -1724512 -1952649 -1624950 -1351311 -1280887 -958987 -182013 443099 114530 -1133667
42290 -1133667 -2319899 -2514392 -1815951 -1192582 -1348385 -1913664 -1935328 -1093002 -126855
42281 -126855 52653 -581985 -1227833 -1179483 -463210 333924 611357 186809 -584742 -1106784
42271 -1106784 -1068854 -640659 -126834 330604 575725 308538 -515424 -1372194 -1658986 -1395672
42261 -1395672 -1110049 -1166951 -1559980 -2182182 -2862933 -3295874 -3423427 -3732167 -4579798 -5382791
42251 -5382791 -5238898 -4341931 -3871947 -4259446 -4514790 -3792290 -2730831 -2416903 -2660270
42242 -2660270 -2331512 -1138313 -35978 183733 -164710 -368906 -239458 66081 560286
42233 560286 1210461 1520555 942300 -283676 -1161076 -1002545 -188058 366616 304437 71946
42223 71946 160688 558798 1114413 1975086 3203647 4226463 4286511 3456887 2624401 2299804
42213 2299804 1997293 1139881 113412 -139566 595005 1460296 1551355 915682 336466
42204 336466 304564 478013 237926 -408684 -780025 -416835 315657 765724 821752 806594
42194 806594 806186 648163 415272 370314 406188 224787 91888 660982 1865983 2773947
42184 2773947 2876340 2754969 2980249 3092997 2360226 953267 -383634 -1383496 -2186981
42175 -2186981 -2591536 -2259190 -1537482 -1245226 -1585193 -1904856 -1606118 -780102 96756
42166 96756 653880 803196 772657 871537 929822 276595 -1253716 -2640141 -2670736 -1417503
42156 -1417503 -45062 661495 824713 687576 213894 -421458 -745827 -589302 -132803
42147 -132803 693565 2079122 3483096 3822056 2866575 1673837 1215124 1303275 1348471
42138 1348471 1418700 1861678 2431293 2547113 2117472 1502889 953500 643185 929749 1888456
42128 1888456 2768607 2649813 1677294 1007459 1338646 2012286 1902660 870606 -101522
42119 -101522 -168657 406623 791038 811263 1104450 1966209 2692857 2557756 1945936 1772660
42109 1772660 2077466 2122040 1797897 1850116 2453105 2640962 1732962 447159 -128783 18012
42099 18012 158235 -32648 -497719 -1421144 -2852714 -4051762 -4171655 -3395203 -2498254
42090 -2498254 -1542041 -65843 1552350 2194180 1682996 1163837 1321252 1338072 396069
42081 396069 -740966 -733302 285605 834891 150066 -921818 -1288824 -1026568 -978992 -1504195
42071 -1504195 -2185985 -2591090 -2815182 -3189453 -3698437 -3859128 -3184764 -1754107 -291548
42062 -291548 402335 162546 -414576 -579816 -126729 549933 1006251 1194603 1288786 1226044
42052 1226044 705860 -263874 -1071113 -1061262 -363625 162059 -72324 -705236 -977939 -741023
42042 -741023 -540070 -773276 -1198218 -1392349 -1326620 -1254686 -1334464 -1629340 -2197865 -2833698
42032 -2833698 -2985018 -2405325 -1713989 -1766483 -2527809 -3125513 -2997980 -2357333 -1468701 -245374
42022 -245374 1166298 2153477 2448237 2549148 2861854 3061592 2862365 2720613 3023348
42013 3023348 3219219 2682612 1909096 1790615 2116143 1986392 1448388 1376048 1759093 1524747
42003 1524747 318874 -880019 -1381266 -1749131 -2507794 -3051095 -2707769 -1945023 -1540388
41994 -1540388 -1272932 -452182 708927 1207274 566849 -609286 -1263975 -695890 907929
41985 907929 2411202 2658296 1800291 1161049 1503212 2171848 2354800 2273086 2443810 2621631
41975 2621631 2332586 1759210 1237711 548674 -412633 -968743 -661116 -258263 -680076
41966 -680076 -1516294 -1761958 -1455367 -1334239 -1375597 -1044769 -593119 -659520 -870073 -351105
41956 -351105 536190 565183 -272978 -692619 -277033 -63211 -594001 -995567 -601636 -61811
41946 -61811 -106080 -436611 -565328 -655577 -886005 -1042502 -1306373 -2279023 -3603584 -3834345
41936 -3834345 -2486495 -991810 -693816 -1090927 -1116375 -940939 -1169031 -1293638 -548660
41927 -548660 377542 110298 -1246879 -2180880 -1862567 -848674 238989 1398858 2445076
41918 2445076 2745846 2226051 1762038 2083619 2848973 3205169 2875605 2366975 2301702 2737954
41908 2737954 3105244 2827634 2001436 1245479 881625 647665 275495 -167046 -628967
41899 -628967 -1124398 -1231785 -337942 1245074 2247763 2060357 1554941 1671199 2065629
41890 2065629 1965588 1489874 1125476 673207 -152185 -734575 -386732 385063 704243
41881 704243 892644 1814918 3049947 3269145 2307982 1342839 994024 772692 553526
41872 553526 989676 1998451 2303670 1218366 -253041 -808839 -406544 211596 673746
41863 673746 994645 1151429 1218290 1313921 1032474 -323335 -2519570 -4194068 -4392230
41854 -4392230 -3598062 -2800519 -2327829 -2119346 -2301131 -2770961 -2883686 -2285428 -1547884
41845 -1547884 -1361196 -1623977 -1895003 -2127616 -2292073 -1884502 -627435 784311 1439278
41836 1439278 1382828 1307146 1403110 1324965 1095866 1221132 1875301 2629648 3095227 3347827
41826 3347827 3570463 3598399 3004207 1611166 -67733 -1053519 -878567 -232095 -132440
41817 -132440 -536747 -492270 308239 1079722 1321230 1560221 2147887 2398503 1831677 1309776
41807 1309776 1744236 2378425 1736720 -97472 -1556331 -1843873 -1763145 -2117296 -2521759
41798 -2521759 -2259896 -1395756 -536633 -131289 -356045 -1122586 -1918112 -2168036 -1955663
41789 -1955663 -1837545 -1840922 -1371791 -363247 296278 6436 -512510 -114410 1205096
41780 1205096 2297048 2284374 1455100 717542 580281 825986 990532 952673 967934 1186058
41770 1186058 1385548 1353209 1280676 1447774 1686280 1595517 1195672 855334 581865 -10591
41760 -10591 -859597 -1186479 -463835 752476 1388865 1014398 81874 -770248 -1256327 -1398070
41750 -1398070 -1352579 -1347576 -1520874 -1723440 -1637347 -1183296 -727963 -798184 -1592343 -2797311
41740 -2797311 -3850620 -4301977 -3935889 -2785868 -1299586 -363509 -683481 -1939253 -2894384
41731 -2894384 -2625968 -1420362 -246563 329614 409986 325904 404841 894493 1605435 1860968
41721 1860968 1347681 764471 956334 1627671 1775268 1316951 1244893 1944877 2452660 1958793
41711 1958793 1123558 1055271 1652555 1947156 1710388 1681604 2261602 2906824 2989618 2529406
41701 2529406 1843927 1124449 677131 1004022 2143496 3267044 3439997 2660884 1758955
41692 1758955 1346976 1272833 1128878 899921 879746 1174857 1587494 1954714 2359386 2918851
41682 2918851 3508029 3820031 3657520 3075977 2268979 1410310 625944 35386 -277496
41673 -277496 -378398 -524233 -956256 -1540081 -1690472 -865542 790568 2425612 3177210
41664 3177210 2825250 1788081 709899 140871 340299 1094049 1795220 1937142 1536799
41655 1536799 971845 505593 156644 -39688 100906 689837 1514107 2102331 2096429 1600269
41645 1600269 1092364 878075 735381 337445 -101655 -49657 449704 665872 223732 -259935
41635 -259935 -10923 824641 1429708 1355834 806857 95148 -671009 -1454725 -2235087 -2949391
41625 -2949391 -3212701 -2458935 -813054 595661 847316 436509 526043 1273872 1771962
41616 1771962 1483324 757198 -92373 -1187066 -2341385 -2882999 -2608577 -2134506 -1913909
41607 -1913909 -1632061 -955991 -158541 428545 893007 1230959 1037834 201421 -720373
41598 -720373 -1286658 -1707932 -2140839 -2179131 -1629713 -1082622 -1037431 -1144936 -1033020 -1135856
41588 -1135856 -1785604 -2182987 -1443059 -213791 9554 -988806 -1898264 -1754561 -932707
41579 -932707 -148203 431518 741309 429984 -565717 -1666047 -2264017 -2265741 -1859015 -1286113
41569 -1286113 -982259 -1297937 -1838109 -1685491 -590930 599163 1023488 809202 654132
41560 654132 882959 1321282 1721252 1882414 1614252 967006 340331 80679 98096 53395
41550 53395 -244749 -746025 -1233098 -1376649 -974398 -261797 267748 451394 582467 867016
41540 867016 1111598 1092228 847106 383587 -515299 -1838738 -2959359 -3092079 -2108735
41531 -2108735 -712331 139666 -60156 -1023743 -1899987 -2031872 -1561009 -1090052 -797486
41522 -797486 -325633 360320 594833 -79813 -1051682 -1277618 -610981 85192 138102 -194197
41512 -194197 -376102 -499366 -1086882 -2176312 -3089705 -3248594 -2890896 -2705086 -2930278
41503 -2930278 -3160502 -2981695 -2404988 -1606058 -672628 185889 613019 629806 808318 1510672
41493 1510672 2311375 2665523 2777482 3152214 3597023 3506684 2993190 2772248 2849933 2330873
41483 2330873 890917 -460322 -653637 81780 718655 728600 288715 -300253 -729631
41474 -729631 -571568 288087 1311813 1923363 2208856 2500967 2577103 1921664 615405
41465 615405 -685333 -1592492 -2208794 -2529216 -2253798 -1357878 -358858 227877 417459
41456 417459 586979 975019 1426744 1509138 919267 -88281 -825520 -924799 -772392 -903239
41446 -903239 -1189826 -1074806 -505820 -133892 -468317 -1163162 -1297146 -263484 1560189
41437 1560189 2926374 2746909 1280984 54529 245443 1402021 2184075 2039965 1478404
41428 1478404 902616 107551 -897141 -1428018 -979098 15532 754210 1015791 1094067
41419 1094067 1116924 926489 470045 -115871 -734128 -1312053 -1636517 -1513335 -1056811 -560973
41409 -560973 -111809 422675 1017100 1356524 1171273 547125 -200214 -859316 -1397002 -1708453
41399 -1708453 -1461327 -387328 1246276 2661142 3236291 3059426 2676226 2448013 2397849
41390 2397849 2541650 2968278 3548861 3916822 3855681 3441184 2744313 1759640 768538 336396
41380 336396 599641 873868 422948 -551134 -1160357 -1013475 -626744 -526248 -443525 199225
41370 199225 1265266 1867354 1420465 380908 -272512 -108007 450649 796853 814391
41361 814391 784624 889300 1081029 1357276 1830310 2402362 2615179 2097977 1123169 452279
41351 452279 518874 942596 1028611 614133 142438 -60477 -187052 -451624 -568182 -125398
41341 -125398 711524 1342743 1535937 1623637 1846443 1965916 1694410 1106599 446139 -75964
41331 -75964 -128281 563533 1565171 1829525 990664 99872 363982 1452664 1883581 1008938
41321 1008938 -233606 -711352 -460615 -270703 -478289 -712913 -594533 -232364 -37425
41312 -37425 -248446 -665857 -838160 -559991 -99859 178689 229888 129435 -259393 -973188
41302 -973188 -1496668 -1237406 -455363 -115206 -683463 -1603454 -2106250 -2008403 -1545336 -1004962
41292 -1004962 -790987 -1266597 -2155748 -2582563 -2087696 -1170144 -486721 -47872 342271
41283 342271 413006 -133082 -871470 -1047445 -539959 142487 645588 975198 1089941 908273
41273 908273 653752 623590 653500 353407 -172434 -420440 -306862 -293883 -606684 -887596
41263 -887596 -778466 -337699 270533 977418 1505830 1412748 747200 192153 172585 214918
41253 214918 -387775 -1584540 -2672675 -3138741 -2926614 -2074481 -690255 655800 1057808
41244 1057808 128009 -1465630 -2549798 -2497651 -1680022 -1008564 -1154365 -2115664 -3348235
41235 -3348235 -4231372 -4465669 -4121080 -3399327 -2452199 -1472274 -827487 -840825 -1318397 -1515821
41225 -1515821 -879416 215142 782413 368450 -422457 -703361 -320680 167586 284316
41216 284316 13155 -514707 -1264562 -2088649 -2561507 -2269772 -1245669 -41454 655636
41207 655636 584460 175064 147759 717775 1309413 1211235 368793 -681256 -1480154 -1906392
41197 -1906392 -1899842 -1438642 -912543 -1058016 -2174917 -3617628 -4376010 -4068554 -3111866
41188 -3111866 -2015037 -899062 156231 676329 202827 -851141 -1283047 -421099 950488
41179 950488 1517261 1124352 859254 1410026 2166607 2321309 2048330 1889355 1619539 688821
41169 688821 -576924 -1279590 -1345660 -1549309 -2047255 -1984629 -921402 345009 942739
41160 942739 1066566 1282786 1425817 1018650 286781 -108001 -53824 39369 -8023 -155161
41150 -155161 -637626 -1604428 -2386101 -2038717 -706849 380675 453103 -49764 -510001
41141 -510001 -1060201 -1962543 -2774261 -2878249 -2446792 -2143397 -2072109 -1739622 -1028187 -504346
41131 -504346 -558132 -790744 -619951 -144963 8594 -451982 -1183803 -1751482 -2092815 -2306301
41121 -2306301 -2312586 -2059017 -1893163 -2286422 -3100396 -3518759 -2974965 -1896958 -1209699 -1267608
41111 -1267608 -1659319 -1977247 -2292311 -2738912 -3057689 -2854103 -2081548 -1004424 130385
41102 130385 1108471 1607807 1427464 863797 543411 776294 1259900 1477893 1206683 585533
41092 585533 -82382 -482056 -456298 -213167 -219507 -683465 -1239105 -1358474 -1021771 -753641
41082 -753641 -990800 -1614384 -2143968 -2221407 -1860051 -1375936 -1119277 -1127213 -1023150 -445899
41072 -445899 400289 872110 642091 54180 -402143 -644495 -773883 -625387 27119 972484
41062 972484 1712924 2079775 2304433 2481247 2384402 1919290 1382995 1107713 1111278 1212264
41052 1212264 1218093 915763 220538 -507095 -634318 23069 927531 1477746 1645697 1729713
41042 1729713 1824979 1890364 2027085 2228884 2071049 1186201 -8029 -564923 -53809 1045125
41032 1045125 2004192 2451833 2257473 1396016 259563 -334509 64657 923808 1300061
41023 1300061 900338 176422 -486838 -1098497 -1506912 -1187092 -35107 1081326 1223831
41014 1223831 641634 403780 787706 918473 351878 77446 1081385 2545546 2692152
41005 2692152 1287311 47089 266114 1201657 1438384 865826 382455 355191 465254
40996 465254 671806 1182400 1605296 1267053 469119 327549 1036146 1333184 298017
40987 298017 -1194895 -1643391 -914237 -77678 449666 1469494 3473321 5427356 5717312
40978 5717312 3980756 1473522 -297284 -854660 -610261 56127 1083947 2202047 2705797
40969 2705797 2140130 946421 808 -419806 -807409 -1538767 -2244173 -2265301 -1493715
40960 -1493715 -547677 -222722 -831188 -1934289 -2699687 -2701127 -2342537 -2251125 -2335147 -1885766
40950 -1885766 -683370 509657 839175 351091 -220709 -304981 228726 1284684 2503632
40941 2503632 3180633 2779498 1595222 538369 187454 306016 305847 -67644 -544973 -636468
40931 -636468 -120263 660663 1098375 1045783 1014553 1412606 1885703 1848300 1437419 1359131
40921 1359131 1854284 2412338 2540669 2205366 1427463 180241 -1007731 -1094723 228461
40912 228461 1838922 2376776 1783320 1017728 625964 435726 457622 1040020 1950152 2266105
40902 2266105 1644840 926989 892515 1073854 573235 -408548 -780209 -143456 697864 871221
40892 871221 321505 -584417 -1595856 -2405168 -2591323 -2207545 -1961220 -2337307 -2907890
40883 -2907890 -2957638 -2427612 -1724361 -939832 77544 1077559 1584467 1729532 2168635
40874 2168635 2939041 3047654 1668623 -607432 -2206924 -2162833 -951959 216855 674688
40865 674688 762450 1187943 2139655 3162255 3762530 3810532 3333356 2390255 1397377 1048389
40855 1048389 1383360 1355706 51331 -1920160 -3091929 -3073055 -2839498 -3019870 -3003696
40846 -3003696 -2191309 -1095025 -458675 -103130 457628 880702 510904 -321238 -567546
40837 -567546 64827 852462 1309707 1798681 2630477 3300540 3052794 1801484 193480
40828 193480 -966110 -1190850 -524791 510149 1292481 1458683 867518 -440132 -1890494
40819 -1890494 -2370390 -1277621 502859 1364224 784713 -246779 -663361 -452746 -147719
40810 -147719 58679 212986 156621 -267757 -852185 -1268188 -1429658 -1314758 -761755 161211
40800 161211 837036 587376 -591386 -2020352 -2920377 -2829173 -1746436 -241877 740758
40791 740758 597003 -360982 -1216310 -1338975 -899032 -592147 -923210 -1636669 -1835091 -875285
40781 -875285 796263 1937207 1720686 449225 -933573 -1714479 -1755143 -1379373 -1096644
40772 -1096644 -1147561 -1232979 -992700 -689985 -882172 -1408344 -1453968 -838604 -405453 -668075
40762 -668075 -889327 -227449 871570 1310389 900760 360772 75431 -168513 -372132
40753 -372132 -232065 125008 226306 189190 703724 1838790 2666338 2461654 1649721 1139139
40743 1139139 1193847 1368176 1213075 695388 133380 -76485 146747 394024 236907 -171345
40733 -171345 -334904 -191173 -157534 -416417 -720691 -975172 -1408949 -2028743 -2508181 -2811799
40723 -2811799 -3302636 -3970816 -4195711 -3633593 -2746203 -2033258 -1309775 -240083 909138
40714 909138 1589506 1639785 1134840 -2176 -1637915 -3014997 -3353178 -2716020 -1778487
40705 -1778487 -921681 -67088 762715 1281837 1333890 1056215 679253 434535 529031 927352
40695 927352 1290576 1327485 993773 256072 -859161 -1766394 -1551405 -215584 931028
40686 931028 790531 -169432 -835652 -1093251 -1501144 -1826530 -1269478 -51644 613206
40677 613206 389530 399725 1455849 2822262 3407423 3285237 3258690 3591303 3970373 4258531
40667 4258531 4517111 4556586 4116378 3375226 2836500 2787428 3081954 3234326 2623913 1035870
40657 1035870 -845751 -2021431 -2443249 -3006495 -3966257 -4245964 -2992070 -1021790 227482
40648 227482 629209 1172440 2174761 2858369 2686315 2037982 1349403 520373 -460485
40639 -460485 -1062932 -859860 -133968 526291 857444 904712 778614 663869 695036 631862
40629 631862 71358 -831219 -1361000 -1275308 -1315530 -2174739 -3331662 -3573363 -2575734 -1339405
40619 -1339405 -932470 -1303892 -1627189 -1459218 -1110728 -974688 -990299 -971058 -1058780 -1401898
40609 -1401898 -1589108 -1028655 23675 466125 -252211 -1274787 -1425960 -744665 -234084
40600 -234084 -327524 -430120 -11282 643945 1028366 1112596 1096196 955750 635850 340770
40590 340770 276402 343855 341940 223753 -31227 -467473 -864259 -794700 -286888 -29509
40580 -29509 -476809 -1060351 -843113 169895 919701 556893 -582542 -1403762 -1206573
40571 -1206573 -280317 520189 689266 565352 886901 1870746 2872866 3009308 1958540
40562 1958540 124288 -1735157 -2919442 -3121592 -2616592 -1986618 -1509302 -998028 -358513
40553 -358513 27010 -223566 -853063 -1160351 -771982 -82 470750 102171 -1085555
40544 -1085555 -2410172 -3065661 -3002558 -2997462 -3553920 -4097360 -3766814 -2736066 -2070073 -2299336
40534 -2299336 -2815584 -2872091 -2608621 -2709256 -3379923 -4054077 -4003837 -3004308 -1450379 19533
40524 19533 996792 1435647 1373242 729640 -435034 -1662677 -2443105 -2756913 -2926041 -2967012
40514 -2967012 -2552873 -1736899 -1239678 -1664366 -2684199 -3371580 -3217845 -2511061 -1769965
40505 -1769965 -1173559 -664732 -306315 -218908 -248954 -37872 478488 937473 1132489 1422113
40495 1422113 2135613 2788376 2542450 1492710 769826 1045720 1618251 1533054 1027069
40486 1027069 1047831 1663127 1877779 1066979 -177459 -819204 -414751 781643 2184944
40477 2184944 3099817 3042910 2179208 1211895 693035 641082 782780 781275 256341 -901789
40467 -901789 -2148804 -2723443 -2589049 -2412287 -2475100 -2264129 -1451953 -611140 -386589 -444800
40457 -444800 58400 1182381 2025713 1846155 865145 -135937 -653636 -722736 -560531
40448 -560531 -229569 242326 541029 204821 -737341 -1588935 -1821160 -1806282 -2189560 -2790281
40438 -2790281 -2899060 -2562435 -2579998 -3021576 -2807662 -1331367 428878 1237817 1319771
40429 1319771 1734799 2494614 2460378 1115405 -552431 -1259823 -905696 -496084 -905286
40420 -905286 -1929177 -2441852 -1485098 663807 2601932 3128911 2334603 1257967 735078
40411 735078 790338 898131 597432 31378 -53516 801826 1885680 1986438 1120865 729040
40401 729040 1663778 2877993 2916378 1964633 1392595 1771536 2432938 2699750 2522081 2077492
40391 2077492 1692828 1968179 3024794 3857387 3477552 2488433 2338822 3121942 3429866
40382 3429866 2478586 1019653 -141647 -1171966 -2234176 -2731022 -2257309 -1367679 -753384
40373 -753384 -483680 -546967 -1152283 -1896416 -1686075 -299034 900132 674620 -493083
40364 -493083 -1419218 -1964415 -2663758 -3333302 -3337394 -2875493 -2787784 -3204043 -3410971 -3028523
40354 -3028523 -2453320 -2142762 -2180610 -2502920 -2920254 -3019576 -2613950 -2106754 -1893319 -1752711
40344 -1752711 -1433381 -1335715 -1755961 -1918262 -869203 892508 1845139 1474953 746493
40335 746493 457483 299131 -133437 -513537 -530483 -584602 -1081047 -1661021 -1744595 -1360840
40325 -1360840 -899018 -428941 219972 984189 1604079 1940362 1943957 1522728 722335 -120688
40315 -120688 -623431 -653153 -322343 123826 403159 429072 446615 671897 866109 623476
40305 623476 9816 -504901 -673998 -558580 -115634 632459 1048355 336621 -1213293
40296 -1213293 -2228125 -1911254 -1034591 -780404 -1205695 -1493082 -1263166 -889304 -715857
40287 -715857 -666137 -640828 -749844 -988092 -1038989 -636229 -10852 215270 -296791 -1076120
40277 -1076120 -1260824 -690041 -184366 -317924 -342286 857759 2928761 4192620 3749099
40268 3749099 2386238 1082292 -210097 -1593016 -2222905 -1489154 -409538 -443663 -1314488
40259 -1314488 -1467332 -588418 -100417 -797074 -1459913 -682526 1014681 1995118 1778845
40250 1778845 1343246 1418272 1615365 1379140 857828 432642 81033 -260260 -190564 645016
40240 645016 1772645 2275263 1947775 1468221 1309538 1094832 336824 -735675 -1563015
40231 -1563015 -2023929 -2239310 -1979071 -1026777 40036 295907 -224877 -465733 185312
40222 185312 1110702 1461806 1215497 797739 349731 -50431 -54934 349313 396528 -490994
40212 -490994 -1629579 -1801908 -853192 257820 851119 1078938 1129826 881717 572501
40203 572501 852002 1672405 1908953 740437 -1144791 -2400115 -2654961 -2554397 -2457471
40194 -2457471 -2005312 -1067034 -285363 -254202 -679683 -882444 -839938 -1160768 -2084771 -3045441
40184 -3045441 -3372574 -3022588 -2393765 -1775075 -1293977 -1113600 -1254973 -1399316 -1322917 -1412197
40174 -1412197 -2210179 -3445375 -4089493 -3553737 -2336190 -1277053 -668536 -389316 -435221
40165 -435221 -891853 -1687342 -2694478 -3756890 -4358742 -3758864 -1922263 42748 852883
40156 852883 206992 -1281210 -2759649 -3329325 -2324907 -270136 1008774 306040 -1229891
40147 -1229891 -1397496 209186 1880214 2290054 1912879 1619723 1303370 674994 241867
40138 241867 442566 650772 148798 -512251 -277620 674779 1159846 828232 619212 1209626
40128 1209626 2047358 2347100 2248227 2412361 2964746 3385823 3197457 2343345 1089454
40119 1089454 -65054 -511505 1449 942594 1334591 716334 -334410 -823151 -463398
40110 -463398 47611 -4425 -378543 -269952 410978 738414 34725 -1049781 -1271216 -386436
40100 -386436 591060 724246 157525 -392209 -631473 -797426 -1086906 -1429710 -1746216 -2062241
40090 -2062241 -2323098 -2338505 -1995346 -1409658 -869493 -731515 -1265185 -2328094 -3197608
40081 -3197608 -3062733 -1858273 -378722 611585 1118098 1511746 1705761 1256689 181680
40072 181680 -929868 -1738819 -2510810 -3371265 -3781444 -3294475 -2451124 -2240493 -2770258
40063 -2770258 -3102716 -2491297 -1261180 -301147 -114164 -587568 -1336631 -1964296 -2170009
40054 -2170009 -1878256 -1246802 -495188 179660 560329 552638 460699 851648 1928690 3145267
40044 3145267 3619760 2955268 1636531 620615 438514 635614 287833 -775621 -1576987
40035 -1576987 -1233098 -362063 -569670 -2421035 -4553507 -5172070 -4004563 -2352979 -1497336
40026 -1497336 -1545980 -1799256 -1786484 -1719575 -2061746 -2858384 -3606025 -3750592 -3159127 -2072607
40016 -2072607 -867098 -34703 -44034 -790554 -1417330 -1221731 -635468 -728571 -1760658 -2830624
40006 -2830624 -3025187 -2309438 -1200489 -258245 -86982 -1056181 -2590211 -3390187 -2881222
39997 -2881222 -1924319 -1621071 -1965109 -2235947 -2174356 -2030217 -1831239 -1405414 -952551 -873263
39987 -873263 -1094633 -1170761 -988799 -798126 -596037 -108548 548993 778274 299873 -343293
39977 -343293 -368391 314334 935270 646237 -553596 -1775054 -2261958 -2255931 -2423119 -2606741
39967 -2606741 -1949095 -387939 921140 1189965 1126391 1695205 2501994 2449410 1520508
39958 1520508 766550 695373 728120 279869 -506557 -1174068 -1361391 -805995 358088 1373531
39948 1373531 1646380 1613516 2021053 2550646 2209870 1045352 305259 693212 1554163
39939 1554163 2124978 2539256 3104613 3510168 3337207 2656891 1688577 581773 -120565
39930 -120565 300724 1537831 2136837 1247991 -232421 -926606 -671835 -233385 5276
39921 5276 213782 453388 663920 991807 1457308 1616399 1153844 451865 -10195 -404442
39911 -404442 -1066662 -1665406 -1561078 -714234 351564 1163097 1347545 577518 -820452
39902 -820452 -1674482 -1230448 -262705 -83737 -782013 -1375850 -1432449 -1431458 -1564112 -1297027
39892 -1297027 -393599 536856 890904 816275 773042 864738 899355 755921 511798 433455
39882 433455 763337 1211747 935885 -435855 -2021997 -2629498 -2279659 -1975141 -2068149
39873 -2068149 -1855411 -932839 30214 253259 -197321 -822051 -1386762 -1783672 -1798110 -1483895
39863 -1483895 -1310173 -1533475 -1825564 -1841691 -1728339 -1755827 -1873900 -1933811 -1929039 -1739085
39853 -1739085 -1099024 -135595 536300 603757 502674 721854 1099791 1192791 922776 473343
39843 473343 -40545 -405005 -251546 384621 873709 824181 654492 794750 815535 114797
39833 114797 -862014 -992375 -35635 984545 1109310 502429 -55904 -193022 -125114 -166565
39823 -166565 -418476 -815567 -1219362 -1435701 -1244396 -540605 418878 979607 618466 -380424
39813 -380424 -1105605 -1066790 -718313 -688072 -919279 -1013063 -1010184 -1189327 -1348261 -1057586
39803 -1057586 -591872 -807446 -1870862 -2781202 -2552120 -1414098 -436432 -266225 -624244
39794 -624244 -835108 -477422 407208 1429951 2126196 2259707 1921246 1357859 781397
39785 781397 306300 -61207 -337159 -330825 335190 1650120 2788783 2795814 1797450 988051
39775 988051 1145767 1692776 1675802 1206454 1235543 2096623 3012657 3120765 2374552 1270627
39765 1270627 271402 -196424 270995 1501120 2442022 2012019 298064 -1467927 -2197996
39756 -2197996 -1947383 -1595235 -1820360 -2535254 -3157273 -3260679 -2954043 -2645529 -2495742
39747 -2495742 -2272047 -1799990 -1276285 -879754 -338989 661612 1766667 2181149 1674376
39738 1674376 853397 313644 33717 -188008 -267530 -176639 -235651 -564955 -659877 -93531
39728 -93531 682218 902475 654207 743529 1406365 1856290 1325681 47600 -1058569 -1365880
39718 -1365880 -1025291 -679765 -771846 -1032532 -806518 -50514 364712 -225594 -1244814
39709 -1244814 -1608601 -1185808 -713442 -473952 -71710 474944 527849 -35294 -534700 -707347
39699 -707347 -1137425 -1951265 -2212381 -1407961 -484378 -361522 -332683 749205 2331100
39690 2331100 2693284 1407690 -120779 -622340 -259344 205729 404657 214123 -392176
39681 -392176 -935811 -702138 201206 798749 587686 130535 -65197 -366341 -1098624 -1625898
39671 -1625898 -1219937 -327499 -22356 -418552 -520584 316606 1523665 2125290 1880213
39662 1880213 1311340 904352 597212 33929 -824079 -1445936 -1215174 -195052 781684
39653 781684 946560 385315 -180424 -269790 -54982 50089 -73756 -235759 -281548 -277459
39643 -277459 -377756 -647545 -1060055 -1551210 -1962389 -2014595 -1527705 -657530 262566 1082933
39633 1082933 1789427 2149661 1859684 1171006 853843 1204833 1565739 1292772 754917
39624 754917 728445 1139994 1199941 637920 -13512 -371780 -624275 -855830 -747957 -235852
39614 -235852 222175 369554 527333 887387 1029000 565873 -255633 -1037860 -1792392 -2548647
39604 -2548647 -2928075 -2696442 -2309147 -2262664 -2241632 -1602949 -491178 236963 141771 -366010
39594 -366010 -732789 -852274 -870565 -864503 -847610 -793645 -611066 -344873 -333865 -844405 -1616443
39583 -1616443 -2130229 -2266217 -2308631 -2334344 -2071210 -1456059 -881804 -651852 -503646 28498
39573 28498 913250 1527654 1268963 173768 -1074717 -1742917 -1660650 -1225045 -833942 -473494
39563 -473494 55852 659957 876756 299834 -919765 -1963329 -1916454 -747509 382711
39554 382711 228960 -1094318 -2265820 -2416702 -1975299 -1605882 -1112553 -50245 1200773
39545 1200773 1862763 1940597 2083156 2409760 2366040 1784832 1249545 1203394 1407966 1532313
39535 1532313 1632011 1736051 1547886 964113 456994 543718 1170394 1903263 2418757 2553013
39525 2553013 2228409 1671663 1416403 1715669 2129283 2011776 1266244 324031 -486083
39516 -486083 -1192154 -1794621 -1956950 -1327323 -134431 782823 796445 301174 338794 1257870
39506 1257870 2175475 2155550 1518000 1346743 1947390 2588153 2724039 2566652 2204642 1087074
39496 1087074 -1009395 -3163030 -4226790 -4213124 -4023862 -3983177 -3428153 -1896251 -75466
39487 -75466 861052 610210 5555 -93501 167394 -965 -810059 -1526395 -1460262 -809829
39477 -809829 -150873 406425 926500 954280 39656 -1203419 -1588398 -992761 -483552 -601954
39467 -601954 -660356 -214777 -40429 -779307 -1613494 -1401203 -425880 181471 257308 553846
39457 553846 1125869 1098656 134353 -1018494 -1685918 -2007458 -2219764 -2082111 -1413410 -505112
39447 -505112 359681 1192711 1822344 1784231 1074283 457997 626388 1465993 2442678 3217377
39437 3217377 3583275 3331601 2607882 1998689 1871939 1957786 1869177 1635881 1414628 1109556
39427 1109556 660397 314894 233891 202384 93632 188478 617004 958494 940199 1090195
39417 1090195 2002635 3244129 3727852 3057473 1850316 818546 185376 -21004 220121
39408 220121 693451 1073271 1381270 1854073 2358768 2512298 2397979 2457397 2510611 1676553
39398 1676553 -295222 -2272714 -2922886 -2208101 -1121299 -311622 328080 914006 1194501
39389 1194501 1042922 776000 775997 1128373 1720410 2350822 2664339 2386002 1827134 1828734 2913204
39378 2913204 4658292 6112288 6668938 6358802 5497165 4375807 3272783 2474264 2127958
39369 2127958 2107563 2077385 1767595 1295074 1170957 1775751 2774851 3301859 2866916 1865948
39359 1865948 1025813 605623 399571 252066 165544 66709 -82773 -37213 389923 794489
39349 794489 581703 -31546 -68908 885858 2044606 2524658 2551567 2944583 3799217 4421591
39339 4421591 4423609 4169611 4100237 4234845 4487013 4937846 5554840 6021783 6075392 5742886
39329 5742886 5124900 4265531 3396086 2985340 3291699 4019021 4563507 4494084 3798677 2897305
39319 2897305 2425231 2705854 3374026 3788834 3824797 3908156 4266743 4614594 4707622 4732848
39309 4732848 4919290 5191142 5456088 5811959 6179960 6154267 5548645 4703023 3934330 3141194
39299 3141194 2334430 2027672 2525820 3251884 3431545 3117804 2878259 2795303 2555123 2299492
39289 2299492 2523655 3195468 3820519 4395745 5423456 6822085 7664054 7306976 6124306
39280 6124306 4873981 4002875 3771029 4268176 4943998 4883825 4038329 3535228 4285233
39271 4285233 5877590 7304750 8112033 8323300 7982695 7465792 7561346 8450486 9223063
39262 9223063 9244858 9344361 10614453 12631942 14099592 14829352 15727439 17075808 18348619
39253 18348619 19749106 22363290 26468161 31137994 36000669 42001570 49848200 59084553
39245 59084553 69453899 81849750 97092825 115152636 136540392 163000904 195808352
39238 195808352 235307687 283411642 342929181 409465587 464961473 485793242 461545059
39231 461545059 404388783 338129325 279739722 232744413 194424167 163446998 139721000
39224 139721000 121404239 105566191 90974805 78411074 68590981 60985886 54545055
39217 54545055 48697313 43548705 39504706 36662999 34376377 31633560 28095518 24510057
39209 24510057 21879578 20455534 19713989 18974752 17787439 16073516 14299895 13292827
39201 13292827 13439304 14123786 14284486 13504048 12276783 11228058 10396497 9421507 8231694
39192 8231694 7288222 7060352 7362121 7431346 6796864 5889633 5520558 5855363 6300644 6421927
39182 6421927 6462899 6683957 6655763 5771392 4301103 3345398 3591741 4515338 5053080 4806334
39172 4806334 4268157 3990224 3920453 3692491 3258454 2898956 2718235 2535404 2338286 2411149
39162 2411149 2774446 2917153 2507790 2037322 2190635 2802474 3125925 3059014 3308027 4187963
39152 4187963 5050584 5246257 4958242 4650337 4346559 3998713 3937589 4261245 4294333 3462684
39142 3462684 2323763 1865358 2055589 2032431 1599530 1495474 2046196 2531411 2272405
39133 2272405 1588364 1214580 1329828 1583590 1660666 1479376 1195783 1233747 1884649 2691252
39123 2691252 2758043 1935794 1133745 1095556 1421259 1282083 637743 188947 422006 1170487
39113 1170487 1888405 2033618 1525662 1111434 1742311 3146278 3653660 2165150 -217586
39104 -217586 -1410142 -854675 139767 346160 -177331 -865380 -1501088 -1909194 -1693260
39095 -1693260 -819159 155453 878453 1658973 2701100 3492020 3534684 3204853 3205586 3469523
39085 3469523 3272323 2304097 1043044 117187 -186411 195839 1150813 2159295 2455605
39076 2455605 1723396 503819 -234496 93135 1227935 2250942 2310248 1429686 587442
39067 587442 729949 1690128 2372053 2062538 1198105 630021 493430 243556 -348427 -793069
39057 -793069 -616802 -46181 365660 490632 587995 713278 694537 669090 1043360 1730902
39047 1730902 2015855 1574206 1141062 1590674 2684723 3399554 3319951 2987060 2885428
39038 2885428 2848121 2644233 2433582 2270571 1745531 592146 -767698 -1732157 -2212553
39029 -2212553 -2383187 -2118326 -1253974 -182890 415442 377169 78115 -296186 -948459
39020 -948459 -1830612 -2315043 -1832384 -642176 274607 100326 -1034999 -2095690 -2058900
39011 -2058900 -915137 341200 800411 492534 8900 -347989 -610074 -620424 -93429
39002 -93429 796945 1434055 1486494 1189464 811263 326471 -193032 -363135 -28117 336049
38992 336049 181694 -345685 -608031 -352540 -809 -11946 -271757 -308809 12795 246611
38982 246611 -108417 -963256 -1729783 -2051904 -2151682 -2288981 -2221796 -1619937 -813615 -560841
38972 -560841 -1034972 -1584432 -1666129 -1495660 -1464249 -1399016 -921522 -264681 -128899 -715153
38962 -715153 -1383497 -1452671 -1042591 -885771 -1412767 -2230177 -2549604 -2032688 -1091149 -350832
38952 -350832 5305 224350 477963 647729 582084 290040 -151583 -634149 -931957 -854512
38942 -854512 -538830 -313494 -216811 35415 519973 896742 874418 555199 165425 -202787
38932 -202787 -409350 -226096 269421 628812 623768 525665 544068 467323 226419 282682 914536
38921 914536 1602108 1793514 1857310 2434787 3134780 2879461 1558069 368522 262842
38912 262842 854436 1193044 899020 109258 -1053554 -2382224 -3368199 -3637135 -3400911
38903 -3400911 -3104508 -2836916 -2419312 -1859491 -1362622 -997530 -615532 -48989 720966
38894 720966 1475073 1810974 1524668 967438 717694 852603 897642 537194 -50003 -590443
38884 -590443 -894520 -574186 650914 2072446 2266897 849158 -776536 -1182832 -783831
38875 -783831 -956316 -1801985 -2038692 -1041893 226910 597501 6002 -923661 -1713546
38866 -1713546 -1964551 -1270379 121588 1120003 948436 136216 -241480 17634 214219
38857 214219 -105787 -651069 -944480 -750251 58885 1416083 2668939 2848757 1699302
38848 1699302 115477 -756352 -621664 9721 669737 1284950 1805756 2016264 1902226
38839 1902226 1856598 2209843 2708988 2757223 2133177 1220886 514391 146488 501 65105
38829 65105 482280 1311254 2356921 3201846 3426242 2968908 2307600 2057406 2301645 2579085
38819 2579085 2643556 2841256 3422204 3861431 3397916 2047677 518684 -741336 -1747891
38810 -1747891 -2286274 -1877540 -728078 66960 -198003 -936576 -1205789 -976326 -755438
38801 -755438 -478591 206768 815603 392370 -837906 -1340657 -296442 1227466 1837034
38792 1837034 1659467 1631277 1626338 679031 -1056419 -1988945 -1171878 377982 1102311 837148
38782 837148 563521 832991 1334195 1700785 1864288 1695198 1088101 457264 463134 1119955
38772 1119955 1747466 1897195 1735968 1423621 819106 65210 -229279 173698 680659
38763 680659 710850 498921 533804 671166 454248 -22911 -291223 -376907 -792695 -1652017
38753 -1652017 -2375405 -2379034 -1647159 -588730 316702 747664 760844 757571 975909 1184717
38743 1184717 1162492 1138440 1291313 1197265 458716 -430101 -677558 -433957 -481367 -832232
38733 -832232 -806051 -559699 -1148040 -2563353 -3072832 -1458003 1112654 2550079 2421669
38724 2421669 1923510 1922125 2357102 3241158 4796974 6492171 7189344 6610990 5688238
38715 5688238 5113758 4485541 3365333 2308545 2093440 2472843 2476383 1727889 814126
38706 814126 387305 409731 401726 138593 -88408 114772 647867 907327 537430 -4719
38696 -4719 -34425 273675 -53872 -1428913 -2907206 -3192987 -2158237 -902173 -427092
38687 -427092 -704432 -1061538 -1067034 -837893 -722547 -915636 -1277431 -1341960 -593416 991681
38677 991681 2638643 3322306 2859479 2237439 2493575 3385558 3660458 2705473 1394196
38668 1394196 1003176 1719545 2629223 2875756 2387852 1669921 1311198 1573579 2102712
38659 2102712 2201800 1708953 1327318 1669551 2307253 2337015 1587942 574202 -484602
38650 -484602 -1726861 -2862784 -3310675 -3186031 -3160245 -3163804 -2336685 -668535 473009
38641 473009 192100 -551997 -362083 599272 1142001 996113 968953 1399093 1687191 1457520
38631 1457520 1167785 1319702 1826285 2353473 2634755 2355420 1437133 555369 614482 1505968
38621 1505968 2147269 2013865 1808381 2176178 2586877 2201500 1231064 576590 465743
38612 465743 314562 -169255 -575512 -609764 -634035 -1067050 -1676653 -1824636 -1212953 -134207
38602 -134207 898123 1567677 1854590 1875730 1685009 1240173 563574 -149444 -678904 -987767
38592 -987767 -1166512 -1213169 -1030277 -659410 -347846 -267699 -257526 11613 604610 1179365
38582 1179365 1371562 1268694 1339632 1820161 2303325 2113483 1053193 -379534 -1488406
38573 -1488406 -1889716 -1535065 -549802 736951 1801444 2254361 2136248 1736635 1240555
38564 1240555 770795 613835 980349 1506290 1437432 542860 -494550 -907188 -776012
38555 -776012 -723915 -885483 -744159 -13905 875604 1393720 1566131 1722575 1962182 2231109
38545 2231109 2597459 2969223 2767965 1482282 -438618 -1752239 -1637478 -431336 890429
38536 890429 1615987 1636561 1301044 1101345 1203705 1192751 589500 -360134 -882578 -763616
38526 -763616 -659868 -1053357 -1508318 -1465201 -1246460 -1556451 -2256504 -2402591 -1499211 -96106
38516 -96106 963826 1400460 1471667 1497019 1578723 1558409 1190287 547565 166752 473536
38506 473536 1136644 1370037 866511 61857 -528250 -837061 -1056030 -1280104 -1437598 -1310628
38496 -1310628 -646933 434573 1241041 1153079 437239 -84341 -148605 -222981 -509691 -539900
38486 -539900 -72432 314608 49101 -565358 -893363 -944953 -1140562 -1398877 -1216608 -611274
38476 -611274 -288292 -677668 -1284172 -1280760 -518190 290770 361874 -275918 -774235 -463769
38466 -463769 237862 263330 -725855 -1893775 -2396546 -2420700 -2536217 -2508824 -1587436 171282
38456 171282 1707940 2219875 1926020 1377080 685049 -188089 -950469 -1301938 -1351285 -1224228
38446 -1224228 -617998 635002 1793754 1758691 456688 -996708 -1719289 -1990893 -2389951
38437 -2389951 -2673648 -2252863 -1387259 -978637 -1211542 -1331023 -1004251 -974488 -1808100 -2791893
38427 -2791893 -2913099 -2380514 -2175259 -2396058 -2155150 -1109021 -343 571940 921489
38418 921489 1380415 1533476 966757 100448 -371933 -352575 -88981 378339 881240 793808
38408 793808 -180291 -1295281 -1637519 -1406714 -1527762 -2232270 -2854561 -2879258 -2369581 -1478161
38398 -1478161 -414443 135002 -480055 -1740056 -2188779 -1139772 510774 1483554 1526940
38389 1526940 1304017 1400184 1809134 2055017 1597991 423131 -714118 -1026985 -669980
38380 -669980 -472569 -757838 -1088955 -1188132 -1283653 -1366638 -955622 40767 961506 1261462
38370 1261462 1072848 642278 47555 -187336 789204 2817070 4472421 4905381 4962761
38361 4962761 5555960 5937092 4943690 3216139 2568983 3432710 4446427 4568359 4137658
38352 4137658 3672402 3033259 2222140 1786788 1849513 1737523 1144420 726875 951876 1265432
38342 1265432 1127455 1045691 1715343 2759835 3225356 2888141 2245264 1595678 976190
38333 976190 688010 958479 1218869 629266 -647599 -1524563 -1480435 -1215660 -1560920 -2377791
38323 -2377791 -2902024 -2702344 -1959444 -1174753 -897342 -1368600 -2117199 -2247756 -1489330
38314 -1489330 -652569 -642414 -1295484 -1704179 -1502631 -1189708 -1147627 -1015556 -361456 527183
38304 527183 1005678 953938 823927 947730 1243503 1528466 1657259 1364243 485491 -550254
38294 -550254 -952282 -502360 177871 500097 546663 561410 436822 238057 630552 1969435
38284 1969435 3367276 3646076 3048775 2946549 3777870 4383607 3749161 2375810 1307611
38275 1307611 678096 42388 -525945 -656414 -630243 -1124199 -2084877 -2679618 -2420679 -1680423
38265 -1680423 -1038546 -723847 -759929 -1029955 -1027128 -142140 1462727 2670305 2474825 1079799
38255 1079799 -265878 -435299 607652 1845899 2197312 1577667 881097 810864 1081768
38246 1081768 1116752 1080328 1518685 2253834 2571910 2510591 2929915 4002095 4641050 4028351
38236 4028351 2831810 2107590 1743403 1051730 398307 905585 2517556 3611473 3010173
38227 3010173 1468159 504381 403783 191085 -698011 -1574227 -1481466 -436418 714375
38218 714375 1412166 1893566 2531444 3096836 3068249 2524997 2214884 2564992 3046746 2865343
38208 2865343 1994281 1116999 735603 816623 1244647 2074936 3163064 3947794 3911934 3143703
38198 3143703 2282780 1927125 2074236 2114156 1541977 773905 890139 2209949 3527538
38189 3527538 3454208 2300724 1711195 2352300 2990018 2320360 789995 -188357 -147661
38180 -147661 283156 734116 1496246 2572227 3294956 3169355 2423500 1482794 493926
38171 493926 -388054 -849249 -913795 -1081753 -1576684 -1922961 -1739184 -1518292 -1978838 -2873843
38161 -2873843 -3156214 -2372048 -1290758 -939804 -1460776 -2221446 -2750461 -3172179 -3791245
38152 -3791245 -4559214 -5047513 -4847958 -3979584 -2961841 -2441676 -2611282 -2967055 -2769742
38143 -2769742 -1827162 -747009 -334207 -807817 -1685170 -2284585 -2135326 -1058270 683926
38134 683926 2193024 2394322 1151996 -305420 -585933 281254 938963 431530 -662309
38125 -662309 -1051312 -252802 1090690 2143355 2656730 2851438 2905672 2724529 2103305
38116 2103305 1055472 -16628 -590456 -568145 -420939 -612272 -1007529 -1142763 -1025521
38107 -1025521 -1261278 -2187516 -3191954 -3273261 -2213849 -850488 -142106 -314135 -1041744
38098 -1041744 -2017467 -2904807 -3067808 -2075036 -521891 329992 7119 -648780 -731039
38089 -731039 -408725 -281098 -225901 254949 944575 1179762 1060284 1320784 1921041 1868063
38079 1868063 789925 -331938 -556544 -238579 -216058 -471187 -364303 334888 1356266
38070 1356266 2390084 2993328 2583099 1262664 127789 -57997 36570 -552725 -1402585
38061 -1402585 -1323224 -304404 451756 320697 -208969 -790423 -1640873 -2478701 -2407743 -1373314
38051 -1373314 -548032 -665048 -1044671 -930493 -721249 -1041910 -1528504 -1502766 -1139511 -1020646
38041 -1020646 -1104463 -1002671 -737234 -405785 302817 1372201 1862824 1081206 -187905
38032 -187905 -707771 -552892 -651150 -1035599 -991728 -687701 -1026603 -1776751 -1503980 161650
38022 161650 1703994 1896750 1458820 1576882 1927753 1405786 61781 -968854 -1096493
38013 -1096493 -708382 -182704 467870 996641 940102 405961 76594 224109 402262 364869
38003 364869 602408 1489016 2393892 2287155 1067956 -303099 -1043094 -1350119 -1667003
37994 -1667003 -1658600 -649934 1014264 1944831 1484989 805317 1445001 3187801 4348313
37985 4348313 4004373 2862120 1807651 829917 -80532 -142928 1038850 2236348 1769622
37976 1769622 -305942 -2245222 -2792872 -2329596 -1761493 -1298049 -768347 -344365 -271663
37967 -271663 -279231 124205 873529 1295936 873651 -149824 -977572 -1053143 -679036 -754691
37957 -754691 -1745883 -3036967 -3579733 -3083772 -2183058 -1475963 -935785 -429967 -258849
37948 -258849 -711718 -1381893 -1453799 -663735 401718 1052088 1265886 1547844 2156178 2716706
37938 2716706 2696182 2109525 1513428 1278117 1154157 742334 121613 -319409 -489754 -614153
37928 -614153 -721573 -569843 -105631 433565 929658 1433676 1726613 1403914 646874 331606
37918 331606 926272 1737174 1789769 1115616 556522 507212 517605 130522 -460503 -693998
37908 -693998 -180987 1055063 2475214 3177695 2622230 1252123 -38699 -1039942 -2245556
37899 -2245556 -3683519 -4495277 -4083944 -3045639 -2371491 -2175667 -1879924 -1346757 -1047109
37890 -1047109 -1143606 -1136983 -622418 133269 636116 816718 961308 1215058 1390295 1204509
37880 1204509 669448 332518 972535 2703001 4442053 4777637 3513350 1915596 1211461
37871 1211461 1301587 1302344 897055 559205 659925 999749 1269579 1480003 1800858 2328540
37861 2328540 3104883 4029124 4669393 4554186 3836639 3304006 3436189 3729992 3314559
37852 3314559 2084624 858245 444886 877000 1599870 2118342 2288112 2141137 1659675
37843 1659675 790910 -355440 -1398950 -1900408 -1764587 -1349226 -1048760 -850532 -506346
37834 -506346 -94021 -60935 -541237 -944687 -599833 337902 1081648 1330531 1643233 2421774
37824 2421774 3051858 2658295 1442532 508688 331960 184986 -594900 -1491194 -1583176
37815 -1583176 -951045 -517176 -665829 -815198 -434864 223427 670077 874695 1035566
37806 1035566 1062327 734396 171471 -233180 -279291 -119788 -22426 -135138 -402830 -600939
37796 -600939 -557664 -401307 -404213 -528718 -413833 43069 403565 236377 -305369 -738225
37786 -738225 -861142 -802049 -644854 -379143 -114599 21884 169223 582442 1193557 1609487
37776 1609487 1574633 1196305 711519 288065 75152 172037 453608 657636 780015 1207058
37766 1207058 2256617 3620349 4435885 4052462 2731290 1437588 818193 544168 -88039
37757 -88039 -1069843 -1650043 -1383890 -674402 -120531 107611 -11539 -605565 -1404301 -1577952
37747 -1577952 -729609 427919 1083240 1502841 2291016 2925553 2262671 431847 -1017351
37738 -1017351 -1089276 -367079 226129 549489 642920 147842 -885674 -1535867 -1245291 -775739
37728 -775739 -1018213 -1551342 -1457834 -1022736 -1361896 -2579973 -3524485 -3437457 -2791037 -2275324
37718 -2275324 -1879906 -1316621 -639342 -88145 196003 120977 -235901 -440964 -214498 -95245
37708 -95245 -840631 -2105654 -2618271 -1929885 -1057084 -917796 -1067318 -743347 -374778 -990637
37698 -990637 -2497313 -3589379 -3368011 -2251275 -1203492 -736724 -822348 -1209878 -1561858
37689 -1561858 -1606895 -1347340 -958354 -553448 -317178 -664874 -1742169 -2829441 -2891667
37680 -2891667 -1887656 -958517 -1044276 -1835794 -2446428 -2588830 -2532631 -2294054 -1607892 -619601
37670 -619601 77708 219961 146521 123752 -87318 -671740 -1198632 -1082989 -393602 250851
37660 250851 510921 634222 912275 1207982 1172821 696363 -13549 -662333 -1074617 -1249405
37650 -1249405 -1257995 -1069376 -592957 -422 238635 -29098 -197537 391700 1346969 1497900
37640 1497900 451506 -800124 -1216316 -1015936 -1063131 -1493850 -1764595 -1754845 -1911812 -2329592
37630 -2329592 -2505329 -2128480 -1416221 -552965 483729 1370201 1482822 816456 149370
37621 149370 -68273 -244077 -599546 -439386 750560 2147074 2519679 1904941 1327788
37612 1327788 1119440 664520 -174317 -581409 -110801 512174 475821 2609 -224620 -120193
37602 -120193 -7314 115773 390800 554829 333040 100282 339646 597680 -98840 -1670566
37592 -1670566 -2703709 -2110333 -411603 1048790 1597460 1471626 1131451 989501 1429438
37583 1429438 2321059 2689011 1637114 -394225 -1997484 -2464645 -2311967 -2012036 -1202084
37574 -1202084 251571 1270371 690367 -962303 -1831416 -885160 1069132 2569608 2910562
37565 2910562 2194844 793899 -758190 -1844690 -2237248 -2239748 -2131867 -1847617 -1424934
37556 -1424934 -1254731 -1489498 -1674348 -1451439 -1215147 -1494984 -2017514 -2011859 -1227596 -39614
37546 -39614 1238711 2434597 3041278 2513681 1210044 345164 693931 1795640 2645047
37537 2645047 2722010 2147700 1297108 559071 173746 86774 154227 457340 1043780 1464568
37527 1464568 1179859 438505 31349 58076 -198973 -890885 -1097155 -322329 448980 124206
37517 124206 -809859 -1089160 -633970 -430849 -708499 -613385 181979 847231 761211 378248
37507 378248 186054 -165402 -949403 -1458571 -980356 -109149 -76053 -1047518 -2023977 -2327118
37497 -2327118 -2287052 -2344564 -2295429 -1806089 -1138555 -883950 -1167546 -1448196 -1111805 -185945
37487 -185945 521708 101436 -1461194 -3043157 -3394246 -2397711 -1125782 -678841 -1210099
37478 -1210099 -2054731 -2480204 -2214017 -1525474 -973922 -916185 -1130156 -1051609 -464973 200292
37468 200292 369636 -26193 -539387 -755040 -726878 -893180 -1606437 -2684609 -3403476 -3051727
37458 -3051727 -1598527 218729 1520318 1991861 2005630 2128002 2512657 2719119 2173398
37449 2173398 908979 -232273 -356264 515339 1455099 1647713 1121914 352659 -484710
37440 -484710 -1447035 -2194703 -2030102 -796752 651889 1283860 1033740 705103 760737
37431 760737 719706 16165 -965368 -1237605 -464406 660032 1327954 1407109 1161126 728392
37421 728392 253026 95210 392502 690664 558107 359008 777480 1653748 2012793 1387565
37411 1387565 449370 33381 119624 192738 127364 169095 321178 318309 136454 70218 265436
37400 265436 497340 479960 185250 -204886 -544817 -874362 -1306440 -1709319 -1620727 -766473
37390 -766473 349399 771137 153039 -853716 -1418551 -1316981 -701124 368238 1702986
37381 1702986 2710405 2895148 2430730 1806170 1176686 513784 57279 14322 51434 -281791
37371 -281791 -815519 -1090606 -1217314 -1643074 -2197461 -2235326 -1742927 -1395012 -1349643 -902144
37361 -902144 312327 1587383 2074425 1770996 1139559 396832 -295848 -511979 -26892
37352 -26892 774482 1396695 1745456 1812752 1414161 684456 254892 402813 578626 338700
37342 338700 127273 418651 683556 112404 -1060563 -1896382 -2102611 -2097379 -1968704 -1389099
37332 -1389099 -483872 192593 550611 919842 1124160 596124 -494049 -1244648 -1368205
37323 -1368205 -1534458 -2085281 -2436025 -2187627 -1816732 -1642636 -1031301 579107 2569175
37314 2569175 3866411 4237346 4107415 3619336 2693319 1640196 914308 515721 294373
37305 294373 475184 1127499 1498219 817326 -429236 -1016912 -741011 -653812 -1377554 -2164432
37295 -2164432 -2078412 -1324258 -785362 -745692 -715183 -298571 309698 697026 766883 801264
37285 801264 1053483 1317888 1081623 321397 -67484 833655 2607498 3642261 2956459
37276 2956459 1409267 605951 917552 1238124 687751 -137988 -44600 1002268 1656831
37267 1656831 892740 -573342 -1060282 34723 1559723 2085686 1466965 563215 -50750
37258 -50750 -430636 -602026 -349129 266673 787105 897130 626176 17475 -783578 -1087154
37248 -1087154 -182446 1338275 1671871 -44408 -2329328 -3025973 -1956458 -864530 -879746
37239 -879746 -1243779 -861476 -39419 72710 -835922 -1917047 -2286309 -1809863 -845454
37230 -845454 225875 1096191 1536240 1487571 1046752 398902 -102680 26735 957362 2187290
37220 2187290 2957218 3032084 2776139 2474893 2000821 1286627 720792 751026 1302265 1867825
37210 1867825 2051842 1818031 1371015 1037292 1096313 1403491 1271875 107889 -1779729
37201 -1779729 -3319973 -3769872 -3455944 -3276644 -3619752 -3980239 -3649924 -2626011 -1669464
37192 -1669464 -1412669 -1590461 -1433045 -760869 -229198 -295132 -451788 5697 804533 991390
37182 991390 311009 -457231 -662583 -559931 -614260 -704262 -556725 -475332 -943128 -1719227
37172 -1719227 -2009986 -1559388 -1020194 -1080279 -1620630 -1998356 -1953904 -1937464 -2480676 -3411740
37162 -3411740 -3946664 -3657609 -3066783 -2914350 -3026272 -2513160 -1150764 120892 390036
37153 390036 -154876 -816127 -1476483 -2421364 -3458530 -3978924 -3747100 -3010027 -2002289
37144 -2002289 -986404 -544476 -971607 -1432903 -663767 1302221 2967228 3238269 2634995
37135 2634995 2195399 2023345 1667857 1308927 1563712 2293629 2524741 1723439 494121
37126 494121 -273962 -462414 -531415 -600439 -302916 386231 729838 100941 -981041 -1356411
37116 -1356411 -840295 -572819 -1314417 -2115294 -1542675 202825 1483259 1452658 958064
37107 958064 992385 1372875 1520843 1576755 1867795 1910130 923226 -913240 -2523901 -3176009
37097 -3176009 -3043277 -2627242 -2202450 -1850260 -1574900 -1295095 -957749 -613871 -239603
37088 -239603 281442 789721 791004 67485 -967707 -1807021 -2325379 -2406492 -1696271 -323113
37078 -323113 686565 528861 -197432 -279033 416783 953189 835695 456972 14783 -891619
37068 -891619 -2246312 -3162873 -2999548 -2262346 -1862846 -1943365 -1874192 -1065982 496287 2165985
37058 2165985 2923757 2232933 773346 -198876 -342602 -414142 -803468 -807679 119368 1234455
37048 1234455 1416417 652931 -175746 -578068 -725185 -765976 -677458 -620068 -713013 -599578
37038 -599578 72943 899002 1180567 1019287 1116527 1503982 1380571 406053 -688095 -1120405
37028 -1120405 -962059 -641627 -288092 -102183 -678955 -2152058 -3442102 -3273710 -1863331
37019 -1863331 -788702 -1051970 -1951396 -2142680 -1248332 3461 823212 993333 641810
37010 641810 -11565 -551347 -466812 309896 1169606 1456280 1265997 1319233 2023451 2967146
37000 2967146 3470919 3371869 3030674 2757257 2551699 2343800 2131592 1804039 1145328 217791
36990 217791 -490168 -585432 -329102 -357288 -844890 -1285058 -1229446 -912945 -840987 -1001690
36980 -1001690 -946665 -584548 -349340 -427113 -353226 240255 904053 949738 495141 291637
36970 291637 568359 704353 177403 -747021 -1503155 -1882553 -1920701 -1624371 -1198081 -1119581
36960 -1119581 -1534036 -1893795 -1650530 -1015258 -563830 -385693 -187364 369 -113932
36951 -113932 -420992 -510781 -456344 -806219 -1644192 -2300600 -2245155 -1687951 -1013683 -218369
36941 -218369 681667 1241013 1169908 957610 1296301 2087196 2586976 2426642 1963769 1696473
36931 1696473 1826338 2337433 2957001 3028830 2033257 404985 -703385 -719844 -236625
36922 -236625 -33712 -73258 60686 209799 -135942 -836531 -1076433 -469418 381886 660235
36912 660235 249390 -348649 -645863 -471515 27446 404918 206429 -474781 -986133 -938330
36902 -938330 -731889 -892301 -1216512 -1140628 -728840 -577210 -741425 -527688 404096 1409340
36892 1409340 1751364 1578124 1474773 1461732 1098088 388597 -88968 -21522 199124 63139
36882 63139 -356148 -487386 86390 1135489 1890500 1736981 920720 383904 705192 1431925
36872 1431925 1750405 1529585 1219851 935867 316102 -680149 -1507871 -1788683 -1772498 -1767626
36862 -1767626 -1620926 -1136717 -587690 -378057 -505737 -750939 -1104247 -1596266 -1981475
36853 -1981475 -2048040 -2005219 -2083071 -1979013 -1276006 -261908 300900 182222 -172487 -495749
36843 -495749 -952858 -1410258 -1295405 -607375 -282119 -852549 -1346016 -444709 1540195
36834 1540195 2858731 2545027 1527579 1189710 1611268 1844220 1427510 871214 738973
36825 738973 878576 733820 73890 -785564 -1351585 -1437325 -1318181 -1404824 -1742724 -1946332
36815 -1946332 -1703122 -1168426 -675704 -204526 570257 1705335 2724524 3043648 2577022
36806 2577022 1880249 1687385 2199039 2784295 2589003 1573736 691185 775674 1517752
36797 1517752 1934808 1650110 1179816 1040855 1184048 1395908 1674407 1993369 2197819
36788 2197819 2358466 2718230 3026965 2518425 988873 -615543 -1235702 -921594 -464812
36779 -464812 -227868 -45522 23454 -289791 -758569 -794203 -405305 -295490 -779503 -1244120
36769 -1244120 -1003695 -168289 682386 1247989 1555288 1602219 1361061 971468 648218 490993
36759 490993 494008 558668 438127 -52566 -689921 -1022006 -982457 -953048 -1098909 -1089941 -698341
36748 -698341 -207482 93069 371110 779806 913580 305165 -728755 -1295835 -961905
36739 -961905 -165954 383426 373172 -36903 -456175 -528128 -195652 260643 595793 930450
36729 930450 1504923 2210189 2649671 2656203 2499347 2534494 2805459 3025348 2863907 2271272
36719 2271272 1555839 1065352 801398 528875 241694 187420 359095 387467 155204 93715
36709 93715 533689 1126636 1289535 891705 136975 -809363 -1591681 -1549131 -557665 352586
36699 352586 63098 -1131339 -1951077 -1937622 -1828861 -2085019 -2181984 -1764984 -1436745 -1690293
36689 -1690293 -1887011 -1182413 49806 603500 -13063 -1164747 -2040163 -2310241 -1933883
36680 -1933883 -1002273 118065 949049 1280973 1120891 461717 -444859 -815841 -28487
36671 -28487 1401662 2185584 1734652 686135 -164226 -731276 -1100854 -884290 145274
36662 145274 1208939 1222840 328347 -74199 914317 2497221 3164130 2462998 1283510
36653 1283510 582291 402242 225203 -188150 -600404 -701518 -438609 -28978 200259
36644 200259 98897 -35729 375113 1546834 2957886 3829617 3885759 3438754 2891686
36635 2891686 2481055 2383162 2623004 2865532 2757225 2558263 2911906 3749074 3965456 2679224
36625 2679224 476494 -1145941 -1420726 -870509 -312730 94773 646397 1405404 2076525
36616 2076525 2358235 2144998 1470597 486523 -486446 -1052519 -1020838 -614041 -329427 -498157
36606 -498157 -967496 -1265073 -1030292 -203784 1049113 2301379 2826969 2082205 404047
36597 404047 -1166323 -1973405 -2253020 -2339436 -2010783 -1177992 -609265 -1033491 -1821454 -1618965
36587 -1618965 -286811 852033 906928 492850 473582 678342 599250 476129 730090 980953
36577 980953 720119 523888 1394955 3036520 3964855 3457695 2321926 1480760 860630
36568 860630 157331 -262630 15638 571506 653679 168466 -486379 -1197716 -2032786 -2608955
36558 -2608955 -2344589 -1356228 -483195 -268396 -343468 -2582 867693 1578459 1314183 80884
36548 80884 -1033645 -863677 446215 1492360 1317949 532059 246618 481316 443700
36539 443700 7543 -126625 319678 835820 1179438 1808436 2859603 3572512 3322552
36530 3322552 2580023 2224758 2389846 2558678 2398046 1932574 1240546 531213 241145
36521 241145 525098 879312 745789 275120 67860 413278 1188533 2177291 3006635 3126187
36511 3126187 2445662 1719508 1706021 2218716 2627144 2952571 3653033 4542497 4852721 4364183
36501 4364183 3622495 2979910 2271307 1555317 1300999 1595132 1954113 2158501 2459077
36492 2459077 2710886 2269351 1214618 718343 1476079 2566986 2698364 1928521 1237673
36483 1237673 922347 483610 -151293 -378184 61698 668696 933735 807975 312401
36474 312401 -623784 -1696236 -2194432 -1798025 -1041325 -701115 -980593 -1501227 -1860044
36465 -1860044 -1969211 -1957531 -1890666 -1621058 -1014872 -390607 -464084 -1539281 -2916932 -3507159
36455 -3507159 -2975854 -1906695 -899612 -20637 766349 1184878 1049127 773536 1018043
36446 1018043 1836448 2493978 2254883 1197247 92930 -456635 -541286 -531711 -447791 -77255
36436 -77255 442540 674051 562369 550811 839108 1054302 935585 773225 738069 372378
36426 372378 -599472 -1470287 -1431542 -930079 -1117478 -1996407 -2200964 -918687 906200
36417 906200 1799774 1451031 561015 -397920 -1443484 -2349892 -2511073 -1753898 -772448
36408 -772448 -390834 -603458 -711504 -405024 -280506 -936892 -1857976 -1885773 -864663 -1325
36398 -1325 -164584 -635520 -340190 355833 242150 -696664 -1185442 -673036 -125865 -393789
36388 -393789 -931504 -785426 55469 973362 1627810 1893248 1594847 971337 735601 1023753
36378 1023753 1003775 238520 -393034 -62053 563668 458636 113601 734859 1951100
36369 1951100 2038778 512024 -1147703 -1716050 -1628792 -1547152 -1050976 183262 1133007
36360 1133007 730959 -330720 -486681 395118 921927 299762 -690980 -1037167 -749106
36351 -749106 -361065 9916 560637 1247183 1786478 1913340 1402481 245964 -929744
36342 -929744 -1125951 -127429 943342 762813 -672012 -2127745 -2585709 -2073094 -1114765
36333 -1114765 -24339 1001214 1576955 1376264 560812 -271020 -488965 248317 1772828
36324 1772828 3329541 4028886 3665012 2862457 2177303 1407402 198590 -1054391 -1621180
36315 -1621180 -1599556 -1828740 -2505094 -2744078 -1975720 -1019515 -990014 -1599931 -1535484 -460128
36305 -460128 361987 -162401 -1342422 -1605713 -639636 259270 63128 -600354 -495636
36296 -495636 329112 584731 -377273 -1633939 -2008845 -1565865 -1138605 -947219 -594749
36287 -594749 -153582 -183317 -567242 -360030 769632 1766512 1471179 111519 -1081768
36278 -1081768 -1298406 -607151 570254 1726394 2249702 1849608 974461 308712 -58914
36269 -58914 -513623 -1125864 -1531197 -1522899 -1241177 -810314 -284469 86344 60596 -118844
36259 -118844 35106 510651 809369 747714 692196 865960 971373 741294 400539 290185
36249 290185 392605 503730 591044 740669 970823 1255395 1514053 1520799 1151986 799588
36239 799588 1099831 2039529 2742975 2453403 1397668 352251 -344285 -942454 -1657186
36230 -1657186 -2358759 -2877662 -3252215 -3567480 -3762556 -3722873 -3473179 -3168398 -2870801 -2406028
36220 -2406028 -1584240 -606903 -38951 -169589 -573186 -613772 -274598 -104875 -380930 -773461
36210 -773461 -951785 -1091487 -1550596 -2335270 -3102604 -3472293 -3196062 -2305439 -1300914
36201 -1300914 -931990 -1493487 -2439806 -2882448 -2389203 -1208616 104213 1102824 1618172
36192 1618172 1734077 1648741 1535671 1513512 1634273 1807222 1863101 1816243 1871235 1998435
36182 1998435 1801126 1130956 521894 529743 906907 1035913 961680 1229532 1769460 1794030
36172 1794030 942242 -245905 -1168819 -1706532 -1744224 -1045903 30769 564128 318196
36163 318196 170518 736578 1359412 1138771 221573 -692628 -1429030 -2062548 -2227455 -1709285
36153 -1709285 -1206644 -1418004 -1751544 -1090140 388952 1349205 1218686 830708 989504
36144 989504 1444823 1611912 1452534 1262273 1210715 1351984 1563247 1391839 571119 -300833
36134 -300833 -329123 383553 818217 519450 106137 91411 140305 -97339 -302660 -174769
36124 -174769 -35202 -152699 -132370 393688 1031520 1190138 876922 380467 -263186 -857132
36114 -857132 -730971 282189 1011889 118253 -2049454 -3697496 -3715596 -2721523 -1869984
36105 -1869984 -1488454 -1301133 -1322156 -1832562 -2653177 -3003341 -2262949 -707359 646391
36096 646391 919999 68799 -1236937 -2218024 -2366120 -1527993 -71356 1097693 1218154
36087 1218154 523415 -15122 110776 533689 929313 1576088 2516444 2890924 1947786
36078 1947786 321950 -573170 -286891 319669 399445 4706 -418974 -653823 -576582 -20258
36068 -20258 902363 1739977 2181539 2253834 1986388 1363498 699008 475208 608763 478579
36058 478579 -43478 -261191 213104 694810 498346 207104 924907 2508962 3547046
36049 3547046 3157094 1939315 951574 573316 725060 1391921 2311743 2730584 2185899
36040 2185899 1199641 576723 335315 -2245 -359978 -188884 498039 1030969 1112701 1141897
36030 1141897 1337231 1354815 1077033 973125 1233042 1297424 784901 158777 -159516 -603803
36020 -603803 -1602745 -2607492 -2943189 -3008631 -3479251 -3834321 -3068853 -1601793 -935787
36011 -935787 -1387055 -1732685 -1396579 -1332603 -2088858 -2600269 -1964716 -1075640 -1171666 -1800101
36001 -1800101 -1683416 -874476 -508775 -828166 -975549 -639380 -480916 -785788 -914562
35992 -914562 -378625 522135 1376657 2070537 2300958 1620631 311206 -627506 -773259
35983 -773259 -828652 -1431561 -2100630 -1931558 -882144 163329 349945 -453535 -1638524
35974 -1638524 -2290010 -1923766 -987320 -361492 -292150 -201786 357185 1043424 1227440 775676
35964 775676 164515 101671 1006408 2416120 2987956 1768939 -453951 -1792076 -1415667
35955 -1415667 -324141 258281 342957 552337 913487 1019633 768045 197176 -879841
35946 -879841 -2341647 -3375934 -3453141 -3236906 -3621764 -4237115 -3949349 -2670144 -1563267
35937 -1563267 -1393211 -1707361 -1883681 -1995251 -2195018 -2101989 -1445818 -760429 -800798 -1601106
35927 -1601106 -2595067 -3341164 -3640749 -3253797 -2120859 -789525 -79431 -235574 -742956
35918 -742956 -980536 -719562 1263 1026105 1939254 2195376 1728539 1164002 1063905
35909 1063905 1189446 971309 524421 495209 817981 455904 -1097069 -2707462 -2803151
35900 -2803151 -1346898 236763 929890 987970 952123 855380 742334 1026646 1782914 2427677
35890 2427677 2621802 2712221 2701019 1732118 -420483 -2176336 -1818239 36990 1019207
35881 1019207 3807 -1771279 -2712194 -2659774 -2224755 -1548299 -545308 391384 755802
35872 755802 590310 240264 -134970 -368989 -118665 576055 992643 533359 -516237
35863 -516237 -1515108 -2344393 -3191778 -3844775 -3912562 -3575269 -3439382 -3682112 -3903397 -3828281
35853 -3828281 -3636600 -3533805 -3448270 -3270244 -3034655 -2739380 -2245374 -1470606 -523786 378899
35843 378899 992498 1094035 652700 -53150 -632673 -909952 -1030465 -1325078 -2042462 -3025539
35833 -3025539 -3707515 -3743580 -3553428 -3691384 -3708499 -2519890 -244851 1300572 756869
35824 756869 -887520 -1591461 -892193 -22450 243375 376344 641733 381661 -651318
35815 -651318 -1468848 -1221079 -521033 -470114 -987812 -1077600 -390040 406833 693621 545213
35805 545213 279301 4267 -204359 -83099 629820 1839213 2914314 2954151 1604316
35796 1604316 -291196 -1326283 -1065047 -445918 -356115 -445742 69629 1036716 1649273
35787 1649273 1731597 1775355 1823270 1304144 132484 -882025 -1060165 -666713 -368789 -381852
35777 -381852 -485919 -508106 -480022 -553057 -909411 -1513657 -1921778 -1683519 -963570 -363194
35767 -363194 -95471 197231 742702 1277970 1521640 1486669 1165990 475143 -267341 -427737
35757 -427737 -4091 93087 -770242 -1923122 -2139683 -1154232 112602 681469 388302
35748 388302 -281007 -793437 -955448 -936272 -961571 -982479 -789337 -390705 45400 565373
35738 565373 1233996 1573245 940745 -303192 -831837 -52128 972202 938539 -25873
35729 -25873 -868938 -1158992 -1204395 -1132430 -900570 -916781 -1574000 -2324442 -2265327 -1566102
35719 -1566102 -1257413 -1625080 -1943731 -1906263 -2109522 -2785836 -3204377 -2877759 -2385638 -2385577
35709 -2385577 -2648340 -2695724 -2613127 -2571634 -2269817 -1552201 -922964 -721731 -421836 457336
35699 457336 1319318 1266491 466191 -179563 -415111 -749271 -1357308 -1759696 -1613605 -1128833
35689 -1128833 -684111 -566931 -952467 -1569865 -1620600 -707545 393329 671912 358516
35680 358516 491907 1126481 1150433 131448 -824971 -675326 16888 -49918 -1082242 -2050041
35670 -2050041 -2063911 -1160493 129636 1312477 1984666 1907644 1266713 623118 444744
35661 444744 731944 1096645 1141700 804091 383298 195116 219072 201569 50123 -109512
35651 -109512 -266190 -584643 -989467 -995010 -251926 868425 1530222 1284137 468787 -278182
35641 -278182 -742994 -1227833 -1967120 -2654011 -2722724 -2048216 -1141963 -583155 -436155 -330807
35631 -330807 43608 633915 1073962 998318 509652 315062 1004885 2119507 2474568 1689426
35621 1689426 816840 979023 1908764 2485281 2275508 1773752 1443605 1389647 1774146 2624685
35611 2624685 3296360 3079590 2372086 2254130 2772583 2731699 1530804 132153 -380218
35602 -380218 -261798 -400080 -932683 -1408592 -1744189 -2145543 -2432196 -2224760 -1632744 -1178276
35592 -1178276 -1184496 -1585049 -2002225 -1724313 -198200 1978576 3219040 2762762 1696403
35583 1696403 1370108 1460686 696241 -965164 -2195061 -2252043 -1837485 -1795386 -2026841 -2067162
35573 -2067162 -1869927 -1549411 -980355 -116715 679709 933526 451184 -583647 -1590179
35564 -1590179 -1841439 -1241798 -642009 -751745 -1048426 -665867 -71416 -546889 -1925269
35555 -1925269 -2335653 -785062 1331371 2176877 1796896 1398758 1259069 750331 -65719
35546 -65719 -346467 70379 352131 1681 -510244 -719294 -890509 -1357809 -1832707 -1860469
35536 -1860469 -1507685 -1155261 -925530 -713438 -585768 -788885 -1412615 -2269463 -3088517
35527 -3088517 -3691349 -3977653 -3843210 -3224666 -2301372 -1559714 -1410907 -1704612 -1905117
35518 -1905117 -1840290 -1883063 -2162757 -2084914 -1146224 133140 778843 706685 749535 1319090
35508 1319090 1841877 1807799 1640543 1973018 2557494 2573536 1812722 936923 580295 723535
35498 723535 1049765 1443473 1878022 2115679 1846041 1030669 -85796 -1196526 -1956190
35489 -1956190 -1925123 -878397 729889 1924959 2055510 1305389 229505 -890120 -1893448
35480 -1893448 -2306085 -1733991 -669562 -183175 -554818 -832919 -167749 952561 1363830
35471 1363830 736788 -212961 -775571 -818180 -413075 375300 1207011 1547942 1242987 633724
35461 633724 48866 -397332 -499114 -25290 774812 1300140 1447781 1781622 2579270 3279600
35451 3279600 3273763 2738793 2217722 1822669 1394654 1070927 1066087 1125027 796509 105181
35441 105181 -582757 -1187830 -1826903 -2254827 -2088073 -1558372 -1320877 -1393184 -994279 277263
35431 277263 1715199 2351041 2072590 1496571 1099426 923634 912441 1091671 1460935 1945950
35421 1945950 2396857 2538075 2134367 1349811 691657 425149 303054 33812 -320772
35412 -320772 -631431 -985085 -1359939 -1432867 -1162919 -1182346 -2010213 -3148054 -3631479 -3320937
35402 -3320937 -2916427 -2751369 -2398588 -1623477 -908882 -654516 -524295 -60651 598378
35393 598378 1118277 1589318 2157076 2425857 1906899 843553 -39897 -460549 -638985
35384 -638985 -590974 -80723 710394 1202885 1275000 1434061 1887212 2093970 1617910 831692
35374 831692 296184 -35129 -418150 -615138 -352843 -163165 -853839 -2176880 -2929943
35365 -2929943 -2578532 -1924488 -1772695 -1764259 -1242800 -659206 -1111411 -2626902 -3840776
35356 -3840776 -3613340 -2312675 -1185400 -968277 -1489956 -2221904 -2709142 -2628472 -1917382
35347 -1917382 -937416 -257071 -169392 -498131 -855408 -997040 -943840 -818268 -587931 -84668
35337 -84668 585474 839442 234089 -748227 -1093615 -617617 -311790 -916482 -1768924 -1784337
35327 -1784337 -1120505 -912423 -1523832 -2116368 -2115108 -2098477 -2762313 -3771720 -4240603 -3845117
35317 -3845117 -2954764 -2090312 -1670011 -1797650 -1853136 -863232 1138232 2684932 2531443
35308 2531443 1211448 102661 -525086 -1359831 -2260507 -2105265 -693491 540827 381175
35299 381175 -628439 -1279116 -1466834 -1842128 -2253456 -1754269 -151185 1432552 1820016
35290 1820016 965855 -400830 -1766838 -3020561 -3966672 -4225462 -3719883 -2932222 -2430942
35281 -2430942 -2270245 -2117428 -1901361 -1921913 -2192447 -2172323 -1560466 -927142 -926411 -1190856
35271 -1190856 -852152 -40992 172723 -453192 -716719 281723 1702454 2143247 1585265
35262 1585265 1166175 1417250 1760267 1601321 957102 -1362 -1118804 -1852688 -1559312
35253 -1559312 -460635 362667 230012 -472402 -1098018 -1543866 -1898630 -1906531 -1278464 -141419
35243 -141419 1194125 2494366 3277010 2767584 796517 -1561651 -2853848 -2648480 -1676293
35234 -1676293 -833940 -566646 -994790 -1920556 -2654396 -2482419 -1546612 -802783 -870375 -1332660
35224 -1332660 -1450095 -1170470 -1014184 -1208308 -1433185 -1398244 -1232122 -1179089 -1228204 -1226429
35214 -1226429 -1126153 -911200 -477804 119498 423609 -45795 -1113187 -1973084 -2040892
35205 -2040892 -1522080 -990127 -707058 -614148 -674915 -791956 -565619 348048 1641248 2558270
35195 2558270 2715440 2291269 1458749 296931 -609557 -365645 849668 1335649 -199198
35186 -199198 -2596218 -3284954 -1468506 833385 1420715 626629 487221 1807963 3265126
35177 3265126 3411089 2428479 1412679 788758 282127 6922 559771 1916266 3040749
35168 3040749 3045248 2292837 1866849 2182187 2619072 2476202 1792880 1055005 453244 -203490
35158 -203490 -920732 -1219804 -610734 733908 1996916 2470968 2141430 1429081 589195
35149 589195 -341249 -1157427 -1522244 -1451206 -1297102 -1081940 -367134 852609 1660265 1268941
35139 1268941 245080 -97673 553940 1176842 954676 357869 289231 801469 1249787
35130 1249787 1321467 1284476 1362223 1404536 1217895 883134 688168 897781 1500466 2034523
35120 2034523 1867245 915725 -64448 -216685 470969 1210752 1293538 643634 -375242
35111 -375242 -1326631 -1868676 -1898655 -1644102 -1431806 -1351596 -1315072 -1363725 -1622030 -1941665
35101 -1941665 -1913426 -1357773 -598357 -142625 -234397 -764926 -1455344 -2064719 -2544894 -3003869
35091 -3003869 -3401731 -3380684 -2657070 -1527912 -621566 -86221 552737 1506403 2104543
35082 2104543 1526220 -16899 -1331136 -1555436 -1027827 -618867 -508725 -52881 1153767
35073 1153767 2524433 3105703 2745833 2194584 1999075 1776333 906378 -399483 -1258568
35064 -1258568 -1260592 -895688 -715782 -592105 -143063 496093 840997 848020 1018374 1629306
35054 1629306 2264831 2338805 1847142 1327136 1143955 1062265 596880 -342393 -1286133 -1691682
35044 -1691682 -1510640 -1198027 -1181713 -1422346 -1523333 -1155392 -273166 980316 2373852
35035 2373852 3554273 4090342 3723241 2600492 1223553 140187 -370136 -409088 -299104
35026 -299104 -259478 -226075 -43277 208392 249860 23814 -125755 123897 604003 838255
35016 838255 631515 227875 -86449 -250451 -286207 -241851 -390245 -1085462 -2133488 -2653405
35006 -2653405 -2030096 -838771 -310792 -879747 -1742025 -1966168 -1538178 -1008569 -522053
34997 -522053 264167 1388657 2231973 2171862 1320997 316302 -538477 -1563755 -2981669
34988 -2981669 -4215004 -4359702 -3341748 -2121261 -1550708 -1478182 -1310620 -987108 -814671
34979 -814671 -706815 -393907 -266141 -1087834 -2694554 -3833452 -3693747 -2864363 -2285239
34970 -2285239 -1951361 -1329123 -476183 103694 395386 818639 1387354 1696508 1671952 1557332
34960 1557332 1154696 -64999 -1859918 -3010271 -2678730 -1446165 -514440 -286039 -265977
34951 -265977 -106993 -116636 -639682 -1375435 -1600657 -974008 76120 795605 808261 297859
34941 297859 -338640 -758225 -705807 -231577 69682 -403198 -1232634 -1151090 210807 1339599
34931 1339599 476387 -2068895 -4192773 -4490884 -3507323 -2466760 -1860161 -1644052 -1804687
34922 -1804687 -2040663 -1623642 -321010 1034773 1536338 1304030 979008 608882 -173675
34913 -173675 -1198266 -1844982 -1958758 -1876515 -1572375 -604401 896838 1915416 1639458
34904 1639458 449569 -527944 -591518 57976 756948 1007819 786722 470432 480783 900890
34894 900890 1380578 1384173 587877 -772225 -1884101 -1958080 -1062140 -147556 31207 -195174
34884 -195174 16149 736703 1117979 601422 -260867 -515875 -2353 579017 656991 407297
34874 407297 251811 91427 -559512 -1706540 -2597262 -2612300 -2144636 -2117076 -2735499 -3291489
34864 -3291489 -3263139 -2959979 -2774746 -2426997 -1510451 -334991 472389 947672 1625686
34855 1625686 2461693 2662671 1765574 307360 -822547 -1264835 -1205083 -910657 -567293
34846 -567293 -355115 -425509 -855062 -1649218 -2652291 -3523949 -4066077 -4496234 -5034585 -5276808
34836 -5276808 -4488222 -2649284 -734752 286866 361556 55604 -207972 -272996 13517
34827 13517 678458 1341916 1466558 931043 152672 -351842 -403436 -219355 -129529 -174194
34817 -174194 -6328 613482 1277918 1269516 513993 -256698 -497207 -500702 -701782 -866541
34807 -866541 -594362 -228787 -452641 -1107110 -1260448 -553478 311094 674260 773397 1083394
34797 1083394 1483551 1669259 1861637 2387953 2892086 2724204 1965388 1351096 1246457
34788 1246457 1401375 1685575 2270640 2985508 3327335 3339974 3607467 4024123 3568182 1950699
34778 1950699 515024 520564 1347743 1613536 1364826 1592609 1965415 990406 -1313390
34769 -1313390 -2811619 -2165749 -770037 -624455 -1548033 -1912708 -1231805 -471395 -293117
34760 -293117 -478918 -903456 -1724571 -2598225 -2860274 -2555324 -2290805 -2100341 -1509239 -716261
34750 -716261 -531239 -967451 -1056013 -383776 265031 211914 -181345 -346633 -313220 -150038
34740 -150038 464714 1499336 2242375 2359957 2445829 2821714 2673028 1320725 -357740
34731 -357740 -889317 -207553 334660 -196285 -1313726 -1908185 -1404405 -169979 769583
34722 769583 567497 -558780 -1579415 -2013803 -2386182 -2910824 -2678396 -1091401 690370
34713 690370 1039258 159615 -265194 464693 1370711 1625070 1618092 1760326 1507147 336040
34703 336040 -1209406 -2235698 -2635377 -2824362 -2860254 -2510418 -1856933 -1201471 -551354
34694 -551354 273882 1101114 1405445 937082 141256 -168591 383381 1246358 1452522 745250
34684 745250 -102257 -354708 -276718 -527967 -1026951 -1186546 -1013914 -1072564 -1439606 -1624786
34674 -1624786 -1521262 -1468257 -1330153 -623616 253235 155846 -1002871 -1813284 -1396341 -695080
34664 -695080 -884004 -1607669 -1896837 -1849356 -2066162 -2171643 -1410699 -291078 -76458 -747561
34654 -747561 -939551 -52059 928347 1046048 612666 334950 234776 55263 -59187 52906
34644 52906 75966 -292566 -740196 -700345 -53352 818493 1399801 1317407 619724 -99269
34634 -99269 -280849 -190266 -615540 -1704408 -2743407 -3254542 -3559254 -3915366 -3870946 -3057686
34624 -3057686 -2024538 -1602828 -1821409 -2048739 -1919057 -1602282 -1422165 -1642161 -2319557
34615 -2319557 -2978685 -2850270 -1901450 -1137660 -1285534 -1687879 -1287065 -264491 275781
34606 275781 20397 -217853 119336 649283 940697 1144698 1377773 1303248 812448 480143
34596 480143 843360 1703740 2534110 3096725 3300576 2977144 2240160 1603924 1318916 1061750
34586 1061750 699978 770749 1582546 2372368 2142505 994413 -140954 -793317 -1113268
34577 -1113268 -990979 -80334 1222041 1834776 1343309 457257 -221289 -1008840 -2168608
34568 -2168608 -2952009 -2489501 -1175330 -248074 -172375 -298612 -132749 -62040 -487048 -944152
34558 -944152 -719627 -4640 251582 -314316 -850091 -330368 1105342 2329626 2636843
34549 2636843 2420772 2310064 2241640 1879669 1472880 1495794 1609247 928559 -467192 -1219083
34539 -1219083 -448581 895988 1276857 697096 602992 1735601 3061028 3155999 1927312
34530 1927312 471596 -267778 -140096 580879 1514501 2126863 1976588 1261740 722299
34521 722299 693045 605457 -117610 -971539 -922340 -62184 207516 -860545 -2032661 -1642660
34511 -1642660 56915 1264618 1173941 813014 1103172 1441220 937150 -58647 -671261
34502 -671261 -925321 -1352491 -1783018 -1708864 -1446661 -1708717 -2221244 -2004771 -992800 -143984
34492 -143984 159080 564469 1302493 1526093 679075 -517010 -1143097 -1304925 -1559189
34483 -1559189 -1853182 -1808311 -1483382 -1109124 -543416 290603 850963 601845 -118615 -548711
34473 -548711 -594790 -843325 -1632922 -2631018 -3213126 -2923532 -1834605 -769702 -750428 -1817636
34463 -1817636 -2867697 -3092956 -2988947 -3344275 -3891578 -3792874 -2928658 -1784703 -537372
34454 -537372 713353 1229838 400704 -971673 -1427526 -887568 -656556 -1274394 -1742271
34445 -1742271 -1307135 -698176 -856002 -1492329 -1781638 -1694487 -1760704 -2057108 -2222397 -2091500
34435 -2091500 -1696100 -1024153 -298473 -21329 -195800 -27628 939289 1863963 1545992
34426 1545992 9714 -1570378 -2291287 -2185151 -1675714 -1112159 -801880 -869227 -1014888
34417 -1014888 -842655 -399974 -56552 -278 -200623 -615761 -1026226 -992016 -488497 -227031
34407 -227031 -711381 -1341904 -1263844 -815137 -1125962 -2332799 -3246580 -2993715 -2019013 -1130129
34397 -1130129 -482120 -25096 -110338 -885181 -1603737 -1291918 129721 1875116 3144403
34388 3144403 3494728 2752868 1219225 -183419 -567157 46231 829418 1078598 768273
34379 768273 315549 117267 240273 322025 -85663 -851868 -1183454 -516734 744767 1721474
34369 1721474 1993483 1622110 624246 -843730 -1955707 -1769224 -498971 507056 380082
34360 380082 -333702 -740622 -920317 -1493224 -2323031 -2550485 -1914720 -1272744 -1508054 -2409310
34350 -2409310 -3005428 -2737540 -1913243 -1113159 -558355 -187686 -54009 -316726 -897269
34341 -897269 -1468472 -1892612 -2387988 -3065667 -3589623 -3629072 -3390502 -3215237 -2842191 -1758699
34331 -1758699 -285330 518042 319725 54939 427973 660715 -339499 -2079217 -2892208
34322 -2892208 -2133223 -847468 -116555 177169 520045 683644 211720 -617819 -1084327
34313 -1084327 -990319 -761312 -786899 -1098501 -1493813 -1640685 -1327837 -901495 -1052175 -1812134
34303 -1812134 -2269550 -1796215 -1043444 -1018668 -1617838 -1952088 -1848348 -2019210 -2767133 -3498934
34293 -3498934 -3715869 -3632864 -3524136 -3199591 -2497632 -1698134 -1106168 -732361 -619104 -907762
34283 -907762 -1341715 -1352842 -961473 -905561 -1455292 -1812920 -1285675 -415014 -184675 -579756
$$ [...]
##END NTUPLES=NMR SPECTRUM
##END=
