##TITLE=31Pdec_75-2022
 CDCl3, 24 sc
 19.9.2022
##JCAMPDX= 6.0         $$ Bruker NMR JCAMP-DX V2.0
##DATA TYPE= NMR SPECTRUM
##DATA CLASS= NTUPLES
##ORIGIN= UXNMR, Bruker Analytische Messtechnik GmbH
##OWNER= root
$$ XWIN-NMR		Version 3.5
$$ Mon Sep 19 14:02:27 2022 Russian Standard Time (UT+4h)  she@DPX200
##.OBSERVE FREQUENCY= 81.013821
##.OBSERVE NUCLEUS= ^31P
##.ACQUISITION MODE= SIMULTANEOUS
##.ACQUISITION SCHEME= undefined
##.AVERAGES= 24
##.DIGITISER RES= 16
##SPECTROMETER/DATA SYSTEM= spect
##.PULSE SEQUENCE= zgpg30
##.SOLVENT NAME= DMSO
##.SHIFT REFERENCE= (INTERNAL, DMSO, 0, 248.564)
##AUDIT TRAIL= $$ (NUMBER, WHEN, WHO, WHERE, WHAT)
$$ ##TITLE= Audit trail, XWIN-NMR		Version 3.5
$$ ##JCAMPDX= 5.01
$$ ##ORIGIN= Bruker BioSpin GmbH
$$ ##OWNER= she
$$ F:/spectra/data/she/nmr/P31/1/pdata/1/auditp.txt
$$ ##AUDIT TRAIL=  $$ (NUMBER, WHEN, WHO, WHERE, WHAT)
(   1,<2022-09-19 14:01:40.95 +0400>,<she>,<DPX200>,
      <created by zg, POWCHK disabled, PULCHK disabled
       configuration hash MD5:
       00 E9 B6 7A A2 85 ED C7 34 08 36 98 17 FE 4E 26
       data hash MD5: 32K
       DA BF 83 6F F3 4F 95 95 CC 18 9F 7F 84 F2 7B 77>)
(   2,<2022-09-19 14:01:43.84 +0400>,<she>,<DPX200>,
      <Start of raw data processing
       efp BC_mod = 2 LB = 1 FT_mod = 6 PKNL = 1 PHC0 = -10287.04 PHC1 = 149.8566 SI = 64K 
       data hash MD5: 64K
       4E 48 34 8E 6E 08 63 CE 37 AC 5D 2B 9F 82 45 6D>)
(   3,<2022-09-19 14:01:57.03 +0400>,<she>,<DPX200>,
      <pk PHC0 = -0.2637673 PHC1 = 0 
       data hash MD5: 64K
       72 84 50 8C 1D E3 9B 3E 2C 1F 78 6A FA 63 61 1E>)
(   4,<2022-09-19 14:01:59.85 +0400>,<she>,<DPX200>,
      <abs ABSG = 5 
       data hash MD5: 64K
       5D EC C9 46 7F BA 27 56 6E B2 73 4D C7 85 B9 8C>)
$$ ##END=
$$ 
$$ hash MD5
$$ 32 30 EB 84 64 06 10 75 00 D1 90 66 68 70 E9 73
##$RELAX= 
##$RELAX= 
##$RELAX= 
##$RELAX= 
##$RELAX= 
##$RELAX= 
##$RELAX= 
##$RELAX= 
##$RELAX= 
$$ Bruker specific parameters
$$ --------------------------
##$DU= <F:/spectra>
##$EXPNO= 1
##$NAME= <P31>
##$PROCNO= 1
##$TYPE= <nmr>
##$USER= <she>
##$AMP= (0..31)
100 100 100 100 100 100 100 100 100 100 100 100 100 100 100 100 100 100 
100 100 100 100 100 100 100 100 100 100 100 100 100 100 
##$AQSEQ= 0
##$AQ_mod= 1
##$AUNM= <au_zg>
##$AUTOPOS= <>
##$BF1= 81.014009
##$BF2= 200.13
##$BF3= 200.13
##$BF4= 200.13
##$BF5= 200.13
##$BF6= 200.13
##$BF7= 200.13
##$BF8= 200.13
##$BYTORDA= 1
##$CFDGTYP= 0
##$CFRGTYP= 5
##$CHEMSTR= <none>
##$CNST= (0..31)
1 1 145 1 1 1 1 1 1 1 1 1 1 1 1 1 1 1 1 1 1 1 1 1 1 1 1 1 1 1 1 1 
##$CPDPRG= <waltz16>
##$CPDPRG1= <>
##$CPDPRG2= <waltz16>
##$CPDPRG3= <>
##$CPDPRG4= <mlev>
##$CPDPRG5= <mlev>
##$CPDPRG6= <mlev>
##$CPDPRG7= <mlev>
##$CPDPRG8= <mlev>
##$CPDPRGB= <>
##$CPDPRGT= <>
##$D= (0..31)
0 1 0 0 0 0 0 0 0 0 0 0.03 2e-05 3e-06 0 0 0 0 0 0 0 0 0 0 0 0 0 0 0 0 
0 0 
##$DATE= 1663581700
##$DBL= (0..7)
120 120 120 11 120 120 24 19 
##$DBP= (0..7)
150 150 150 150 150 150 150 150 
##$DBP07= 0
##$DBPNAM0= <>
##$DBPNAM1= <>
$$ [...]
##$SUBNAM3= <"">
##$SUBNAM4= <"">
##$SUBNAM5= <"">
##$SUBNAM6= <"">
##$SUBNAM7= <"">
##$SUBNAM8= <"">
##$SUBNAM9= <"">
##$SW= 501.771253377433
##$SWIBOX= (0..15)
0 1 3 0 0 0 0 0 0 0 0 0 0 0 0 0 
##$SW_h= 40650.406504065
##$TD= 32768
##$TD0= 1
##$TE= 0
##$TE2= 300
##$TE3= 300
##$TEG= 300
##$TL= (0..7)
0 120 53 12 22 120 120 120 
##$TP= (0..7)
150 150 150 150 150 150 150 150 
##$TP07= 0
##$TPNAME0= <>
##$TPNAME1= <>
##$TPNAME2= <>
##$TPNAME3= <>
##$TPNAME4= <>
##$TPNAME5= <>
##$TPNAME6= <>
##$TPNAME7= <>
##$TPOAL= (0..7)
0.5 0.5 0.5 0.5 0.5 0.5 0.5 0.5 
##$TPOFFS= (0..7)
0 0 0 0 0 0 0 0 
##$TUNHIN= 0
##$TUNHOUT= 0
##$TUNXOUT= 0
##$USERA1= <user>
##$USERA2= <user>
##$USERA3= <user>
##$USERA4= <user>
##$USERA5= <user>
##$V9= 5
##$VALIST= <valist>
##$VCLIST= <CCCCCCCCCCCCCCC>
##$VD= 0
##$VDLIST= <DDDDDDDDDDDDDDD>
##$VPLIST= <PPPPPPPPPPPPPPP>
##$VTLIST= <TTTTTTTTTTTTTTT>
##$WBST= 1024
##$WBSW= 4
##$XGAIN= (0..3)
0 0 0 0 
##$XL= 0
##$YL= 0
##$YMAX_a= 6490
##$YMIN_a= -6692
##$ZGOPTNS= <>
##$ZL1= 120
##$ZL2= 120
##$ZL3= 120
##$ZL4= 120
##$ABSF1= 248.5645
##$ABSF2= -253.2056
##$ABSG= 5
##$ABSL= 3
##$ALPHA= 0
##$AQORDER= 0
##$ASSFAC= 0
##$ASSFACI= 0
##$ASSFACX= 0
##$ASSWID= 0
##$AUNMP= <proc_1d>
##$AZFE= 0.1
##$AZFW= 0.5
##$BCFW= 0
##$BC_mod= 2
##$BYTORDP= 0
##$COROFFS= 0
##$CY= -3
##$DATMOD= 1
##$DC= 0
##$DFILT= <>
##$DTYPP= 0
##$F1P= 0
##$F2P= 0
##$FCOR= 1
##$FTSIZE= 65536
##$FT_mod= 6
##$GAMMA= 0
##$GB= 0
##$INTBC= 1
##$INTSCL= 6.834604e-11
##$ISEN= 30
##$LB= 1
##$LEV0= 0
##$LPBIN= 0
##$MAXI= 10000
##$MC2= 0
##$MEAN= 0
##$ME_mod= 0
##$MI= 50
##$NCOEF= 0
##$NC_proc= -7
##$NLEV= 6
##$NOISF1= 182.463
##$NOISF2= 159.3651
##$NSP= 0
##$NTH_PI= 0
##$NZP= 0
##$OFFSET= 248.5645
##$PC= 4
##$PHC0= -10287.3
##$PHC1= 149.8566
##$PH_mod= 1
##$PKNL= yes
##$PPARMOD= 0
##$PSCAL= 0
##$PSIGN= 0
##$REVERSE= no
##$SF= 81.0140089999694
##$SI= 65536
##$SIGF1= 159.3651
##$SIGF2= -187.1042
##$SINO= 113.3802
##$SIOLD= 16384
##$SREGLST= <1H.CDCl3>
##$SSB= 0
##$STSI= 65536
##$STSR= 0
##$SW_p= 40650.406504065
##$SYMM= 0
##$S_DEV= 0
##$TDeff= 32768
##$TDoff= 0
##$TI= <>
##$TILT= no
##$TM1= 0
##$TM2= 0
##$TOPLEV= 0
##$USERP1= <user>
##$USERP2= <user>
##$USERP3= <user>
##$USERP4= <user>
##$USERP5= <user>
##$WDW= 1
##$XDIM= 65536
##$YMAX_p= 428244364
##$YMIN_p= -12902289
$$ End of Bruker specific parameters
$$ ---------------------------------
##NTUPLES= NMR SPECTRUM
##VAR_NAME=  FREQUENCY,     SPECTRUM/REAL,   SPECTRUM/IMAG
##SYMBOL=    X,             R,               I
##VAR_TYPE=  INDEPENDENT,   DEPENDENT,       DEPENDENT
##VAR_FORM=  AFFN,          ASDF,            ASDF
##VAR_DIM=   65536,         65536,           65536
##UNITS=     HZ,            ARBITRARY UNITS, ARBITRARY UNITS
##FACTOR=    0.620285442955139, 1,           1
##FIRST=     20137.2065510682, 0,            0
##LAST=      -20513.1999529968, 0,           0
##MIN=       -20513.1999529968, -12902289,   0
##MAX=       20137.2065510682, 428244364,    0
$$ Real data points
##PAGE= N=1
##DATA TABLE= (X++(R..R)), XYDATA
$$ [...]
$$ plain form
39965 -4469630 -3250993 -604888 -537911 -1663313 -727275 1169849 810398 -1110814 -1184929
39956 -1184929 828348 1946880 1173565 582565 1303954 2034257 1706593 651949 -885360
39947 -885360 -2678435 -3261016 -1535128 708482 767480 -843378 -1349279 -479860 -687516
39938 -687516 -2376486 -2741935 -490320 1723684 1293680 -687052 -1642815 -1107183 -166999
39929 -166999 858033 2208397 3352188 3442986 2297350 61807 -2901521 -5129153 -4738489
39920 -4738489 -2038962 180140 139414 -836072 -998730 -997029 -2060053 -3049637 -1887241
39911 -1887241 949362 2842237 2580342 1266231 -76616 -1500303 -2649728 -2582631 -1574465
39902 -1574465 -1033471 -989457 200594 2718203 4155535 3141068 1995718 3394400 5887923
$$ packed form
39965d469630J218637K646105O6977j125402R36038J897124l59451j921212p4115
39956a184929K013277J118532p73315n91000P21389P30303l27664j054644j537309
39947h85360j793075n82581J725888K243610N8998j610858n05901Q69419k07656
39938f87516j688970l65449K251615K214004m30004j980732r55763N35632R40184
39929a66999J025032J350364J143791R0798j145636k235543k963328k227632L90664
39920d738489K699527K219102m0726r75486j62658J701j063024r89584J162396
39911a887241K836603J892875k61895j314111j342847j423687j149425O7097J008166
39902a574465N40994M4014J190051K517609J437332j014467j145350J398682K493523
$$ plain form
39893 5887923 5706353 2398744 -458206 -411767 1040668 1706241 1863538 2422696 2408206
39884 2408206 767591 -1005612 -808977 541116 529373 -856405 -1067710 833034 2848305
39875 2848305 3486307 3756417 4568892 4620849 2597946 -334143 -2033833 -2078387 -1416604
39866 -1416604 -606719 -6514 -489830 -2110712 -3015649 -1711607 239169 -23773 -2425926
39857 -2425926 -3742391 -2020325 818001 1777600 646669 -355656 71286 903143 736703
39848 736703 -202870 -747116 -717931 -991731 -1659836 -1422122 476643 2756987 3700558
39839 3700558 3446386 3251311 3105410 1984847 220302 -611899 -389860 -676600 -1638764
39830 -1638764 -1357207 518275 1158791 -1205806 -3778293 -2889666 409189 1881241 437464
$$ packed form
39893E887923j81570l307609k856950M6439J452435O65573J57297N59158j4490
39884B408206j640615j773203J96635J350093j1743j385778k11305J900744K015271
39875B848305O38002K70110Q12475N1957k022903k932089j699690m4554O61783
39866a416604Q09885O00205m83316j620882r04937J304042J950776k62942k402153
39857b425926j316465J722066K838326R59599j130931j002325M26942Q31857j66440
39848G36703r39573n44246K9185k73800o68105K37714J898765K280344R43571
39839C700558k54172j95075j45901j120563j764545q32201K22039k86740r62164
39830a638764K81557J875482O40516k364597k572487Q88627L298855J472052j443777
$$ plain form
39821 437464 -782551 110246 892165 -717241 -3139622 -3369568 -1421675 141372 166884
39812 166884 19159 925993 2314659 3199747 3526866 3313057 1789524 -1352377 -4640066
39803 -4640066 -6160044 -5978885 -5863259 -6528062 -6650101 -5166368 -3113445 -2093128 -1982330
39794 -1982330 -1500009 -347646 577505 685159 199481 -495438 -1018943 -1003792 -789347
39785 -789347 -1168547 -1517095 175078 3765324 5544309 3168953 100426 1144406 4785661
39776 4785661 4951075 401055 -3139898 -1681981 1548152 2039912 597097 220473 347074
39767 347074 -1220279 -3355741 -3311791 -1763093 -1759548 -3533465 -4294493 -2788899 -652995
39758 -652995 570363 883188 573774 -16919 56322 1017244 1465863 823953 939658 2656802
$$ packed form
39821D37464j220015Q92797P81919j609406k422381k29946J947893J563047K5512
39812A66884j47725R06834J388666Q85088L27119k13809j523533l141901l287689
39803d640066j519978J81159J15626o64803j22039J483733K052923J020317J10798
39794a982330M82321J152363R25151J07654m85678o94919n23505J5151K14445
39785g89347l79200l48548J692173L590246J778985k375356l068527J043980L641255
39776D785661J65414m550020l540953J457917L230133M91760j442815l76624J26601
39767C47074j567353k135462M3950J548698L545j773917p61028J505594K135904
39758f52995J223358L12825l09414n90693P3241R60922M48619o41910J15705J717144
$$ plain form
39748 2656802 3004395 -540515 -4954683 -5335158 -2319746 -795921 -1838096 -1514728 1749838
39739 1749838 4233592 3128680 832502 533449 1502085 1538911 847391 649602 576035
39730 576035 113337 445673 2332665 4055401 3858863 2770373 2713697 3306977 2790994
39721 2790994 955514 -944109 -2197689 -2693547 -1935241 86469 1758365 1381482 -601717
39712 -601717 -2386284 -3254217 -3660546 -3252982 -691868 3983487 8055371 8356099 4741087
39703 4741087 520789 -1127387 -622406 -741173 -2270617 -2965975 -1468543 203823 -173340
39694 -173340 -1627811 -2223732 -2610175 -4130737 -5200967 -3610674 -1237840 -1781275 -4209338
39685 -4209338 -3638669 661960 3463520 1428581 -2278217 -3733369 -3910587 -5220486
$$ packed form
39748B656802L47593l544910m414168l80475L015412J523825j042175L23368L264566
39739A749838K483754j104912k296178k99053R68636L6826o91520j97789p3567
39730E76035m62698L32336J886992J722736j96538j088490n6676N93280n15983
39721B790994j835480j899623j253580m95858P58306K021710J671896l76883j983199
39712f01717j784567q67933m06329M07564K561114M675355M071884L00728l615012
39703D741087m220298j648176N04981j18767j529444o95358J497432J672366l77163
39694a73340j454471n95921l86443j520562j070230J590293K372834n43435k428063
39685d209338N70669M300629K801560k034939l706798j455152j77218j309899
$$ plain form
39677 -5220486 -6400709 -4935693 -1753125 388069 1026470 1012897 -423208 -3847935 -6609210
39668 -6609210 -5588137 -1947229 387960 151041 -696929 -1041760 -1734994 -2824503 -2899123
39659 -2899123 -1518001 198714 1535158 2560696 2687304 1100656 -1339171 -2629347
39651 -2629347 -2112548 -843230 206287 734126 496906 -227091 -298756 492914 365586
39642 365586 -1804244 -4051947 -3909450 -2122190 -1010415 -376559 1593508 4226634 4990017
39633 4990017 4003244 4014597 5541649 5910607 3946510 1825490 1017715 111834 -1589488
39624 -1589488 -1917678 334726 2558463 2078269 189192 -459531 -208910 -825798 -1452273
39615 -1452273 73368 2749686 3113070 509912 -1712514 -1042989 949421 1308927 -584511
$$ packed form
39677e220486j180223J465016L182568K141194O38401j3573j436105l424727k761275
39668f609210J021073L640908K335189k36919q47970l44831o93234j089509p4620
39659b899123J381122J716715J336444J025538J26608j586648k439827j290176
39651b629347N16799J269318J049517N27839k37220p23997p1665P91670j27328
39642C65586k169830k247703J42497J787260J111775O33856J970067K633126P63383
39633D990017r86773J1353J527052L68958j964097k121020q07775r05881j701322
39624a589488l28190K252404K223737m80194j889077o48723K50621o16888o26475
39615a452273J525641K676318L63384k603158k222426O69525J992410L59506j893438
$$ plain form
39606 -584511 -3191358 -4898273 -4697951 -2383036 551416 1532740 -29065 -1378413 207378
39597 207378 3549553 5107280 3931162 2628180 2986924 3207642 1060108 -2152481 -3183651
39588 -3183651 -1478378 370444 730596 882555 2080844 3097252 2433386 1274895 1969894
39579 1969894 4349728 5834123 5088470 3461175 2397325 1428004 -255147 -1826129
39571 -1826129 -1926347 -809751 170100 733386 1717341 2997842 3079320 1378516 -512673
39562 -512673 -931184 -457644 -731300 -1633886 -1384370 628122 2824040 3659498 3356461
39553 3356461 2774625 2017784 1086068 606120 804809 879444 438150 298726 698043 292545
39543 292545 -1425058 -2429143 -1161659 353699 -636533 -2842171 -2621448 48510 1326866
$$ packed form
39606e84511k606847j706915K00322K314915K934452R81324j561805j349348J585791
39597B07378L342175J557727j176118j302982L58744K20718k147534l212589j031170
39588c183651J705273J848822L60152J51959J198289J016408o63866j158491O94999
39579A969894K379834J484395p45653j627295j063850r69321j683151j570982
39571a826129j00218J116596R79851N63286R83955J280501Q1478j700804j891189
39562e12673m18511M73540k73656r02586K49516K012492K195918Q35458l03037
39553C356461n81836p56841r31716m79948J98689P4635m41294j39424L99317m05498
39543B92545j717603j004085J267484J515358r90232k205638K20723K669958J278356
$$ plain form
39534 1326866 -364590 -2076577 -1487686 -442930 -1243230 -2765412 -2930211 -2333374 -2546777
39525 -2546777 -2922976 -1998626 -464028 10887 -428351 -737487 -1320875 -2818025 -3809756
39516 -3809756 -2613411 -463605 -16655 -1312963 -2121633 -1936280 -2615217 -4811785 -6473838
39507 -6473838 -5651062 -2877949 -158944 1021780 501737 -488901 -219695 1390799 2142822
39498 2142822 490001 -1899179 -2480302 -1693950 -1908011 -3204093 -3287027 -1592993 -383321
39489 -383321 -1079778 -2276617 -2416224 -1998881 -1842240 -1217120 739507 3186253 4509569
39480 4509569 4134843 2531178 407063 -1324386 -1691003 -545093 1180506 2336415
39472 2336415 2223970 772044 -1032230 -1392606 351610 2494848 3054452 2444466 2384785
$$ packed form
39534A326866j691456j711987N88891J044756q00300j522182j64799N96837k13403
39525b546777l76199R24350J534598M74915m39238l09136n83388j497150r91731
39516c809756J196345K149806M46950j296308q08670J85353o78937k196568j662053
39507f473838Q22776K773113K719005J180724n20043r90638K69206J610494P52023
39498B142822j652821k389180n81123P86352k14061j296082q2934J694034J209672
39489c83321o96457j196839j39607M17343J56641O25120J956627K446746J323316
39480D509569l74726j603665k124115j731449l66617J145910J725599J155909
39472B336415j12445j451926j804274l60376J744216K143238N59604o09986n9681
$$ plain form
39463 2384785 2951205 2972877 2759619 3652283 4963506 4373083 1797179 -142658 -346798
39454 -346798 -915629 -3237768 -5233058 -4453130 -1694500 603186 1837037 2970838 4015595
39445 4015595 3870611 2172117 -101669 -1537730 -1181225 690985 2312263 2074394 668762
39436 668762 114082 607227 496309 -312160 266549 2650632 4079532 2772816 881140
39427 881140 896731 1530236 138635 -2521476 -3276069 -1362489 775491 1148960 24651
39418 24651 -1741180 -3658327 -4759789 -4039757 -2201768 -1290858 -2166056 -3623827 -4239109
39409 -4239109 -3884106 -3162250 -2279017 -871938 1277163 3323014 3489857 1150305 -1429946
39400 -1429946 -1227410 1411091 3042023 2142383 962563 1018350 148316 -3304060 -6550675
$$ packed form
39463B384785N66420K1672k13258Q92664J311223n90423k575904j939837k04140
39454c46798n68831k322139j995290P79928K758630K297686J233851J133801J044757
39445D015595j44984j698494k273786j436061L56505J872210J621278k37869j405632
39436F68762n54680M93145j10918q08469N78709K384083J428900j306716j891676
39427H81140J5591O33505j391601k660111p54593J913580K137980L73469j124309
39418B4651j765831j917147j101462P20032J837989R10910q75198j457771o15282
39409d239109L55003P21856Q83233J407079K149101K045851J66843k339552k580251
39400a429946K02536K638501J630932q99640j179820N5787q70034l452376l246615
$$ plain form
39391 -6550675 -6282073 -4014159 -3246309 -3298392 -1005287 2607490 2979989 -482206 -3020137
39382 -3020137 -1768897 669782 1624302 2383395 4239036 5027848 3150349 1451451 3107869
39373 3107869 6216376 6453260 3329714 22638 -1718170 -2809690 -3797062 -4105125 -4043206
39364 -4043206 -4408195 -4159421 -1481478 2603045 4514472 2698983 -374132 -1579909
39356 -1579909 -595206 794619 1242724 824097 478783 937156 1555218 577813 -2350303
39347 -2350303 -4670525 -3722712 -574391 1214970 523869 -213763 806356 2242383 2402535
39338 2402535 1977552 2193684 2316106 1201816 -92820 405316 2499922 4193901 4697129
39329 4697129 4969171 5359402 4813485 2947966 1176199 794418 1103679 586818 -652058
$$ packed form
39391f550675K68602K267914P67850n2083K293105L612777L72499l462195k537931
39382c020137J251240K438679R54520P59093J855641P88812j877499j698898J656418
39373C107869L108507K36884l123546l307076j740808j091520r87372l08063O1919
39364d043206l64989K48774K677943M084523J911427j815489l073115j205777
39356a579909R84703J389825M48105m18627l45314M58373O18062r77405k928116
39347b350303k320222R47813L148321J789361o91101p37632J020119J436027J60152
39338B402535m24983K16132J22422j114290j294636M98136K094606J693979N03228
39329D697129K72042L90231n45917j865519j771767l81781L09261n16861j238876
$$ plain form
39320 -652058 -894434 590882 1987123 938888 -2111078 -3910271 -2474024 -13667
39312 -13667 -114924 -2564064 -3403992 -673450 2444876 1906006 -1711724 -4385288 -4136492
39303 -4136492 -2641112 -1745573 -1164476 -142129 974278 1836075 2926491 4146893 4104320
39294 4104320 2140243 -103651 -577786 492488 1173482 539703 -543896 -1138225 -1367538
39285 -1367538 -1551732 -1222512 284988 2536480 3844851 2724648 -416145 -3259024
39277 -3259024 -3623960 -1554547 909618 1914084 1325435 276350 -124272 452323 1465756
39268 1465756 1991326 1674436 1101311 789745 282214 -874305 -1772960 -1198751 171597
39259 171597 340343 -1069279 -2264339 -2108349 -1503509 -1193178 -424193 836881 634529
$$ packed form
39320f52058k42376J485316J396241j048235l049966j799193J436247K460357
39312a3667j01257k449140q39928K730542L118326n38870l617730k673564K48796
39303d136492J495380Q95539N81097J022347J116407Q61797J090416J220402m2573
39294D104320j964077k243894m74135J070274O80994o33779j083599n94329k29313
39285a367538j84194L29220J507500K251492J308371j120203l140793k842879
39277c259024l64936K069413K464165J004466n88649j049085m00622N76595J013433
39268A465756N25570l16890n73125l11566n07531j156519q98655N74209J370348
39259A71597J68746j409622j195060J55990O04840L10331P68985J261074k02352
$$ plain form
39250 634529 -1865399 -3843220 -2137646 2070894 4784378 4717189 4202087 4684092 4648551
39241 4648551 2900288 909483 269119 136399 -829134 -1706665 -724676 1548784 2629607
39232 2629607 1508748 -176063 -569335 154748 460605 -461383 -1819088 -2154087 -895901
39223 -895901 1002973 2044460 1723745 715313 -437354 -2005717 -3985318 -5137876
39215 -5137876 -4202727 -1867013 -402322 -957241 -2031662 -1363923 1098227 3032726 2594079
39206 2594079 514080 -1124076 -1371934 -716652 493306 2384603 4216257 4350246 2438986
39197 2438986 412544 119779 888158 748289 -581069 -1460203 -830344 553013 1532211
39188 1532211 1926413 2129774 2277117 2227147 1790755 805349 -513018 -1348053 -1047711
$$ packed form
39250F34529k499928j977821J705574M208540K713484o7189n15102M82005l5541
39241D648551j748263j990805o40364j32720r65533q77531R81989K273460J080823
39232B629607j120859j684811l93272P24083L05857r21988j357705l34999J258186
39223h95901J898874J041487l20715j008432j152667j568363j979601j152558
39215e137876R35149K335714J464691n54919j074421O67739K462150J934499m38647
39206B594079k079999j638156k47858O55282J209958J891297J831654J33989j911260
39197B438986k026442k92765P68379j39869j329358q79134O29859J383357R79198
39188A532211L94202K03361J47343m9970m36392r85406j318367q35035L00342
$$ plain form
39179 -1047711 -92483 273818 -633415 -2330477 -3580996 -3163463 -982539 1096972 649682
39170 649682 -2160147 -4123435 -3036532 -763117 -296853 -1251245 -1124985 -38790 -542467
39161 -542467 -2710443 -3345551 -1132115 1055038 780239 -281272 317070 1594173 1195648
39152 1195648 -481120 -1328179 -1184182 -1364096 -1645618 -868364 136836 -612465 -2654225
39143 -2654225 -3325788 -1797125 -53036 579182 1094773 2166607 2514333 1343703 225126
39134 225126 754870 1910571 1593492 -226369 -1724286 -2041868 -2177755 -2996496 -3668188
39125 -3668188 -2658335 259176 3454463 4944493 4340618 3067655 2524253 2497018 1946463
39116 1946463 916887 675567 1958696 3959960 5207193 4792307 2855098 712148
$$ packed form
39179a047711R55228L66301r07233j697062j250519M17533K180924K079511m47290
39170F49682k809829j963288J086903K273415M66264r54392J26260J086195n03677
39161e42467k167976o35108K213436K187153k74799j061511N98342J277103l98525
39152A195648j676768q47059J43997j79914k81522P77254J005200p49301k041760
39143b654225o71563J528663J744089O32218N15591J071834L47726j170630j118577
39134B25126N29744J155701l17079j819861j497917l17582j35887q18741o71692
39125c668188J009853K917511L195287J490030o03875j272963n43402k7235n50555
39116A946463j029576k41320J283129K001264J247233m14886j937209k142950
$$ plain form
39108 712148 309608 2331679 4833213 5140513 3307866 2037947 2639620 3054924 1261862
39099 1261862 -1183455 -1283092 677910 1207760 -1434246 -4747804 -5470939 -3796859 -2618378
39090 -2618378 -3540324 -5280581 -5852684 -4905365 -3416078 -2010956 -536818 861773 1200260
39081 1200260 -139071 -2012633 -2327094 -603982 1119262 767667 -1009239 -1748709 -585010
39072 -585010 773857 809646 363446 1024442 2530223 3173039 2152042 162345 -1918199
39063 -1918199 -3531830 -3965043 -2978986 -1888261 -2331392 -3734144 -3769838 -1859210 -262999
39054 -262999 -643529 -1453443 -433085 1832662 2989620 2521189 1886097 1525480 315118
39045 315118 -1714165 -2534663 -1023910 1087358 1465447 202727 -630800 271607 2194643
$$ packed form
39108G12148m02540K022071K501534L07300j832647j269919O01673M15304j793062
39099A261862k445317r9637J961002N29850k642006l313558p23135J674080J178481
39090b618378r21946j740257n72103R47319J489287J405122J474138J398591L38487
39081A200260j339331j873562l14461J723112J723244l51595j776906p39470J163699
39072e85010J358867L5789m46200O60996J505781O42816j020997j989697k080544
39063a918199j613631m33213R86057J090725m43131j402752l5694J910628J596211
39054b62999l80530q09914J020358K265747J156958m68431o35092l60617j210362
39045C15118k029283q20498J510753K111268L78089j262720q33527R02407J923036
$$ plain form
39036 2194643 3434406 2863639 878214 -703469 -204594 1953197 3418264 2549561 306362
39027 306362 -1084142 -753342 305780 975785 1290627 1833477 2539959 2629303 1683938
39018 1683938 396945 -128625 316445 1035304 1711854 2710243 3658667 3038278 373915
39009 373915 -2267837 -2685078 -1658289 -1545915 -2226105 -1114216 2398390 5270321 4845040
39000 4845040 2339403 656516 494183 523555 116881 -180042 -243989 -656117 -1585432
38991 -1585432 -2528456 -2831551 -1803912 774199 3447914 3731144 1268762 -943397 -165084
38982 -165084 2421259 3580277 2534148 1305764 1221316 1643679 2107128 3161836 4592869
38973 4592869 4998430 3966193 2933489 3046774 3580925 3212837 1647871 -538410 -2441747
$$ packed form
39036B194643J239763n70767j985425j581683M98875K157791J465067q68703k243199
39027C06362j390504L30800J059122O70005L14842N42850P06482Q9344r45365
39018A683938j286993n25570M45070P18859O76550R98389R48424o20389k664363
39009C73915k641752m17241J026789J12374o80190J111889L512606K871931m25281
39000D845040k505637j682887j62333K9372m06674k96923o3947m12128r29315
38991a585432r43024l03095J027639K578111K673715K83230k462382k212159P78313
38982a65084K586343J159018j046129j228384q4448M22363M63449J054708J431033
38973D592869M05561j032237j032704J13285N34151l68088j564966k186281j903337
$$ plain form
38964 -2441747 -2861027 -1265582 794951 851636 -1237408 -2837500 -2162772 -555293 90253
38955 90253 333977 1681106 3388307 3150850 524768 -2457101 -4024926 -4121815 -3030977
38946 -3030977 -625846 2283161 3657592 2610235 982658 1177030 3015018 4052660
38938 4052660 2772566 245412 -1475125 -1565820 -691897 134855 399609 199710 -55272
38929 -55272 -231932 -793435 -2062511 -3172095 -2635117 -362633 1805012 2293197 1601878
38920 1601878 885499 -303079 -3097212 -6540215 -7832557 -5821855 -2488220 -210213
38912 -210213 812118 1435504 1614954 1210379 1438672 3397160 5703362 5718339 3118143
38903 3118143 331388 -864582 -1243734 -1849670 -1707654 515350 3653923 4909233 3520087
$$ packed form
38964b441747m19280J595445K060533N6685k089044j600092O74728J607479O45546
38955I0253K43724J347129J707201k37457k626082k981869j567825r6889J090838
38946c030977K405131K909007J374431j047357j627577J94372J837988J037642
38938D052660j280094k527154j720537r0695Q73923Q26752K64754j99899k54982
38929e5272j76660n61503j269076j109584N36978K272484K167645M88185o91319
38920A601878p16379j188578k794133l443003j292342K010702L333635K278007
38912b10213J022331O23386J79450m04575K28293J958488K306202J4977k600196
38903C118143k786755j195970l79152o05936J42016K223004L138573J255310j389146
$$ plain form
38894 3520087 1754379 1609799 2062828 931382 -1510810 -2693044 -1458401 335790
38886 335790 638581 -123678 -446398 -208615 126846 1410203 4268655 6375994 4490016
38877 4490016 -394039 -3143216 -1080418 2348100 2487260 -350558 -2250794 -1534394
38869 -1534394 -145268 197930 373136 1966439 4859026 7224927 7085402 4106856 571434
38860 571434 -364937 1532525 2783959 757680 -2407350 -2690663 201114 2942849 3592189
38851 3592189 3236402 2661817 843895 -2229526 -4177079 -3277117 -830258 929835 1507773
38842 1507773 1507074 1119379 629824 852663 1705772 1810574 782927 307658 1405270 2257497
38832 2257497 755205 -2029074 -3187327 -2118738 -1084879 -1798748 -3503695 -4664745
$$ packed form
38894C520087j765708j44580M53029j131446k442192j182234J234643J794191
38886C35790L02791p62259l22720K37783L35461J283357K858452K107339j885978
38877D490016m884055k749177K062798L428518J39160k837818j900236P16400
38869a534394J389126L43198J75206J593303K892587K365901j39525k978546l535422
38860E71434r36371J897462J251434k026279l165030k83313K891777K741735O49340
38851C592189l55787n74585j817922l073421j947553Q99962K446859J760093N77938
38842A507773o99l87695m89555K22839Q53109J04802j027647m75269J097612Q52227
38832B257497j502292k784279j158253J068589J033859p13869j704947j161050
$$ plain form
38824 -4664745 -4782086 -3981162 -2272767 -79249 1435461 1448919 493207 -209426 -188671
38815 -188671 -28275 -315883 -786502 -824821 -581716 -927052 -1984471 -2386601 -855924
38806 -855924 1764729 3128039 2137687 132824 -917080 -467982 690198 1623274 1779102
38797 1779102 1082629 119701 -295006 -115220 -41569 -280818 -195810 416715 683090 -51735
38787 -51735 -1112446 -1395604 -708894 380369 1288989 1469306 647527 -325318 75134
38778 75134 1880759 3082844 2398910 1342396 1885010 3128532 2533638 -9008 -1834808
38769 -1834808 -1508948 -766048 -1463352 -2634198 -2152380 27374 2051030 2867823 3087298
38760 3087298 3360992 3350623 2491224 824369 -1052652 -2181122 -1590999 585306 2483155
$$ packed form
38824d664745j17341Q00924J708395K193518J514710J3458r55712p02633K0755
38815a88671J60396k87608m70619l8319K43105l45336j057419m02130J530677
38806h55924K620653J363310r90352k004863j049904M49098J158180R33076J55828
38797A779102o96473r62928m14707J79786P3651k39249Q5008O12525K66375p34825
38787e1735j060711k83158O86710J089263R08620J80317q21779r72845M00452
38778G5134J805625J202085o83934j056514N42614J243522n94894k542646j825800
38769a834808L25860P42900o97304j170846M81818K179754K023656Q16793K19475
38760C087298K73694j0369q59399j666855j877021j128470N90123K176305J897849
$$ plain form
38751 2483155 2166273 45992 -1540703 -1374604 -553211 -158736 519793 2167512 3397337
38742 3397337 2505947 398064 -431169 497044 1262124 808826 312054 763151 1377871
38733 1377871 1325600 1086255 996776 333463 -859323 -883715 1062480 3133521 3406503
38724 3406503 2600852 2272656 1957133 555576 -869994 -603160 389889 -244732 -2145681
38715 -2145681 -2705573 -1546740 -1089414 -2163208 -2507467 -836747 767833 312386 -893671
38706 -893671 -598220 809561 1271159 233825 -1153327 -2080034 -2608668 -2793415 -2540248
38697 -2540248 -1852283 -528939 1523300 3223668 2901176 616516 -1530655 -2104378 -1753086
38688 -1753086 -1305002 -529498 180467 -716929 -3076456 -3998174 -1821110 818957 563641
$$ packed form
38751B483155l16882k120281j586695J66099Q21393L94475O78529J647719J229825
38742C397337q91390k107883q29233R28213P65080m53298m96772M51097O14720
38733A377871n2271k39345q9479o63313j192786k4392J946195K071041K72982
38724C406503q05651l28196l15523j401557j425570K66834R93049o34621j900949
38715b145681n59892J158833M57326j073794l44259J670720J604580m55447j206057
38706h93671K95451J407781M61598j037334j387152r26707n28634j84747K53167
38697b540248O87965J323344K052239J700368l22492k284660k147171n73723L51292
38688a753086M48084P75504P09965q97396k359527r21718K177064K640067k55316
$$ plain form
38679 563641 -1671183 -2268630 -362014 1506638 1726257 1448410 1861533 2413218 2409544
38670 2409544 2172071 1872876 1005897 -321688 -1037763 -557921 569853 1600176 2025490
38661 2025490 1376029 99279 208320 3019803 6385036 6485076 2669520 -1749192 -3895084
38652 -3895084 -3988506 -2942386 -341318 3377960 5355212 3602013 268125 -1079407
38644 -1079407 -347359 -263829 -1483544 -1594557 525529 2375801 1376527 -1386459 -2895061
38635 -2895061 -2329342 -1388292 -1162408 -856990 211128 1171881 878430 -584745 -2368262
38626 -2368262 -3833985 -4419211 -3647800 -2230851 -2070782 -3821191 -5333025 -4254712 -1575976
38617 -1575976 -430180 -1454849 -1884042 -82371 1520416 -56901 -3580089 -4823109
$$ packed form
38679E63641k234824n97447J906616J868652K19619k77847M13123N51685l674
38670B409544k37473k99195q66979j327585p16075M79842J127774J030323M25314
38661B025490o49461j276750J09041K811483L365233J00040l815556m418712k145892
38652c895084r3422J046120K601068L719278J977252j753199l333888j347532
38644a079407P32048Q3530j219715j11013K120086J850272r99274k762986j508602
38635b895061N65719R41050K25884L05418J068118R60753k93451j463175j783517
38626b368262j465723n85226P71411J416949J60069j750409j511834J078313K678736
38617a575976J145796j024669m29193J801671J602787j577317l523188j243020
$$ plain form
38609 -4823109 -2039009 1990390 3556833 1979967 -518889 -1591191 -693887 961104
38601 961104 1696570 901708 -414132 -803874 -107012 466824 73041 -515421 131444
38592 131444 2066666 3458296 2500870 -324934 -2489007 -2170565 -214603 1235968 1496885
38583 1496885 1687972 2517931 3016774 1933784 -475170 -2627240 -3128126 -1857318 6293
38574 6293 926745 386541 -752766 -1545997 -1967663 -1986711 -805661 1508750 2805856
38565 2805856 1552065 -81963 1181352 4350468 5044841 2356127 783794 3443382
38557 3443382 7096332 6911442 3223569 28781 -1115777 -1893617 -3216548 -4131801 -4257296
38548 -4257296 -4122240 -3320974 -1138280 1226550 1740477 632964 -171117 -438680 -1665383
$$ packed form
38609d823109K784100M029399J566443j576866k498856j072302Q97304J654991
38601I61104P35466p94862j315840l89742O96862N73836l93783n88462O46865
38592A31444J935222J391630r57426k825804k164073L18442J955962J450571K60917
38583A496885J91087Q29959M98843j082990k408954k152070n00886J270808J863611
38574F293R20452n40204j139307p93231m21666j9048J181050K314411J297106
38565B805856j253791j634028J263315L169116O94373k688714j572333K659588
38557C443382L652950j84890l687873l194788j144558p77840j322931r15253j25495
38548d257296J35056Q01266K182694K364830N13927j107513q04081k67563j226703
$$ plain form
38539 -1665383 -3725749 -4324733 -2322744 697503 2670460 2938131 1808619 249410
38531 249410 5997 1883998 3917272 3415257 750614 -1185982 -1146806 -564110 -459183
38522 -459183 -160446 520038 572012 -160300 -671931 -924498 -1731382 -2334343 -1097260 977436
38512 977436 789457 -1911194 -3529020 -1913105 643428 1344179 690507 422104 592836
38503 592836 811152 1700186 2970432 2623858 265259 -1357629 -379029 1216304 1028969
38494 1028969 -44839 -206985 -166761 -1138250 -1971340 -1506994 -1272083 -2313487 -2019113
38485 -2019113 1626310 4992710 3106594 -2516524 -5699227 -4431264 -2300183 -1314179
38477 -1314179 588848 3683721 4039681 -319231 -5477545 -7026168 -5807579 -5120714
$$ packed form
38539a665383k060366n98984K001989L020247J972957K67671j129512j559209
38531B49410k43413J878001K033274n02015k664643j936596L9176N82696J04927
38522d59183K98737O80484N1974p32312n11631k52567q06884o02961J237083K074696
38512I77436j87979k700651j617826J615915K556533P00751o53672k68403J70732
38503E92836K18316Q89034J270246l46574k358599j622888R78600J595333j87335
38494A028969j073808j62146M0224r71489q33090M64346K34911j041404K94374
38485b019113L645423L366400j886116n623118l182703J267963K131081R86004
38477a314179J903027L094873L55960m358912n158314j548623J218589O86865
$$ plain form
38469 -5120714 -5258990 -4324846 -2336432 -1039462 -729775 -85408 1428127 3037726 3969810
38460 3969810 3799698 2319978 271785 -846243 -727633 -661143 -1087682 -714729 616685
38451 616685 514699 -2411760 -5661486 -6060140 -4128388 -2446154 -1325325 462300 1808202
38442 1808202 158609 -3787021 -6130063 -5206013 -3496870 -3118557 -2878450 -1527571 -681133
38433 -681133 -1874433 -3100200 -1358497 2623434 5071659 4031275 1202970 -804520
38425 -804520 -966426 364552 2249907 3411971 3024561 1562934 125920 -753109 -804460
38416 -804460 564455 3105373 4832588 4200989 2573063 2359544 3237340 2895610 1356417
38407 1356417 1261128 3194438 4207799 2604568 880012 1429666 2265616 335746 -3046897
$$ packed form
38469e120714j38276R34144J988414J296970L09687O44367J513535J609599R32084
38460C969810j70112j479720k048193j118028J18610O6490m26539L72953J331414
38451F16685j01986k926459l249726l98654J931752J682234J120829J787625J345902
38442A808202j649593l945630k343042R24050J709143L78313K40107J350879Q46438
38433f81133j193300j225767J741703L981931K448225j040384k828305k007490
38425h04520j61906J330978J885355J162064l87410j461627j437014q79029n1351
38416h04460J368915K540918J727215o31599j627926k13519Q77796l41730j539193
38407A356417r5289J933310J013361j603231j724556N49654Q35950j929870l382643
$$ plain form
38398 -3046897 -3964811 -1926672 -221865 -584749 -1256236 -697597 207528 476266 546733
38389 546733 516724 -395697 -1674049 -1560533 -381935 -854031 -3550755 -5143788 -3367866
38380 -3367866 -899762 -1405433 -4015635 -5056615 -3608421 -1747855 -312420 1704152
38372 1704152 3704722 3279658 284068 -2089808 -1678266 -189787 -61190 -623640 526391
38363 526391 3628615 6319088 6701651 5316923 4001312 3776329 4122187 3923338 2893316
38354 2893316 1875904 1566241 1429516 645655 -258180 50317 1484512 2217881 1122142
38345 1122142 -640153 -1280263 -739522 -385882 -927008 -1687404 -1798557 -1200385 -329393
38336 -329393 531143 1261738 1592659 1176493 76590 -966698 -1038008 21683 1333625
$$ packed form
38398c046897r17914K038139J704807l62884o71487N58639R05125K68738P0467
38389E46733l0009r12421j278352J13516J178598m72096k696724j593033J775922
38380c367866K468104n05671k610202j040980J448194J860566J435435K016572
38372A704152K000570m25064k995590k373876M11542J488479J28597n62450J150031
38363E26391L102224K690473L82563j384728j315611k24983L45858j98849j030022
38354B893316j017412l09663j36725p83861r03835L08497J434195P33369j095739
38345A122142j762295o40110N40741L53640n41126p60396j11153N98172Q70992
38336c29393Q60536P30595L30921m16166j099903j043288p1310J059691J311942
$$ plain form
38327 1333625 1820196 1228712 214274 -372659 -124692 690478 1310856 1217793 868951
38318 868951 1175975 2013001 2072969 813928 -384022 -89118 919543 753287 -619975
38309 -619975 -1279775 -359717 639016 231988 -891110 -1198674 -664192 -420561 -712362
38300 -712362 -616427 278407 1098768 894197 -160455 -1151974 -1511090 -1315358 -885106 -606720
38290 -606720 -1000309 -2243313 -3352281 -2578654 552418 4029697 5362291 4713414 4515554
38281 4515554 5577758 5484730 2239659 -2158348 -4008181 -2890825 -1813446 -2555686 -3568799
38272 -3568799 -3128139 -2024714 -1711929 -1764211 -1013396 132204 469282 331664 1199738
38263 1199738 3169523 4525105 4132228 2951928 2551517 2906144 2491337 474418 -1801321
$$ packed form
38327A333625M86571n91484j014438n86933K47967Q15170O20378r3063l48842
38318H68951L07024Q37026N9968j259041j197950K94904J008661j66256j373262
38309f19975o59800R20058R98733m07028j123098l07564N34482K43631k91801
38300g12362R5935Q94834Q20361k04571j054652r91519l59116J95732M30252K78386
38290f06720l93589j243004j108968P73627L131072L477279J332594o48877j97860
38281D515554J062204r3028l245071m398007j849833J117356J077379p42240j013113
38272c568799M40660J103425L12785n2282P50815J145600L37078j37618Q68074
38263A199738J969785J355582l92877j180300m00411L54627m14807k016919k275739
$$ plain form
38254 -1801321 -2087787 5708 2312406 2771654 1943402 1598965 1500758 -309788 -3874763
38245 -3874763 -6306983 -5465713 -2720492 -647934 337615 1310064 2183208 1833946 156606
38236 156606 -1800212 -3224476 -3634819 -2440195 -37384 1590016 1255127 631867 1809704
38227 1809704 3735543 3705742 1717029 299930 281132 59437 -641776 72251 2342646
38218 2342646 3342194 1739071 184054 1123110 2988367 3186214 2341112 2474707 2992359
38209 2992359 1941630 -38278 -483391 869639 1994056 2064910 2014625 1909227 840918
38200 840918 -609975 -866599 -474887 -1623858 -4107680 -4956904 -2979314 -582979 153481
38191 153481 215778 834419 856495 -787951 -2372880 -1787078 -26284 319618 -1029063
$$ packed form
38254a801321k86466K093495K306698M59248q28252l44437r8207j810546l564975
38245c874763k432220Q41270K745221K072558R85549R72449Q73144l49262j677340
38236A56606j956818j424264m10343J194624K402811J627400l34889o23260J177837
38227A809704J925839k9801j988713j417099j8798k21695p01213P14027K270395
38218B342646R99548j603123j555017R39056J865257J97847q45102J33595N17652
38209B992359j050729j979908m45113J353030J124417P0854n0285j05398j068309
38200H40918j450893k56624L91712j148971k483822q49224J977590K396335P36460
38191A53481O2297O18641K2076j644446j584929N85802J760794L45902j348681
$$ plain form
38182 -1029063 -2070584 -1761219 -1042448 -972260 -1607059 -2507873 -2970159 -2117195 36117
38173 36117 2118004 3062183 3514344 4497485 5588613 5686926 4705282 3220498 1430735
38164 1430735 -175068 -245986 1675299 3810165 4241949 3385023 2701584 2209359 1335893
38155 1335893 1006545 2314361 3972407 3805732 2208261 1356778 1430343 602700 -1307439
38146 -1307439 -2271864 -1462633 -339826 145165 664865 1312414 1086069 255555 499017
38137 499017 1936154 2730018 2288455 1941823 1837030 588793 -1071218 -276152 2707031
38128 2707031 3388487 -221414 -3850245 -3294273 -790495 -867146 -2980156 -3305031 -1713492
38119 -1713492 -1454619 -2773188 -2307210 804100 3052284 1954305 -629899 -1944528
$$ packed form
38182a029063j041521L09365P18771P0188o34799r00814m62286Q52964K153312
38173C6117K081887R44179M52161R83141J091128R8313r81644j484784j789763
38164A430735j605803p0918J921285K134866M31784q56926o83439m92225q73466
38155A335893l29348J307816J658046j66675j597471q51483P3565q27643j910139
38146a307439r64425Q09231J122807M84991N19700O47549k26345q30514K43462
38137D99017J437137P93864m41563l46632j04793j248237j660011P95066K983183
38128B707031O81456l609901l628831N55972K503778p6651k113010l24875J591539
38119a713492K58873j318569M65978L111310K248184j097979k584204j314629
$$ plain form
38111 -1944528 -1785636 -1100314 -73387 861281 577860 -674442 -866883 780162 2278726
38102 2278726 1732574 25394 -696611 153319 1527102 2386613 2396905 1812204 1336452
38093 1336452 1394144 1399201 699965 58430 787741 2576880 3818998 3976315 3788469 3331575
38083 3331575 2106723 1013478 1614522 3138991 3074147 1374704 934430 2690258 3626428
38074 3626428 1683033 -541685 91626 2026023 1512820 -1200715 -2076624 659300 4194740
38065 4194740 5495895 5204417 5874436 8076544 9783167 9109565 6658840 4813898 4783004
38056 4783004 4987125 3306440 470320 -647417 634464 1532771 69383 -1718070
38048 -1718070 -928761 1676234 2929583 1855000 213177 -904292 -2136372 -3526701
$$ packed form
38111a944528J58892O85322J026927R34668k83421j252302j92441J647045J498564
38102B278726n46152j707180p22005Q49930J373783Q59511J0292n84701m75752
38093A336452N7692N057o99236o41535P29311J789139J242118J57317j87846m56894
38083C331575j224852j093245O01044J524469o4844j699443m40274J755828R36170
38074C626428j943395k224718O33311J934397n13203k713535q75909K735924L535440
38065D194740J301155k91478O70019K202108J706623o73602k450725j844942l0894
38056D783004K04121j680685k836120j117737J281881Q98307j463388j787453
38048a718070P89309K604995J253349j074583j641823j117469j232080j390329
$$ plain form
38040 -3526701 -3874366 -2987790 -2335818 -2637225 -2622209 -1101209 1137791 2364816 1890286
38031 1890286 515766 -195865 953391 3363012 4452069 2308847 -1469213 -3211013
38023 -3211013 -1716938 363264 308841 -1246074 -1793339 -548161 870066 793206 -603772
38014 -603772 -1692970 -1125307 798348 2456194 2824083 2629372 2876269 2911864 1507759
38005 1507759 -438828 -450022 1721517 2987699 1039908 -2088154 -2492543 480790 3594005
37996 3594005 3967046 2154179 652595 812894 2032346 3134045 3534745 3218243 2377888
37987 2377888 1450275 1100320 1576548 2077619 1387746 -564326 -2374120 -2855817 -2453697
37978 -2453697 -2312081 -2620092 -2838104 -2936404 -3121838 -2769038 -1143936 976752 1999782
$$ packed form
38040c526701l47665Q86576O51972l01407J5016J521000K239000J227025m74530
38031A890286j374520p11631J149256K409621J089057k143222l778060j741800
38023c211013J494075K080202n4423j554915n47265J245178J418227p6860j396978
38014f03772j089198N67663J923655J657846L67889j94711K46897L5595j404105
38005A507759j946587j1194K171539J266182j947791l128062m04389K973333L113215
37996C594005L73041j812867j501584J60299J219452J101699M00700l16502q40355
37987B377888r27613l49955M76228N01071o89873j952072j809794m81697M02120
37978b453697J41616l08011k18012r8300j85434L52800J625102K120688J023030
$$ plain form
37969 1999782 1799318 1596513 1510470 315599 -1862413 -2870092 -1654049 -2957 332281
37960 332281 372563 1833519 3854696 4126093 2382005 502738 -379842 -745875 -933290
37951 -933290 -661657 -395125 -1178410 -2678043 -3071375 -1477452 857808 2353746 2869326
37942 2869326 3114596 3342326 3286766 2695197 1461030 -208169 -1547627 -1793279 -1134193
37933 -1134193 -514165 -456257 -685300 -796166 -597420 8485 710534 662931 -419359 -1440519
37923 -1440519 -1290678 -556822 -512241 -901453 -499743 420606 334598 -688736 -696262 950387
37913 950387 2325003 1931190 881781 741741 1072647 760598 194746 304491 698405
37904 698405 603299 591536 1508344 2592731 2592214 1985125 2073322 2455706 1596559 -329397
$$ packed form
37969A999782k00464k02805q6043j194871k178012j007679J216043J651092L35238
37960C32281M0282J460956K021177K71397j744088j879267q82580l66033j87415
37951i33290K71633K66532p83285j499633l93332J593923K335260J495938N15580
37942B869326K45270K27730n5560n91569j234167j669199j339458k45652O59086
37933a134193O20028N7908k29043j10866J98746O05905P02049m7603j082290j021160
37923a440519J49841P33856M4581l89212M01710R20349q6008j023334p526J646649
37913I50387J374616l93813j049409j40040L30906l12049n65852J09745L93914
37904F98405r5106j1763R16808J084387n17o07089Q8197L82384q59147j925956
$$ plain form
37894 -329397 -1379805 -790078 98550 329077 829249 2537654 4503593 4962022 3488715
37885 3488715 1271403 -247069 -513124 -123272 -251173 -1434502 -2869150 -3312849 -2528900
37876 -2528900 -1308039 -379536 -22399 -379975 -1208419 -1564260 -740482 671342 1602952
37867 1602952 2059559 2686667 3107562 2175158 -36228 -1850782 -1893328 -348277 1715495
37858 1715495 3173982 3099964 1543000 139273 604796 2502958 3807388 3629303 2829277
37849 2829277 1998050 850842 -33290 910081 3665894 5860931 5728895 4254801 3212659
37840 3212659 2668523 1821515 920289 750247 1178206 1579283 1892824 2135893 1806672
37831 1806672 868591 330966 752803 1219880 894379 372565 294821 -23707 -1070297
$$ packed form
37894c29397j050408N89727Q88628K30527N00172J708405J965939M58429j473307
37885C488715k217312j518472k66055L89852j27901j183329j434648m43699P83949
37876b528900J220861R28503L57137l57576q28444l55841Q23778J411824R31610
37867A602952M56607O27108M20895r32404k211386j814554m2546J545051K063772
37858A715495J458487p4018j556964j403727M65523J898162J304430j78085q00026
37849B829277q31227j147208q84132R43371K755813K195037j32036j474094j042142
37840C212659n44136q47008r01226j70042M27959M01077L13541K43069l29221
37831A806672r38081n37625M21837M67077l25501n21814p7744l18528j046590
$$ plain form
37822 -1070297 -1610753 -531362 955349 996837 76691 137053 1416835 2439381 2714284
37813 2714284 3068959 3379271 2383329 152555 -1374407 -1001376 288188 1125178 1411877
37804 1411877 1493877 1135241 245171 -415607 -143466 718498 1277249 1102747 440476 -139531
37794 -139531 -162555 320006 795072 1053810 1452350 2046545 2264749 2052937 2283754 3101640
37784 3101640 3153716 1837168 897992 1846462 3092405 2189545 -35715 -606646 824618
37775 824618 1656853 945850 815813 2356032 3486801 2555136 1146969 1277995 2228215
37766 2228215 2433438 2453511 3544713 4871021 4796143 3922370 4220703 5613975 5851980
37757 5851980 3842714 1139495 -211767 184417 1460122 2847813 4091530 5057771
$$ packed form
37822a070297n40456J079391J486711M1488r20146O0362J279782J022546K74903
37813B714284L54675L10312r95942k230774j526962L73031J289564Q36990K86699
37804A411877Q2000l58636q90070o60778K72141Q61964N58751j74502o62271n80007
37794a39531k3024M82561M75066K58738L98540N94195K18204k11812K30817Q17886
37784C101640N2076j316548r39176R48470J245943r02860k225260n70931J431264
37775H24618Q32235p11003j30037J540219J130769r31665j408167J31026R50220
37766B228215K05223K0073J091202J326308p4878q73773K98333J393272K38005
37757E851980k009266k703219j351262L96184J275705J387691J243717R66241
$$ plain form
37749 5057771 5407981 4793130 3505061 2574311 2555468 2636765 2063115 1844567 3126642
37740 3126642 4252700 2348513 -1651802 -2966043 326574 3791363 2622630 -1614239
37732 -1614239 -3778220 -2627094 -1275832 -1295047 -992366 243482 322258 -1489355 -2541737
37723 -2541737 -795836 1896648 2581997 1233619 21717 100410 923533 1628981 1631707
37714 1631707 774508 -75615 296867 1411103 1349794 56573 249574 3234475 5836329
37705 5836329 4232240 -368782 -2909174 -1003034 2592155 4244472 3495945 2083710
37697 2083710 1308030 1629741 3041762 4449104 4121429 2129088 1023534 2565653 4902263
37688 4902263 4798747 1943843 -885057 -1576755 -590576 945688 2906360 5097776 6212387
$$ packed form
37749E057771L50210o14851j288069r30750j8843Q1297n73650k18548J282075
37740C126642J126058j904187m000315j314241L292617L464789j168733m236869
37732a614239k163981J151126J351262j9215L02681J235848P8776j811613j052382
37723b541737J745901K692484O85349j348378j211902P8693Q23123P05448K726
37714A631707q57199q50123L72482J114236o1309j293221J93001K984901K601854
37705E836329j604089m601022k540392J906140L595189J652317p48527j412235
37697B083710p75680L21711J412021J407342l27675j992341j105554J542119K336610
37688D902263j03516k854904k828900o91698R86179J536264J960672K191416J114611
$$ plain form
37679 6212387 5261136 3272593 2383135 3491406 5477462 6439131 5254504 2378072 -412150
37670 -412150 -1416284 -518660 1001541 2077850 2460736 1840491 -90492 -2171557 -2116121
37661 -2116121 414748 2550852 1688095 -972050 -2304414 -1685005 -1164431 -1733392 -2024570
37652 -2024570 -885829 1162323 3487034 6072999 8042215 7746709 5384330 3462811
37644 3462811 3464184 3993930 3542251 2991242 3553295 4107152 2991926 1238775 1457069
37635 1457069 3957086 6188316 5971985 3587220 816848 -472907 972280 4771413
37627 4771413 8469418 9563431 8080853 5994802 4423223 3026629 1966864 2311463
37619 2311463 3863613 4449833 2569138 -414018 -1909958 -1214732 84091 381254 -266648
$$ packed form
37679F212387r51251j988543q89458J108271J986056R61669j184627k876432k790222
37670d12150j004134Q97624J520201J076309L82886o20245j930983k081065N5436
37661b116121K530869K136104q62757k660145j332364O19409N20574n68961k91178
37652b024570J138741K048152K324711K585965J969216k95506k362379j921519
37644C462811J373N29746m51679n51009N62053N53857j115226j753151K18294
37635A457069K500017K231230k16331k384765k770372j289755J445187L799133
37627D771413L698005J094013j482578k086051j571579j396594j059765L44599
37619B311463J552150N86220j880695k983156j495940O95226J298823K97163o47902
$$ plain form
37610 -266648 -683186 -48287 1385058 2693858 3176393 2939739 2760127 3347413 4515580
37601 4515580 4965194 3303180 -209740 -3245731 -3547458 -1379968 1022272 2305975
37593 2305975 3050243 3920494 4437711 4265981 4188270 4770518 5332590 5269360 5065614 4897635
37583 4897635 3773293 1527022 74018 781538 2064203 1845737 1028183 1740766 3234019
37574 3234019 2909971 1080733 1020035 3708257 6027623 5507648 3767828 3363896 3827697
37565 3827697 3215777 1708793 1107812 1820145 2659332 3076330 3582476 4213407 4354392
37556 4354392 4169163 4741872 6424689 8021673 8100598 6702286 5438777 5874434 7757039
37547 7757039 9072761 8252402 6024827 4371416 3991489 3933964 3555169 3343744 3592199
$$ packed form
37610b66648m16538O34899J433345J308800M82535k36654j79612N87286J168167
37601D515580M49614j662014l512920l035991l01727K167490K402240J283703
37593B305975P44268Q70251N17217j71730p7711N82248N62072o3230k03746j67979
37583D897635j124342k246271j453004P07520J282665k18466q17554P12583J493253
37574C234019l24048j829238o0698K688222K319366n19975j739820m03932M63801
37565C827697o11920j506984o00981P12333Q39187M16998N06146O30931J40985
37556D354392j85229N72709J682817J596984P8925j398312j263509M35657J882605
37547G757039J315722q20359k227575j653411l79927n7525l78795k11425K48455
$$ plain form
37538 3592199 3814041 3996090 4922632 6582162 7754565 7966791 8234611 8829517 8105655
37529 8105655 5177830 2222927 1974871 3878788 5009232 4375498 3965641 5275262 6928101
37520 6928101 6706618 4587705 2618113 2353758 3328342 4031924 3895433 3903605 5075553
37511 5075553 6769698 7353148 6530056 5792899 6085380 6361020 5510013 4530037 5202016
37502 5202016 7251299 8507897 7776229 6141427 5358819 6090589 7753479 9021983 8485275
37493 8485275 5947843 3216891 2576384 4331695 6775339 8544039 9834073 11121894
37485 11121894 11961869 11627356 10075372 7843341 5756884 4949966 6102759 8177498
37477 8177498 8984781 7791673 6555115 7700498 11223428 14746975 15982723 14478151
$$ packed form
37538C592199K21842J82049R26542J659530J172403K12226K67820N94906p23862
37529H105655k927825k954903k48056J903917J130444o33734m09857J309621J652839
37520F928101k21483k118913j969592k64355R74584P03582j36491Q172J171948
37511E075553J694145N83450q23092p37157K92481K75640q51007r79976O71979
37502E202016K049283J256598p31668j634802p82608P31770J662890J268504n36708
37493H485275k537432k730952o40507J755311K443644J768700J290034J287821
37485A1121894Q39975l34513j551984k232031k086457q06918J152793K074739
37477H177498Q07283j193108j236558J145383L522930L523547J235748j504572
$$ plain form
37469 14478151 11497061 9030310 8547463 9822190 11100175 11056363 10300369 10260616 11058485
37460 11058485 11620821 11685084 12220338 13474305 14031698 12811527 11003053 10719854 12251178
37451 12251178 14004175 14953781 15599639 16186355 15588941 13116252 10448742 10262139 12982214
37442 12982214 16004044 16396119 13734433 10117897 7998592 8254476 9918929 11382022
37434 11382022 11879439 11886222 12169490 12882831 13849056 15185645 16947866 18419339 18593187
37425 18593187 17456196 16219702 16163087 17570538 19609388 20814910 20094304 17982376
37417 17982376 16541650 17142765 18764012 19619317 19950251 21434193 23898716 24858954 23151240
37408 23151240 21027418 21196864 23320935 25170317 26092715 27257735 28980058 29923617
$$ packed form
37469A4478151k981090k466751m82847J274727J277985m3812p55994l9753P97869
37460A1058485N62336O4263N35254J253967N57393j220171j808474k83199J531324
37451A2251178J752997R49606O45858N86716n97414k472689k667510j86603K720075
37442A2982214L021830L92075k661686l616536k119305K55884J664453J463093
37434A1382022M97417O783K83268P13341R66225J336589J762221J471473J73848
37425A8593187j136991j236494n6615J407451K038850J205522p20606k111928
37417A7982376j440726O01115J621247Q55305L30934J483942K464523R60238j707714
37408B3151240k123822J69446K124071J849382R22398J165020J722323R43559
$$ plain form
37400 29923617 29251792 28039873 28018793 29796425 32539177 34671766 34933177 33638867 32886646
37391 32886646 34517083 37730874 39705038 38863128 36636543 35535734 36233794 37213947
37383 37213947 36934171 35732954 35508926 37649223 41385838 44490159 45738637 46207511
37375 46207511 47665120 50202576 52305761 53022433 53037788 53489179 54664275 56292697 58416806
37366 58416806 61341696 64964337 68590077 71439609 73266583 74524289 75869837 77483455
37358 77483455 79139783 80997809 83727741 87476526 91357059 94635947 97859385 101963786
37350 101963786 106822347 111729112 116799829 122512626 128224808 132909000 137394692 143856769
37342 143856769 152494263 160828777 167541547 175005975 185983759 199257376 211128710
$$ packed form
37400B9923617o71825j211919k1080J777632K742752K132589K61411j294310p52221
37391C2886646J630437L213791J974164q41910k226585j100809O98060R80153
37383C7213947k79776j201217k24028K140297L736615L104321J248478M68874
37375D6207511J457609K537456K103185P16672J5355M51391J175096J628422K124109
37366E8416806K924890L622641L625740K849532J826974J257706J345548J613618
37358G7483455J656328J858026K729932L748785L880533L278888L223438M104401
37350A01963786M858561M906765N070717N712797N712182M684192M485692O462077
37342A43856769Q637494Q334514O712770P464428J0977784J3273617J1871334
$$ plain form
37335 211128710 220624617 230456879 242644782 255892556 268285055 280214676 292998690
37328 292998690 306416575 319662968 333471109 348925966 364772025 378361665 389334044
37321 389334044 399985196 411360638 421163056 426719112 428244364 427683228 425770673 422042739
37313 422042739 416726114 410578587 403255256 393654200 381777606 368706309 354918581
37306 354918581 340282661 325560336 311972884 299076165 285118056 270090904 256341852
37299 256341852 245102310 234426829 222218233 209651529 199419255 191498654 183007816
37292 183007816 172183586 160440718 149964396 140907785 132050251 123329923 116375231
37285 116375231 112331397 109950515 106590359 101040557 94558296 88829259 84022162 79808689
$$ packed form
37335B11128710R495907R832262J2187903J3247774J2392499J1929621J2784014
37328B92998690J3417885J3246393J3808141J5454857J5846059J3589640J0972379
37321C89334044J0651152J1375442R802418N556056J525252n61136j912555l727934
37313D22042739n316625o147527p323331r601056j1876594j3071297j3787728
37306C54918581j4635920j4722325j3587452j2896719j3958109j5027152j3749052
37299B56341852j1239542j0675481j2208596j2566704j0232274p920601q490838
37292A83007816j0824230j1742868j0476322r056611q857534q720328o954692
37285A16375231m043834k380882l360156n549802o482261n729037m807097m213473
$$ plain form
37277 79808689 77017946 76244696 75505394 71980856 66278519 62119022 60961244 59931936
37269 59931936 56645003 53025376 51835803 52034100 50829835 48405322 46967934 46460522
37261 46460522 45111893 43466742 43667717 44752613 42991671 37846102 33644232 33700632
37253 33700632 36098629 37169694 36159818 34300512 31944731 29222157 27581304 28110237
37245 28110237 29601948 30312891 30342289 30430412 29903242 27965596 25820964 25277241 26052828
37236 26052828 26400555 25670549 24565951 23717404 23588025 24689884 26202042 25717432 22415324
37227 22415324 19114127 18716229 19891120 19255431 16905409 16253305 18419078 20310743
37219 20310743 19135396 15931224 13465071 12939301 13891252 15339473 15958021 14852958
$$ packed form
37277G9808689k790743p73250p39302l524538n702337m159497j157778j029308
37269E9931936l286933l619627j189573J98297j204265k424513j437388n07412
37261D6460522j348629j645151K00975J084896j760942n145569m201870N6400
37253C3700632K397997J071065j009876j859306k355781k722574j640853N28933
37245B8110237J491711P10943K9398Q8123n27170j937646k144632n43723P75587
37236B6052828L47727p30006j104598q48547j29379J101859J512158m84610l302108
37227B2415324l301197l97898J174891o35689k350022o52104K165773J891665
37219B0310743j175347l204172k466153n25770R51951J448221O18548j105063
$$ plain form
37211 14852958 13046096 12572652 13547175 13990467 13037345 12028427 11686349 10829152 9156943
37202 9156943 8633073 10222877 11737809 11289072 10690614 12541949 15627078 16531420 14864395
37193 14864395 13421560 13424067 13091465 11497237 10523060 11446842 12172547 10065667 6099939
37184 6099939 3946538 5364408 8301399 9781090 9313298 8647333 8837111 8817195 7324175
37175 7324175 5216069 4509268 5331391 5556102 4025764 2403752 2585903 3786959 4003637
37166 4003637 3284530 3369968 4582570 5283887 4434026 2768170 1322006 617469 1393681
37157 1393681 4068457 7015168 7442299 4890282 2160261 1803635 3180053 3994632 3372340
37148 3372340 2235819 1630003 1741322 2028923 1862051 1608408 2802963 5875192 8177835
$$ packed form
37211A4852958j806862m73444R74523M43292r53122j008918l42078q57197j672209
37202I156943n23870J589804J514932m48737n98458J851335L085129R04342j667025
37193A4864395j442835K507l32602j594228r74177R23782P25705k106880l965728
37184F099939k153401J417870K936991J479691m67792o65965J89778j9916j493020
37175G324175k108106p06801Q22123K24711j530338j622012J82151J201056K16678
37166D003637p19107Q5438J212602P01317q49861j665856j446164p04537P76212
37157A393681K674776K946711M27131k552017k730021l56626J376418Q14579o22292
37148C372340j136521o05816J11319K87601j66872k53643J194555L072229K302643
$$ plain form
37139 8177835 6667730 2691844 1156281 3948221 7247881 7112976 4698671 3374921
37131 3374921 3399515 2863597 1971580 2536065 4216273 4950736 4704449 5317127 6734095
37122 6734095 6780973 4966368 3323093 2947171 2713106 2109468 2392060 3931435 5114948
37113 5114948 5007699 4701225 5042170 5438791 5823392 7157662 8909203 8829570 6612262
37104 6612262 4915319 5131177 5164657 3474095 2154570 3193242 4584813 3688149 2019428
37095 2019428 2600341 4288157 3362012 -147 -1586098 190323 1974682 1095598 -437984
37086 -437984 318832 2555823 3377788 2241856 1185909 1607482 2896075 3854012 3932758
37077 3932758 3218952 2267376 1867479 2309449 3063505 3625624 4319551 5721522 7458379
$$ packed form
37139H177835j510105l975886j535563K791940L299660j34905k414305j323750
37131C374921K4594n35918q92017N64485J680208P34463k46287O12678J416968
37122F734095M6878j814605j643275l75922k34065o03638K82592J539375J183513
37113E114948j07249l06474L40945L96621L84601J334270J751541p9633k217308
37104F612262j696943K15858L3480j690562j319525J038672J391571q96664j668721
37095B019428N80913J687816r26145l362159j585951J776421J784359q79084j533582
37086d37984P56816K236991Q21965j135932j055947M21573J288593R57937P8746
37077C932758p13806r51576l99897M41970P54056N62119O93927J401971J736857
$$ plain form
37068 7458379 8035181 6077116 1928902 -1970841 -2887572 -464874 2848684 4586303
37060 4586303 4849396 5324047 6492727 7186595 6603031 5337722 4269942 3487627 2475754
37051 2475754 654915 -2048078 -4414745 -4338170 -1219908 2574398 4079823 3091967 1644104
37042 1644104 777035 -75490 -813614 -318665 1256295 2178930 1782306 1274893 1236058
37033 1236058 612949 -822579 -1428199 -504843 137919 -817203 -1797612 -1081391 69584
37024 69584 -317314 -1084406 484683 4031571 6260927 5672386 4179888 3531931 2924138
37015 2924138 1298029 -353900 -669903 -335070 -1027234 -2788224 -4030308 -3819286 -2835309
37006 -2835309 -2032705 -1351689 -127558 1721098 3337028 3766437 3009728 2029683 1637468
$$ packed form
37068G458379N76802j958065m148214l899743r16731K422698L313558J737619
37060D586303K63093M74651J168680O93868n83564j265309j067780p82315j011873
37051B475754j820839k702993k366667P6575L118262L794306J505425r87856j447863
37042A644104q67069q52525p38124M94949J574960R22635l96624n07413l8835
37033A236058o23109j435528o05620R23356O42762r55122r80409P16221J150975
37024F9584l86898p67092J569089L546888K229356n88541j492498o47957o07793
37015B924138j626109j651929l16003L34833o92164j760990j242084K11022R83977
37006b835309Q02604O81016J224131J848656J615930M29409p56709r80045l92215
$$ plain form
36997 1637468 1677837 1612115 1525140 1899467 2549139 2626992 1906853 1293778 1580249 2299879
36987 2299879 2526324 2447867 3195492 4981716 6357790 6005754 4652568 4143261 4789656
36978 4789656 4972825 3793435 2681174 3179333 4255167 3665288 1525247 344437 1226554
36969 1226554 2222757 1479317 106478 278234 1829949 2670850 1842162 305204 -929286
36960 -929286 -1668006 -1670385 -671405 598409 1024244 930395 1617227 2776204 2369730 -23902
36950 -23902 -1770921 -740572 1251470 732872 -2552684 -5405165 -5550078 -3889229 -2125695
36941 -2125695 -658823 126071 -1123018 -4446261 -7027450 -6360069 -3936899 -3183447 -4345834
36932 -4345834 -4518616 -2849087 -2159866 -4048039 -5766345 -4568176 -2467751 -3168984 -5936101
$$ packed form
36997A637468M0369o5722q6975L74327O49672P7853p20139o13075K86471P19630
36987B299879K26445p8457P47625J786224J376074l52036j353186n09307O46395
36978D789656J83169j179390j112261M98159J075834n89879k140041j180810Q82117
36969A226554R96203p43440j372839J71756J551715Q40901q28688j536958j234490
36960i29286p38720k379R98980J269814M25835r3849O86832J158977m06474k393632
36950b3902j747019J030349J992042n18598l285556k852481j44913J660849J763534
36941b125695J466872P84894j249089l323243k581189O67381K423170P53452j162387
36932d345834j72782J669529O89221j888173j718306J198169K100425p01233k767117
$$ plain form
36923 -5936101 -6581098 -4053859 -1862090 -2253379 -2927407 -1340310 952904 857769 -1481748
36914 -1481748 -3136537 -2392866 -32989 2424193 3658634 2534894 -674723 -3450681
36906 -3450681 -3361492 -1091827 434780 -334894 -2332035 -3706923 -3223424 -363887 3897443
36897 3897443 6682347 5780613 2701584 1003635 1511625 1722820 360543 -539861 534971
36888 534971 1625846 599812 -885743 178902 3090602 4176224 2247410 73040
36880 73040 -20901 955185 1231123 1110377 1526662 1819778 1026266 -21954 -36665 294431
36870 294431 -522778 -1826311 -1471764 640515 2232098 2259751 2375620 3822638 5243223
36861 5243223 5110490 4256217 3976300 3382951 1146425 -1380843 -1693155 -264393 -163815
$$ packed form
36923e936101o44997K527239K191769l91289o74028J587097K293214r5135k339517
36914a481748j654789P43671K359877K457182J234441j123740l209617k775958
36906c450681Q9189K269665J526607p69674j997141j374888M83499K859537M261330
36897C897443K784904r01734l079029j697949N07990K11195j362277r00404J074832
36888E34971J090875j026034j485555J064645K911700J085622j928814k174370
36880G3040r3941R76086K75938j20746M16285K93116p93512j048220j4711L31096
36870B94431q17209j303533L54547K112279J591583K7653J15869J447018J420585
36861E243223j32733q54273k79917n93349k236526k527268l12312J428762J00578
$$ plain form
36852 -163815 -2379436 -4399131 -4202071 -2996353 -2671112 -2796645 -1930003 -281767 762518
36843 762518 773263 413948 222059 414416 1081116 1656590 1305677 713460 1888804 4843825
36833 4843825 6335993 4095850 763282 738109 3931478 5874498 4089447 1085561
36825 1085561 12242 279336 -479809 -2082410 -2029983 502206 3119071 3146934 877436
36816 877436 -943878 -464516 1258496 1929288 1092159 426580 906226 1237985 209279
36807 209279 -802390 375119 3065466 4188505 2471099 25228 -941654 -950179 -1542309
36798 -1542309 -2386960 -1849705 308517 2409560 2911321 1896989 494901 -443526 -979806
36789 -979806 -1738760 -2884823 -3470515 -2355742 47049 1709344 1198975 -630206 -1761081
$$ packed form
36852a63815k215621k019695J97060J205718L25241j25533Q66642J648236J044285
36843G62518J0745l59315j91889J92357O66700N75474l50913n92217J175344K955021
36833D843825J492168k240143l332568k5173L193369J943020j785051l003886
36825A085561j073319K67094p59145j602601N2427K532189K616865K7863k269498
36816H77436j821314M79362J723012O70792q37129o65579M79646L31759j028706
36807B09279j011669J177509K690347J123039j717406k445871r66882q525n92130
36798a542309q44651N37255K158222K101043N01761j014332j402088r38427n36280
36789i79806p58954j146063n85692J114773K402791J662295n10369j829181j130875
$$ plain form
36780 -1761081 -1342123 -242853 334328 54486 -614269 -1048750 -1003537 -842424 -1191767
36771 -1191767 -2097064 -2691293 -2105643 -687977 104372 -716001 -2327440 -2673476 -617670
36762 -617670 2596639 4431358 3683454 1616449 285233 261770 454191 -279640 -1962302
36753 -1962302 -3715692 -4639949 -4608323 -4416979 -4759925 -4975905 -3762593 -1559245 -841957
36744 -841957 -2848148 -5220167 -4718957 -1573677 896604 718449 -769421 -1472133 -964654
36735 -964654 138026 1326363 1912065 1168927 -412394 -1321337 -1148389 -1212067 -2478704
36726 -2478704 -4222796 -5362494 -5721086 -5362297 -4170138 -2717580 -1966283 -1498672 134023
36717 134023 2646211 3816474 3077990 2828931 4533154 5954792 4480929 1078631 -1534100
$$ packed form
36780a761081M18958J099270N77181k79842o68755m34481M5213J61113l49343
36771a191767r05297n94229N85650J417666P92349q20373j611439l46036K055806
36762f17670L214309J834719p47904k067005j331216k3463J92421p33831j682662
36753a962302j753390r24257L1626J91344l42946k15980J213312K203348P17288
36744h41957k006191k372019N01210L145280K470281j78155j487870p02712N07479
36735i64654J102680J188337N85702p43138j581321r08943J72948o3678j266637
36726b478704j744092j139698l58592L58789J192159J452558P51297M67611J632695
36717A34023K512188J170263p38484k49059J704223J421638j473863l402298k612731
$$ plain form
36708 -1534100 -2736623 -3320776 -2857166 -978179 270688 -956644 -2429642 -600301
36700 -600301 3316746 4418251 1515289 -1074796 -365701 1008853 -355243 -3066309
36692 -3066309 -3320429 -646538 1667076 804250 -2924442 -6760683 -7612257 -4761912 -1353092
36683 -1353092 -1419919 -4639165 -6438670 -4419867 -1584932 -1213328 -1890622 -801914 953591
36674 953591 491123 -1397701 -1468489 319661 921105 -383113 -1186418 -740334 -1020975
36665 -1020975 -2259054 -1901082 538595 1901009 682492 -163826 1647035 3570317
36657 3570317 2485364 -89954 -814128 -509 -177119 -1041556 -205246 2041454 2910646
36648 2910646 1673391 191357 -884636 -2577021 -4194013 -3572096 -1393142 -1222471
$$ packed form
36708a534100j202523n84153M63610J878987J248867j227332j472998J829341
36700f00301L917047J101505k902962k590085P09095J374554j364096k711066
36692c066309k54120K673891K313614q62826l728692l836241q51574K850345L408820
36683a353092o6827l219246j799505K018803K834935L71604o77294J088708J755505
36674I53591m62468j888824p0788J788150O01444j304218q03305M46084k80641
36665a020975j238079L57972K439677J362414j218517q46318J810861J923282
36657C570317j084953k575318p24174Q13619j76610q64437Q36310K246700Q69192
36648B910646j237255j482034j075993j692385j616992O21917K178954J70671
$$ plain form
36640 -1222471 -3888285 -5604211 -3628978 -387392 510586 -546775 -873040 -140792 -140553
36631 -140553 -1148185 -1511790 -472399 787562 766513 -992085 -3557512 -4711421 -2661604
36622 -2661604 1230158 3108562 1464924 -616434 83085 2398577 3312425 2884189 3180771
36613 3180771 3777701 2382659 -574199 -1981367 -864028 505974 749894 1021862 1784265
36604 1784265 1589767 303486 112410 1775944 3061113 2604717 2161282 3027577 3419798
36595 3419798 1901756 483261 1382631 3234712 3632029 3150977 3473813 3577123 1627602
36586 1627602 -851497 -774360 1447338 2607882 1890927 1318961 1318598 183863 -1651374
36577 -1651374 -1232516 1798836 3777923 2514465 582231 912802 2391565 2535221 1807211
$$ packed form
36640a222471k665814j715926J975233L241586Q97978j057361l26265P32248K39
36631a40553j007632l63605J039391J259961k1049j758598k565427j153909K049817
36622b661604L891762J878404j643638k081358O99519K315492R13848m28236K96582
36613C180771N96930j395042k956858j407168J117339J370002K43920K71968P62403
36604A784265j94498j286281j91076J663534J285169m56396m43435Q66295L92221
36595C419798j518042j418495Q99370J852081L97317m81052L22836J03310j949521
36586A627602k479099P7137K221698J160544p16955n71966l63j134735j835237
36577a651374M18858L031352J979087j263458j932234L30571J478763J43656p28010
$$ plain form
36568 1807211 2185269 3416919 3788341 3261193 2960906 2558885 960376 -1080278 -1758091
36559 -1758091 -1316552 -1734141 -3208572 -3370364 -651372 3348717 5632288 4839934 2138384
36550 2138384 -15835 113273 1914211 2864125 1343639 -1349567 -2668492 -1870572 -243636
36541 -243636 976217 1331771 400900 -1697984 -3240589 -2383416 99825 1485363 808743
36532 808743 -26045 701736 2402768 3843854 4876793 5368917 4341797 1735447 -482073
36523 -482073 -620344 494702 1107308 1139968 1493843 1866778 1339165 454103 603665 1633208
36513 1633208 2007427 1226232 208066 -628267 -1657481 -2353773 -1517240 290471 723575
36504 723575 -984302 -2635452 -2306238 -1107994 -1087297 -2061326 -2693686 -3451154 -5777376
$$ packed form
36568A807211L78058J231650L71422n27148l00287m02021j598509k040654o77813
36559a758091M41539m17589j474431j61792K718992M000089K283571p92354k701550
36550B138384k154219J29108J800938R49914j520486k693206j318925P97920J626936
36541b43636J219853L55554r30871k098884j542605Q57173K483241J385538o76620
36532H08743q34788P27781J701032J441086J032939M92124j027120k606350k217520
36523d82073j38271J115046O12606L2660L53875L72935n27613q85062J49562J029543
36513A633208L74219p81195j018166q36333j029214o96292Q36533J807711M33104
36504G23575j707877j651150L29214J198244K0697r74029o32360p57468k326222
$$ plain form
36495 -5777376 -8692210 -9023109 -5690472 -1536615 233777 -273200 -821557 -436440 119191
36486 119191 382053 764023 1236242 1139427 549282 345076 480371 -302911 -2177131 -3082592
36476 -3082592 -1358769 1406655 2007749 -135148 -2190584 -1691635 555511 2064389
36468 2064389 1761175 450013 -697317 -873268 332572 2248374 2928107 1045961 -2118824
36459 -2118824 -3817242 -3023573 -1435123 -1136785 -2234562 -3100449 -2254936 223450 2678239
36450 2678239 3329905 2265628 1591704 2791484 4487462 4161596 1738511 -329215 -687983
36441 -687983 -821136 -2353594 -4374723 -4837865 -3510456 -2074657 -1857419 -2642869 -3422230
36432 -3422230 -3434849 -2670441 -1828242 -1389144 -586079 1682919 4511037 5053966 2137023
$$ packed form
36495e777376k914834l30899L332637M153857J770392n06977n48357L85117N55631
36486A19191K62862L81970M72219r6815n90145k04206J35295p83282j874220r05461
36476c082592J723823K765424O01094k142897k055436M98949K247146J508878
36468B064389l03214j311162j147330j75951J205840J915802O79733j882146l164785
36459b118824j698418P93669J588450K98338j097777q65887Q45513K478386K454789
36450B678239O51666j064277o73924J199780J695978l25866k423085k067726l58768
36441f87983j33153j532458k021129m63142J327409J435799K17238p85450p79361
36432c422230j2619P64408Q42199M39098Q03065K268998K828118N42929k916943
$$ plain form
36423 2137023 -1483591 -2207707 -198203 1052701 -428264 -2727673 -3087711 -1584323
36415 -1584323 -480407 -823453 -1287017 -557597 443777 -148769 -2103588 -2955165 -1511920
36406 -1511920 60961 -777678 -3019772 -3452018 -1436621 417747 632807 857695 2302684
36397 2302684 3153058 1660058 -616745 -1272775 -876206 -1406865 -2269742 -1089578 2123492
36388 2123492 4639506 4781411 3484708 2135065 1248363 1278389 2338248 2988543 1594131
36379 1594131 -916702 -1834938 -377461 1566405 2505094 2802271 2768769 1743129 -231776
36370 -231776 -1866578 -2370738 -1988876 -679029 1647393 3534304 3110096 1071541 -380
36361 -380 438758 458239 -536432 -775567 312431 842215 -44851 -706555 -363490 -549640
$$ packed form
36423B137023l620614p24116K009504J250904j480965k299409l60038J503388
36415a584323J103916l43046m63564P29420J001374n92546j954819q51577J443245
36406a511920J572881q38639k242094m32246K015397J854368K15060K24888J444989
36397B302684Q50374j493000k276803o56030L96569n30659q62877J180164L213070
36388B123492K516014J41905j296703j349643q86702L0026J059859O50295j394412
36379A594131k510833r18236J457477J943866R38689K97177l3502j025640j974905
36370b31776j634802n04160L81862J309847K326422J886911m24208k038555j071921
36361c80M39138J9481r94671k39135J087998N29784q87066o61704L43065j86150
$$ plain form
36351 -549640 -1598193 -1294653 860586 1746475 -319744 -2219034 -1052696 812644 -284345
36342 -284345 -3054763 -3454887 -1161609 670751 831076 869481 1336185 1359348 1487768
36333 1487768 3073777 5152087 5553083 4700491 4681581 5094759 3766620 1205628 90602
36324 90602 398959 -471208 -2437348 -2403722 -161642 280063 -2879840 -5971615 -5479355
36315 -5479355 -2986724 -1697641 -1487818 -566850 776231 1339347 1701269 2719761 3233953
36306 3233953 2117685 881662 1420836 2751338 2760052 1715821 1242420 1237583 776538
36297 776538 734064 2215279 3406546 1609544 -2037471 -3578486 -2114569 -966545 -2170921
36288 -2170921 -3400253 -2066441 478968 1194312 -209782 -1533196 -1592284 -1110524 -630655
$$ packed form
36351e49640j048553L03540K155239Q85889k066219j899290J166338J865340j096989
36342b84345k770418m00124K293278J832360J60325L8405M66704K3163J28420
36333A487768J586009K078310M00996q52592j8910M13178j328139k560992j115026
36324I0602L08357q70167j966140L3626K242080M41705l159903l091775M92260
36315e479355K492631J289083K09823R20968J343081N63116L61922J018492N14192
36306C233953j116268j236023N39174J330502Q714j044231m73401m837m61045
36297G76538m2474J481215J191267j797002l647015j541015J463917J148024j204376
36288b170921j229332J333812K545409P15344j404094j323414n9088M81760M79869
$$ plain form
36279 -630655 284653 1550153 1898499 433410 -1973028 -3434085 -2897846 -983032 814320
36270 814320 1571440 1660786 2048924 2919441 3285453 2209989 153476 -1361731 -1413663
36261 -1413663 -520928 341273 1029108 2020867 3241929 3852688 3292983 1906037 325080
36252 325080 -1132608 -2155179 -2234885 -1389401 -568826 -638804 -1286547 -1568518 -1209653 -707946
36242 -707946 -507034 -788868 -1722223 -3067925 -3831763 -3254162 -1972539 -1240716 -1092129
36233 -1092129 -293667 1798755 4259453 5635571 5233632 3290703 596551 -1916531
36225 -1916531 -3752487 -5073009 -6078347 -6599984 -6732516 -7085971 -7614906 -7071543 -4724948
36216 -4724948 -1753646 362202 1843473 3409495 4223343 3269185 1895269 2267470 3709683
$$ packed form
36279f30655R15308J265500L48346j465089k406438j461057N36239J914814J797352
36270H14320P57120Q9346L88138Q70517L66012j075464k056513j515207n1932
36261a413663Q92735Q62201O87835R91759J221062O10759n59705j386946j580957
36252C25080j457688j022571p9706Q45484Q20575o9978o47743k81971L58865N01707
36242g07946K00912k81834r33355j345702p63838N77601J281623P31823J48587
36233a092129P98462K092422K460698J376118m01939j942929k694152k513082
36225a916531j835956j320522j005338n21637j32532l53455n28935N43363K346595
36216d724948K971302K115848J481271J566022Q13848r54158j373916L72201J442213
$$ plain form
36207 3709683 3524390 1410537 -101615 682 -196531 -1646456 -2467237 -1578209 -1020911
36198 -1020911 -2453120 -4077999 -3619438 -2088156 -1864668 -2848340 -3259201 -2838625 -2585681
36189 -2585681 -2452850 -1808111 -1171368 -1123187 -538508 1670062 4068777 4487983 3388048
36180 3388048 2896907 3379903 3637238 3584998 3707640 2645659 -1065099 -5018001 -4602570
36171 -4602570 528990 5136964 4911962 1381911 -1244288 -1410981 -377505 754199
36163 754199 1751839 2175929 1643040 645289 -145944 -745438 -1142846 -714592 633328
36154 633328 1708630 1536319 782012 573010 689557 159186 -907094 -1351873 -663377
36145 -663377 423576 1069865 1294317 1569473 1881033 1523933 -17006 -1989526 -2638042
$$ packed form
36207C709683j85293k113853j512152J02297j97213j449925q20781Q89028N57298
36198a020911j432209j624879M58561J531282K23488r83672m10861M20576K52944
36189b585681J32831O44739O36743M8181N84679K208570K398715M19206j099935
36180C388048m91141M82996K57335n2240J22642j061981l710758l952902M15431
36171d602570N131560M607974k25002l530051k626199j66693J033476J131704
36163G54199R97640M24090n32889r97751p91233n99494l97408M28254J347920
36154F33328J075302j72311p54307k09002J16547n30371j066280m44779O88496
36145f63377J086953O46289K24452K75156L11560l57100j540939j972520o48516
$$ plain form
36136 -2638042 -1062964 1480776 2799221 2029363 13743 -2132014 -3722572 -4089842
36128 -4089842 -2927138 -1207439 -450010 -792018 -999367 -580834 -431683 -977673 -1313057
36119 -1313057 -983684 -1041874 -2110493 -2728824 -1191628 1812448 4014275 4565114 4638960
36110 4638960 5101639 5139052 3787771 1780362 885329 1619615 2430297 1606771 -319492
36101 -319492 -918856 1072072 3890383 4870272 3795906 2753821 2885799 3039897 2071315
36092 2071315 737490 190709 -121103 -1557442 -3924067 -5432512 -4942424 -3240024 -1996610
36083 -1996610 -2095995 -3036701 -3556195 -2838528 -1326857 -249464 -319033 -1182234 -2027049
36074 -2027049 -2159206 -1137312 727397 1977486 1264919 -752146 -2026276 -1979983 -2161907
$$ packed form
36136b638042J575078K543740J318445p69858k015620k145757j590558l67270
36128d089842J162704J719699P57429l42008k07349M18533J49151n45990l35384
36119a313057L29373n8190j068619o18331J537196L004076K201827N50839P3846
36110D638960M62679L7413j351281k007409q95033P34286Q10682q23526j926263
36101c19492n99364J990928K818311R79889j074366j042085J31978J54098r68582
36092B071315j333825n46781l11812j436339k366625j508445M90088J702400J243414
36083a996610r9385r40706n19494P17667J511671J077393o9569q63201q44815
36074b027049j32157J021894J864709J250089p12567k017065j274130M6293j81924
$$ plain form
36065 -2161907 -3342625 -3886876 -2528488 -967519 -1362397 -2429323 -958738 3024848
36057 3024848 5595984 4068092 180513 -3012358 -5011578 -6765179 -7631232 -6089565
36049 -6089565 -2761713 -255821 106818 -475939 -551605 -117101 467318 1556693 3186076
36040 3186076 4194054 3532802 1622042 -562339 -2820508 -5008023 -5988012 -4979938
36032 -4979938 -3364664 -3207617 -4109338 -3571303 -804293 1955536 2763878 2541930 2946290
36023 2946290 3469317 2594319 604331 -863471 -1315393 -1435297 -1232902 -340069 226475
36014 226475 -937059 -2758061 -2391695 526421 2778644 1923429 -410678 -1181693 -15634
36005 -15634 1321993 2020724 2447553 2209834 544112 -1564923 -2037967 -783278 14275
$$ packed form
36065b161907j180718n44251J358388J560969l94878j066926J470585L983586
36057C024848K571136j527892l887579l192871j999220j753601q66053J541667
36049f089565L327852K505892L62639n82757p5666M34504N84419J089375J629383
36040C186076J007978o61252j910760k184381k258169k187515r79989J008074
36032d979938J615274J57047r01721N38035K767010K759829Q08342k21948M04360
36023B946290N23027q74998j989988j467802m51922j19904K02395Q92833N66544
36014B26475j163534j821002L66366K918116K252223q55215k334107p71015J166059
36005a5634J337627O98731M26829k37719j665722k109035m73044J254689P97553
$$ plain form
35996 14275 -659243 -954676 851353 3332118 3657263 1495746 -666257 -921447 -18216
35987 -18216 260769 -535180 -1437908 -1446345 -284846 1637114 3391459 4127057 4057175 4360070
35977 4360070 5537905 6525336 6226180 5224341 4782298 4685975 3619741 1480549 -385768
35968 -385768 -1370652 -2207707 -2968242 -2409668 -260373 1619046 1595001 297944 -850223
35959 -850223 -1517989 -1607369 -475908 1179523 692549 -2838583 -5974474 -5141846 -1994977
35950 -1994977 -982409 -2477828 -2535461 456642 3260069 3096399 1560502 1304945 2029917
35941 2029917 2034954 1247182 491376 -207272 -656990 172407 2044769 2767268 1470580
35932 1470580 353446 1071227 1785730 418573 -1465482 -1231106 265302 336105 -610075
$$ packed form
35996A4275o73518k95433J806029K480765L25145k161517k162003k55190R03231
35987a8216K78985p95949r02728q437J161499J921960J754345P35598o9882L02895
35977D360070J177835R87431k99156j001839m42043r6323j066234k139192j866317
35968c85768r84884q37055p60535N58574K149295J879419k4045j297057j148167
35959h50223o67766q9380J131461J655431m86974l531132l135891Q32628L146869
35950a994977J012568j495419n7633K992103K803427j63670j535897k55557P24972
35941B029917N037p87772p55806o98648m49718Q29397J872362P22499j296688
35932A470580j117134P17781P14503j367157j884055K34376J496408P0803r46180
$$ plain form
35923 -610075 265989 3150637 5003232 4247028 2582192 1599718 781320 -277843 -554918
35914 -554918 314903 1012937 723894 284443 189898 -456643 -1903016 -2626618 -1558162
35905 -1558162 190651 1065293 1146541 1370430 1935695 2527146 3017901 3126024 2486380
35896 2486380 1658725 1731124 2385105 1985339 269095 -960513 -833214 -1042282 -2957085
35887 -2957085 -5022753 -5022772 -3399166 -2123926 -1486421 -423059 749903 484418 -1301261
35878 -1301261 -2888007 -3168898 -2528983 -1438133 -179680 78318 -1739729 -4194466 -4253758
35869 -4253758 -1493541 854940 328853 -1350989 -1042649 1309590 3076764 2757608 1124541
35860 1124541 -827710 -2749133 -3870841 -3376885 -2224739 -2501424 -4288641 -5208296 -4130559
$$ packed form
35923f10075Q76064K884648J852595p56204j664836r82474q18398j059163k77075
35914e54918Q69821O98034k89043m39451r4545o46541j446373p23602J068456
35905a558162J748813Q74642Q1248K23889N65265N91451M90755J08123o39644
35896B486380q27655P2399O53981l99766j716244j229608J27299k09068j914803
35887b957085k065668j9J623606J275240O37505J063362J172962k65485j785679
35878a301261j586746k80891O39915J090850J258453K57998j818047k454737n9292
35869d253758K760217K348481n26087j679842L08340K352239J767174l19156j633067
35860A124541j952251j921423j121708M93956J152146k76685j787217r19655J077737
$$ plain form
35851 -4130559 -3259871 -4777903 -7120729 -7035957 -4431905 -2467300 -2889535 -3979797 -3851186
35842 -3851186 -3286112 -3712178 -4243524 -2973965 -372451 871008 -487632 -2477787 -2452427
35833 -2452427 -277698 1812244 1968663 545773 -776043 -1102466 -1133395 -1892979 -3190053
35824 -3190053 -3889415 -3442974 -2315449 -902864 879519 2550300 2820969 1352361 -179825
35815 -179825 -39479 1122727 1172388 -416182 -1897464 -1900686 -1301785 -1732337 -3253107
35806 -3253107 -4509071 -4706648 -4466699 -4738221 -5587706 -6295179 -6182290 -5002716 -2861936
35797 -2861936 -349298 1323228 1136651 -383393 -1387367 -955129 -345847 -960336 -1935103
35788 -1935103 -1533657 -410483 -1026844 -3502785 -4760134 -3056421 -882308 -1339580 -3660644
$$ packed form
35851d130559Q70688j518032k342826Q4772K604052J964605m22235j090262J28611
35842c851186N65074m26066n31346J269559K601514J243459j358640j990155K5360
35833b452427K174729K089942J56419j422890j321816l26423l0929p59584j297074
35824c190053o99362M46441J127525J412585J782383J670781K70669j468608j532186
35815a79825J40346J162206M9661j588570j481282l222N98901m30552j520770
35806c253107j255964j97577K39949k71522q49485p07473J12889J179574K140780
35797b861936K512638J672526j86577j520044j003974M32238O09282o14489r74767
35788a935103M01446J123174o16361k475941j257349J703713K174113m57272k321064
$$ plain form
35779 -3660644 -4803835 -3955212 -2638012 -1427252 316516 1876757 1552155 -173634
35771 -173634 -807241 215214 623357 -700729 -1685056 -618479 761008 -53119 -2311878
35762 -2311878 -3102719 -1555640 275640 466146 -657580 -1576165 -1472536 -777034 -545352
35753 -545352 -1441241 -2974427 -3855965 -3343456 -1981828 -906095 -809480 -1576685 -2332088
35744 -2332088 -1934226 -225728 1343566 1376854 620146 949095 2295244 2472382 572541
35735 572541 -1451913 -1640189 -648092 -106696 75255 990710 2405153 3006886 2418122
35726 2418122 1394253 427363 -500256 -1136359 -1137890 -702941 -58269 1131554 2836919
35717 2836919 3859189 3188306 1578102 530740 297867 182748 175263 705890 1174020
$$ packed form
35779c660644j143191Q48623J317200J210760J743768J560241l24602j725789
35771a73634o33607J022455M08143j324086r84327J066577J379487q14127k258759
35762b311878p90841J547079J831280J90506j123726r18585J03629O95502K31682
35753e45352q95889j533186q81538N12509J361628J075733R6615p67205p55403
35744b332088L97862J708498J569294L3288p56708L28949J346149J77138j899841
35735E72541k024454j88276R92097N41396J81951R15455J414443O01733n88764
35726B418122j023869r66890r27619o36103j531M34949O44672J189823J705365
35717B836919J022270o70883j610204j047362k32873j15119p485N30627M68130
$$ plain form
35708 1174020 404369 -1457191 -2944015 -3210889 -2720300 -2013575 -1082844 -63486 622699
35699 622699 994849 1457092 2003513 2328166 2546714 2894042 2999791 2473421 1838770 1786297
35689 1786297 1956667 1689513 1372164 1534486 1280974 -395099 -2176265 -1659205 936649
35680 936649 2730923 2269507 1227564 1305315 1885131 1939754 1935147 2276458 1953465 578256
35670 578256 -75157 1311689 2967254 2352101 6114 -1347554 -835471 -162898 -646742
35661 -646742 -1816335 -2936407 -3783005 -3734758 -2124669 90831 830365 -395914 -1819093
35652 -1819093 -1947439 -1279855 -978365 -1266658 -1700594 -1715376 -528685 1976062 3891132
35643 3891132 2724102 -978192 -3417998 -2248477 327275 786622 -1038051 -2550797
$$ packed form
35708A174020p69651j861560j486824k66874M90589P06725R30731J019358O86185
35699F22699L72150M62243N46421L24653K18548L47328J05749n26370o34651n2473
35689A786297J70370k67154l17349J62322k53512j676073j781166N17060K595854
35680I36649J794274m61416j041943P7751N79816N4623m607L41311l22993j375209
35670E78256o53413J386846J655565o15153k345987j353668N12083O72573m83844
35661f46742j169593j120072q46598M8247J610089K215500P39534j226279j423179
35652a819093j28346O67584L01490k88293m33936j4782J186691K504747J915070
35643C891132j167030l702294k439806J169521K575752M59347j824673j512746
$$ plain form
35635 -2550797 -2366952 -1367130 -537811 -84004 -365608 -1579030 -2637196 -2324970 -1412557
35626 -1412557 -1626775 -2713570 -2765425 -1426830 -261118 319061 1710829 3988978 4967503
35617 4967503 3645151 1890869 1154635 263095 -1512901 -2073507 -1460 2062096 1090109
35608 1090109 -1195522 -900618 1597010 2342567 624851 209219 2744068 4532542 2180094
35599 2180094 -2133674 -3935817 -2489161 -548372 206751 506925 1083627 1517168 1366523
35590 1366523 668653 -568334 -2094006 -2990215 -2656676 -1792890 -1387114 -1269031 -660155
35581 -660155 412951 1227643 1348546 725782 -450115 -1264625 -512010 1404944 2196331
35572 2196331 629783 -1378678 -1283692 383334 797014 -1084457 -3187922 -3171348 -1004446
$$ packed form
35635b550797J83845R99822Q29319M53807k81604j213422j058166L12226R12413
35626a412557k14218j086795n1855J338595J165712N80179J391768K278149R78525
35617D967503j322352j754282p36234q91540j775996n60606K072047K063556r71987
35608A090109k285631K94904K497628P45557j717716m15632K534849J788474k352448
35599B180094m313768j802143J446656J940789P55123L00174N76702M33541j50645
35590A366523o97870j236987j525672q96209L33539Q63786M05776J18083O08876
35581f60155J073106Q14692J20903o22764j175897q14510P52615J916954P91387
35572B196331j566548k008461R4986J667026M13680j881471k103465J6574K166902
$$ plain form
35563 -1004446 1575673 2924770 2480765 864658 -652848 -1291284 -1357010 -1380264 -1162428
35554 -1162428 -262271 1166736 2691121 4073545 4823095 4295703 3111518 3202150 5126903
35545 5126903 6603480 5459127 2957276 2062838 3149643 3801997 2576511 566376
35537 566376 -837038 -1401676 -919888 1065076 3568787 4209128 2152829 -365240 -602250
35528 -602250 1546936 3811872 4197950 2719183 1051715 853498 2020072 2678378 1480383
35519 1480383 -528710 -1282102 -416330 670119 1026395 826361 132730 -1163465 -2104312
35510 -2104312 -1190135 1509261 4298206 6096044 7150543 7408377 6017364 2898595
35502 2898595 -747351 -3785463 -5528341 -5004415 -2001900 1158026 1505379 -424887
$$ packed form
35563a004446K580119J349097m44005j616107j517506o38436o5726k3254K17836
35554a162428R00157J429007J524385J382424P49550n27392j184185R0632J924753
35545E126903J476577j144353k501851q94438J086805O52354j225486k010135
35537E66376j403414n64638M81788J984964K503711O40341k056299k518069k37010
35528f02250K149186K264936L86078j478767j667468j98217J166574O58306j197995
35519A480383k009093p53392Q65772J086449L56276k00034o93631j296195r40847
35510b104312R14177K699396K788945J797838J054499K57834j391013l118769
35502B898595l645946l038112j742878N23926L002515L159926L47353j930266
$$ plain form
35494 -424887 -1009989 1134218 3222002 3010860 2293010 3409219 4960418 4015833 913503
35485 913503 -1181320 -644477 1271812 2868420 3417738 2565100 519272 -1258437 -1373377
35476 -1373377 -423297 -95941 -654687 -931102 -556299 -465246 -1124039 -1812998 -1946977 -1840646
35466 -1840646 -1805755 -1478169 -461905 949171 1964868 1948073 893423 -582383 -1866721
35457 -1866721 -2862123 -3508601 -3298058 -2252825 -1804960 -2981323 -4029695 -2218097 1750185
35448 1750185 3856458 2212834 -425361 -1026094 -258709 -74182 -200458 184412 -145061
35439 -145061 -2044819 -3109025 -948261 2281537 2702159 900668 870526 3279750 4468168
35430 4468168 2548148 4279 -909376 -1220800 -2024644 -1939854 52452 2276476 3106165
$$ packed form
35494d24887n85102K144207K087784k11142p17850J116209J551199r44585l102330
35485I13503k094823N36843J916289J596608N49318q52638k045828j777709j14940
35476a373377R50080L27356n58746k76415L74803R1053o58793o88959j33979J06331
35466a840646L4891L27586J016264J411076J015697j6795j054650j475806j284338
35457a866721r95402o46478K10543J045233M47865j176363j048372J811598L968282
35448A750185K106273j643624k638195o00733P67385J84527j26276L84870l29473
35439a45061j899758j064206K160764L229798M20622j801491l0142K409224J188418
35430D468168j920020k543869r13655l11424q03844Q4790J992306K224024Q29689
$$ plain form
35421 3106165 3453000 4321309 4305624 1994554 -1068559 -2337367 -1769217 -1176494 -1320650
35412 -1320650 -1708974 -2138831 -2447011 -1765537 34921 1183504 294159 -1148884 -775100
35403 -775100 942640 1312830 -534133 -2589981 -3071239 -2352538 -1280108 366029 2582993
35394 2582993 3800179 2374604 -1012270 -3602006 -3344318 -943455 1021492 844971
35386 844971 -570516 -794043 1408422 4718753 6715003 6286344 4290654 2117103 196126
35377 196126 -1849973 -3940620 -5067936 -4459509 -2791727 -1454270 -707503 361814 1844714
35368 1844714 2346873 1054546 -930375 -2422053 -3828241 -5438759 -5666573 -3398421
35360 -3398421 -877119 -1232030 -3719103 -4663408 -3021023 -1473484 -1556025 -1498190 -123441
$$ packed form
35421C106165L46835Q68309j5685k311070l063113j268808N68150N92723j44156
35412a320650l88324m29857l08180O81474J800458J148583q89345j443043L73784
35403g75100J717740L70190j846963k055848m81258P18701J072430J646137K216964
35394B582993J217186j425575l386874k589736K57688K400863J964947j76521
35386H44971j415487k23527K202465L310331J996250m28659j995690k173551j920977
35377A96126k046099k090647j127316O08427J667782J337457P46767J069317J482900
35368A844714N02159j292327j984921j491678j406188j610518k27814K268152
35360c398421K521302l54911k487073r44305J642385J547539q2541N7835J374749
$$ plain form
35351 -123441 876625 499992 712378 2623825 3660817 1708431 -771579 -414246 1620482
35342 1620482 1966913 926487 1404586 3037064 2373235 -983050 -3221312 -2351608 -1032615
35333 -1032615 -1628000 -2304819 -566151 2316853 3256795 1730846 -433822 -2190142 -3650078
35324 -3650078 -4303533 -3330213 -1449704 -547549 -1356255 -2757606 -3373978 -2932580 -2172621
35315 -2172621 -2075101 -2958717 -3953747 -3903676 -3029857 -2693565 -3069113 -2485070 -97015 2216592
35305 2216592 2218539 484060 -704593 -897345 -1655160 -3340548 -4149526 -3029617 -1499338
35296 -1499338 -1350986 -2146471 -2506034 -2623221 -3556422 -4677368 -4065083 -1649651 141710
35287 141710 -199941 -1022540 -254687 1039411 171663 -2687165 -4307243 -3229421 -2101905
$$ packed form
35351a23441J000066l76633K12386J911447J036992j952386k480010L57333K034728
35342A620482L46431j040426M78099J632478o63829l356285k238262Q69704J318993
35333a032615n95385o76819J738668K883004R39942j525949k164668j756320j459936
35324c650078o53455R73320J880509R02155q08706j401351o16372M41398P59959
35315b172621R7520q83616r95030N0071Q73819L36292l75548N84043K388055K313607
35305B216592J947j734479j188653j92752p57815j685388q08978J119909J530279
35296a499338J48352p95485l59563j17187r33201j120946O12285K415432J791361
35287A41710l41651q22599P67853J294098q67748k858828j620078J077822J127516
$$ plain form
35278 -2101905 -3560264 -5951886 -5675313 -2500988 341573 985401 813540 1085652 647347
35269 647347 -1579470 -4200033 -5356038 -5359249 -5261048 -4338665 -1560060 1438925 1805194
35260 1805194 -229415 -1417650 -425504 188790 -1665681 -3829641 -2853731 809121 3296221
35251 3296221 2515730 290860 -894436 -998307 -1345258 -2194686 -2775392 -2806816 -2681142
35242 -2681142 -2532269 -2129662 -1528592 -1105273 -1069443 -1417224 -2080161 -2655095 -2399732 -1087973
35232 -1087973 520312 1662922 2506960 3299902 3215154 1354199 -1314275 -2523638 -1543866
35223 -1543866 -130314 -27267 -681069 -387687 1074103 2094598 1312249 -790612 -2427506
35214 -2427506 -2224686 -447269 1193348 1000054 -1278597 -4414358 -6810032 -7382003 -5887205
$$ packed form
35278b101905j458359k391622K76573L174325K842561O43828j71861K72112m38305
35269F47347k226817k620563j156005l211R8201R22383K778605K998985L66269
35260A805194k034609j188235R92146O14294j854471k163960R75910L662852K487100
35251C296221p80491k224870j185296j03871l46951q49428n80706l1424J25674
35242b681142J48873M02607O01070M23319L5830l47781o62937n74934K55363J311759
35232a087973J608285J142610Q44038P92942q4748j860955k668474j209363R79772
35223a543866J413552J03047o53802K93382J461790J020495p82349k102861j636894
35214b427506K02820J777417J640617j93294k278651l135761k395674n71971J494798
$$ plain form
35205 -5887205 -3260842 -1381624 -1377649 -2127237 -1604922 182162 1048051 -141110 -1672132
35196 -1672132 -1383580 467431 1948971 2029778 1141116 -12612 -939352 -1276170 -1299600
35187 -1299600 -1869469 -2965523 -3261225 -2217108 -1316488 -1693571 -1869889 21638 2779360
35178 2779360 3473373 1787878 331052 538942 931103 45676 -1284276 -1563670 -652421
35169 -652421 740663 1927806 1947606 193233 -1969553 -2120050 -118624 1512059 1473216
35160 1473216 1584357 3270616 4551693 2921879 -435467 -1978168 -498971 1859295
35152 1859295 2763544 1784270 -272494 -2153047 -2482954 -1048201 447006 440602 -125512
35143 -125512 747913 2807570 3819815 3020782 2055017 2202665 2810244 3008212 2924872
$$ packed form
35205e887205K626363J879218L975p49588N22315J787084Q65889j189161j531022
35196a672132K88552J851011J481540Q0807q88662j153728r26740l36818k3430
35187a299600n69869j096054k95702J044117R00620l77083j76318J891527K757722
35178B779360O94013j685495j456826K07890L92161q85427j329952k79394R11249
35169f52421J393084J187143J9800j754373k162786j50497K001426J630683l8843
35160A473216J11141J686259J281077j629814l357346j542701J479197K358266
35152A859295R04249r79274k056764j880553l29907J434753J495207o404n66114
35143a25512Q73425K059657J012245p99033r65765J47648O07579J97968q3340
$$ plain form
35134 2924872 2415558 607553 -2122323 -3494941 -2165290 87160 548975 -991552
35126 -991552 -2478803 -2523372 -1602347 -777317 -621865 -1205526 -1900320 -1364793 1041007
35117 1041007 3854070 4768107 3485674 2157292 2615930 4250981 5184254 4593056 3116200
35108 3116200 1754546 1282304 2126026 3744647 4517453 3442103 1760366 1539868 2588336
35099 2588336 2467952 260746 -1450270 53842 3475682 4825640 2540280 -817288
35091 -817288 -2182927 -1304925 301830 1874204 3496877 4830262 5216014 4596063 3380750
35082 3380750 1905864 748882 807401 2079152 3019012 2187819 93490 -1527286 -1744555
35073 -1744555 -877283 378520 1135125 316692 -2127392 -4425772 -4748411 -3427825 -2137739
$$ packed form
35134B924872n09314j808005k729876j372618J329651K252450M61815j540527
35126i91552j487251m4569R21025Q25030J55452n83661o94794N35527K405800
35117A041007K813063R14037j282433j328382M58638J635051R33273n91198j476856
35108C116200j361654m72242Q43722J618621P72806j075350j681737k20498J048468
35099B588336j20384k207206j711016J504112L421840J349958k285360l357568
35091h17288j365639Q78002J606755J572374J622673J333385L85752o19951j215313
35082C380750j474886j156982N8519J271751R39860q31193k094329j620776k17269
35073a744555Q67272J255803P56605q18433k444084k298380l22639J320586J290086
$$ plain form
35064 -2137739 -1384880 -456688 529102 544741 -279107 -516960 130358 156431 -1206900 -2432256
35054 -2432256 -1766938 374114 2098872 2158568 621812 -1516172 -2643903 -1577425 817552
35045 817552 2065910 1004067 -794914 -1404933 -1135784 -1502680 -2666059 -3417079 -3090425
35036 -3090425 -2088065 -911876 98919 456715 97654 -146526 236052 260724 -1218482
35027 -1218482 -3421536 -4366699 -3521725 -2266573 -1672209 -1263094 -282265 1099513 2292483
35018 2292483 2957816 2753661 1401003 -525788 -1790074 -2019433 -2213950 -3106831 -3801469
35009 -3801469 -2940642 -795442 823210 795772 -9813 -158888 197994 -397149 -2135058
35000 -2135058 -2908470 -1112297 1290739 624647 -3293461 -6151352 -4711054 -1263489
$$ packed form
35064b137739P52859R28192R85790J5639q23848k37853O47318K6073j363331j225356
35054b432256O65318K141052J724758N9696j536756k137984j127731J066478K394977
35045H17552J248358j061843j798981o10019K69149l66896j163379p51020L26654
35036c090425J002360J176189J010795L57796l59061k44180L82578K4672j479206
35027a218482k203054r45163Q44974J255152N94364M09115R80829J381778J192970
35018B292483O65333k04155j352658j926791j264286k29359j94517q92881o94638
35009c801469Q60827K145200J618652k7438q05585j49075L56882n95143j737909
35000b135058p73412J796173K403036o66092l918108k857891J440298L447565
$$ plain form
34992 -1263489 -201796 -1715211 -2100107 147499 2172694 1546230 -69117 4625 1158690
34983 1158690 856534 -1126491 -2518949 -2100331 -1001721 -384857 509 308973 -523191
34974 -523191 -3137879 -6001794 -6686892 -4757980 -2387543 -1820287 -2842344 -3301103 -1888535
34965 -1888535 326115 1365422 627867 -941360 -2370472 -3299941 -3408920 -2562581 -1654421
34956 -1654421 -1868386 -2653816 -1958240 682368 2847639 2378786 426479 -491742 -362596
34947 -362596 -1142986 -2767335 -2548657 665808 4143074 4575360 2128498 -452371 -1623515
34938 -1623515 -2108622 -2781453 -3346997 -3275566 -2694562 -1973368 -1291126 -847853 -770859 -676416
34928 -676416 -63261 733265 790011 39133 -378922 316277 1297927 1075070 -683352 -2737800
$$ packed form
34992a263489J061693j513415l84896K247606K025195o26464j615347P3742J154065
34983A158690l02156j983025j392458M18618J098610O16864L85366L08464q32164
34974e23191k614688k863915o85098J928912K370437N67256j022057m58759J412568
34965a888535K214650J039307p37555j569227j429112r29469j08979Q46339R08160
34956a654421k13965p85430O95576K640608K165271m68853j952307r18221J29146
34947c62596p80390j624349K18678L214465L477266M32286k446862k580869j171144
34938a623515m85107o72831n65544P1431N81004P21194O82242M43273P6994R4443
34928f76416O13155P96526N6746p50878m18055O95199R81650k22857j758422k054448
$$ plain form
34918 -2737800 -3431167 -2008765 774639 3078918 3499941 2454790 1488154 1037359 -81100
34909 -81100 -2420806 -4435084 -4427758 -2866052 -1200567 594703 3182512 5272876 4666376
34900 4666376 2051170 856798 2390460 3894627 2970891 1261013 1471838 3022213
34892 3022213 3509965 2818523 2536414 2378573 670951 -2001817 -3150874 -2583786 -2803890
34883 -2803890 -4473842 -4891338 -2486296 168729 -29396 -2334837 -3679688 -3028451 -1983654
34874 -1983654 -1957906 -2639105 -2895985 -2030518 -465731 377994 -294763 -1160899 -485652
34865 -485652 714200 -297944 -3256822 -4303953 -1582780 1699806 2018568 369278
34857 369278 -440989 -497702 -1212496 -1489289 269632 2010639 520268 -2855116 -3748898
$$ packed form
34918b737800o93367J422402K783404K304279M21023j045151r66636m50795j118459
34909h1100k339706k014278P326J561706J665485J795270K587809K090364o06500
34900D666376k615206j194372J533662J504167r23736j709878K10825J550375
34892C022213M87752o91442k82109j57841j707622k672768j149057N67088k20104
34883b803890j669952m17496K405042K655025j98125k305441j344851O51237J044797
34874a983654K5748o81199k56880Q65467J564787Q43725o72757q66136O75247
34865d85652J199852j012144k958878j047131K721173L282586L18762j649290
34857C69278q10267n6713p14794k76793J758921J741007j490371l375384q93782
$$ plain form
34848 -3748898 -1754861 -978120 -3149773 -5080445 -4316760 -2802615 -2858880 -3462631 -3011697
34839 -3011697 -2515060 -3390990 -4688821 -4889906 -4190540 -2991033 -627545 2310062 3126305
34830 3126305 975840 -944145 60388 1980299 1640199 31256 233776 1762525
34822 1762525 1304234 -1619233 -3825170 -3350553 -1633215 -509850 -137713 -299493 -964738
34813 -964738 -1162766 92665 1530513 985593 -811144 -914018 853920 1056600 -1867378
34804 -1867378 -4551553 -3372477 288778 2043398 240826 -2646811 -3506680 -1519473
34796 -1519473 1803503 3985620 3450719 1154437 -209229 579422 1849001 1748251 998192
34787 998192 1428089 2965577 4080003 4518226 5376811 6545761 6302957 4068335 1737283
$$ packed form
34848c748898J994037P76741k171653j930672P63685J514145n6265o03751M50934
34839c011697M96637q75930j297831k01085O99366J199507K363488K937607Q16243
34830C126305k150465j919985J004533J919911l40100j608943K02520J528749
34822A762525m58291k923467k205937M74617J717338J123365L72137j61780o65245
34813i64738j98028J255431J437848n44920j796737j02874J767938K02680k923978
34804a867378k684175J179076L661255J754620j802572k887637q59869J987207
34796a519473L322976K182117n34901k296282j363666P88651J269579j00750p50059
34787I98192M29897J537488J114426M38223Q58585J168950k42804k234622k331052
$$ plain form
34778 1737283 1188481 1746006 1426687 -62017 -1042491 -460644 610829 583891 -484404
34769 -484404 -1244376 -1092947 -760558 -811405 -658186 351951 1671533 2185645 1618537
34760 1618537 502105 -832290 -2265376 -3154605 -2741934 -1475731 -968598 -2174206 -4115938
34751 -4115938 -4774436 -3051153 127796 2497906 2590706 1427488 1376400 2882487 3592681
34742 3592681 1942130 199408 1604897 5175367 6361592 3300006 -549396 -1315988
34734 -1315988 357162 1329109 790666 396454 765318 730802 -69153 -307852 843350
34725 843350 2404277 3035491 2531889 1474600 526781 403096 1410225 2590104 2380002
34716 2380002 707179 -465736 590454 3143694 4733524 3818265 1156395 -1258656
$$ packed form
34778A737283n48802N57525l19319j488704r80474N81847J071473k6938j068295
34769d84404p59972J51429L32389n0847J53219J010137J319582N14112n67108
34760A618537j116432j334395j433086q89229M12671J266203N07133j205608j941732
34751d115938o58498J723283L178949K370110R2800j163218n1088J506087P10194
34742C592681j650551j742722J405489L570470J186225l061586l849402p66592
34734a315988J673150R71947n38443l94212L68864l4516p99955k38699J151202
34725H43350J560927O31214n03602j057289r47819j23685J007129J179879k10102
34716B380002j672823j172915J056190K553240J589830r15259k661870k415051
$$ plain form
34708 -1258656 -2159948 -1865618 -1477795 -1549484 -1815230 -2119279 -2899154 -4261131 -5152880
34699 -5152880 -4352026 -2137504 -117770 701423 921412 1575806 2574547 2749458 1249242
34690 1249242 -1262819 -2771640 -1641460 1376382 3339013 2201206 -542418 -1437844
34682 -1437844 688080 3391449 3911272 2392532 892274 418596 437768 623340 1339935
34673 1339935 2315263 2311419 720822 -1351944 -2140632 -941809 1337181 2897806 2480286
34664 2480286 851548 656734 3561779 7466742 8169961 4522336 327365 -247033 2167030
34655 2167030 3475519 1820299 -487462 -908777 -177627 -621467 -2541588 -3970613 -3549874
34646 -3549874 -2257526 -2054052 -3484130 -4980406 -4563726 -2195315 -39521 37346 -1303436
$$ packed form
34708a258656r01292K94330L87823p1689k65746l04049p79875j361977q91749
34699e152880Q00854K214522K019734Q19193K19989O54394R98741J74911j500216
34690A249242k512061j508821J130180L017842J962631j137807k743624q95426
34682a437844K125924K703369N19823j518740j500258m73678J9172J85572P16595
34673A339935R75328l844j590597k072766p88688J198823K278990J560625m17520
34664B480286j628738j94814K905045L904963P03219l647625m194971n74398K414063
34655B167030J308489j655220k307761m21315P31150m43840j920121j429025M20739
34646c549874J292348K03474j430078j496276M16680K368411K155794P6867j340782
$$ [...]
##END NTUPLES=NMR SPECTRUM
##END=
