##TITLE=31Pdec_71-2025 Bay
 CDCl3, 64 sc
 24.6.2025
##JCAMPDX= 6.0         $$ Bruker NMR JCAMP-DX V2.0
##DATA TYPE= NMR SPECTRUM
##DATA CLASS= NTUPLES
##ORIGIN= UXNMR, Bruker Analytische Messtechnik GmbH
##OWNER= root
$$ XWIN-NMR		Version 3.5
$$ Tue Jun 24 15:33:40 2025 Russian Standard Time (UT+4h)  she@DPX200
##.OBSERVE FREQUENCY= 81.013821
##.OBSERVE NUCLEUS= ^31P
##.ACQUISITION MODE= SIMULTANEOUS
##.ACQUISITION SCHEME= undefined
##.AVERAGES= 64
##.DIGITISER RES= 17
##SPECTROMETER/DATA SYSTEM= spect
##.PULSE SEQUENCE= zgpg30
##.SOLVENT NAME= DMSO
##.SHIFT REFERENCE= (INTERNAL, DMSO, 0, 198.062)
##AUDIT TRAIL= $$ (NUMBER, WHEN, WHO, WHERE, WHAT)
$$ ##TITLE= Audit trail, XWIN-NMR		Version 3.5
$$ ##JCAMPDX= 5.01
$$ ##ORIGIN= Bruker BioSpin GmbH
$$ ##OWNER= she
$$ F:/spectra/data/she/nmr/P31/2/pdata/1/auditp.txt
$$ ##AUDIT TRAIL=  $$ (NUMBER, WHEN, WHO, WHERE, WHAT)
(   1,<2025-06-24 15:31:56.09 +0400>,<she>,<DPX200>,
      <continue with go, POWCHK disabled, PULCHK disabled
       configuration hash MD5:
       00 E9 B6 7A A2 85 ED C7 34 08 36 98 17 FE 4E 26
       data hash MD5: 32K
       8A 4D ED D0 C3 2D B4 D6 28 B9 4F D4 57 A1 E7 7D>)
(   2,<2025-06-24 15:32:32.81 +0400>,<she>,<DPX200>,
      <Start of raw data processing
       efp BC_mod = 2 LB = 1.5 FT_mod = 6 PKNL = 1 PHC0 = 1294.066 PHC1 = 371.0952 SI = 64K 
       data hash MD5: 64K
       1F 28 BE 1A D4 3D 92 2A CF 09 67 64 2A CA 57 2D>)
(   3,<2025-06-24 15:33:04.07 +0400>,<she>,<DPX200>,
      <pk PHC0 = 84.87465 PHC1 = -213.2 
       data hash MD5: 64K
       C5 5E EE 19 6F F1 88 2D 55 C2 57 DA DC C0 D7 D9>)
(   4,<2025-06-24 15:33:09.65 +0400>,<she>,<DPX200>,
      <abs ABSG = 5 
       data hash MD5: 64K
       0B F7 69 B3 CE 22 42 0C 76 2E 14 3A 2D C2 A1 6D>)
$$ ##END=
$$ 
$$ hash MD5
$$ BE 09 AF CC 5E EF 56 BA 0D 78 4A 14 04 12 04 D8
##$RELAX= 
##$RELAX= 
##$RELAX= 
##$RELAX= 
##$RELAX= 
##$RELAX= 
##$RELAX= 
##$RELAX= 
$$ Bruker specific parameters
$$ --------------------------
##$DU= <F:/spectra>
##$EXPNO= 2
##$NAME= <P31>
##$PROCNO= 1
##$TYPE= <nmr>
##$USER= <she>
##$AMP= (0..31)
100 100 100 100 100 100 100 100 100 100 100 100 100 100 100 100 100 100 
100 100 100 100 100 100 100 100 100 100 100 100 100 100 
##$AQSEQ= 0
##$AQ_mod= 1
##$AUNM= <au_zg>
##$AUTOPOS= <>
##$BF1= 81.014009
##$BF2= 200.13
##$BF3= 200.13
##$BF4= 200.13
##$BF5= 200.13
##$BF6= 200.13
##$BF7= 200.13
##$BF8= 200.13
##$BYTORDA= 1
##$CFDGTYP= 0
##$CFRGTYP= 5
##$CHEMSTR= <none>
##$CNST= (0..31)
1 1 145 1 1 1 1 1 1 1 1 1 1 1 1 1 1 1 1 1 1 1 1 1 1 1 1 1 1 1 1 1 
##$CPDPRG= <waltz16>
##$CPDPRG1= <>
##$CPDPRG2= <waltz16>
##$CPDPRG3= <>
##$CPDPRG4= <mlev>
##$CPDPRG5= <mlev>
##$CPDPRG6= <mlev>
##$CPDPRG7= <mlev>
##$CPDPRG8= <mlev>
##$CPDPRGB= <>
##$CPDPRGT= <>
##$D= (0..31)
0 1 0 0 0 0 0 0 0 0.06 0 0.03 2e-05 3e-06 0 0 0.0002 0 0 0 0 0 0 0 0 0 
0 0 0 0 0 0 
##$DATE= 1750764637
##$DBL= (0..7)
120 120 120 11 120 120 24 19 
##$DBP= (0..7)
150 150 150 150 150 150 150 150 
##$DBP07= 0
##$DBPNAM0= <>
##$DBPNAM1= <>
$$ [...]
##$SUBNAM3= <"">
##$SUBNAM4= <"">
##$SUBNAM5= <"">
##$SUBNAM6= <"">
##$SUBNAM7= <"">
##$SUBNAM8= <"">
##$SUBNAM9= <"">
##$SW= 400.765351723535
##$SWIBOX= (0..15)
0 1 3 0 0 0 0 0 0 0 0 0 0 0 0 0 
##$SW_h= 32467.5324675325
##$TD= 32768
##$TD0= 1
##$TE= 0
##$TE2= 300
##$TE3= 300
##$TEG= 300
##$TL= (0..7)
0 120 53 12 22 120 120 120 
##$TP= (0..7)
150 150 150 150 150 150 150 150 
##$TP07= 0
##$TPNAME0= <>
##$TPNAME1= <>
##$TPNAME2= <>
##$TPNAME3= <>
##$TPNAME4= <>
##$TPNAME5= <>
##$TPNAME6= <>
##$TPNAME7= <>
##$TPOAL= (0..7)
0.5 0.5 0.5 0.5 0.5 0.5 0.5 0.5 
##$TPOFFS= (0..7)
0 0 0 0 0 0 0 0 
##$TUNHIN= 0
##$TUNHOUT= 0
##$TUNXOUT= 0
##$USERA1= <user>
##$USERA2= <user>
##$USERA3= <user>
##$USERA4= <user>
##$USERA5= <user>
##$V9= 5
##$VALIST= <valist>
##$VCLIST= <CCCCCCCCCCCCCCC>
##$VD= 0
##$VDLIST= <DDDDDDDDDDDDDDD>
##$VPLIST= <PPPPPPPPPPPPPPP>
##$VTLIST= <TTTTTTTTTTTTTTT>
##$WBST= 1024
##$WBSW= 4
##$XGAIN= (0..3)
0 0 0 0 
##$XL= 0
##$YL= 0
##$YMAX_a= 5599
##$YMIN_a= -13229
##$ZGOPTNS= <>
##$ZL1= 120
##$ZL2= 120
##$ZL3= 120
##$ZL4= 120
##$ABSF1= 198.0616
##$ABSF2= -202.7028
##$ABSG= 5
##$ABSL= 3
##$ALPHA= 0
##$AQORDER= 0
##$ASSFAC= 0
##$ASSFACI= 0
##$ASSFACX= 0
##$ASSWID= 0
##$AUNMP= <proc_1d>
##$AZFE= 0.1
##$AZFW= 0.5
##$BCFW= 0
##$BC_mod= 2
##$BYTORDP= 0
##$COROFFS= 0
##$CY= -3
##$DATMOD= 1
##$DC= 0
##$DFILT= <>
##$DTYPP= 0
##$F1P= 0
##$F2P= 0
##$FCOR= 1
##$FTSIZE= 65536
##$FT_mod= 6
##$GAMMA= 0
##$GB= 0
##$INTBC= 1
##$INTSCL= 9.790993e-09
##$ISEN= 30
##$LB= 1.5
##$LEV0= 0
##$LPBIN= 0
##$MAXI= 10000
##$MC2= 0
##$MEAN= 0
##$ME_mod= 0
##$MI= 50
##$NCOEF= 0
##$NC_proc= -9
##$NLEV= 6
##$NOISF1= 182.463
##$NOISF2= 159.3651
##$NSP= 0
##$NTH_PI= 0
##$NZP= 0
##$OFFSET= 198.0616
##$PC= 4
##$PHC0= 1378.941
##$PHC1= 157.8952
##$PH_mod= 1
##$PKNL= yes
##$PPARMOD= 0
##$PSCAL= 0
##$PSIGN= 0
##$REVERSE= no
##$SF= 81.0140089999434
##$SI= 65536
##$SIGF1= 159.3651
##$SIGF2= -187.1042
##$SINO= 113.3802
##$SIOLD= 16384
##$SREGLST= <1H.CDCl3>
##$SSB= 0
##$STSI= 65536
##$STSR= 0
##$SW_p= 32467.5324675325
##$SYMM= 0
##$S_DEV= 0
##$TDeff= 32768
##$TDoff= 0
##$TI= <>
##$TILT= no
##$TM1= 0
##$TM2= 0
##$TOPLEV= 0
##$USERP1= <user>
##$USERP2= <user>
##$USERP3= <user>
##$USERP4= <user>
##$USERP5= <user>
##$WDW= 1
##$XDIM= 65536
##$YMAX_p= 273005641
##$YMIN_p= -205861254
$$ End of Bruker specific parameters
$$ ---------------------------------
##NTUPLES= NMR SPECTRUM
##VAR_NAME=  FREQUENCY,     SPECTRUM/REAL,   SPECTRUM/IMAG
##SYMBOL=    X,             R,               I
##VAR_TYPE=  INDEPENDENT,   DEPENDENT,       DEPENDENT
##VAR_FORM=  AFFN,          ASDF,            ASDF
##VAR_DIM=   65536,         65536,           65536
##UNITS=     HZ,            ARBITRARY UNITS, ARBITRARY UNITS
##FACTOR=    0.49542278885378, 1,            1
##FIRST=     16045.7642231865, 0,            0
##LAST=      -16421.768244346, 0,            0
##MIN=       -16421.768244346, -205861254,   0
##MAX=       16045.7642231865, 273005641,    0
$$ Real data points
##PAGE= N=1
##DATA TABLE= (X++(R..R)), XYDATA
$$ [...]
##PAGE= N=2
##DATA TABLE= (X++(I..I)), XYDATA
$$ plain form
7378 5334888 7030651 8703946 9369102 7654307 4624919 3085253 3864435 4928249 4809911
7369 4809911 4473152 4385941 2490171 -2129957 -5661829 -3594059 2271715 4849404 503922
7360 503922 -6505365 -9411292 -6065602 389923 5360378 5963125 2592544 -1359989 -3041893
7351 -3041893 -3679021 -5990145 -8139312 -4719618 4598101 12133894 11201491 4114922 -2612505
7342 -2612505 -7100895 -10938884 -12482877 -8182146 432783 7685133 11841235 15943513
7334 15943513 19735575 17705578 8070546 -2449595 -7273938 -8619556 -12322849 -17611919
7326 -17611919 -18191429 -11865947 -3062625 4023594 9104104 11681494 8931270 774657
7318 774657 -6884396 -7989854 -3502367 638040 1423701 1236190 2976634 6347291 9586129
$$ packed form
7378E334888J695763J673295O65156j714795l029388j539666P79182J063814j18338
7369D809911l36759q7211j895770m620128l531872K067770N865774K577689m345482
7360E03922p009287k905927L345690O455525M970455O02747l370581l952533j681904
7351c041893o37128k311124k149167L419694R317719P535793r32403p086569o727427
7342b612505m488390l837989j543993M300731Q614929P252350M156102M102278
7334A5943513L792062k029997r635032j0520141m824343j345618l703293n289070
7326a7611919n79510O325482Q803322P086219N080510K577390k750224q156613
7318G74657p659053j105458M487487M140407P85661j87511J740444L370657L238838
$$ plain form
7309 9586129 11830989 12543324 11237456 9431345 10385714 14538975 17255166 14245500 7977851
7300 7977851 5008381 7106657 8888043 5314530 -1966746 -7852177 -10558391 -12308457
7292 -12308457 -14854098 -17302311 -18024256 -16478567 -13118286 -9013668 -5395415 -2379051
7284 -2379051 1228579 5421363 7248943 3980514 -2057624 -4471539 113162 7680627
7276 7680627 11277950 9087483 6181854 7845746 12732703 14483579 10088775 4353285
7268 4353285 4086463 9175546 12802773 11074570 8667920 11924850 18736485 19967560
7260 19967560 11355385 -196549 -4793302 -1497715 1569147 -1556941 -7615298 -10138633
7252 -10138633 -8952295 -9258405 -12514946 -13809610 -9887767 -4577460 -2387919 -893135
$$ packed form
7309I586129K244860P12335j305868j806111R54369M153261K716191l009666o267649
7300G977851k969470K098276J781386l573513p281276n885431k706214j750066
7292a2308457k545641k448213p21945J545689L360281M104618L618253L016364
7284b379051L607630M192784J827580l268429o038138k413915M584701P567465
7276G680627L597323k190467k905629J663892M886957J750876m394804n735490
7268D353285k66822N089083L627227j728203k406650L256930O811635J231075
7260A9967560q612175j1551934m596753L295587L066862l126088o058357k523335
7252a0138633J186338l06110l256541j294664L921843N310307K189541J494784
$$ plain form
7244 -893135 4781411 12281323 13685188 6815128 -1517840 -4845150 -3718818 -1141345
7236 -1141345 2630076 7395443 10437498 10757794 11505868 14084317 14290952 9193625 3597216
7227 3597216 3676385 7404804 7829007 3654672 -92571 -541606 727980 3284002 8695522
7218 8695522 15022350 16888332 12819280 7268739 3697718 529138 -4232851 -8972919
7210 -8972919 -11255991 -11005183 -9231397 -6870130 -5737727 -6856856 -7171213 -2357669 6103461
7201 6103461 11418111 10354549 6622604 3775960 408868 -4790487 -8758106 -8812146 -7122176
7192 -7122176 -6247072 -4413681 65418 3365018 615051 -6479018 -11639580 -12300933 -11347630
7183 -11347630 -11468589 -11920095 -10659240 -6525413 322393 7626130 11525542 10204942
$$ packed form
7244h93135N674546P499912J403865o870060q332968l327310J126332K577473
7236a141345L771421M765367L042055L20296P48074K578449K06635n097327n596409
7227C597216P9169L728419M24203m174335l747243m49035J269586K556022N411520
7218H695522O326828J865982m069052n550541l571021l168580m761989m740068
7210h972919k283072K50808J773786K361267J132403j119129l14357M813544Q461130
7201F103461N314650j063562l731945k846644l367092n199355l967619n4040J689970
7192g122176Q75104J833391M479099L299600k749967p094069n160562o61353R53303
7183a1347630j20959m51506J260855M133827O847806P303737L899412j320600
$$ plain form
7175 10204942 6067597 2369524 -533674 -3365221 -4759531 -3226231 -577872 28376
7167 28376 -1648205 -3562428 -4957766 -6406383 -7727853 -8818314 -10886917 -13672421 -13354762
7158 -13354762 -7115192 1841904 8017047 10842562 13376155 15042566 11749454 3731248
7150 3731248 -2732514 -3607355 -2206002 -3086495 -4873179 -2945353 3211340 9287372 11979088
7141 11979088 12378852 13272529 15223353 16397495 15522688 13947150 14193113 16730196 19149212
7132 19149212 18785395 15081189 9077521 2353669 -2563955 -2853016 1573117 7137903
7124 7137903 10563349 12230539 13748657 14413475 13075410 11666341 13014690 15990795
7116 15990795 16554729 13229625 7959466 1970225 -5059192 -11402808 -13247304 -9814679
$$ packed form
7175A0204942m137345l698073k903198k831547j394310J533300K648359O06248
7167B8376j676581j914223j395338j448617j321470j090461k068603k785504L17659
7158a3354762O239570Q957096O175143K825515K533593J666411l293112q018206
7150C731248o463762q74841J401353q80493j786684J927826O156693O076032K691716
7141A1979088L99764Q93677J950824J174142q74807j575538K45963K537083K419016
7132A9149212l63817l704206o003668o723852m917624k89061M426133N564786
7124G137903L425446J667190J518118O64818j338065j409069J348349K976105
7116A5990795N63934l325104n270159n989241p029417o343616j844496L432625
$$ plain form
7108 -9814679 -5236309 -3742347 -5635361 -9068229 -12600509 -14248877 -11067009 -2483415
7100 -2483415 7408605 13047903 12194522 6633750 -394186 -6228823 -9675502 -11502387
7092 -11502387 -13619443 -16968995 -20606593 -22982849 -23410542 -22388404 -21317044 -21412225 -21886951
7083 -21886951 -20244972 -15959117 -12441181 -12856253 -15274271 -15326057 -12800213 -11454180 -12308795
7074 -12308795 -11807342 -7894595 -3548319 -2045809 -2389239 -2124013 -1707407 -3087511 -6026745
7065 -6026745 -8469980 -8972381 -6853659 -2020128 3287374 4882786 1424295 -3037577
7057 -3037577 -3918833 -1707181 51762 376518 766928 779672 -1891364 -6634661 -9264882
7048 -9264882 -7708235 -5386124 -6819015 -11749991 -15853294 -16212271 -13845839 -11148946
$$ packed form
7108i814679M578370J493962j893014l432868l532280j648368L181868Q583594
7100b483415R892020N639298q53381n560772p027936n834637l446679j826885
7092a1502387k117056l349552l637598k376256m27693J022138J071360r5181m74726
7083b1886951J641979M285855L517936m15072k418018n1786K525844J346033q54615
7074a2308795N01453L912747M346276J502510l43430K65226M16606j380104k939234
7065f026745k443235n02401K118722M833531N307502J595412l458491m461872
7057c037577q81256K211652J758943L24756L90410J2744k671036m743297k630221
7048i264882J556647K322111j432891m930976m103303l58977K366432K696893
$$ plain form
7040 -11148946 -9288937 -8998074 -11711208 -17445871 -22255055 -20766769 -12288589 -2216355
7032 -2216355 4065046 6687207 8860534 11153618 11418572 9329697 7404558 7381331 8549919
7023 8549919 9994521 11709919 13059502 12922565 12128374 13150659 16371960 18778111 17272675
7014 17272675 11727243 4685818 -149607 131992 4420396 7043901 4009733 -897785
7006 -897785 -750598 4121794 6039659 1128358 -5689657 -9031003 -9921521 -10708143 -9399414
6997 -9399414 -4455166 -115947 -595312 -2633242 -389856 4962077 7268624 5140513
6989 5140513 2695847 1422797 -1493074 -6041462 -7340846 -3032727 2351019 3107650
6981 3107650 -1021348 -5979709 -8241136 -6880099 -3267077 -51758 1363218 2696954
$$ packed form
7040a1148946J860009K90863k713134n734663m809184J488286Q478180J0072234
7032b216355O281401K622161K173327K293084K64954k088875j925139k3227J168588
7023H549919J444602J715398J349583j36937p94191J022285L221301K406151j505436
7014A7272675n545432p041425m835425K81599M288404K623505l034168m907518
7006h97785J47187M872392J917865m911301o818015l341346q90518p86622J308729
6997i399414M944248M339219m79365k037930K243386N351933K306547k128111
6989E140513k444666j273050k915871m548388j299384M308119N383746P56631
6981C107650m128998m958361k261427J361037L613022L215319J414976J333736
$$ plain form
6973 2696954 6134015 10289706 11873799 11069317 11406051 13756679 14431574 10657250 4525851
6964 4525851 -230167 -2488069 -3085511 -2715677 -2481310 -4264563 -8396151 -12488185 -14276086
6955 -14276086 -14333892 -14583712 -15203265 -14183489 -9391650 -877509 8046180 12690956 11752948
6946 11752948 9487486 10684711 14189635 14751988 11003239 7274185 6553028 6172443 2905980
6937 2905980 -1387595 -2482475 281896 3849344 5564535 4873666 2388895 -314329
6929 -314329 -1007112 1231230 5299437 10098644 14994122 17248781 12825616 2836575 -4239694
6920 -4239694 -1522188 6949893 10840418 6573008 552668 -664078 2281842 5619400
6912 5619400 8296803 10262779 9252176 4156214 -844135 -639725 3204055 4116735 -76606
$$ packed form
6973B696954L437061M155691J584093q04482L36734K350628O74895l774324o131399
6964D525851m756018k257902n97442L69834K34367j783253m131588m092034j787901
6955a4276086n7806k49820o19553J019776M791839Q514141Q923689M644776r38008
6946A1752948k265462J197225L504924N62353l748749l729054p21157l80585l266463
6937B905980m293575j094880K764371L567448J715191o90869k484771k703224
6929c14329o92783K238342M068207M799207M895478K254659m423165r989041p076269
6920d239694K717506Q472081L890525m267410o020340j216746K945920L337558
6912E619400K677403J965976j010603n095962n000349K04410L843780R12680m193341
$$ plain form
6903 -76606 -4449406 -5195817 -5651774 -10610895 -18181062 -22037750 -20151694 -16403750 -13642338
6894 -13642338 -9836906 -2629105 5803718 10582006 8897910 1915346 -5925366 -8857865
6886 -8857865 -4069242 4538205 9621826 8773450 6495794 6509562 6487549 3271570 -1258600
6877 -1258600 -3973684 -6217543 -10189740 -12776465 -9668013 -3780471 -2291981 -5626449
6869 -5626449 -6614223 -1446663 5552912 9876295 12720390 16033743 17938612 17045908 16127884
6860 16127884 17068103 16381991 10412261 1838454 -3315527 -2853573 789291 4332328 5084323
6851 5084323 1478677 -4400930 -7445360 -5760065 -3355581 -3759823 -4999348 -4844454 -6426348
6842 -6426348 -12784021 -19371523 -18871967 -11530014 -4193810 -659240 350090 -928698
$$ packed form
6903g6606m372800p46411m55957m959121p570167l856688J886056L747944K761412
6894a3642338L805432P207801Q432823M778288j684096o982564p840712k932499
6886h857865M788623Q607447N083621q48376k277656J3768k2013l215979m530170
6877a258600k715084k243859l972197k586725L108452N887542J488490l334468
6869e626449r87774N167560O999575M323383K844095L313353J904869q92704r18024
6860A6127884R40219o86112n969730q573807n153981M61954L642864L543037P51995
6851E084323l605646n879607l044430J685295K404484m04242j239525J54894j581894
6842f426348o357673o587502M99556P341953P336204L534570J009330j278788
$$ plain form
6834 -928698 -5530734 -9877875 -7844466 -449436 3972420 1810033 -846765 1216757
6826 1216757 3952298 1605926 -3199295 -3686280 487399 3732648 3635097 3007542 3429847
6817 3429847 2888096 816199 381182 3596084 7639953 8441545 5802320 2745572 917538
6808 917538 -1180634 -4997890 -8148859 -5468429 4960797 17599064 23660014 20182224
6800 20182224 12588339 7113007 3660229 -1324753 -7803160 -12293761 -13805730 -14865982
6792 -14865982 -16342222 -15643307 -11436790 -6429613 -3525830 -2249963 -930344 488788
6784 488788 1973694 4683621 7968567 8176906 4238538 1749598 6457276 15056094 18034432
6775 18034432 11696102 1832691 -5533814 -11174116 -17643711 -22503966 -21226619 -13984200
$$ packed form
6834i28698m602036m347141K033409P395030M421856k162387k656798K063522
6826A216757K735541k346372m805221m86985M173679L245249r7551o27555M22305
6817C429847n41751k071897m35017L214902M043869Q01592k639225l056748j828034
6808I17538k098172l817256l150969K680430J0429226J2638267O060950l477790
6800B0182224p593885n475332l452778m984982o478407m490601j511969j060252
6792a4865982j476240O98915M206517N007177K903783J275867J319619J419132
6784D88788J484906K709927L284946K08339l938368k488940M707678Q598818K978338
6775A8034432o338330r863411p366505n640302o469595m860255J277347P242419
$$ plain form
6767 -13984200 -5291149 1301386 4650502 4183980 615865 -2733458 -3094863 -1980462
6759 -1980462 -2662190 -5237007 -7632116 -9850190 -12743503 -13681628 -8767234 290966 6291493
6750 6291493 4477278 -3431390 -13188299 -21413185 -24810085 -21488534 -14551154 -9480504
6742 -9480504 -6625971 -1491735 6381353 11512166 11874623 12640063 16089909 15429595 5630514
6733 5630514 -5893904 -8326080 -3018804 -486697 -4179110 -7510624 -7053465 -8148504
6725 -8148504 -14073115 -18383039 -13774717 -3098994 4338864 4623750 2482639 3917013
6717 3917013 9339589 14124980 13918824 8927368 3366752 845580 1319628 3352126 7155996
6708 7155996 12605087 15918688 12591639 3785990 -3866784 -5684182 -3370146 -1489609
$$ packed form
6767a3984200Q693051O592535L349116m66522l568115l349323l61405J114401
6759a980462o81728k574817k395109k218074k893313r38125M914394R058200O000527
6750F291493j814215p908668r756909q224886l396900L321551O937380N070650
6742i480504K854533N134236P873088N130813L62457P65440L449846o60314r799081
6733E630514j1524418k432176N307276K532107l692413l331514M57159j095039
6725h148504n924611m309924M608322J0675723P437858K84886k141111J434374
6717C917013N422576M785391k06156m991456n560616k521172M74048K032498L803870
6708G155996N449091L313601l327049q805649p652774j817398K314036J880537
$$ plain form
6700 -1489609 -2115585 -3547401 -2283112 3684493 11592822 14960554 10684701 3788509
6692 3788509 1493017 3816080 4529498 597611 -4610534 -7551111 -8479005 -8374387 -7190564
6683 -7190564 -6496057 -8812107 -12688611 -13222430 -9094466 -4327546 -1606895 858675 4113376
6674 4113376 5953340 6027144 7336779 9642492 7913084 1514431 -1729699 3508767 10782646
6665 10782646 10485516 3323317 -2288134 -3052353 -3061106 -4847063 -6081655 -5612445 -6199380
6656 -6199380 -9583828 -13398490 -14542918 -12777893 -10436612 -10518824 -14211391 -18343280 -17340528
6647 -17340528 -10296844 -3437878 -2291731 -4495340 -4438159 -1656117 618527 2133144
6639 2133144 4515445 5795283 2930156 -1545971 -2408510 -476073 -1177815 -4647853 -5146654
$$ packed form
6700a489609o25976j431816J264289N967605P908329L367732m275853o896192
6692C788509k295492K323063P13418l931887n208145k940577r27894J04618J183823
6683g190564O94507k316050l876504n33819M127964M766920K720651K465570L254701
6674D113376J839964P3804J309635K305713j729408o398653l244130N238466P273879
6665A0782646k97130p162199n611451p64219q753j785957j234592M69210n86935
6656f199380l384448l814662j144428J765025K341281q2212l692567m131889J002752
6647a7340528P043684O858966J146147k203609N7181K782042K274644J514617
6639B133144K382301J279838k865127m476127q62539J932437p01742l470038m98801
$$ plain form
6630 -5146654 -1342014 891258 -1509976 -3341161 504088 7203648 10713371 9540773
6622 9540773 5899701 1302849 -2986598 -4490136 -2380409 540357 1554022 1347261
6614 1347261 1516997 1783675 2082427 4334883 9285755 14051559 15450194 13709472 10805945
6605 10805945 7339284 2962894 -2244512 -8363534 -15230830 -20302086 -19838060 -13579387
6597 -13579387 -5346834 1888717 7863011 11176425 8740295 1465623 -4372540 -4766376
6589 -4766376 -2804883 -2725620 -3759199 -3881976 -5061348 -9503357 -14238184 -15049253 -13193102
6580 -13193102 -12793792 -13788041 -13021866 -10607523 -9419798 -9237677 -6944154 -2171861 2395490
6571 2395490 6086218 10407186 14044018 13151714 7920899 4123255 6029559 11190611
$$ packed form
6630e146654L804640K233272k401234j831185L845249O699560L509723j172598
6622I540773l641072m596852m289447j503538K109727K920766J013665k06761
6614A347261J69736K66678K98752K252456M950872M765804J398635j740722k903527
6605A0805945l466661m376390n207406o119022o867296n071256M64026O258673
6597a3579387Q232553P235551N974294L313414k436130p274672n838163l93836
6589d766376J961493P9263j033579j22777j179372m442009m734827q11069J856151
6580a3193102L99310r94249P66175K414343J187725J82121K293523M772293M567351
6571B395490L690728M320968L636832q92304n230815l797644J906304N161052
$$ plain form
6563 11190611 14144775 12784992 9675548 9131475 13752404 21651190 26422449 22081021
6555 22081021 9240301 -4594696 -11149116 -7405336 2958229 12403455 15272992 13008921
6547 13008921 12549121 17651044 23839308 24559009 19758057 14451041 10973691 7653590
6539 7653590 4025827 2086348 2414500 3750315 6493148 12027016 18372340 21095076
6531 21095076 18971214 14585367 9610145 4427251 1919648 5223836 10969466 11536524
6523 11536524 5902534 1551299 3054995 5787148 4762699 2704842 3902105 6165741
6515 6165741 5538302 4238248 6683624 10998892 11781835 8984919 6835754 5598435 1922731
6506 1922731 -3272246 -4958271 -2649132 -1512289 -3272265 -3380825 -296900 -467513 -8737625
$$ packed form
6563A1190611K954164j359783l109444n44073M620929P898786M771259m341428
6555B2081021j2840720j3834997o554420L743780J0363565R445226K869537k264071
6547A3008921m59800N101923O188264P19701m800952n307016l477350l320101
6539G653590l627763j939479L28152J335815K742833N533868O345324K722736
6531B1095076k123862m385847m975222n182894k507603L304188N745630N67058
6523A1536524n633990m351235J503696K732153j024449k057857J197263K263636
6515F165741o27439j300054K445376M315268P82943k796916k149165j237319l675704
6506A922731n194977j686025K309139J136843j759976j08560L083925j70613q270112
$$ plain form
6497 -8737625 -19007577 -21091198 -14283417 -7523169 -6528653 -6897561 -1778577 8211377
6489 8211377 16084370 17242056 13760767 10406775 9267532 9250153 8970109 8357243 7927800
6480 7927800 7946860 8444142 9059585 8653830 5918200 845186 -4641134 -7541654 -5369244
6471 -5369244 2015621 11254524 17235891 17436077 13725237 8629704 1749210 -7282077
6463 -7282077 -14168473 -13202493 -5314299 2039459 4350790 4645104 6619709 8545225 7798428
6454 7798428 6707915 8417359 10091564 6400524 -1595613 -6826192 -5234191 622657
6446 622657 6981229 12714841 16915370 17654319 15341954 13654880 14746700 16134016 14417768
6437 14417768 10070953 6579989 6111422 7490146 7753371 4979870 52543 -4408684
$$ packed form
6497h737625j0269952k083621O807781O760248R94516l68908N118984R989954
6489H211377P872993J157686l481289l353992j139243j7379k80044o12866m29443
6480G927800J9060M97282O15443m05755k735630n073014n486320k900520K172410
6471e369244P384865R238903N981367K00186l710840n095533o880494r031287
6463g282077o886396R65980P888194P353758K311331K94314J974605J925516p46797
6454G798428j090513J709444J674205l691040p996137n230579J592001N856848
6446F22657O358572N733612M200529P38949k312365j687074J091820J387316j716248
6437A4417768m346815l490964m68567J378724K63225k773501m927327m461227
$$ plain form
6429 -4408684 -7141541 -9060713 -10302131 -9019634 -5355252 -3615671 -6412140 -8966107
6421 -8966107 -4728854 4397810 9610539 7198501 2619785 1177526 1110542 -1068470 -4222509
6412 -4222509 -5809929 -6892750 -9352889 -11538365 -11042293 -9017238 -7732736 -6570853
6404 -6570853 -4398442 -3055586 -4083581 -4647505 -1613313 2530894 3068578 593734 -476691
6395 -476691 317208 -586980 -3281038 -3420646 -51583 1791718 -991362 -4221098 -2648705
6386 -2648705 2298200 4941876 3049336 -690023 -3499196 -5435031 -7836583 -11349726
6378 -11349726 -15598114 -19262752 -20505545 -18468198 -14474321 -11188354 -10475516 -11874353
6370 -11874353 -12718166 -10271498 -4756064 259234 1821689 1337344 2544635 6294996
$$ packed form
6429d408684k732857j919172j241418J282497L664382J739581k796469k553967
6421h966107M237253R126664N212729k412038m578716j442259o6984k179012l154039
6412d222509j587420j082821k460139k185476M96072K025055J284502J161883
6404f570853K172411J342856j027995n63924L034192M144207N37684k474844j070425
6395d76691P93899r04188k694058j39608L369063J843301k783080l229736J572393
6386b648705M946905K643676j892540l739359k809173j935835k401552l513143
6378a1349726m248388l664638j242793K037347L993877L285967P12838j398837
6370a1874353q43813K446668N515434N015298J562455m84345J207291L750361
$$ plain form
6362 6294996 9708276 10357984 8597695 5411923 862290 -4265628 -7723560 -8050399 -5981696
6353 -5981696 -3372114 -2921161 -8448301 -21155562 -34579412 -38178678 -28967105 -15728683
6345 -15728683 -8394734 -7205951 -6605985 -5592337 -7554397 -12060786 -14308550 -12927774
6337 -12927774 -11652750 -12048815 -10911944 -7024794 -4396927 -5479183 -6601018 -4326244
6329 -4326244 -1450246 -1496204 -1425070 3665689 11096516 12925397 7171125 257289 -2231421
6320 -2231421 -1147112 1074348 4637803 8963908 10398018 7297246 3531540 2991207
6312 2991207 3914727 2810883 969121 2093328 5537382 7305268 6785931 6950901 7893511
6303 7893511 6004494 1056507 -1374532 2310874 7642365 7661517 2005323 -3488074 -4692973
$$ packed form
6362F294996L413280O49708j760289l185772m549633n127918l457932l26839K068703
6353e981696K609582M50953n527140j2707261j3423850l599266R211573J3238422
6345a5728683P333949J188783N99966J013648j962060m506389k247764J380776
6337a2927774J275024l96065J136871L887150K627867j082256j121835K274774
6329d326244K875998m5958P1134N090759P430827J828881n754272o913836k488710
6320b231421J084309K221460L563455M326105J434110l100772l765706n40333
6312B991207R23520j103844j841762J124207L444054J767886n19337J64970R42610
6303G893511j889017m947987k431039L685406N331491J9152n656194n493397j204899
$$ plain form
6294 -4692973 -2764458 -195504 2847450 6937721 10557895 10990861 7713352 3634466
6286 3634466 2275802 3779967 4373157 380445 -7618040 -15274262 -18457267 -15849335
6278 -15849335 -8833469 -987309 2988966 784793 -4638283 -8095736 -8304425 -8129744
6270 -8129744 -8714174 -7671118 -4662457 -4095519 -8770598 -14336758 -14301444 -8320186 -1592948
6261 -1592948 1912113 1560634 -2436407 -8564795 -12329278 -10425252 -6259247 -6046787 -9381036
6252 -9381036 -9440669 -3557655 2493099 3194448 737142 159468 1624420 1942091 372411
6243 372411 -1799855 -5137405 -10787411 -16741156 -19787634 -20392267 -21275170 -21398798 -16121429
6234 -16121429 -4679386 6450881 10347215 7614513 4826669 5931042 8009183 6316336
$$ packed form
6294d692973J928515K568954L042954M090271L620174M32966l277509m078886
6286C634466j358664J504165N93190l992712p998485p656222l183005K607932
6278a5849335P015866P846160L976275k204173n423076l457453k08689J74681
6270h129744n84430J043056L008661N66938m675079n566160L5314N981258O727238
6261a592948L505061l51479l997041o128388l764483J904026M166005K12460l334249
6252i381036n9633N883014O050754P01349k457306n77674J464952L17671j569680
6243C72411k172266l337550n650006n953745l046478o04633q82903j23628N277369
6234a6121429J1442043J1130267L896334k732702k787844J104373K078141j692847
$$ plain form
6226 6316336 1300584 -2113108 -2210850 -4019604 -12128160 -21960600 -23383573 -14056835 -4107979
6217 -4107979 -3887800 -10677328 -12708081 -4742807 6114295 10645285 8078332 3805379
6209 3805379 724530 -2725368 -7381299 -10607587 -9871440 -6718614 -5541769 -9100242
6201 -9100242 -16211277 -23388933 -27757709 -28459275 -26445006 -23754229 -22397603 -22756325 -22932571
6192 -22932571 -20499227 -15088077 -8577122 -2811216 1611228 3958594 2525461 -3121072
6184 -3121072 -9720636 -12225188 -8935342 -3647619 -1499900 -2994439 -3535678 545031
6176 545031 6946221 10163878 8604575 6198801 6351091 7435822 6447172 4335124 4170519
6167 4170519 5667475 5652136 3417132 1518432 1246991 1509815 2647119 6745669 12803697
$$ packed form
6226F316336n015752l413692r7742j808754q108556r832440j422973R326738R948856
6217d107979K20179o789528k030753P965274J0857102M530990k566953m272953
6209C805379l080849l449898m655931l226288P36147L152826J176845l558473
6201i100242p111035p177656m368776p01566K014269K690777J356626l58722j76246
6192b2932571K433344N411150O510955N765906M422444K347366j433133n646533
6184c121072o599564k504552L289846N287723K147719j494539n41239M080709
6176E45031O401190L217657j559303k405774J52290J084731r88650k112048j64605
6167D170519J496956j5339k235004j898700k71441K62824J137304M098550O058028
$$ plain form
6158 12803697 16120040 14550573 11066387 7757002 2110196 -7124067 -14925497 -15830625
6150 -15830625 -11398321 -6574208 -1516844 6642589 15507355 17951444 11778254 3238061
6142 3238061 -648126 1032598 4975777 7934969 7338449 1788093 -6327211 -11438923
6134 -11438923 -10415453 -5726220 -1533804 1057445 3020328 3856837 1693948 -3652266
6126 -3652266 -9541670 -12752209 -12526708 -11405185 -12451262 -15070998 -14839333 -8997670 -768686
6117 -768686 4191192 4637340 4146050 5317676 6954817 7143001 5775580 3189318 -882300
6108 -882300 -5995318 -10817636 -14737586 -17540957 -17698894 -13841233 -7844221 -3151446 8766
6099 8766 3902307 7557511 6568058 251681 -5591725 -5794255 -2031186 853122 1332472
$$ packed form
6158A2803697L316343j569467l484186l309385n646806r234263p801430r05128
6150a5830625M432304M824113N057364Q159433Q864766K444089o173190q540193
6142C238061l886187J680724L943179K959192n96520n550356q115304n111712
6134a1438923J023470M689233M192416K591249J962883Q36509k162889n346214
6126c652266n889404l210539K25501J121523j046077k619736K31665N841663Q228984
6117g68686M959878M46148m91290J171626J637141J88184j367421k586262m071618
6108h82300n113018m822318l919950k803371j57937L857661N997012M692775L160212
6099H766L893541L655204r89453o316377n843406k02530L763069K884308M79350
$$ plain form
6090 1332472 895140 222360 -891887 -1988411 -3355211 -6887893 -12588359 -16396696 -14811837
6081 -14811837 -9823894 -5909897 -3933073 -1841929 11389 -1130849 -5102655 -7798949
6073 -7798949 -6901875 -5467172 -7610968 -12283404 -13731102 -8356873 276387 4565660
6065 4565660 965696 -6518501 -11751776 -13349906 -13868115 -14143490 -12613391 -9671987 -7913888
6056 -7913888 -7400051 -5436819 -2199372 -1322427 -2933183 -1921024 3437645 6852582 2866572
6047 2866572 -4652599 -8594198 -8727976 -8939661 -8056232 -1824945 7396961 11471055 7854250
6038 7854250 2998765 2721351 5350104 6637862 6102078 5706306 6315868 7940851 10336673
6029 10336673 11705601 9938348 6388493 5100118 7185818 9493970 9902794 9910203 10374120
$$ packed form
6090A332472m37332o72780j114247j096524j366800l532682n700466l808337J584859
6081a4811837M987943L913997J976824K091144J853318j142238l971806k696294
6073g798949Q97074J434703k143796m672436j447698N374229Q633260M289273
6065D565660l599964p484197n233275j598130n18209k75375J530099K941404J758099
6056g913888N13837J963232L237447Q76945j610756J012159N358669L414937l986010
6047B866572p519171l941599j33778k11685Q83429O231287R221906M074094l616805
6038G854250m855485k77414K628753J287758n35784l95772O09562J624983K395822
6029A0336673J368928j767253l549855j288375K085700K308152M08824P409M63917
$$ plain form
6020 10374120 8918652 4183930 -897516 -3224164 -4432343 -8614237 -16586186 -24782266
6012 -24782266 -28963166 -27687922 -23183769 -19568833 -19036699 -19737492 -19064729 -18233038 -20445721
6003 -20445721 -24824851 -26307652 -22456013 -16363323 -11440585 -7408497 -3439499 -1188446
5995 -1188446 -1765998 -2921687 -2295882 -917859 -707763 -955694 -130009 945658 505904
5986 505904 -1309859 -3366385 -5489503 -7442919 -7997066 -7101171 -6804540 -7925135 -8167032
5977 -8167032 -5715906 -2111360 743498 3405182 5934547 5486639 726700 -4140821
5969 -4140821 -4249512 -1095302 -331280 -4032358 -9434423 -14063764 -17611114 -19515860 -19152673
5960 -19152673 -18099979 -18230384 -18126921 -15565360 -12745418 -13946456 -17960859 -18395171 -12785638
$$ packed form
6020A0374120j455468m734722n081446k326648j208179m181894p971949q196080
6012b4782266m180900J275244M504153L614936N32134p00793O72763Q31691k212683
6003b0445721m379130j482801L851639O092690M922738M032088L968998K251053
5995a188446n77552j155689O25805J378023K10096k47931Q25685J075667m39754
5986E05904j815763k056526k123118j953416n54147Q95895K96631j120595k41897
5977h167032K451126L604546K854858K661684K529365m47908m759939m867521
5969d140821j08691L154210P64022l701078n402065m629341l547350j904746L63187
5960a9152673J052694j30405J03463K561561K819942j201038m014403m34312N609533
$$ plain form
5951 -12785638 -6280564 -4079799 -4745109 -3930602 -1047236 1283426 1965713 2193086 2674805
5942 2674805 2739564 1721934 -344138 -3044978 -6050647 -10021081 -16553348 -25051982 -30124042
5933 -30124042 -25970951 -14648892 -6030938 -6777764 -12416197 -13813979 -8993701 -3964190
5925 -3964190 -2881394 -2596080 1563923 8520881 12952952 12288703 9101998 6551563 4067909
5916 4067909 -806170 -7588967 -12361090 -12550351 -10056783 -8125782 -6991856 -5183324
5908 -5183324 -3799422 -5579523 -9355789 -9552097 -3404091 4397523 7172303 4129124
5900 4129124 -407645 -3749269 -6638903 -8979738 -8521714 -5044041 -1865543 -919145 433953
5891 433953 4571946 8130970 5640115 -2107995 -7678824 -5903919 403417 5295505
$$ packed form
5951a2785638O505074K200765o65310Q14507K883366K330662O82287K27373M81719
5942B674805O4759j017630k066072k700840l005669l970434o532267q498634n072060
5933c0124042M153091J1322059Q617954p46826n638433j397782M820278N029511
5925c964190J082796K85314M160003O956958M432071o64249l186705k550435k483654
5916D067909m874079o782797m772123j89261K493568J931001J133926J808532
5908e183324J383902j780101l776266j96308O148006P801614K774780l043179
5900D129124m536769l341624k889634k340835M58024L477673L178498R46398J353098
5891D33953M137993L559024k490855p748110n570829J774905O307336M892088
$$ plain form
5883 5295505 6984671 7478225 7313405 4505212 -1817431 -9983841 -17966660 -24045192 -25401655
5874 -25401655 -19975782 -11030731 -6022016 -8138772 -11874091 -10462330 -5437581 -4332945
5866 -4332945 -9895921 -16765912 -19731888 -20193188 -21394746 -21158400 -14363595 -1650207
5858 -1650207 9125412 11442874 7034103 2467697 1210595 1620819 1371173 561896 176964
5849 176964 184815 257822 305893 -855335 -5149045 -11832863 -16707329 -17232732 -16353622 -17890589
5839 -17890589 -20078154 -18475667 -14371543 -14097581 -18678544 -20448927 -13586425 -2981236
5831 -2981236 2242192 418850 -2757015 -3377370 -2426137 -916140 2141187 6486344 10087704
5822 10087704 12473329 14464526 14370400 9173400 559135 -4826097 -3076061 2585991
$$ packed form
5883E295505J689166M93554j64820k808193o322643q166410p982819o078532j356463
5874b5401655N425873Q945051N008715k116756l735319J411761N024749J104636
5866d332945n562976o869991k965976m61300j201558K36346O794805J2713388
5858a650207J0775619K317462m408771m566406j257102M10224k49646q09277l84932
5849A76964P851P3007M8071j161228m293710o683818m874466n25403Q79110j536967
5839a7890589k187565J602487M104124K73962m580963j770383O862502J0605189
5831b981236N223428j823342l175865o20355R51233J509997L057327M345157L601360
5822A0087704K385625J991197r4126n197000q614265n385232J750036N662052
$$ plain form
5814 2585991 6619819 6710999 3066715 -3551445 -10623701 -14538023 -15416513 -17909566 -24053061
5805 -24053061 -28703674 -26027315 -17903723 -11609767 -10980340 -13959120 -17195311 -18474584
5797 -18474584 -15752043 -8959371 -2862169 -3097303 -8156189 -9683720 -2691173 8061501
5789 8061501 13976522 11864703 5104661 -1426334 -4584576 -3386684 169232 1526577
5781 1526577 -2083960 -7800479 -9988060 -6845129 -2002586 296089 -870112 -4264972
5773 -4264972 -8862079 -13657489 -17001167 -17804919 -16521177 -14013971 -10727068 -7919253
5765 -7919253 -7943164 -11367567 -14931232 -14482509 -9501565 -3075459 1805187 3955830 2972040
5756 2972040 -650666 -4380254 -5286007 -3246249 -410588 2362125 5760165 8870227
$$ packed form
5814B585991M033828R1180l644284o618160p072256l914322q78490k493053o143495
5805b4053061m650613K676359Q123592O293956O29427k978780l236191j279273
5797a8474584K722541O792672O097202k35134n058886j527531O992547J0752674
5789H061501N915021k111819o760042o530995l158242J197892L555916J357345
5781A526577l610537n716519k187581L142931M842543K298675j166201l394860
5773d264972m597107m795410l343678q03752J283742K507206L286903K807815
5765g919253k3911l424403l563665M48723M980944O426106M880646K150643r83790
5756B972040l622706l729588r05753K039758K835661K772713L398040L110062
$$ plain form
5748 8870227 9470030 8172347 8340952 10506627 10963421 7821358 3956516 1243013 -3082859
5739 -3082859 -10045735 -13903013 -9693090 -2204110 -275420 -4445205 -7895457 -8343177
5731 -8343177 -10404268 -15644493 -19035515 -17780547 -15778724 -15814137 -14641829 -10312771 -7462972
5722 -7462972 -9471947 -11197701 -6368265 2196807 6929755 6735970 6325870 6664639 4456566
5713 4456566 902131 2712222 12160589 22481474 26248100 23672208 19563394 15941199
5705 15941199 11313901 5092669 -529021 -2468650 979338 8711534 16527261 19572074
5697 19572074 16446944 10317592 5435545 3505844 3818958 5480255 8274153 11755243
5689 11755243 14332240 13709161 8915045 2276462 -1669134 -462490 3567713 5934927
$$ packed form
5748H870227N99803j297683J68605K165675M56794l142063l864842k713503m325872
5739c082859o962876l857278M209923P488980J928690m169785l450252m47720
5731h343177k061091n240225l391022J254968K001823l5413J172308M329058K849799
5722g462972k008975j725754M829436Q565072M732948j93785m10100L38769k208073
5713D456566l554435J810091R448367J0320885L766626k575892m108814l622195
5705A5941199m627298o221232n621690j939629L447988P732196P815727L044813
5697A9572074l125130o129352m882047j929701L13114J661297K793898L481090
5689A1755243K576997o23079m794116o638583l945596J206644M030203K367214
$$ plain form
5681 5934927 4706752 1462151 -1566708 -3550319 -4554312 -4667008 -3963870 -2534849 -571993
5672 -571993 1273297 2401574 3522947 6043881 9396910 10480041 6744683 -1615947
5664 -1615947 -12933422 -24741052 -32305150 -30822867 -22283917 -16284476 -19264856 -25705505
5656 -25705505 -25453275 -17705680 -11232483 -11396564 -13981836 -13054842 -8367941 -2380704 4374752
5647 4374752 11301387 15367869 14545353 10767353 6641884 2179620 -2571060 -5031138
5639 -5031138 -3727635 -1741255 -2839476 -6073420 -7556546 -5990592 -3380997 -1922393
5631 -1922393 -3167840 -8388407 -16143963 -20933612 -18295584 -10819590 -5604222 -5999359
5623 -5999359 -9156887 -11462600 -12550974 -13195457 -12751675 -10555283 -7765433 -6152872 -6112972
$$ packed form
5681E934927j228175l244601l028859j983611j003993j12696P03138J429021J962856
5672e71993J845290J128277J121373K520934L353029J083131l735358q360630
5664a615947j1317475j1807630p564098J482283Q538950N999441k980380o440649
5656b5705505K52230P747595O473197j64081k585272R26994M686901N987237O755456
5647D374752O926635M066482q22516l778000m125469m462264m750680k460078
5639e031138J303503J986380j098221l233944j483126J565954K609595J458604
5631a922393j245447n220567p755556m789649K638028P475994N215368l95137
5623e999359l157528k305713j088374o44483M43782K196392K789850J612561L9900
$$ plain form
5614 -6112972 -6648971 -6335373 -4105752 -410436 2284831 1676200 -1464591 -4011154 -4196100
5605 -4196100 -2888687 -1062724 1756087 5677609 9230686 11434234 13430816 16321354
5597 16321354 18660311 18145360 15022315 11614042 8778229 5273764 978490 -2005287
5589 -2005287 -2959043 -4776174 -9764729 -14710666 -13917012 -7263435 -1332434 -985891 -3339950
5580 -3339950 -2645511 2082619 7964796 13872853 19767746 21877039 15387351 3410285
5572 3410285 -3031348 2274204 12461064 16330864 11862354 5932383 3080444 950577
5564 950577 -2950921 -5946631 -4421172 43268 1919073 -2000305 -9509812 -15705950
5556 -15705950 -17713880 -16893676 -16712942 -18373575 -19111579 -15572278 -8177327 -917726 2708916
$$ packed form
5614f112972n35999L13598K229621L695316K695267o08631l140791k546563j84946
5605d196100J307413J825963K818811L921522L553077K203548J996582K890538
5597A6321354K338957n14951l123045l408273k835813l504465m295274k983777
5589b005287r53756j817131m988555m945937P93654O653577N931001L46543k354059
5580c339950O94439M728130N882177N908057N894893K109293o489688j1977066
5572C410285o441633N305552J0186860L869800m468510n929971k851939k129867
5564I50577l901498k995710J525459M464440J875805l919378p509507o196138
5556a5705950k007930Q20204J80734j660633p38004L539301P394951P259601L626642
$$ plain form
5547 2708916 2321722 -82232 -1831085 -1047228 1692233 3350117 1834770 -974670 -1697945
5538 -1697945 -501601 -815154 -3777321 -6270314 -5813073 -4319621 -4672119 -5929508 -4856186
5529 -4856186 -796105 3886848 7336181 9117132 7963978 2111730 -7043920 -14359357
5521 -14359357 -15824388 -12358640 -7283245 -1977514 3574235 7465481 6853682 2777775
5513 2777775 568942 3273365 6867125 4997971 -2412249 -8566759 -8267299 -4067506
5505 -4067506 -2356841 -5475085 -10147635 -12698504 -13060447 -13300987 -14396283 -15744849 -16749355
5496 -16749355 -17429643 -17558156 -16184626 -12569490 -7397540 -2526798 814684 3242347
5488 3242347 5970708 8598927 9341975 7775445 5898281 5448737 5483313 4172054 1778105
$$ packed form
5547B708916l87194k403954j748853P83857K739461J657884j515347k809440p23275
5538a697945J196344l13553k962167k492993M57241J493452l52498j257389J073322
5529d856186M060081M682953L449333J780951j153154n852248r155650p315437
5521a4359357j465031L465748N075395N305731N551749L891246o11799m075907
5513B777775k208833K704423L593760j869154p410220o154510K99460M199793
5505d067506J710665l118244m672550k550869l61943k40540j095296j348566j004506
5496a6749355o80288j28513J373530L615136N171950M870742L341482K427663
5488C242347K728361K628219P43048j566530j877164m49544L4576j311259k393949
$$ plain form
5479 1778105 -475723 -3668970 -9826989 -16568817 -16845383 -6953084 7237594 15447055
5471 15447055 13664636 6641835 300852 -4356392 -8771119 -12249028 -12763904 -10060823
5463 -10060823 -5115330 1718272 9005338 12433107 8791342 1120519 -4358764 -6403076
5455 -6403076 -9009455 -12744385 -11725123 -2537158 8888216 14190894 12675231 8961962
5447 8961962 3743015 -5717539 -16705851 -20755766 -14581149 -5205890 -934172 -1927155
5439 -1927155 -3149599 -2375718 -910171 653455 2721938 4151755 3209986 330219 -2908676
5430 -2908676 -6499793 -11059939 -15420262 -18012260 -19575270 -21594129 -23088494 -22179762
5422 -22179762 -20164131 -20454529 -23257562 -24521891 -21082173 -14465549 -8665398 -5920767
$$ packed form
5479A778105k253828l193247o158019o741828k76566R892299J4190678Q209461
5471A5447055j782419p022801o340983m657244m414727l477909n14876K703081
5463a0060823M945493O833602P287066L427769l641765p670823n479283k044312
5455f403076k606379l734930J019262R187965J1425374N302678j515663l713269
5447H961962n218947r460554j0988312m049915O174617R375259M271718r92983
5439a927155j222444P73881J465547J563626K068483J429817r41769k879767l238895
5430b908676l591117m560146m360323k591998j563010k018859j494365R08732
5422b2179762K015631k90398k803033j264329L439718O616624N800151K744631
$$ plain form
5414 -5920767 -5443439 -4964350 -3031104 -648025 -448966 -3291034 -6436493 -6525108 -3437244
5405 -3437244 459954 3645697 5720068 5756196 3814333 3516034 8998235 18443559 24323230
5396 24323230 21883628 14590869 9167568 7676498 7031479 4574717 961293 -2432185
5388 -2432185 -6505158 -13519036 -23539133 -32423027 -34173417 -26370444 -13460061 -3663861
5380 -3663861 -1901145 -5894383 -9162305 -7276087 -1246112 4420297 6516758 5999450
5372 5999450 6036285 7715932 8936466 7647927 4404023 914842 -1941490 -3350619 -2051864
5363 -2051864 1299192 3340452 2241214 802357 2125428 4083689 2334698 -2291232
5355 -2291232 -4340724 -1801403 1112845 177103 -4149204 -9518029 -15032875 -20068143
$$ packed form
5414e920767M77328M79089J933246K383079J99059k842068l145459q8615L087864
5405c437244L897198L185743K074371L6128j941863k98299N482201R445324N879671
5396B4323230k439602p292759n423301j491070o45019k456762l613424l393478
5388b432185m072973p013878j0020097q883894j750390P802973J2910383R796200
5380c663861J762716l993238l267922J886218O029975N666409K096461n17308
5372E999450L6835J679647J220534j288539l243904l489181k856332j409129J298755
5363b051864L351056K041260j099238j438857J323071J958261j748991m625930
5355b291232k049492K539321K914248r35742m326307n368825n514846n035268
$$ plain form
5347 -20068143 -23539006 -26205956 -30103796 -33915000 -32981789 -26330435 -19531224 -17405822
5339 -17405822 -17885872 -17021302 -16125726 -18456783 -21362534 -18168081 -7734490 3239928
5331 3239928 8381941 7875876 5403814 2752135 -351253 -3465513 -4893619 -3373926
5323 -3373926 522984 4393641 5825915 5228371 6104251 10954582 17593069 21385710 20511096
5314 20511096 16853168 12329932 7186415 1952254 -2111441 -5633521 -11395475 -19986353
5306 -19986353 -27110812 -27645254 -21606133 -14010829 -9080156 -6645569 -4750403 -3683689
5298 -3683689 -5400072 -9542642 -12442811 -11111262 -6643406 -2108638 1684618 6030428
5290 6030428 10565976 12630640 11059633 8103930 6324371 5594570 4492405 2656846
$$ packed form
5347b0068143l470863k666950l897840l811204R33211O651354O799211K125402
5339a7405822m80050Q64570Q95576k331057k905751L194453J0433591J0974418
5331C239928N142013n06065k472062k651679l103388l114260j428106J519693
5323c373926L896910L870657J432274n97544Q75880M850331O638487L792641q74614
5314B0511096l657928m523236n143517n234161m063695l522080n761954q590878
5306a9986353p124459n34442O039121P595304M930673K434587J895166J066714
5298c683689j716383m142570k900169J331549M467856M534768L793256M345810
5290F030428M535548K064664j571007k955703j779559p29801j102165j835559
$$ plain form
5282 2656846 64132 -4298282 -10988870 -18403662 -24141094 -27113312 -27149118 -24107901 -19068509
5273 -19068509 -14913392 -13791587 -15022863 -16762598 -17832356 -16271287 -8948577 3879751
5265 3879751 15436404 18108527 12128835 5234536 3649455 6458678 9001469 8580700
5257 8580700 5911766 3342241 2580470 2773011 1043752 -3352650 -6503798 -4403791 688464
5248 688464 2222291 -2144493 -7875494 -10151820 -9176902 -7412765 -5502063 -3525941 -3074874
5239 -3074874 -4762782 -5756584 -3039183 2037118 5289809 5113553 3924086 4584949 7463159
5230 7463159 10882910 12826387 12290834 10331749 9590518 11561101 14548414 15572919 14178401
5221 14178401 13047725 14533205 17589445 18873639 16562156 12336549 9231448 8020122
$$ packed form
5282B656846k592714m362414o690588p414792n737432k972218l5806L041217N039392
5273a9068509M155117J121805j231276j739735j069758J561069P322710J2828328
5265C879751J1556653K672123n979692o894299j585081K809223K542791m20769
5257H580700k668934k569525p61771J92541j729259m396402l151148K100007N092255
5248F88464J533827m366784n731001k276326R74918J764137J910702J976122M51067
5239c074874j687908r93802K717401N076301L252691j76256j189467O60863K878210
5230G463159L419751J943477n35553j959085p41231J970583K987313J024505j394518
5221A4178401j130676J485480L056240J284194k311483m225607l105101j211326
$$ plain form
5213 8020122 6740849 3809830 79145 -2968219 -5297708 -6902668 -5992663 -1398008
5205 -1398008 4040949 5718639 2989210 -411455 -2086845 -3844683 -7734368 -12446766
5197 -12446766 -15619648 -17136120 -17788845 -16553123 -11652953 -3462365 5207143 10891167
5189 10891167 11009431 5655551 -1050258 -3717626 -1442944 1263892 772173 -1163351
5181 -1163351 -1374478 -862113 -3072292 -8542182 -14650614 -19228405 -21165040 -18966202 -12438367
5172 -12438367 -4745981 961830 5966608 12829426 18628582 16634909 5735617 -6416509
5164 -6416509 -11581455 -8849487 -2945674 1675161 2913907 578663 -3146773 -4660700
5156 -4660700 -2671582 322110 1492558 745965 -592952 -1530635 -606038 3439325 8164172
$$ packed form
5213H020122j279273k931019l730685l047364k329489j604960R10005M594655
5205a398008N438957J677690k729429l400665j675390j757838l889685m712398
5197a2446766l172882j516472o52725J235722M900170Q190588Q669508N684024
5189A0891167J18264n353880o705809k667368K274682K706836m91719j935524
5181a163351k11127N12365k210179n469890o108432m577791j936635K198838O527835
5172a2438367P692386N707811N004778O862818N799156j993673j0899292j2152126
5164f416509n164946K731968N903813M620835J238746k335244l725436j513927
5156d660700J989118K993692J170448p46593j338917r37683R24597M045363M724847
$$ plain form
5147 8164172 7900314 623851 -8385390 -12715251 -11798701 -8474998 -3234794 3882602 8431333
5138 8431333 5544348 -1704289 -4865702 -2254388 -1883606 -9467432 -19487564 -22737055
5130 -22737055 -18304074 -12590736 -9221892 -6056349 -1744393 370249 -3224240 -10981232
5122 -10981232 -17596909 -19141886 -15909777 -11240689 -8292229 -7553059 -7365252 -6782707 -6805951
5113 -6805951 -8226380 -9870787 -10403210 -10343891 -10366343 -9108867 -5459485 -2079387 -3181580
5104 -3181580 -8491990 -12637538 -11748234 -8034605 -6037861 -6389870 -5820620 -2713854 -196703
5095 -196703 -2644459 -10064850 -17485007 -20447417 -19775207 -19077670 -18468544 -14306459 -6037558
5086 -6037558 948909 2467420 2038635 5441064 10974487 11115031 3639333 -4689120 -6689400
$$ packed form
5147H164172k63858p276463r009241m329861R16550L323703N240204P117396M548731
5138H431333k886985p248637l161413K611314L70782p583826j0020132l249491
5130b2737055M432981N713338L368844L165543M311956K114642l594489p756992
5122a0981232o615677j544977L232109M669088K948460P39170J87807N82545k3244
5113f805951j420429j644407n32423N9319k2452J257476L649382L380098j102193
5104c181580n310410m145548Q89304L713629J996744l52009N69250L106766K517151
5095a96703k447756p420391p420157k962410O72210O97537O09126M162085Q268901
5086f037558O986467J518511m28785L402429N533423J40544p475698q328453k000280
$$ plain form
5077 -6689400 -2136030 4602551 9169472 7703483 -1767358 -15141625 -23889445 -24327878
5069 -24327878 -21401798 -20274452 -19108832 -14556311 -9311391 -7775155 -7776006 -3957597 2466964
5060 2466964 4841703 1458121 -2545042 -4354083 -7171053 -12394193 -14923821 -10617686
5052 -10617686 -3719385 -1968681 -6889362 -13039155 -15241177 -12955898 -8533145 -4603981
5044 -4603981 -3241290 -4923589 -7315824 -6515612 -744913 7224550 11902171 9972391
5036 9972391 3532256 -2108974 -3864816 -2890187 -1023510 2358552 8188298 14461901
5028 14461901 17828246 17431052 15018962 12500031 11566143 13818224 18118655 19630130
5020 19630130 15461546 9879144 9272073 12845798 13773106 9690640 6019148 7183737
$$ packed form
5077f689400M553370O738581M566921j465989r470841j3374267q747820m38433
5069b4327878K926080J127346J165620M552521N244920J536236q51L818409O424561
5060B466964K374739l383582m003163j809041k816970n223140k529628M306135
5052a0617686O898301J750704m920681o149793k202022K285279M422753L929164
5044d603981J362691j682299k392235Q00212N770699P969463M677621j929780
5036I972391o440135n641230j755842R74629J866677L382062N829746O273603
5028A4461901L366345l97194k412090k518931r33888K252081M300431J511475
5020A9630130m168584n582402o07071L573725R27308m082466l671492J164589
$$ plain form
5012 7183737 10302204 10739220 9112666 8583165 8605544 6093122 1131927 -2757807 -3821658
5003 -3821658 -4260339 -6543725 -9462699 -8902500 -2210611 8586601 18234943 22876726
4995 22876726 22355849 18067157 11110911 3977579 767064 2309000 3519880 -323510
4987 -323510 -6934588 -11387820 -14611396 -20843274 -27836748 -27528836 -17487872 -4348686
4979 -4348686 5992192 14257797 21099945 22112779 14442434 2730388 -6576997 -12556191
4971 -12556191 -17237240 -20136455 -19943922 -18028015 -16054926 -13337617 -9983152 -8940272
4963 -8940272 -11441950 -14318929 -15230448 -16191260 -18223407 -17348365 -10535641 -1431315 4454391
4954 4454391 6362424 5956782 2959349 -2225312 -6034424 -6663458 -6860848 -7305937 -2993716
$$ packed form
5012G183737L118467M37016j626554n29501K2379k512422m961195l889734j063851
5003c821658m38681k283386k918974N60199O691889J0797212R648342M641783
4995B2876726n20877m288692o956246p133332l210515J541936J210880l843390
4987c23510o611078m453232l223576o231878o993474L07912J0040964J3139186
4979d348686J0340878Q265605O842148J012834p670345j1712046r307385n979194
4971a2556191m681049k899215J92533J915907J973089K717309L354465J042880
4963h940272k501678k876979r11519r60812k032147Q75042O812724R104326N885706
4954D454391J908033m05642k997433n184661l809112o29034j97390m45089M312221
$$ plain form
4945 -2993716 7983417 17931721 18792309 12637080 5826158 -1584266 -12056459 -21425923
4937 -21425923 -23567935 -20891588 -20582133 -23004756 -23078323 -20587087 -19573933 -19588390 -16992571
4928 -16992571 -12956965 -10759721 -7654094 282695 7743750 6260817 -967541 -2727186
4920 -2727186 2424489 5165500 2596004 2232902 6211706 5738681 -3310374 -11723829 -10752488
4911 -10752488 -4503547 -1709563 -3423088 -5227551 -4797370 -1872160 3504640 8907748
4903 8907748 11079854 11363621 13493675 15938279 14324331 10759027 10885446 12424104 8325030
4894 8325030 951300 -139097 5371966 9047143 10625460 17169047 24321435 18813102
4886 18813102 3363031 -2871750 5512790 13055307 13552481 20030445 34018372 36055069
$$ packed form
4945b993716J0977133R948304Q60588o155229o810922p410424j0472193r369464
4937b1425923k142012K676347L09455k422623p3567K491236J013154j4457K595819
4928a6992571M035606K197244L105627P936789P461055j482933p228358j759645
4920b727186N151675K741011k569496l63102L978804m73025r049055q413455R71341
4911a0752488O248941K793984j713525j804463M30181K925210N376800N403108
4903H907748K172106K83767K130054K444604j613948l565304J26419J538658m099074
4894H325030p373730j090397N511063L675177J578317O543587P152388n508333
4886A8813102j5450071o234781Q384540P542517M97174O477964J3987927K036697
$$ plain form
4878 36055069 23376348 23203469 45720429 62869931 69357947 121990483 257444846
4871 257444846 396428538 406721948 266954311 99495179 20799602 20845356 22224165
4864 22224165 -947950 -17281020 -13181707 -10575167 -19153943 -22024296 -12261665 -5492091
4856 -5492091 -9387110 -11028102 -2833641 3811131 -20043 -6075438 -5289161 -2475349
4848 -2475349 -4883809 -8968934 -8243166 -4889094 -4699825 -6786512 -5742985 -529864 3804971
4839 3804971 1579845 -8161480 -20019120 -26424208 -25706161 -23752672 -24683418 -24160872 -17125696
4830 -17125696 -7314693 -1652903 641100 4477349 7909066 5259086 -447262 478998
4822 478998 9240871 16083236 14940912 10550251 7928701 4359776 -3440167 -12011865
$$ packed form
4878C6055069j2678721j72879K2516960J7149502O488016N2632536J35454363
4871B57444846J38983692J0293410j39767637j67459132p8695577M5754J378809
4864B2224165k3172115j6333070M099313K606540q578776k870353R762631O769574
4856e492091l895019j640992Q194461O644772l831174o055395P86277K813812
4848b475349k408460m085125P25768L354072J89269k086687J043527N213121M334835
4839C804971k225126r741325j1857640o405088P18047J953489r30746N22546P035176
4830a7125696R811003N661790K294003L836249L431717k649980n706348R26260
4822D78998Q761873O842365j142324m390661k621550l568925p799943q571698
$$ plain form
4814 -12011865 -16132660 -15025221 -9411074 1502668 15424670 24800426 24351426 16982922
4806 16982922 8444172 478524 -6814729 -10555470 -8319576 -2733719 1963019 5679359
4798 5679359 10672931 16164440 18816688 16967689 10901381 784598 -11799014 -21705510
4790 -21705510 -23914375 -19372134 -14057945 -12111672 -12339964 -11526198 -8820751 -6254210
4782 -6254210 -6309642 -9408636 -13197030 -14560662 -12683403 -9262747 -5519818 -904664 4154368
4773 4154368 6476272 3577930 -2282730 -6189292 -6296788 -4902459 -3756077 -1272889
4765 -1272889 4159435 10379042 13364619 11990436 8495481 4564453 -308327 -5943291
4757 -5943291 -9971539 -11199136 -11902730 -13611314 -12538162 -3761461 10272330 20204727
$$ packed form
4814a2011865m120795J107439N614147J0913742J3922002R375756m49000p368504
4806A6982922q538750p965648p293253l740741K235894N585857M696738L716340
4798E679359M993572N491509K652248j848999o066308j0116783j2583612r906496
4790b1705510k208865M542241N314189J946273k28292Q13766K705447K566541
4782f254210n5432l098994l788394j363632J877259L420656L742929M615154N059032
4773D154368K321904k898342n860660l906562j07496J394329J146382K483188
4765a272889N432324O219607K985577j374183l494955l931028m872780n634964
4757e943291m028248j227597p03594j708584J073152Q776701J4033791R932397
$$ plain form
4749 20204727 20089991 13279677 6366496 1497000 -2652131 -6355421 -9177646 -11757044
4741 -11757044 -13237042 -9793188 -467848 7884839 7252355 -723999 -6153968 -3330650
4733 -3330650 3462907 7480533 7650854 6906339 6538662 5512955 3246226 361830 -2369594
4724 -2369594 -4280352 -4801849 -4185605 -3558576 -3693251 -4087736 -3251054 114139 5183495
4715 5183495 8231081 6117091 1335329 197358 4016838 6249046 2089262 -3355096
4707 -3355096 -2191279 4248332 7646272 5088207 1291444 -1111557 -4958357 -10723607
4699 -10723607 -13577508 -11533241 -9460125 -11090165 -13319620 -12623375 -10997836 -10582126
4691 -10582126 -8232440 -1661870 3772603 1538593 -5865678 -10270113 -9704212 -9968661
$$ packed form
4749B0204727j14736o810314o913181m869496m149131l703290k822225k579398
4741a1757044j479998L443854R325340Q352687o32484p976354n429969K823318
4733c330650O793557M017626J70321p44515l67677j025707k266729k884396k731424
4724b369594j910758n21497O16244O27029j34675l94485Q36682L365193N069356
4715E183495L047586k113990m781762j137971L819480K232208m159784n444358
4707c355096J163817O439611L397940k558065l796763k403001l846800n765250
4699a0723607k853901K044267K073116j630040k229455O96245J625539M15710
4691a0582126K349686O570570N434473k234010p404271m404435N65901k64449
$$ plain form
4683 -9968661 -14538230 -19226646 -18419238 -12190729 -5417991 -2556280 -4577469 -9352824
4675 -9352824 -14137837 -17904593 -20517240 -19956785 -13530567 -3196798 4054405 4059344 559665
4666 559665 -877433 -650405 -2451548 -5800876 -6872954 -5219467 -3953428 -3727992 -2058697
4657 -2058697 959470 1436710 -2474092 -7685615 -10635894 -11305071 -11482474 -11932023 -12455163
4648 -12455163 -12378935 -10325800 -5863288 -1599614 -887664 -3160034 -4482733 -3150472 -1573329
4639 -1573329 -1845047 -2706253 -2365725 -1559652 -1873855 -2819892 -2304287 810434 5293920
4630 5293920 8000771 6087938 72940 -6037224 -9343504 -11564677 -15509474 -19515587
4622 -19515587 -19177619 -14127957 -9019243 -7350715 -8021870 -8575288 -8156407 -6518207 -3855617
$$ packed form
4683i968661m569569m688416Q07408O228509O772738K861711k021189m775355
4675i352824m785013l766756k612647N60455O426218J0333769P251203M939l499679
4666E59665j437098K27028j801143l349328j072078J653487J266039K25436J669295
4657b058697L018167M77240l910802n211523k950279o69177j77403m49549n23140
4648a2455163P6228K053135M462512M263674P11950k272370j322699J332261J577143
4639a573329k71718q61206L40528Q06073l14203r46037N15605L114721M483486
4630E293920K706851j912833o014998o110164l306280k221173l944797m006113
4622a9515587L37968N049662N108714J668528o71155n53418M18881J638200K662590
$$ plain form
4613 -3855617 -2527667 -5007632 -9007034 -8916484 -3770567 630088 -187942 -3680188 -5816668
4604 -5816668 -7834026 -12876560 -19133876 -21683357 -19734370 -17137466 -15999428 -14122163
4596 -14122163 -9539922 -4314806 -2264323 -4382709 -7612351 -8107841 -5859377 -5441105
4588 -5441105 -10391836 -17219669 -18328229 -11905757 -5056921 -4637789 -8533197 -9656205
4580 -9656205 -5828467 -1326904 -229459 -2499140 -5878148 -7873639 -6420369 -2046736
4572 -2046736 1162985 36782 -3056160 -3484794 -1193830 -82862 -1235338 -1582039 378278
4563 378278 2157623 1400432 -1836431 -7529165 -15498498 -21663487 -20262660 -12612084 -8195991
4554 -8195991 -12774402 -19948428 -19904213 -13126608 -8962561 -11924477 -15947678 -13136312 -3115312
$$ packed form
4613c855617J327950k479965l999402R0550N145917M400655q18030l492246k136480
4604e816668k017358n042534o257316k549481J948987K596904J138038J877265
4596a4122163M582241N225116K050483k118386l229642m95490K248464M18272
4588e441105m950731o827833j108560O422472O848836M19132l895408j123008
4580i656205L827738M501563J097445k269681l379008j995491J453270M373633
4572b046736L209721j126203l092942m28634K290964J110968j152476l46701J960317
4563C78278J779345p57191l236863n692734p969333o164989J400827P650576M416093
4554h195991m578411p174026M4215O777605M164047k961916m023201K811366J0021000
$$ plain form
4545 -3115312 8066053 14497494 13874702 7426467 -1144418 -8030045 -12083005 -14339443
4537 -14339443 -14821304 -12256771 -7762870 -5751330 -8649111 -12500588 -10816072 -2487008
4529 -2487008 6443540 9161652 4603888 -2626891 -7267095 -7493581 -4949472 -1820954
4521 -1820954 1595760 6138983 11024579 13507625 12414930 10479720 10831398 12012690
4513 12012690 9815180 4466133 2010845 6113927 11798731 11419642 5078100 284455
4505 284455 1425814 4515270 3854907 -507129 -4634149 -6487888 -6522438 -5115906 -3071484
4496 -3071484 -2860373 -5687953 -8683978 -8678486 -7417741 -8777195 -11903517 -12420108 -10339798
4487 -10339798 -10563133 -13788540 -13304463 -4839685 5592929 9281124 6797987 6060877
$$ packed form
4545c115312J1181365O431441o22792o448235q570885o885627m052960k256438
4537a4339443m81861K564533M493901K011540k897781l851477J684516Q329064
4529b487008Q930548K718112m557764p230779m640204k26486K544109L128518
4521a820954L416714M543223M885596K483046j092695j935210L51678J181292
4513A2012690k197510n349047k455288M103082N684804l79089o341542m793645
4505B84455J141359L089456o60363m362036m127020j853739l4550J406532K044422
4496c071484K11111k827580k996025N492J260745j359454l126322n16591K080310
4487a0339798k23335l225407M84077Q464778J0432614L688195k483137p37110
$$ plain form
4479 6060877 10101338 13535455 11649011 6658810 2612665 -623539 -4337267 -5585267
4471 -5585267 -48719 10536815 18306683 17847310 12105131 8046005 8176873 8681109 5598879
4462 5598879 391601 -2037476 471390 5233276 8588416 9575508 8894747 6330916 1227856
4453 1227856 -5335985 -10619165 -12230988 -9251409 -2542279 4605649 7575756 4614740
4445 4614740 -700111 -3461832 -3253977 -3429764 -5397324 -7217479 -7944494 -9237486 -11404815
4436 -11404815 -11841563 -9578314 -7682493 -8184587 -8086627 -4432727 -522753 -1882602 -7397791
4427 -7397791 -10105028 -7115182 -3346119 -3635735 -5939297 -5540060 -2569982 -1363193 -3962802
4418 -3962802 -7873823 -9813225 -8827929 -5642154 -1355081 2475286 4010770 2431810
$$ packed form
4479F060877M040461L434117j886444m990201m046145l236204l713728j248000
4471e585267N536548J0585534P769868m59373n742179m059126J30868N04236l082230
4462E598879n207278k429077K508866M761886L355140R87092o80761k563831n103060
4453A227856o563841n283180j611823K979579O709130P147928K970107k961016
4445D614740n314851k761721K07855j75787j967560j820155p27015j292992k167329
4436a1404815m36748K263249J895821n02094R7960L653900L909974j359849n515189
4427g397791k707237K989846L769063k89616k303562L99237K970078J206789k599609
4418c962802l911021j939402R85296L185775M287073L830367J535484j578960
$$ plain form
4410 2431810 -1162303 -4246012 -4404102 -1401940 1750251 1095549 -3810417 -8963425 -10729076
4401 -10729076 -9951984 -9069600 -6920528 -442589 8593588 13278912 10168911 4395225
4393 4395225 2579484 3229738 -965986 -11816811 -21648018 -22445990 -15381690 -8451573
4385 -8451573 -6876523 -8922928 -10092417 -8178904 -3990284 264572 2289029 1072384
4377 1072384 -2116986 -5214803 -8211758 -12954187 -19405065 -23937601 -22893757 -16646060
4369 -16646060 -8596767 -1372468 3940351 5826162 2723827 -4088339 -10585619 -14253706
4361 -14253706 -16290206 -18137364 -17948137 -13214030 -6015790 -2473481 -6021918 -13147784
4353 -13147784 -16998330 -14084586 -6507946 1173435 5743524 6627835 5213117 3416275
$$ packed form
4410B431810l594113l083709j58090L002162L152191o54702m905966n153008j765651
4401a0729076P77092Q82384K149072O477939R036177M685324l110001n773686
4393D395225j815741O50254m195724j0850825r831207p97972P064300O930117
4385h451573J575050k046405j169489J913513M188620M254856K024457j216645
4377A072384l189370l097817k996955m742429o450878m532536J043844O247697
4369a6646060Q049293P224299N312819J885811l102335o812166o497280l668087
4361a4253706k036500j847158J89227M734107P198240L542309l548437p125866
4353a3147784l850546K913744P576640P681381M570089Q84311j414718j796842
$$ plain form
4345 3416275 2186309 1113111 -227422 -1020666 -251256 1304562 1526949 -360364 -2919993
4336 -2919993 -4740707 -5850567 -5940059 -3283183 2244933 6535551 5106269 -280503 -2393055
4327 -2393055 2411346 8575150 7313004 -3198540 -15926687 -22469968 -20421903 -14023698
4319 -14023698 -9781159 -11294658 -16396750 -19144013 -16005606 -9834115 -6224615 -6591032
4311 -6591032 -7033776 -3748849 2920962 9722371 12929744 9462228 -672622 -11641062
4303 -11641062 -15210407 -9664204 -2531695 -1374286 -4403679 -4266637 687553 4247718
4295 4247718 1904816 -2286301 -952711 7306558 16667969 20859593 18903626 14564294
4287 14564294 12122062 13320400 17217514 21296136 22121308 16627236 5525206 -4565320
$$ packed form
4345C416275j229966j073198j340533p93244P69410J555818K22387j887313k559629
4336b919993j820714j109860q9492K656876N528116M290618j429282n386772k112552
4327b393055M804401O163804j262146j0511544j2728147o543281K048065O398205
4319a4023698M242539j513499n102092k747263L138407O171491L609500l66417
4311f591032m42744L284927O669811O801409L207373l467516j0134850j0968440
4303a1641062l569345N546203P132509J157409l029393J37042M954190L560165
4295D247718k342902m191117J333590Q259269R361411M191624j955967m339332
4287A4564294k442232J198338L897114M078622Q25172n494072j1102030j0090526
$$ plain form
4279 -4565320 -6017441 647236 5569910 849306 -9466383 -14918440 -11935009 -5717494
4271 -5717494 29447 7409654 16503371 21201194 17989834 12817983 12476390 13472543 7511474
4262 7511474 -4171993 -10921189 -7883490 -2943831 -5322087 -13832692 -20965496 -23553016
4254 -23553016 -23704726 -22168949 -16988307 -8434068 -364610 4391098 6794545 8752929
4246 8752929 10169753 10216022 9570288 9560668 9953565 9336352 7779789 7691664 10877379 15150441
4236 15150441 15429078 9048649 -999737 -9132596 -12394712 -11305946 -7222915 -1843237
4228 -1843237 1475343 -110763 -4666715 -7001235 -5703928 -4868708 -6888529 -7812321 -3381444
4219 -3381444 3929037 8442933 9199959 9324379 9458398 7546037 4385550 3537488 5342786
$$ packed form
4279d565320j452121O664677M922674m720604j0315689n452057K983431O217515
4271e717494N746941P380207R093717M697823l211360n171851l41593R96153n961069
4262G511474j1683467o749196L037699M939659k378256q510605p132804k587520
4254b3553016j51710J535777N180642Q554239Q069458M755708K403447J958384
4246H752929J416824M6269o45734r620L92897o17213j556563q8125L185715M273062
4236A5150441K78637o380429j0048386q132859l262116J088766M083031N379678
4228a843237L318580j586106m555952k334520J297307Q35220k019821r23792M430877
4219c381444P310481M513896P57026J24420J34019j912361l160487q48062J805298
$$ plain form
4210 5342786 6465098 6147978 7414636 10665740 11748236 8801179 5853179 6673595 9735721
4201 9735721 12246402 14204529 14959321 11166983 2984796 -2892698 -2447006 -1912300 -8741582
4192 -8741582 -18786074 -21443587 -15636305 -10790253 -11615569 -12007849 -6903857 -855856
4184 -855856 349555 -888564 645980 3688325 3433663 197085 -1542229 -734580 -378977
4175 -378977 -1584212 -2385515 -2182826 -2596150 -3543033 -2392128 2270265 8925246 15438678
4166 15438678 20449539 22343129 19602141 13067545 6307390 3155647 5176510 10555165
4158 10555165 14849262 14542057 10759039 7429005 5544814 3192587 1682107 4101694
4150 4101694 3413820 -18947642 -71313824 -132476519 -167108691 -161745823 -134794478 -109459094
$$ packed form
4210E342786J122312l17120J266658L251104J082496k947057k948000Q20416L062126
4201I735721K510681J958127P54792l792338q182187n877494M45692N34706o829282
4192h741582j0044492k657513N807282M846052q25316l92280N103992O048001
4184h55856J205411j238119J534544L042345k54662l236578j739314Q07649L55603
4175c78977j205235q01303K02689m13324r46883J150905M662393O654981O513432
4166A5438678N010861J893590k740988o534596o760155l151743K020863N378655
4158A0555165M294097l07205l783018l330034j884191k352227j510480K419587
4150D101694o87874k2361462n2366182o1162695l4632172N362868K6951345K5335384
$$ plain form
4142 -109459094 -89900663 -70054342 -52514715 -45332529 -46355614 -44494591 -35909020 -28183431
4134 -28183431 -27353925 -30091582 -31471168 -32645253 -36359653 -40131502 -38684725 -30619558
4126 -30619558 -19479979 -9952226 -4843235 -3797407 -3527654 -1287143 1108799 -560482
4118 -560482 -5971838 -9262688 -7056789 -3706945 -5093068 -10145654 -12988388 -11879742
4110 -11879742 -10996907 -13148733 -15434554 -14120201 -10443117 -8690106 -10385456 -13435955
4102 -13435955 -16308744 -19828257 -24083504 -26336335 -24178512 -19326825 -15756479 -14599902
4094 -14599902 -13649301 -12060906 -12152412 -14830526 -16402365 -13234748 -7670116 -5333642 -7209395
4085 -7209395 -8483690 -5634755 -676834 2881351 4462497 4650934 2419428 -2752804
$$ packed form
4142a09459094J9558431J9846321J7539627P182186j023085J861023Q585571P725589
4134b8183431Q29506k737657j379586j174085l714400l771849J446777Q065167
4126c0619558J1139579R527753N108991J045828K69753K240511K395942j669281
4118e60482n411356l290850K205899L349844j386123n052586k842734J108646
4110a1879742Q82835k151826k285821J314353L677084J753011j695350l050499
4102a3435955k872789l519513m255247k252831K157823M851687L570346J156577
4094a4599902R50601J588395r1506k678114j571839L167617N564632K336474j875753
4085g209395j274295K848935M957921L558185J581146J88437k231506n172232
$$ plain form
4077 -2752804 -8350621 -11684591 -13579907 -15890414 -16782715 -12595968 -4306685 1728351
4069 1728351 590085 -6376191 -14542092 -21119602 -25662774 -27614739 -25884283 -20574871
4061 -20574871 -13681021 -7806184 -4449955 -3264680 -2813264 -2213755 -1682647 -1153016 552827
4052 552827 3988423 7555697 9395839 9744136 9140074 5594878 -2647860 -11703300 -14186809
4043 -14186809 -8618791 -2451844 -2613000 -6565208 -6948149 -2538087 612856 -1787208
4035 -1787208 -7128864 -10502900 -10225696 -7286238 -2780558 1865298 4353853 3364479 -92371
4026 -92371 -4119514 -7341511 -8343056 -5919151 -1274446 1822351 707865 -3585676 -8589231
4017 -8589231 -13655251 -19318668 -24702987 -27596466 -26837997 -23495823 -20040837 -18819853
$$ packed form
4077b752804n597817l333970j895316k310507q92301M186747Q289283O035036
4069A728351j138266o966276q165901o577510m543172j951965J730456N309412
4061b0574871O893850N874837L356229J185275M51416N99509N31108N29631J705843
4052E52827L435596L567274J840142L48297o04062l545196q242738r055440k483509
4043a4186809N568018O166947j61156l952208l82941M410062L150943k400064
4035a787208n341656l374036K77204K939458M505680M645856K488555r89374l456850
4026i2371m027143l221997j001545K423905M644705L096797j114486m293541n003555
4017h589231n066020n663417n384319k893479P58469L342174L454986J220984
$$ plain form
4009 -18819853 -20259724 -21944679 -20857145 -17283292 -14748789 -15086350 -15829997 -14303985
4001 -14303985 -12000746 -12116508 -14360215 -15483745 -14226736 -12520703 -11893198 -11642773 -10898750
3992 -10898750 -9878677 -8633631 -6941182 -5996361 -7901346 -12703869 -17943333 -21780269
3984 -21780269 -24476286 -25957889 -24159836 -17384581 -7071323 2956640 9234844 10356701
3976 10356701 7362090 3040569 -282636 -2506128 -4255399 -4458708 -1985094 663782
3968 663782 -837965 -5843033 -7583578 -1716905 6755994 8811348 2246409 -6416338
3960 -6416338 -10408431 -9637110 -8661361 -10888229 -16440539 -23790670 -31077101 -35885924 -35600063
3951 -35600063 -29514990 -20663770 -14191062 -12655563 -13411673 -11918081 -7170736 -2099887
$$ packed form
4009a8819853j439871j684955J087534L573853K534503l37561p43647J526012
4001a4303985K303239j15762k243707j123530J257009J706033O27505K50425P44023
3992a0898750J020073J245046J692449R44821j904985m802523n239464l836936
3984b1780269k696017j481603J798053O775255J0313258J0027963O278204J121857
3976A0356701k994611m321521l323205k223492j749271k03309K473614K648876
3968F63782j501747n005068j740545N866673Q472899K055354o564939q662747
3960f416338l992093P71321R75749k226868n552310p350131p286431m808823K85861
3951c5600063O085073Q851220O472708J535499p56110J493592M747345N070849
$$ plain form
3943 -2099887 1092690 3398729 6165130 8431656 8707072 7419260 5774463 3715567
3935 3715567 822044 -2095739 -4121252 -5708602 -7076253 -6197562 -695724 8482145
3927 8482145 16959064 20520108 18162394 12602688 8865356 11079900 18820663 26897731
3919 26897731 29667861 25025198 14335308 998553 -9738541 -12673307 -7483913 -231978
3911 -231978 2610141 491057 -2933447 -5806869 -9148335 -13304425 -16892797 -18838083
3903 -18838083 -18670716 -15697643 -10844093 -8076842 -10179219 -13788552 -12786912 -6618026
3895 -6618026 -1116955 -588306 -3069812 -4409668 -3281695 -847047 1202956 922529 -2440201
3886 -2440201 -6045080 -5721538 -1963901 -294525 -3848339 -8804129 -9468006 -5230344 -116004
$$ packed form
3943b099887L192577K306039K766401K266526K75416j287812j644797k058896
3935C715567k893523k917783k025513j587350j367651Q78691N501838R177869
3927H482145Q476919L561044k357714n559706l737332K214544P740763Q077068
3919B6897731K770130m642663j0689890j3336755j0737094k934766N189394P251935
3911b31978K842119k119084l424504k873422l341466m156090l588372j945286
3903a8838083J67367K973073M853550K767251k102377l609333J001640O168886
3895f618026N501071N28649k481506j339856J127973K434648K050003k80427l362730
3886b440201l604879L23542L757637J669376l553814m955790o63877M237662N114340
$$ plain form
3877 -116004 2386367 1798645 -259024 -1509910 -900314 -102124 -1396939 -3701848 -3706817
3868 -3706817 -1765589 -2555818 -7541405 -10703932 -5571738 6017258 16018055 19442602
3860 19442602 17972360 15404820 13027989 9617557 3829958 -3505178 -8780461 -8847120
3852 -8847120 -5906464 -6552304 -13643321 -21576594 -22713425 -16552782 -9110499 -4885948
3844 -4885948 -3631561 -4390340 -8017476 -14280528 -19672683 -20372419 -16299607 -10934379 -7432763
3835 -7432763 -5564874 -2832070 1313932 3529017 537750 -5771573 -10011449 -9894815
3827 -9894815 -7707925 -4986934 -412518 5391248 8094572 5926783 3233429 4009054
3819 4009054 6246538 7073082 8741559 13570963 17130447 13903853 6964389 3986977
$$ packed form
3877a16004K502371n87722k057669j250886O09596P98190j294815k304909m969
3868c706817J941228p90229m985587l162527N132194J1588996J0000797L424547
3860A9442602j470242k567540k376831l410432n787599p335136n275283o6659
3852h847120K940656o45840p091017p933273j136831O160643P442283M224551
3844d885948J254387p58779l627136o263052n392155o99736M072812N365228L501616
3835g432763J867889K732804M146002K215085k991267o309323m239876J16634
3827i894815K186890K720991M574416N803766K703324k167789k693354P75625
3819D009054K237484Q26544J668477M829404L559484l226594o939464k977412
$$ plain form
3811 3986977 5231073 3936233 -1814282 -6576679 -7867571 -9895530 -14185336 -15107653
3803 -15107653 -9430827 -3052372 -2298994 -4066663 -1137581 6311083 10890385 8026022
3795 8026022 761683 -4683067 -4596800 137481 5073742 6471151 6077128 9200896 16261265
3786 16261265 19898553 13876667 1891883 -6465586 -6463804 -1208587 4174300 7189774
3778 7189774 7905228 8145344 10446829 14853967 17329804 14132932 7149385 2127525 1979596
3769 1979596 4196760 4541513 1243196 -4136394 -8469715 -10263587 -11915447 -17131226
3761 -17131226 -25110130 -29899780 -27413457 -20426673 -14341745 -10944254 -9195636 -8929261
3753 -8929261 -9757608 -8997057 -5188020 -1585822 -1609961 -2959795 -1431961 1320314 21903
$$ packed form
3811C986977J244096j294840n750515m762397j290892k027959m289806r22317
3803a5107653N676826O378455P53378j767669K929082P448664M579302k864363
3795H026022p264339n444750Q6267M734281M936261J397409l94023L123768P060369
3786A6261265L637288o021886j1984784q357469J782N255217N382887L015474
3778G189774P15454K40116K301485M407138K475837l196872o983547n021860j47929
3769A979596K217164L44753l298317n379590m333321j793872j651860n215779
3761a7131226p978904m789650K486323O986784O084928L397491J748618K66375
3753h929261q28347P60551L809037L602198k4139j349834J527834K752275j298411
$$ plain form
3744 21903 -5029378 -7463174 -3941240 2251325 7549811 11964059 15036812 14057748 9060627
3735 9060627 4390588 2201833 -959811 -7828332 -15115104 -18364350 -18323277 -18379807 -18860798
3726 -18860798 -18184651 -17043864 -16880952 -16037390 -11944811 -6182109 -3297036 -5020606 -9028669
3717 -9028669 -12944574 -16240202 -18337604 -17959478 -14850713 -10266680 -6087526 -4932892
3709 -4932892 -9306866 -17524714 -21998750 -16060093 -2771375 7078109 6914111 889444
3701 889444 -3008307 -2851608 -2880246 -5962422 -9801201 -10912091 -9638086 -9458418 -12076422
3692 -12076422 -14935138 -14337105 -9988903 -4990122 -1798538 -308852 -101537 -1815829
3684 -1815829 -4885159 -6556253 -5454314 -3912238 -4148353 -4473422 -2685931 -884632 -2325058
$$ packed form
3744B1903n051281k433796L521934O192565N298486M414248L072753r79064m997121
3735I060627m670039k188755l161644o868521p286772l249246M1073n6530m80991
3726a8860798O76147J140787J62912Q43562M092579N762702K885073j723570m008063
3717i028669l915905l295628k097402L78126L108765M584033M179154J154634
3709d932892m373974q217848m474036N938657J3288718R849484j63998o024667
3701H89444l897751J56699k8638l082176l838779j110890J274005J79668k618004
3692a2076422k858716N98033M348202M998781L191584J489686K07315j714292
3684a815829l069330j671094J101939J542076k36115l25069J787491J801299j440426
$$ plain form
3675 -2325058 -5305455 -5906518 -5848356 -10534808 -18483590 -20672907 -13832655 -6924969 -8712715
3666 -8712715 -15065255 -15995310 -10617396 -6136222 -4498279 -233006 7749820 11978693
3658 11978693 7742543 1043808 298249 5521038 10636648 12054946 9902139 4585228
3650 4585228 -2176103 -5492583 -2124655 4394427 8442040 10360053 14171433 18530139
3642 18530139 16879466 7658033 -1898456 -4737350 -2052660 408060 97446 -1447351
3634 -1447351 -2331240 -1504414 1737549 6568704 10431736 12174874 13616009 15875372 16254610
3625 16254610 11567562 3173246 -3980105 -6403432 -4192499 256535 3141035 586744
3617 586744 -7432838 -15154411 -16314233 -11449336 -7229086 -8492060 -13548162 -17468116
$$ packed form
3675b325058k980397o01063N8162m686452p948782k189317O840252O907686j787746
3666h712715o352540r30055N377914M481174J637943M265273P982826M228873
3658A1978693m236150o698735p45559N222789N115610J418298k152807n316911
3650D585228o761331l316480L367928O519082M047613J918013L811380M358706
3642A8530139j650673r221433r556489k838894K684690K460720l10614j544797
3634a447351q83889Q26826L241963M831155L863032J743138J441135K259363L79238
3625A6254610m687048q394316p153351k423327K210933M449034K884500k554291
3617E86744q019582p721573j159822M864897M220250j262974n056102l919954
$$ plain form
3609 -17468116 -17341925 -13845961 -10086029 -9475816 -12491799 -15018203 -12285759 -5078337
3601 -5078337 524990 485413 -2896319 -5447174 -6839613 -9078807 -11558977 -11571660 -9348055
3592 -9348055 -8794648 -11854192 -14767334 -12276133 -4564583 2162067 2195511 -4051876 -11381541
3583 -11381541 -15358162 -15367207 -13113325 -10083141 -6989760 -4362449 -2546506 -1337768 -101383
3574 -101383 1724493 3973290 5217982 3582841 -914721 -5628226 -8457094 -10835393
3566 -10835393 -15109801 -19740623 -20817606 -18517452 -17504437 -19352893 -19396547 -14130381
3558 -14130381 -7117295 -3167181 -810326 3680203 8048562 6952941 1541886 -1429627
3550 -1429627 -217151 -487979 -5595303 -11197795 -12043785 -8190984 -1938230 5267414 9553225
$$ packed form
3609a7468116J26191L495964L759932O10213l015983k526404K732444P207422
3601e078337N603327l9577l381732k550855j392439k239194k480170j2683K223605
3592i348055N53407l059544k913142K491201P711550O726650L3444o247387p329665
3583a1381541l976621r045K253882L030184L093381K627311J815943J208738J236385
3574a01383J825876K248797J244692j635141m497562m713505k828868k378299
3566a0835393m274408m630822j076983K300154J013015j848456m3654N266166
3558a4130381P013086L950114K356855M490529M368359j095621n411055k971513
3550a429627J212476k70828n107324n602492q45990L852801O252754P205644M285811
$$ plain form
3541 9553225 4792410 -8647388 -20422427 -21526518 -15430215 -11993004 -13538550 -13930521
3533 -13930521 -9791419 -5263396 -4859069 -7312633 -8176468 -4706386 2630483 9990197
3525 9990197 11198048 2997887 -9769819 -17921597 -18173674 -16288605 -18427660 -22697660
3517 -22697660 -22077665 -13868014 -3210874 2777058 2502386 578058 1487936 4080423
3509 4080423 3948428 487348 -1747588 107279 2620354 1336241 -2146352 -2489059 1614812
3500 1614812 6383279 8969910 10222880 11400069 12067637 11582936 9174969 2697719 -8588863
3491 -8588863 -19876767 -24190304 -20986031 -16846288 -16169937 -15990847 -12331308 -6751676
3483 -6751676 -2840473 -213995 3312891 6269124 5345060 1647213 458113 4264277
$$ packed form
3541I553225m760815j3439798j1775039j104091O096303L437211j545546l91971
3533a3930521M139102M528023M04327k453564q63835L470082P336869P359714
3525I990197J207851q200161j2767706q151778k52077J885069k139055m270000
3517b2697660O19995Q209651J0657140N987932k74672j924328R09878K592487
3509D080423j31995l461080k234936J854867K513075j284113l482593l42707M103871
3500A614812M768467K586631J252970J177189O67568m84701k407967o477250j1286582
3491h588863j1287904m313537L204273M139743O76351J79090L659539N579632
3483f751676L911203K626478L526886K956233r24064l697847j189100L806164
$$ plain form
3475 4264277 9445345 11037362 8577337 5755220 5095829 4432369 -218362 -8217780 -12918961
3466 -12918961 -9105066 -295512 5177307 4717002 3107676 3206094 1423678 -4490445 -9378971
3457 -9378971 -7940495 -3708818 -4238841 -9878166 -13933001 -12640958 -8389351 -3527062
3449 -3527062 2120188 6742625 6339081 1384240 -2006739 -571548 1334172 -1278744
3441 -1278744 -6876028 -11150907 -13768474 -16450132 -17458917 -13701085 -6843619 -1827338
3433 -1827338 335740 3020322 6791943 7135257 1507656 -5694862 -8373343 -5918004
3425 -5918004 -1885038 2027298 6483874 10103797 9282476 3536163 -2561799 -4939918
3417 -4939918 -5168091 -7573010 -12766594 -16957821 -17319400 -15183796 -13171395 -11497768 -8877784
$$ packed form
3475D264277N181068J592017k460025k822117o59391o63460m650731p999418m701181
3466a2918961L813895Q809554N472819m60305j609326R8418j782416n914123m888526
3457i378971J438476M231677n30023n639325m054835J292043M251607M862289
3449c527062N647250M622437m03544m954841l390979J435191J905720k612916
3441a278744n597284m274879k617567k681658j008785L757832O857466N016281
3433a827338K163078K684582L771621L43314n627601p202518k678481K455339
3425e918004M032966L912336M456576L619923q21321n746313o097962k378119
3417d939918k28173k404919n193584m191227l61579K135604K012401J673627K619984
$$ plain form
3408 -8877784 -5913105 -5490289 -9386706 -15481329 -19260828 -18356181 -15153210 -14064310 -16184708
3399 -16184708 -18058454 -16559315 -13206903 -11527251 -11554388 -10362912 -7836226 -7736760 -11415554
3390 -11415554 -14158096 -10882935 -3148119 2842081 3702518 934230 -3412614 -9090617
3382 -9090617 -15265526 -19433968 -20416800 -20073787 -20221140 -19496626 -15393047 -8683091 -3522107
3373 -3522107 -2335236 -2108114 2075511 9561438 12872161 6594511 -4045924 -7880750
3365 -7880750 -1566371 6127226 6100574 271424 -3065971 -1247385 1444899 2319242 3250940
3356 3250940 5077354 5309606 2759109 -845477 -5187029 -11846259 -18603417 -19097978 -11448241
3347 -11448241 -2097894 2764490 4791775 7922294 9991190 6235500 -1752842 -7337843
$$ packed form
3408h877784K964679M22816l896417o094623l779499R04647L202971J088900k120398
3399a6184708j873746J499139L352412J679652k7137J191476K526686R9466l678794
3390a1415554k742542L275161P734816N990200Q60437k768288m346844n678003
3382i090617o174909m168442r82832L43013j47353P24514M103579O709956N160984
3373c522107J186871K27122M183625P485927L310723o277650j0640435l834826
3365g880750O314379P693597k6652n829150l337395J818586K692284Q74343R31698
3356C250940J826414K32252k550497l604586m341552o659230o757158m94561P649737
3347a1448241R350347M862384K027285L130519K068896l755690p988342n585001
$$ plain form
3339 -7337843 -7981003 -7025470 -6831858 -6119165 -4679410 -5126248 -8284517 -11193113 -11279994
3330 -11279994 -8818879 -4213533 2835583 9745471 11085435 5198997 -2401559 -5210866
3322 -5210866 -2766617 1075790 4090931 6494050 7862972 7090146 4628936 1640986
3314 1640986 -2586931 -9463537 -17495779 -22501409 -21674651 -15675013 -7212401 174029
3306 174029 2635452 -1325725 -8105810 -11849123 -11109992 -9942691 -11046291 -11074429 -5659664
3297 -5659664 3268849 9233758 9631557 8393808 9531131 11706477 11258107 7801541 3820859
3288 3820859 144691 -4932439 -12051384 -18835570 -22156381 -20877935 -16313331 -11575830
3280 -11575830 -10279674 -13504024 -17370026 -15844577 -7306101 3094908 8656259 7409498
$$ packed form
3339g337843o43160R55533J93612P12693J439755m46838l158269k908596q6881
3330a1279994K461115M605346P049116O909888J339964n886438p600556k809307
3322e210866K444249L842407L015141K403119J368922p72826k461210k987950
3314A640986m227917o876606q032242n005630Q26758N999638Q462612P386430
3306A74029K461423l961177o780085l743313P39131J167301j103600k8138N414765
3297e659664Q928513N964909L97799j237749J137323K175346m48370l456566l980682
3288C820859l676168n077130p118945o784186l320811J278446M564604M737501
3280a1575830J296156l224350l866002J525449Q538476J0401009N561351j246761
$$ plain form
3272 7409498 2533848 -1618807 -2655997 -1043157 435166 -885260 -4631653 -8139156
3264 -8139156 -10468513 -13210624 -16416128 -17260412 -15048005 -13889127 -16781475 -20310689
3256 -20310689 -19935410 -17750162 -19095708 -23303419 -24805763 -23097763 -23936040 -28986807
3248 -28986807 -31671708 -26858548 -18623078 -14061088 -14251596 -15676250 -16099750 -14367871
3240 -14367871 -8624372 -154871 4501776 1137612 -5044798 -5706645 -435403 4491042
3232 4491042 6320291 7850511 10135188 10496258 8595538 7973705 9954065 11495857 10546074
3223 10546074 8366473 5446169 752363 -3593556 -3200708 745313 1053848 -4601515
3215 -4601515 -8722582 -4545426 4120827 9103666 8809713 6504893 2066738 -6550232
$$ packed form
3272G409498m875650m152655j037190J612840J478323j320426l746393l507503
3264h139156k329357k742111l205504q44284K212407J158878k892348l529214
3256b0310689L75279K185248j345546m207711j502344J708000q38277n050767
3248b8986807k684901M813160Q235470M561990j90508j424654m23500J731879
3240a4367871N743499Q469501M656647l364164o182410o61847N271242M926445
3232D491042J829249J530220K284677L61070j900720o21833J980360J541792r49783
3223A0546074k179601k920304m693806m345919L92848L946021L08535n655363
3215d601515m121067M177156Q666253M982839k93953k304820m438155q616970
$$ plain form
3207 -6550232 -15793035 -18533492 -13672715 -7186127 -3172742 160417 4841640 9299556
3199 9299556 11812837 12911953 12658407 9910638 5915689 4361664 6018923 7325349
3191 7325349 6112410 4622735 4778323 4904578 4172976 6114934 13519444 22623826 26569864
3182 26569864 22992979 14914279 6083983 -969451 -4063505 -2767428 -96837 658651
3174 658651 271805 1584065 4026584 3946946 289676 -3858426 -5916169 -6459247 -6363713
3165 -6363713 -4857326 -2094897 -683272 -2440081 -5776352 -8378385 -10580388 -13689396
3157 -13689396 -16433865 -16012702 -12477448 -9561402 -10374981 -13768039 -15893447 -14547941
3149 -14547941 -10929916 -7297182 -4131315 -716161 1894784 530858 -5965927 -13354982
$$ packed form
3207f550232r242803k740457M860777O486588M013385L333159M681223M457916
3199I299556K513281J099116k53546k747769l994949j554025J657259J306426
3191G325349j212939j489675J55588J26255p31602J941958P404510R104382L946038
3182B6569864l576885q078700q830296p053434l094054J296077K670591P55488
3174F58651l86846J312260K442519p9638l657270m148102k057743n43078R5534
3165f363713J506387K762429J411625j756809l336271k602033k202003l109008
3157a3689396k744469M21163L535254K916046q13579l393058k125408J345506
3149a4547941L618025L632734L165867L415154K610945j363926o496785p389055
$$ plain form
3141 -13354982 -15130127 -9517331 -1670662 1966430 336959 -1996124 -219435 6232689
3133 6232689 13826321 18079396 16289110 8368202 -3268453 -13823567 -17598323 -12294852
3125 -12294852 -2631535 3214320 2984051 3593186 11622320 22953878 27400045 23082223
3117 23082223 19440915 23744805 31013701 31968387 25967601 19670823 15853355 10964573
3109 10964573 3521337 -1952274 -1312611 3804981 9132212 12305086 12110637 7124277
3101 7124277 -1710467 -9741794 -13014279 -12524455 -11781313 -11863469 -11518328 -10776539 -11367925
3092 -11367925 -13703624 -15879470 -16188475 -15198405 -14809224 -15811194 -16588777 -14509070 -9305615
3083 -9305615 -4628277 -4529228 -8410399 -11640093 -11506122 -9779353 -8457216 -6380938 -2296770
$$ packed form
3141a3354982j775145N612796P846669L637092j629471k333083J776689O452124
3133F232689P593632M253075j790286p920908j1636655j0555114l774756N303471
3125a2294852R663317N845855k30269O09135Q029134J1331558M446167m317822
3117B3082223l641308M303890P268896R54686o000786o296778l817468m888782
3109A0964573p443236n473611O39663N117592N327231L172874j94449m986360
3101G124277q834744q031327l272485M89824P43142q2156L45141P41789n91386
3092a1367925k335699k175846l09005R90070L89181j001970p77583K079707N203455
3083i305615M677338R9049l881171l229694J33971J726769J322137K076278M084168
$$ plain form
3074 -2296770 1842076 3764392 4578022 6061998 6515955 3641766 52471 890940 6160757
3065 6160757 10280433 9987995 8200565 8639284 10704698 11624807 10195711 6305108 -23202
3056 -23202 -6699212 -9508263 -6626475 -1044241 3654836 7454462 11481003 14175186 13154903
3047 13154903 8926963 3555027 -2531354 -9108301 -13628549 -14350761 -14487623 -18272286
3039 -18272286 -23481343 -23413003 -17068710 -11698453 -12787154 -16475230 -15718873 -10219544 -5491468
3030 -5491468 -4155776 -3104179 994530 7460660 13434623 16765158 16260848 11770781
3022 11770781 5295519 233873 -1484988 -335520 2708402 6790932 9433278 7063623
3014 7063623 -780220 -9668160 -14746527 -15563413 -14489300 -12044982 -6800640 825033
$$ packed form
3074b296770M138846J922316Q13630J483976M53957k874189l589295Q38469N269817
3065F160757M119676k92438j787430M38719K065414R20109j429096l890603o328310
3056b3202o676010k809051K881788N582234M699077L799626M026541K694183j020283
3047A3154903m227940n371936o086381o576947m520248p22212j36862l784663
3039a8272286n209057O8340O344293N370257j088701l688076P56357N499329M728076
3030e491468J335692J051597M098709O466130N973963L330535n04310m490067
3022A1770781o475262n061646j718861J149468L043922M082530K642346k369655
3014G063623p843843q887940n078367q16886J074113K444318N244342P625673
$$ plain form
3006 825033 7921835 12530100 14981153 15335589 12413890 6670511 1560682 229077 2421891
2997 2421891 5950740 9335681 11551126 11278711 8491206 5062443 1767860 -3324440
2989 -3324440 -10842167 -16521710 -15354101 -8377149 -1614439 1375254 2243953 3431829
2981 3431829 5229107 7847483 12085077 16324694 16767786 12885616 9234138 9182055 9777703
2972 9777703 6028683 -1784482 -8236330 -8998478 -4519865 1325813 4122843 1711587
2964 1711587 -3862850 -8315461 -10328251 -12686985 -16700579 -18768766 -15635087 -10025833
2956 -10025833 -6674918 -4974535 -969068 4235658 4017674 -4545111 -15694310 -21370039
2948 -21370039 -19439893 -13893243 -9580309 -8431113 -8721234 -6691430 -652018 5782903
$$ packed form
3006H25033P096802M608265K451053L54436k921699n743379n109829j331605K192814
2997B421891L528849L384941K215445k72415k787505l428763l294583n092300
2989c324440p517727n679543J167609O976952O762710K989693Q68699J187876
2981C431829J797278K618376M237594M239617M43092l882170l651478n2083N95648
2972I777703l749020p813165o451848p62148M478613N845678K797030k411256
2964A711587n574437m452611k012790k358734m013594k068187L133679N609254
2956a0025833L350915J700383M005467N204726k17984q562785j1149199n675729
2948b1370039J930146N546650M312934J149196k90121K029804O039412O434921
$$ plain form
2940 5782903 6661330 624885 -7346337 -11860543 -12385046 -11669340 -11480469 -11493156 -10588064
2931 -10588064 -7901052 -3948562 -1239622 -1869380 -4172682 -4330606 -1908200 -696453
2923 -696453 -2828627 -5463716 -5486272 -4339452 -5111235 -7175479 -7252836 -4488799 -1181918
2914 -1181918 894632 1984483 2438365 1906374 558293 -911729 -2634468 -5349803 -8973480
2905 -8973480 -12862677 -17167941 -22170588 -26376523 -27188958 -24111811 -20030891 -18496934
2897 -18496934 -20183728 -22410027 -21988854 -18455211 -14383724 -12269440 -11502866 -9440583
2889 -9440583 -5391141 -2059071 -2346887 -5770111 -8816751 -8243934 -3694996 2197297 6162368
2880 6162368 7517660 8710567 11403998 12742002 7889809 -3577338 -16241228 -24388000
$$ packed form
2940E782903Q78427o036445p971222m514206n24503P15706J88871j2687R05092
2931a0588064K687012L952490K708940o29758k303302j57924K422406J211747
2923f96453k132174k635089k2556J146820p71783k064244p7357K764037L306881
2914a181918K076550J089851M53882n31991j348081j470022j722739k715335l623677
2905h973480l889197m305264n002647m205935q12435L077147M080920J533957
2897a8496934j686794k226299M21173L533643M071487K114284P66574K062283
2889i440583M049442L332070k87816l423224l046640N72817M548938N892293L965071
2880F162368J355292J192907K693431J338004m852193j1467147j2663890q146772
$$ plain form
2872 -24388000 -26879912 -26125493 -24706552 -23808792 -22733207 -19372542 -13353425 -8361150
2864 -8361150 -7827450 -8573036 -3911988 5877127 12330810 10919823 8033755 10896176 16198004
2855 16198004 15795529 9816712 5928885 7251307 9249041 8947565 9471768 13206763 16790840
2846 16790840 16255995 12642716 9076632 5358006 -1239113 -11199519 -20881425 -24942169
2838 -24942169 -20629531 -11042688 -3496240 -2474413 -4943247 -5088177 -2256828 -526941
2830 -526941 -1674628 -3550629 -5298884 -8711004 -13154816 -14269196 -10002576 -3931531
2822 -3931531 -352289 398029 -164845 -1662229 -3429382 -3659552 -2591124 -3484369 -7943767
2813 -7943767 -13212918 -16425121 -18162556 -18899120 -15486683 -5592270 6319461 11936157
$$ packed form
2872b4388000k491912P54419J418941Q97760J075585L360665O019117M992275
2864h361150N33700p45586M661048R789115O453683j410987k886068K862421N301828
2855A6198004m02475n978817l887827J322422J997734l01476N24203L734995L584077
2846A6790840n34845l613279l566084l718626o597119r960406r681906m060744
2838b4942169M312638R586843P546448J021827k468834j44930K831349J729887
2830e26941j147687j876001j748255l412120m443812j114380M266620O071045
2822c931531L579242P50318n62874j497384j767153k30170J068428q93245m459398
2813g943767n269151l212203j737435p36564L412437R894413J1911731N616696
$$ plain form
2805 11936157 7919634 -1056520 -7869303 -9331931 -7273096 -5258776 -4855386 -4804874 -3810430
2796 -3810430 -2986806 -3886426 -5349782 -5449455 -5822039 -9781392 -15896157 -18424040 -15633724
2787 -15633724 -12758098 -14219178 -17495210 -17702548 -13968294 -7923966 -190147 7574533
2779 7574533 10998069 7944936 2143625 -2109781 -5396792 -9084464 -10029775 -5317986
2771 -5317986 964380 2362270 -688159 -2917498 -3767329 -7332454 -13122689 -14665038
2763 -14665038 -9008341 -1287026 2428802 1686848 -944274 -4088040 -6580639 -6260122
2755 -6260122 -2533844 2298311 5764819 6940281 5211354 802306 -2981671 -2084878
2747 -2084878 2463977 4663903 779882 -6813407 -13781310 -17985253 -18657493 -15962182
$$ packed form
2805A1936157m016523q976154o812783j462628K058835K014320M03390N0512R94444
2796c810430Q23624q99620j463356r9673l72584l959353o114765k527883K790316
2787a5633724K875626j461080l276032k07338L734254O044328P733819P764680
2779G574533L423536l053133n801311m253406l287011l687672r45311M711789
2771e317986O282366J397890l050429k229339q49831l565125n790235j542349
2763a4665038N656697P721315L715828p41954k631122l143766k492599L20517
2755f260122L726278M832155L466508J175462j728927m409048l783977Q96793
2747b084878M548855K199926l884021p593289o967903m203943o72240K695311
$$ plain form
2739 -15962182 -13121559 -14625194 -20028929 -23471536 -21657585 -18202519 -17276591 -17239745 -14544192
2730 -14544192 -10482836 -9284305 -11343366 -12661070 -10294357 -5171033 -140300 2206798
2722 2206798 514266 -4246386 -9083717 -11701142 -11998828 -10402286 -7072398 -3797480
2714 -3797480 -3450564 -5556911 -5758740 -2401971 -58366 -2682564 -6742704 -6445439 -3314283
2705 -3314283 -4050530 -9538014 -12976693 -10529221 -7374505 -9422244 -13866546 -13357105 -7226906
2696 -7226906 -2733834 -4604540 -8142248 -5550168 3460469 10988351 10405290 3060450
2688 3060450 -5470042 -12350998 -17553252 -19250207 -14274148 -4004807 4456097 5612851
2680 5612851 1731809 -663201 1275316 4452195 4111590 -1651103 -10551615 -17514213
$$ packed form
2739a5962182K840623j503635n403735l442607J813951L455066R25928L6846K695553
2730a4544192M061356J198531k059061j317704K366713N123324N030733K347098
2722B206798j692532m760652m837331k617425k97686J596542L329888L274918
2714c797480L46916k106347k01829L356769K343605k624198m060140K97265L131156
2705c314283p36247n487484l438679K447472L154716k047739m444302N09441O130199
2696g226906M493072j870706l537708K592080R010637P527882n83061p344840
2688C060450q530492o880956n202254j696955M976059J0269341Q460904J156754
2680E612851l881042k395010J938517L176879l40605n762693q900512o962598
$$ plain form
2672 -17514213 -18460368 -14241468 -9705334 -7832970 -6798491 -4190432 -1135508 620269
2664 620269 2864901 7781454 12303358 10762987 3245806 -3577228 -5292743 -5122620 -8007185
2655 -8007185 -12666737 -13204158 -7430241 -313617 1552691 -2725614 -7728213 -8156175 -4647749
2646 -4647749 -2013550 -2491064 -3575613 -3418798 -4779975 -10243810 -16028884 -15544198 -8628504
2637 -8628504 -2234672 -1065888 -2320910 -1583553 835334 2676947 4626160 7623864
2629 7623864 8091767 1843834 -7635265 -10670737 -3127791 7510499 10640567 4427516
2621 4427516 -3742158 -6769745 -4336400 -573561 1090291 -231989 -3413049 -5709631
2613 -5709631 -4178765 1200754 6436116 7386660 4573450 2524443 4275496 8153543
$$ packed form
2672a7514213r46155M218900M536134J872364J034479K608059L054924J755777
2664F20269K244632M916553M521904j540371p517181o823034j715515J70123k884565
2655h007185m659552n37421N773917P116624J866308m278305n002599m27962L508426
2646d647749K634199m77514j084549J56815j361177n463835n785074M84686O915694
2637h628504O393832J168784j255022P37357K418887J841613J949213K997704
2629G623864M67903o247933r479099l035472P542946J0638290L130068o213051
2621D427516q169674l027587K433345L762839J663852j322280l181060k296582
2613e709631J530866N379519N235362R50544k813210k049007J751053L878047
$$ plain form
2605 8153543 10435887 9596142 6948255 4273775 2180536 526081 -483934 30870 2618871
2596 2618871 5942948 7180083 5437929 4147067 7613031 14866813 19703625 18153034
2588 18153034 13322963 10746035 11203429 11028136 7983591 3624259 485295 -172488 1723474
2579 1723474 4589549 5132431 1878988 -1602122 -637752 3369322 4048871 -689374 -5470395
2570 -5470395 -6096793 -6465207 -12125360 -20416182 -23219971 -18360509 -11977534 -8980398 -7303604
2561 -7303604 -4098027 -2023236 -4723541 -9596679 -10561694 -6605171 -2438929 -976674
2553 -976674 -306006 897358 -40536 -5129045 -11281028 -13685954 -11141495 -5326758 2531716
2544 2531716 10875710 16170631 16409303 14829165 15594302 16665990 12097822 1581328
$$ packed form
2605H153543K282344q39745k647887k674480k093239j654455j010015N14804K588001
2596B618871L324077J237135j742154j290862L465964P253782M836812j550591
2588A8153034m830071k576928M57394j75293l044545m359332l138964o57783J895962
2579A723474K866075N42882l253443l481110R64370M007074O79549m738245m781021
2570e470395o26398l68414n660153q290822k803789M859462O382975K997136J676794
2561g303604L205577K074791k700305m873138r65015L956523M166242J462255
2553i76674O70668J203364r37894n088509o151983k404926K544459N814737P858474
2544B531716Q343994N294921K38672j580138P65137J071688m568168j0516494
$$ plain form
2536 1581328 -7688727 -10192728 -8312658 -7201945 -7943491 -8890314 -10019175 -12174915 -14475425
2527 -14475425 -15724679 -16319855 -16209775 -13760987 -9541873 -7779827 -9955884 -10320502 -3452828
2518 -3452828 5884615 7151564 -1844771 -11586139 -12892232 -6668174 580978 5574127
2510 5574127 8547074 8373847 2744546 -6963364 -14627283 -14759152 -7946377 139643 5224980
2501 5224980 8792119 14316263 19767862 17700681 5017117 -10755872 -18931135 -17237302
2493 -17237302 -11534698 -5991639 422592 7951799 13176647 14010257 12173411 8386386
2485 8386386 317342 -11458005 -20305882 -20883900 -16342118 -13608486 -13901878 -12698490
2477 -12698490 -7719675 -2003438 1145638 2110660 2522194 1751347 -1950182 -7693767 -11352765
$$ packed form
2536A581328r270055k504001J880070J110713p41546r46823j128861k155740k300510
2527a4475425j249254n95176J10080K448788M219114J762046k176057l64618O867674
2518c452828R337443J266949q996335r741368j306093O224058P249152M993149
2510E574127K972947j73227n629301r707910p663919j31869O812775Q086020N085337
2501E224980L567139N524144N451599k067181j2683564j5772989q175263J693833
2493a7237302N702604N543059O414231P529207N224848Q33610j836846l787025
2485H386386q069044j1775347q847877n78018M541782K733632k93392J203388
2477a2698490M978815N716237L149076R65022M11534p70847l701529n743585l658998
$$ plain form
2468 -11352765 -9972707 -6455103 -7659343 -16158540 -25818756 -28712730 -25063324 -21993652
2460 -21993652 -23044626 -24561630 -23262327 -20904465 -18764599 -14141483 -7148869 -4988494
2452 -4988494 -12579085 -23093434 -25622057 -19837075 -14886862 -14775983 -13762476 -7622703
2444 -7622703 -918753 812924 -639345 -763237 -265963 -2576330 -6370877 -6619724 -2355257
2435 -2355257 1685422 1880415 358461 1325247 5383352 9500064 11276447 11094196 9982816
2426 9982816 7159659 1158806 -7026194 -13689577 -16079336 -15068289 -13096859 -10777290
2418 -10777290 -7399078 -3876187 -2487162 -3321407 -3399057 -596902 3172153 4278418 2021265
2409 2021265 -628319 -787173 1285141 3539626 5476430 8425473 12248435 13824103
$$ packed form
2468a1352765J380058L517604j204240q499197r660216k893974L649406L069672
2460b1993652j050974j517004J299303K357862K139866M623116O992614K160375
2452d988494p590591j0514349k528623N784982M950213J10879J013507O139773
2444g622703O703950J731677j452269j23892M97274k310367l794547k48847M264467
2435b355257M040679J94993j521954R66786M058105M116712J776383j82251j111380
2426I982816k823157o000853q185000o663383k389759J011047J971430K319569
2418a0777290L378212L522891J389025q34245p7650K802155L769055J106265k257153
2409B021265k649584j58854K072314K254485J936804K949043L822962J575668
$$ plain form
2401 13824103 10856882 6076154 4654677 7373689 9639194 8275036 5621317 4572243
2393 4572243 3191004 -1623163 -7406794 -8090389 -2298198 4744337 8111876 8162735 7730635
2384 7730635 7902622 8114313 7557749 4842507 -1223120 -8607151 -11870136 -7310123 2568955
$$ packed form
2401A3824103k967221m780728j421477K719012K265505j364158k653719j049074
2393D572243j381239m814167n783631o83595N792191P042535L367539N0859m32100
2384G730635J71987K11691n56564k715242o065627p384031l262985M560013R879078
$$ [...]
##END NTUPLES=NMR SPECTRUM
##END=
