##TITLE=31Pdec_70-2025 
 CDCl3, 64 sc
 24.6.2025
##JCAMPDX= 6.0         $$ Bruker NMR JCAMP-DX V2.0
##DATA TYPE= NMR SPECTRUM
##DATA CLASS= NTUPLES
##ORIGIN= UXNMR, Bruker Analytische Messtechnik GmbH
##OWNER= root
$$ XWIN-NMR		Version 3.5
$$ Tue Jun 24 15:44:06 2025 Russian Standard Time (UT+4h)  she@DPX200
##.OBSERVE FREQUENCY= 81.013821
##.OBSERVE NUCLEUS= ^31P
##.ACQUISITION MODE= SIMULTANEOUS
##.ACQUISITION SCHEME= undefined
##.AVERAGES= 64
##.DIGITISER RES= 17
##SPECTROMETER/DATA SYSTEM= spect
##.PULSE SEQUENCE= zgpg30
##.SOLVENT NAME= DMSO
##.SHIFT REFERENCE= (INTERNAL, DMSO, 0, 198.062)
##AUDIT TRAIL= $$ (NUMBER, WHEN, WHO, WHERE, WHAT)
$$ ##TITLE= Audit trail, XWIN-NMR		Version 3.5
$$ ##JCAMPDX= 5.01
$$ ##ORIGIN= Bruker BioSpin GmbH
$$ ##OWNER= she
$$ F:/spectra/data/she/nmr/P31/2/pdata/1/auditp.txt
$$ ##AUDIT TRAIL=  $$ (NUMBER, WHEN, WHO, WHERE, WHAT)
(   1,<2025-06-24 15:42:48.06 +0400>,<she>,<DPX200>,
      <created by zg, POWCHK disabled, PULCHK disabled
       configuration hash MD5:
       00 E9 B6 7A A2 85 ED C7 34 08 36 98 17 FE 4E 26
       data hash MD5: 32K
       DB 10 9E 78 43 0A 40 ED C4 A9 A5 98 E0 46 AB D0>)
(   2,<2025-06-24 15:42:50.73 +0400>,<she>,<DPX200>,
      <Start of raw data processing
       efp BC_mod = 2 LB = 1.5 FT_mod = 6 PKNL = 1 PHC0 = 1378.941 PHC1 = 157.8952 SI = 64K 
       data hash MD5: 64K
       BF 5A E9 9E 02 CF 4A 77 F9 E1 CD 96 A8 41 A3 A8>)
(   3,<2025-06-24 15:43:11.78 +0400>,<she>,<DPX200>,
      <pk PHC0 = 79.12277 PHC1 = -216.4 
       data hash MD5: 64K
       D2 38 47 C5 F4 09 79 47 AE D7 83 78 2B F5 F2 25>)
(   4,<2025-06-24 15:43:22.50 +0400>,<she>,<DPX200>,
      <abs ABSG = 5 
       data hash MD5: 64K
       E2 E5 FB F7 D9 D1 F0 B1 2B B8 8B 7A BC 9D 39 73>)
$$ ##END=
$$ 
$$ hash MD5
$$ 0A 4E CF D4 1F E4 AC 1F FF 7B 71 A2 DE 86 CA 90
##$RELAX= 
##$RELAX= 
##$RELAX= 
##$RELAX= 
##$RELAX= 
##$RELAX= 
##$RELAX= 
##$RELAX= 
$$ Bruker specific parameters
$$ --------------------------
##$DU= <F:/spectra>
##$EXPNO= 2
##$NAME= <P31>
##$PROCNO= 1
##$TYPE= <nmr>
##$USER= <she>
##$AMP= (0..31)
100 100 100 100 100 100 100 100 100 100 100 100 100 100 100 100 100 100 
100 100 100 100 100 100 100 100 100 100 100 100 100 100 
##$AQSEQ= 0
##$AQ_mod= 1
##$AUNM= <au_zg>
##$AUTOPOS= <>
##$BF1= 81.014009
##$BF2= 200.13
##$BF3= 200.13
##$BF4= 200.13
##$BF5= 200.13
##$BF6= 200.13
##$BF7= 200.13
##$BF8= 200.13
##$BYTORDA= 1
##$CFDGTYP= 0
##$CFRGTYP= 5
##$CHEMSTR= <none>
##$CNST= (0..31)
1 1 145 1 1 1 1 1 1 1 1 1 1 1 1 1 1 1 1 1 1 1 1 1 1 1 1 1 1 1 1 1 
##$CPDPRG= <waltz16>
##$CPDPRG1= <>
##$CPDPRG2= <waltz16>
##$CPDPRG3= <>
##$CPDPRG4= <mlev>
##$CPDPRG5= <mlev>
##$CPDPRG6= <mlev>
##$CPDPRG7= <mlev>
##$CPDPRG8= <mlev>
##$CPDPRGB= <>
##$CPDPRGT= <>
##$D= (0..31)
0 1 0 0 0 0 0 0 0 0.06 0 0.03 2e-05 3e-06 0 0 0.0002 0 0 0 0 0 0 0 0 0 
0 0 0 0 0 0 
##$DATE= 1750765367
##$DBL= (0..7)
120 120 120 11 120 120 24 19 
##$DBP= (0..7)
150 150 150 150 150 150 150 150 
##$DBP07= 0
##$DBPNAM0= <>
##$DBPNAM1= <>
$$ [...]
##$SUBNAM3= <"">
##$SUBNAM4= <"">
##$SUBNAM5= <"">
##$SUBNAM6= <"">
##$SUBNAM7= <"">
##$SUBNAM8= <"">
##$SUBNAM9= <"">
##$SW= 400.765351723535
##$SWIBOX= (0..15)
0 1 3 0 0 0 0 0 0 0 0 0 0 0 0 0 
##$SW_h= 32467.5324675325
##$TD= 32768
##$TD0= 1
##$TE= 0
##$TE2= 300
##$TE3= 300
##$TEG= 300
##$TL= (0..7)
0 120 53 12 22 120 120 120 
##$TP= (0..7)
150 150 150 150 150 150 150 150 
##$TP07= 0
##$TPNAME0= <>
##$TPNAME1= <>
##$TPNAME2= <>
##$TPNAME3= <>
##$TPNAME4= <>
##$TPNAME5= <>
##$TPNAME6= <>
##$TPNAME7= <>
##$TPOAL= (0..7)
0.5 0.5 0.5 0.5 0.5 0.5 0.5 0.5 
##$TPOFFS= (0..7)
0 0 0 0 0 0 0 0 
##$TUNHIN= 0
##$TUNHOUT= 0
##$TUNXOUT= 0
##$USERA1= <user>
##$USERA2= <user>
##$USERA3= <user>
##$USERA4= <user>
##$USERA5= <user>
##$V9= 5
##$VALIST= <valist>
##$VCLIST= <CCCCCCCCCCCCCCC>
##$VD= 0
##$VDLIST= <DDDDDDDDDDDDDDD>
##$VPLIST= <PPPPPPPPPPPPPPP>
##$VTLIST= <TTTTTTTTTTTTTTT>
##$WBST= 1024
##$WBSW= 4
##$XGAIN= (0..3)
0 0 0 0 
##$XL= 0
##$YL= 0
##$YMAX_a= 42554
##$YMIN_a= -44033
##$ZGOPTNS= <>
##$ZL1= 120
##$ZL2= 120
##$ZL3= 120
##$ZL4= 120
##$ABSF1= 198.0616
##$ABSF2= -202.7028
##$ABSG= 5
##$ABSL= 3
##$ALPHA= 0
##$AQORDER= 0
##$ASSFAC= 0
##$ASSFACI= 0
##$ASSFACX= 0
##$ASSWID= 0
##$AUNMP= <proc_1d>
##$AZFE= 0.1
##$AZFW= 0.5
##$BCFW= 0
##$BC_mod= 2
##$BYTORDP= 0
##$COROFFS= 0
##$CY= -3
##$DATMOD= 1
##$DC= 0
##$DFILT= <>
##$DTYPP= 0
##$F1P= 0
##$F2P= 0
##$FCOR= 1
##$FTSIZE= 65536
##$FT_mod= 6
##$GAMMA= 0
##$GB= 0
##$INTBC= 1
##$INTSCL= 9.790993e-09
##$ISEN= 30
##$LB= 1.5
##$LEV0= 0
##$LPBIN= 0
##$MAXI= 10000
##$MC2= 0
##$MEAN= 0
##$ME_mod= 0
##$MI= 50
##$NCOEF= 0
##$NC_proc= -3
##$NLEV= 6
##$NOISF1= 182.463
##$NOISF2= 159.3651
##$NSP= 0
##$NTH_PI= 0
##$NZP= 0
##$OFFSET= 198.0616
##$PC= 4
##$PHC0= 1458.064
##$PHC1= -58.50479
##$PH_mod= 1
##$PKNL= yes
##$PPARMOD= 0
##$PSCAL= 0
##$PSIGN= 0
##$REVERSE= no
##$SF= 81.0140089999434
##$SI= 65536
##$SIGF1= 159.3651
##$SIGF2= -187.1042
##$SINO= 113.3802
##$SIOLD= 16384
##$SREGLST= <1H.CDCl3>
##$SSB= 0
##$STSI= 65536
##$STSR= 0
##$SW_p= 32467.5324675325
##$SYMM= 0
##$S_DEV= 0
##$TDeff= 32768
##$TDoff= 0
##$TI= <>
##$TILT= no
##$TM1= 0
##$TM2= 0
##$TOPLEV= 0
##$USERP1= <user>
##$USERP2= <user>
##$USERP3= <user>
##$USERP4= <user>
##$USERP5= <user>
##$WDW= 1
##$XDIM= 65536
##$YMAX_p= 391066230
##$YMIN_p= -3145869
$$ End of Bruker specific parameters
$$ ---------------------------------
##NTUPLES= NMR SPECTRUM
##VAR_NAME=  FREQUENCY,     SPECTRUM/REAL,   SPECTRUM/IMAG
##SYMBOL=    X,             R,               I
##VAR_TYPE=  INDEPENDENT,   DEPENDENT,       DEPENDENT
##VAR_FORM=  AFFN,          ASDF,            ASDF
##VAR_DIM=   65536,         65536,           65536
##UNITS=     HZ,            ARBITRARY UNITS, ARBITRARY UNITS
##FACTOR=    0.49542278885378, 1,            1
##FIRST=     16045.7642231865, 0,            0
##LAST=      -16421.768244346, 0,            0
##MIN=       -16421.768244346, -3145869,     0
##MAX=       16045.7642231865, 391066230,    0
$$ Real data points
##PAGE= N=1
##DATA TABLE= (X++(R..R)), XYDATA
$$ [...]
45924 27419 -59219 -125019 -96134 -13288 16305 -35048 -93058 -89054 -26147 50897 96903 87548
45912 87548 47557 46749 124801 232571 286551 263522 203764 145977 103349 78758 56128 2055
45900 2055 -76505 -110351 -63551 -14674 -64192 -186187 -264083 -264919 -276552 -356812 -445942 -469109
45888 -469109 -440727 -412282 -384784 -336322 -286916 -270596 -274002 -261248 -238731 -240777 -261340 -248941
45876 -248941 -172532 -61767 18733 16783 -73481 -199341 -277862 -260387 -170712 -73586 -18645
45865 -18645 -21139 -69477 -127903 -152435 -133457 -111450 -125377 -155757 -145587 -72779 22754 84524
45853 84524 93869 78416 79181 109751 143157 145392 121969 111489 125825 124757 71118 -15145 -90421
45840 -90421 -154876 -242122 -344791 -396621 -347231 -226262 -111503 -48044 -16337 28392 101374
45829 101374 174189 208396 197298 167582 140396 109028 69050 50544 86118 148499 157275 65794
45817 65794 -80384 -187447 -196099 -106836 46514 211403 320330 329609 268490 218356 226996
45806 226996 268007 296941 311373 325183 316571 253281 157152 88141 61310 36124 1855 9013
45794 9013 77871 135838 109735 39322 20086 52783 39899 -58259 -151482 -142041 -49936 36544
45782 36544 82246 114626 147939 168419 183037 216780 252968 229507 116392 -36294 -148322
45771 -148322 -187811 -187524 -200072 -248177 -306508 -321809 -256123 -116710 52114 196632 273121
45760 273121 263608 191628 107848 40810 -24203 -99895 -156597 -163597 -152661 -189886 -281560 -353542
45748 -353542 -338517 -248292 -144718 -73565 -47868 -64379 -103125 -125064 -101162 -46088 -7796
45737 -7796 -18301 -56458 -62378 781 95638 142862 120329 97213 130705 163502 95807 -52244
45725 -52244 -140785 -94924 -52 35851 30719 60920 111678 99126 11547 -76377 -125707 -170194
45713 -170194 -218629 -217327 -145749 -67461 -38238 -31406 -6305 11939 -15643 -62035 -78605 -80839
45701 -80839 -111568 -145438 -118422 -46221 -20924 -71436 -114647 -87649 -52644 -103612 -218957
45690 -218957 -285660 -249259 -163901 -92982 -33842 32394 76236 55580 -11846 -62296 -69785 -77851
45678 -77851 -135853 -227473 -283912 -266462 -220604 -230779 -315039 -383964 -333380 -172642 -19500
45667 -19500 44491 64164 120423 197988 212762 149960 90054 83717 80159 18408 -75520 -135941
45655 -135941 -150597 -144281 -110038 -31569 46516 49515 -24749 -101857 -137350 -161541 -200909 -221727
45643 -221727 -189764 -136333 -119690 -151111 -198330 -238492 -268052 -273717 -233762 -155383 -89166 -90203
45631 -90203 -158847 -225089 -214755 -142205 -102673 -141234 -173488 -101775 23507 55748 -38291
45620 -38291 -130356 -119644 -58601 -33187 -23879 25321 84035 88178 55983 42759 26174 -47753
45608 -47753 -135972 -138670 -57398 5663 6324 -3019 -1977 -39036 -104263 -92221 39925 176828
45596 176828 185619 80290 -23662 -56399 -30283 13986 32324 -5538 -67053 -69696 8840
45585 8840 86706 95197 78740 114451 192430 253676 296938 360388 427999 436320 358813 223963
45573 223963 77556 -21441 -20031 43190 32339 -111916 -249980 -210831 -33784 97117 128695
45562 128695 178834 293304 348549 265455 157290 154500 204938 175936 68769 -2329 6556
45551 6556 34182 37267 31330 13124 -51939 -149122 -205628 -184780 -122816 -54826 29547 129166
45539 129166 189277 158804 56597 -53173 -127947 -161509 -154145 -103743 -25525 42488 64093
45528 64093 34660 -10210 -15540 52096 170980 269450 276422 183682 62486 2142 17866 33081
45516 33081 -27264 -142565 -228981 -252813 -259230 -280785 -277099 -202004 -86898 -7092 12224 9108
45504 9108 16698 29348 37187 52319 86322 125771 142050 114477 45940 -28158 -52760 -2659
45492 -2659 73399 81372 -25519 -187386 -284705 -249938 -127630 -18735 25642 34326 41379 24287
45480 24287 -47106 -130772 -144000 -74991 -3595 5702 -22207 -30613 -10596 12975 31197 44432
45468 44432 39509 14811 394 17084 45253 67491 103290 160073 194123 175781 151698 172783
45456 172783 192955 121140 -41285 -195388 -270937 -279158 -242754 -163917 -80496 -67498 -142260
45445 -142260 -230687 -263335 -249789 -228594 -206262 -186933 -204235 -270966 -339199 -358427 -335976
45434 -335976 -295461 -219348 -92955 26760 58356 7112 -30356 18131 122645 199559 203153
45423 203153 153583 96516 54521 16497 -31629 -74191 -75523 -19885 76099 189077 299599
45412 299599 371738 357021 241980 72152 -88952 -207274 -274024 -283009 -237757 -166000 -106051
45401 -106051 -85561 -118431 -202087 -306879 -386198 -407802 -367336 -283221 -202444 -187900 -248554
45390 -248554 -297068 -244486 -130399 -74563 -96702 -96113 -41858 -49618 -183921 -305282 -247525
45379 -247525 -66387 38174 -1733 -81889 -138019 -222327 -344795 -405793 -355545 -286958 -284884
45368 -284884 -291796 -218189 -98842 -35160 -43546 -61398 -57221 -35104 34613 178668 321393
45357 321393 327062 169056 -17873 -89697 -47125 -3999 -37137 -105667 -112232 -20339 103012
45346 103012 167925 171879 195257 279623 357675 340771 239647 145104 106498 85752 32191
45335 32191 -47397 -108248 -122399 -96426 -54553 -18087 4936 12262 -8657 -71731 -159620 -225490
45323 -225490 -244339 -236156 -219606 -179901 -113906 -65008 -63532 -67701 -24284 40660 62622 49450
45311 49450 67614 122356 143598 110350 100648 174807 277837 308545 238496 122535 33840
45300 33840 19022 69257 106880 56162 -42756 -59972 41266 128316 75431 -59117 -126798
45289 -126798 -100456 -77491 -104922 -126162 -102619 -74240 -77633 -99146 -132161 -191809 -250222 -250526
45277 -250526 -214081 -231854 -302620 -286421 -97146 146365 257105 203902 100053 20069 -57263
45266 -57263 -143864 -197066 -197570 -186351 -195923 -206491 -194042 -171068 -155102 -133315 -79760 9245
45254 9245 98755 125539 53727 -55043 -74639 30199 131734 100344 -9086 -40917 19550
45243 19550 27124 -88280 -213476 -233438 -189394 -172025 -168451 -120318 -48048 -5945 17762 43765
45231 43765 11257 -123499 -248794 -210745 -47391 46907 -57 -56020 -20070 22888 -28602
45220 -28602 -108432 -96458 -23655 -21702 -112824 -185264 -170130 -124810 -122814 -156932 -185394 -200465
45208 -200465 -208585 -191792 -130799 -40394 45777 108628 148275 174433 201452 235129 260192 257824
45196 257824 231773 195564 145142 78180 29576 39296 84512 97799 62550 30050 21213 -16454
45184 -16454 -104784 -155029 -73378 91341 196923 192666 161121 165713 157288 79680 -16591 -45159
45172 -45159 -18334 -22621 -77284 -103193 -46190 38243 58694 3545 -54962 -52722 -1218 30229
45160 30229 -15003 -123125 -219162 -242363 -207589 -174948 -169536 -165569 -147812 -141194 -159925 -168845
45148 -168845 -129229 -55846 5672 38402 58870 81361 113557 172395 261434 336531 336957 259726
45136 259726 170281 127547 124824 117100 81532 30028 -23876 -85313 -158189 -215890 -211441 -132808
45124 -132808 -38787 -8560 -47758 -78981 -45774 11361 19216 -22166 -53531 -57663 -77883 -128048
45112 -128048 -148855 -85790 31781 124175 147806 118451 67848 9008 -56010 -110633 -116064
45101 -116064 -41855 87371 197301 241941 255935 292722 335114 325380 268976 231128 226009
45090 226009 197352 136826 127655 210126 285012 237189 99535 -979 -22084 -26388 -41152
45079 -41152 -15831 58540 94021 26715 -79073 -112929 -59903 2570 21381 16671 17823 7334
45067 7334 -48664 -141072 -212949 -210778 -133202 -31505 35131 47919 37759 49440 94581 136300
45055 136300 122457 39560 -68440 -140368 -149747 -109145 -43646 9988 -4109 -112314 -246512
45044 -246512 -287830 -206438 -104639 -78580 -91225 -46154 57622 131977 143021 153197 204770
45033 204770 243429 196993 75486 -45983 -107785 -101829 -60541 -32811 -40875 -46332 5416 95484
45021 95484 133920 74210 -23620 -77171 -83308 -93912 -129416 -166944 -188144 -188216 -153373 -76600
45009 -76600 11506 65494 70680 34981 -45954 -171358 -293877 -345307 -309531 -234000 -167614
44998 -167614 -123331 -101099 -101906 -105793 -76033 -7395 56462 69170 18409 -93003 -259188 -432993
44986 -432993 -516611 -449910 -299881 -204798 -215906 -243671 -189145 -82849 -37684 -84147 -123812
44975 -123812 -67126 41337 84463 27157 -51079 -73579 -56764 -60124 -89345 -90032 -25020 73219
44963 73219 130267 99105 7439 -56534 -18520 105702 214580 216532 121468 27860 20132 86673
44951 86673 139152 104844 -6423 -125280 -199163 -228913 -234140 -214934 -166860 -106112 -48150
44940 -48150 16491 84955 102062 17235 -121962 -200767 -179090 -137648 -151008 -179511 -141996
44929 -141996 -45914 25023 27513 -4172 -26904 -32284 -21436 7783 40152 56175 72924 125467
44917 125467 197025 215354 139246 8287 -114637 -207544 -264857 -252853 -147945 -6131 65651
44906 65651 25564 -53064 -71583 -19010 36281 50068 51094 79657 124822 155800 179806 215382
44894 215382 225899 148756 1856 -108621 -124534 -120634 -193554 -308300 -334641 -226395 -85622
44883 -85622 -29303 -56013 -82136 -64259 -33523 -25744 -28972 -14002 13506 19599 -3499 -16873
44871 -16873 13174 59513 63611 20082 -8264 21904 69663 68065 20166 -10463 2797 8749
44859 8749 -52808 -171621 -273984 -298106 -254014 -209961 -217058 -252233 -253634 -206518 -154354 -117274
44847 -117274 -57422 38145 97854 55814 -35056 -60459 -1768 46037 17994 -40583 -63584
44836 -63584 -63428 -95456 -168384 -237892 -268890 -270248 -275633 -304908 -336065 -315586 -215616 -78354
44824 -78354 19232 40489 7703 -37010 -56541 -26863 31852 50317 -8433 -80726 -81353 -32498
44812 -32498 -27782 -74299 -75529 7897 88185 86567 39649 5411 -45553 -156697 -268628 -272524
44800 -272524 -150942 7858 111567 123628 57134 -30361 -66618 -43187 -30948 -72754 -113685
44789 -113685 -96739 -66080 -93721 -156326 -178583 -156284 -135350 -105309 -27779 51970 45971 -26924
44777 -26924 -56159 -15277 3473 -41290 -64463 -3670 72420 81870 58678 74242 106737 90469
44765 90469 45675 55767 135243 210212 229367 221778 234988 271352 300613 298222 258636 192810
44753 192810 116630 30795 -75567 -186286 -245452 -211480 -109851 -5292 65665 107505 124739
44742 124739 103202 35303 -58631 -140558 -178801 -166871 -126337 -84593 -45875 4832 70225
44731 70225 134636 191543 246188 279997 248955 144338 26940 -33300 -34758 -28101 -35252 -22084
44719 -22084 46053 153212 250428 306014 322045 308132 259713 176060 88481 40152 29449
44708 29449 9806 -25215 4372 166735 391489 516891 475996 365346 299771 269467 196076
44697 196076 76434 -6517 -4 56972 93174 79699 33395 -21176 -72588 -111805 -111318 -32813
44685 -32813 121010 272673 332065 299928 261278 262253 257175 212925 192778 262589 363475 370937
44673 370937 262851 139266 76580 52099 31333 40362 102697 169889 177146 131072 85164
44662 85164 51222 -8061 -104452 -195047 -240376 -251512 -254286 -233909 -155980 -42424 15862 -45407
44650 -45407 -174122 -248800 -216292 -142331 -115177 -146537 -196633 -249506 -308085 -341336 -302842
44639 -302842 -203771 -114176 -80752 -84467 -86908 -73461 -36055 38848 131539 170618 96209 -62099
44627 -62099 -195679 -210354 -106374 26445 88884 57587 -4235 -24407 -572 13565 -12061
44616 -12061 -48346 -49728 14 90042 195926 275411 281583 206363 96107 6766 -42641 -61737
44604 -61737 -59290 -44802 -39155 -52365 -58916 -24977 41245 94473 111069 112977 120147 110999 63964
44591 63964 20887 58444 181662 287017 266323 125694 -32559 -124971 -138786 -87610 14562
44580 14562 120549 156312 98522 4543 -64480 -104990 -126129 -106357 -51612 -39399 -122972
44569 -122972 -227434 -232761 -143676 -81253 -105278 -145410 -133054 -105086 -125008 -175031 -189313
44558 -189313 -147137 -79021 -17835 9147 -23882 -103835 -165596 -161944 -121724 -97698 -87441 -56897
44546 -56897 -16048 -7024 -23035 -2188 82489 174454 201156 159941 106463 71594 25178 -63023
44534 -63023 -148286 -137198 -4992 146106 184822 93063 -29884 -92206 -85131 -39426 21215
44523 21215 60075 28309 -68398 -150373 -155348 -111564 -81064 -73944 -67076 -66109 -88199 -111823 -105896
44510 -105896 -89849 -104137 -133380 -119729 -51381 14748 21521 -38111 -133246 -213451 -221940 -140147
44498 -140147 -22779 50709 59596 44919 43780 63762 106203 159769 180322 136732 71848 53821
44486 53821 68832 38357 -44623 -80956 -5592 109735 150938 107386 60751 59212 65786 26296
44474 26296 -57148 -128893 -137836 -93454 -65229 -107123 -183246 -204640 -146213 -76530 -48059 -15594
44462 -15594 84595 216859 277082 228848 145364 110167 128864 156218 168095 177027 197029
44451 197029 219006 217709 171832 80502 -32217 -127096 -165981 -127865 -25379 90848 162404
44440 162404 171657 151140 137426 133345 129268 136312 164167 178023 124280 12822 -66190 -41252
44428 -41252 46956 93004 60345 15556 13623 7442 -74556 -199230 -258575 -224730 -185699 -197591
44416 -197591 -190855 -89573 47761 100000 54117 5035 8445 41363 103017 231621 389697
44405 389697 448780 351085 195545 94765 31423 -59278 -142859 -134864 -53240 -2426 -15145
44394 -15145 -17717 37679 105141 136200 151346 176917 182000 136263 82738 89327 148478 180627
44382 180627 137052 59225 26533 70749 155337 223286 247116 236184 216691 214377 236365 248895
44370 248895 194767 71964 -21691 15968 147476 220848 165685 84875 96872 166415 181136
44359 181136 134336 111417 120213 67973 -72979 -194089 -193716 -103410 -20480 10026 -5816 -56895
44347 -56895 -107087 -88116 16706 122590 140112 83634 22505 -30684 -103869 -169553 -158854
44336 -158854 -70516 14006 34142 913 -63086 -157296 -250825 -269964 -187549 -75607 -18612
44325 -18612 -12007 -487 13050 -34364 -158934 -282745 -318211 -262807 -183010 -131090 -111061
44314 -111061 -113052 -141895 -201820 -275362 -328947 -327977 -249051 -106696 22970 46310 -42475 -125813
44302 -125813 -82633 64575 173574 152687 49620 -40773 -88255 -107556 -90291 -26853 34464
44291 34464 23959 -56232 -132221 -154376 -143330 -134964 -128325 -102309 -45775 40118 135193 192359
44279 192359 179901 137501 136728 169967 141201 5083 -142320 -170188 -72346 43020 97347
44268 97347 107138 118375 150420 213870 314185 410387 427041 343725 230108 157925 119441
44257 119441 72712 24828 12775 29058 31342 15574 15989 34084 35188 25943 61607 145126
44245 145126 189766 135518 44130 8580 12205 -37322 -157911 -270911 -326415 -351830 -356162
44234 -356162 -292397 -171918 -120939 -227602 -390823 -428487 -311930 -188073 -171136 -219942
44224 -219942 -247800 -250360 -263122 -271730 -248778 -234145 -288653 -381010 -404141 -317943 -210737 -190556
44212 -190556 -261540 -340723 -363359 -332319 -280012 -222270 -156823 -84695 -19766 20373 33006
44201 33006 41669 80045 152050 212068 203468 124706 42683 24042 59408 75461 22447 -74085
44189 -74085 -156687 -200107 -206011 -163975 -70531 20653 33893 -18929 -23369 94560 254954 319187
44177 319187 272581 233518 280737 354112 357421 289288 219144 181547 156734 129701 106639 80536
44165 80536 33701 -23357 -57912 -62259 -58654 -59755 -64127 -86557 -141077 -187971 -155598 -37288
44153 -37288 85049 142468 153629 163378 163292 129164 88890 77208 53487 -46953 -187813 -251880
44141 -251880 -202242 -132742 -121239 -121493 -65475 2327 -14034 -109708 -188852 -212501 -235293 -283069
44129 -283069 -293938 -226237 -144093 -126267 -140609 -87015 54136 187425 221111 168036 113450
44118 113450 117262 163687 187234 138693 35547 -55786 -95078 -105449 -117357 -111045 -63206 -24747
44106 -24747 -77663 -210633 -314142 -326633 -313576 -353901 -411860 -392079 -281393 -158828 -83746
44095 -83746 -47741 -30257 -28272 -23710 10833 57366 63253 24570 -1324 10621 9773 -45985 -124233
44082 -124233 -181919 -235800 -306303 -340989 -276283 -150888 -71800 -69068 -66391 -12979 34622 6605
44070 6605 -63690 -83133 -36430 -16153 -101299 -246674 -325682 -272113 -146322 -49478 -2631
44059 -2631 51619 140449 210966 209268 159433 120684 96768 36948 -85192 -231575 -326217 -295510
44047 -295510 -115944 129216 272252 211145 31362 -84789 -64586 4376 20648 -19846
44037 -19846 -71857 -110407 -115327 -62875 19570 52845 5764 -62433 -99879 -132273 -181361 -189883
44025 -189883 -109731 -6227 19923 -23989 -52559 -47463 -70393 -138555 -186501 -164106 -90649
44014 -90649 -1045 82239 114400 54807 -46491 -75628 -8216 43364 -12712 -114639 -137928
44003 -137928 -66674 92 -15480 -94281 -167218 -182574 -131415 -50484 140 -6120 -31546 -25239
43991 -25239 5557 4757 -56821 -140651 -176342 -126889 -26835 37402 6025 -81693 -118144 -49495
43979 -49495 59983 109868 79399 26450 -704 -1121 15940 51832 95556 121464 122290 114210
43967 114210 100104 57975 -20656 -106064 -160485 -175876 -168681 -152446 -129705 -100679 -67870 -37881
43955 -37881 -24655 -41936 -85528 -132113 -163560 -183360 -199158 -199900 -170752 -129988 -125179 -174727
43943 -174727 -229206 -219319 -139967 -55775 -15712 2490 40870 89005 103312 75933 34901 -13601
43931 -13601 -86131 -160483 -173283 -104389 -16410 21634 11973 -2271 -7141 -17746 -39905 -77586
43919 -77586 -154080 -273408 -372966 -370219 -263115 -140493 -80339 -73174 -62855 -32546 -20378
43908 -20378 -57629 -116315 -132000 -76206 8115 54720 45884 13882 -19390 -65924 -128879 -177410
43896 -177410 -183225 -148199 -78159 29484 145996 205548 181606 132432 123944 140490 125097
43885 125097 78741 56135 77603 106519 109362 84262 34107 -37400 -106240 -152027 -193536 -252324
43873 -252324 -296453 -280051 -225607 -197481 -201089 -187497 -159680 -182664 -262347 -300514 -217713 -57872
43861 -57872 73062 118709 86290 10724 -46023 -12667 114791 244297 281624 229691 163585
43850 163585 139022 156967 186208 188912 150568 105825 104975 146224 183928 204232 226989 227603
43838 227603 146586 3024 -99227 -121207 -141321 -202981 -229301 -176909 -152124 -246091 -357137
43827 -357137 -332960 -213386 -159701 -194173 -196308 -135746 -114146 -164407 -198012 -186855 -211000
43816 -211000 -268954 -228356 -56114 77427 44987 -39476 -11299 84955 89433 -14186 -106026
43805 -106026 -136151 -154593 -167013 -122038 -38539 -619 -12012 19485 131847 251533 305446
43794 305446 290833 220063 101888 1670 13240 128351 224718 227202 196255 210883 249774
43783 249774 249246 205534 149650 77794 -20865 -107416 -132221 -105043 -70755 -38770 12197 79119
43771 79119 131668 149977 130334 77012 25655 43999 156822 287420 326367 252669 143212
43760 143212 69628 32249 -4566 -58131 -119624 -166300 -170057 -119918 -44956 6203 13910 -3490
43748 -3490 -28907 -67502 -118156 -147169 -113068 -16693 85066 124765 89310 35554 29473 71178
43736 71178 97495 60685 -17347 -74753 -67899 8629 127381 232699 268663 229480 163018
43725 163018 105769 41298 -55622 -166990 -252714 -291132 -270687 -185839 -80667 -41986 -86927
43714 -86927 -109705 -23962 87428 73311 -62200 -166249 -166774 -151070 -180730 -180529 -93320 -8471
43702 -8471 -14912 -34876 46358 159142 129442 -46978 -182850 -166949 -92071 -67154 -52928
43691 -52928 23447 108956 104786 40339 41366 142735 238852 231107 143304 63149 25393 -9141
43679 -9141 -83290 -183455 -251170 -246090 -188056 -125431 -72499 -11566 42621 32806 -57850 -158612
43667 -158612 -192644 -173230 -169149 -203137 -245499 -287386 -343377 -380131 -326278 -187021 -79724
43656 -79724 -98011 -181755 -185292 -58995 94878 148209 76190 -56925 -193949 -320084 -417245
43645 -417245 -440277 -371912 -277245 -255863 -327580 -397822 -359938 -212013 -48103 47200 63055
43634 63055 36538 8000 6084 35063 58522 24849 -71819 -178293 -245331 -278279 -302789 -305238
43622 -305238 -245504 -127051 -22025 -8209 -85876 -167617 -159116 -53294 64244 109922 85447
43611 85447 48276 23060 -12469 -60296 -78979 -45830 8340 53504 100526 151983 166471 127070
43599 127070 98520 140582 195438 154119 30413 -31709 47604 172649 208643 157527 125660
43588 125660 165614 233240 280026 304572 308106 273115 211987 181008 209237 249505 237087 174573
43576 174573 122906 119828 140131 134965 82221 -8355 -117110 -225320 -312682 -359360 -355391 -305392
43564 -305392 -221981 -115580 5111 118692 182486 155275 41804 -92766 -172287 -178933 -159415
43553 -159415 -157090 -159905 -136432 -103683 -116759 -187541 -259837 -292291 -326284 -421691 -545384 -587161
43541 -587161 -496324 -347209 -243938 -208372 -200245 -203930 -233577 -271291 -268781 -220974 -182816 -188941
43529 -188941 -199766 -160466 -83709 -35549 -52920 -109331 -159266 -189108 -219822 -275843 -354162
43518 -354162 -414994 -407976 -320893 -200197 -113146 -93112 -126087 -173219 -190105 -144870 -52395
43507 -52395 14587 -13600 -121774 -217581 -232321 -187650 -149159 -143962 -149448 -141693 -123270 -111132
43495 -111132 -121944 -163616 -218356 -238073 -180539 -54489 83800 176936 200427 164350 103829
43484 103829 61643 56598 69374 75092 78762 94031 101288 67627 6890 -25872 -12434 -2288
43472 -2288 -43690 -118762 -174027 -188400 -184773 -196645 -244180 -316214 -354664 -292758 -141603 -3321
43460 -3321 43712 38439 65361 125954 154782 142033 147799 185542 184332 106628 25342 22497 66575
43447 66575 62957 -3170 -47774 -10900 58368 58259 -50517 -196807 -259398 -184934 -53281 -3314
43435 -3314 -80190 -186914 -207897 -139094 -57503 -6749 20837 15470 -51194 -149685 -191353 -136752
43423 -136752 -53151 -28048 -65074 -103527 -111469 -116503 -153070 -210118 -235215 -183814 -70777 30067
43411 30067 57126 28286 8180 13344 -2489 -58646 -101507 -83973 -41560 -36197 -58024 -46353
43399 -46353 5252 29121 -22872 -115644 -178414 -181282 -147311 -112927 -91358 -62776 881 87998
43387 87998 136829 102976 28437 1994 49769 111667 137935 156282 210413 275647 286256 226635
43375 226635 146760 92302 62111 38600 20634 9075 -14486 -72863 -165530 -265675 -337893
43364 -337893 -356314 -319524 -256722 -209235 -195830 -200260 -195482 -169194 -119884 -44649 49728 131153
43352 131153 161803 137303 85972 22174 -72755 -199605 -293214 -270668 -135943 1004 35183
43341 35183 -24357 -81582 -71994 -20157 15751 18645 16005 29930 43293 13839 -80646 -206458
43329 -206458 -290022 -286163 -228176 -190666 -202389 -218361 -182048 -89389 19060 102836 139393
43318 139393 120557 60654 332 -23627 -15422 -13084 -42082 -84717 -98159 -61137 -2047 27142
43306 27142 12952 1924 37282 88326 84404 16788 -47640 -69120 -89039 -142497 -177009 -124877
43294 -124877 -17095 53111 60536 60091 74868 62687 13452 -7305 42776 108801 119097 88028
43282 88028 76819 88554 68734 -5532 -96290 -162738 -202223 -229911 -251295 -257474 -227106 -144340
43270 -144340 -38004 19162 -12512 -81384 -106913 -84629 -74046 -89162 -71302 7129 75418
43259 75418 50126 -46570 -106806 -66517 27591 86463 81184 55350 47847 33915 -36658 -155641
43247 -155641 -249413 -271951 -267689 -301529 -351453 -332176 -227047 -129486 -119802 -152552 -121782 -14092
43235 -14092 64880 23918 -101611 -198186 -208157 -178248 -176206 -197845 -187243 -131897 -88920 -99963
43223 -99963 -122887 -90170 -11231 36959 17989 -19714 -22163 -6292 -24648 -80434 -112975 -66617
43211 -66617 39043 111012 68119 -60586 -146268 -106459 -16968 -15904 -109585 -163157 -101091
43200 -101091 -15932 -21479 -88883 -116615 -94074 -85494 -92652 -58347 -1027 -21728 -145325 -259196
43188 -259196 -263091 -198496 -165056 -172092 -150821 -78874 -11406 12112 27608 85716 164963 184752
43176 184752 110127 14172 -2217 49463 41641 -98433 -268644 -310572 -210137 -89695 -18871
43165 -18871 52876 157904 225951 200565 143547 140053 170155 162571 119707 93882 79290 27427
43153 27427 -52897 -109684 -151232 -235003 -345958 -382288 -289486 -130997 2587 85095 128939
43142 128939 138828 127406 115704 85084 -5094 -113996 -112345 52047 243658 282191 162440
43131 162440 42904 31350 76666 86652 62311 64304 102527 124278 98828 66230 92219 192992
43119 192992 310508 359055 303772 199452 140508 160520 190619 135479 -10700 -143577 -153502
43108 -153502 -38246 102197 172694 163654 129294 117421 136625 168858 188306 180339 166282
43097 166282 197291 293583 397829 425191 360560 270254 213846 187803 171715 181920 239410
43086 239410 313830 346105 319251 271825 245126 247634 268869 295253 304592 272045 197753 116260
43074 116260 66883 58635 66509 56784 16613 -34612 -63455 -54399 -17257 38290 114355 192727
43062 192727 212885 125652 -24537 -112945 -62968 57566 105450 24615 -97510 -146461 -112880
43051 -112880 -73056 -67333 -59872 -24382 -5185 -52153 -137247 -189016 -186120 -159706 -117293 -32264
43039 -32264 84257 169855 197288 216131 266410 299606 244084 122715 42557 66663 143231
43028 143231 173283 115938 10931 -82355 -146138 -201809 -256606 -274342 -219285 -117965 -45072
43017 -45072 -47465 -113788 -214524 -320668 -374374 -308965 -139385 19154 72983 50165 31740
43006 31740 31888 15290 -4329 28465 111783 172992 162374 97609 10815 -83119 -153333 -153355 -82598
42993 -82598 -3267 25513 -1580 -53277 -86280 -54308 51282 162380 192962 149233 123620
42982 123620 166135 225739 240275 215936 182272 131867 52775 -25821 -65860 -65238 -42639 -17705
42970 -17705 -24521 -86289 -151034 -124342 -8178 68586 16725 -90113 -131356 -105476 -85861
42959 -85861 -75048 -23507 41630 37641 -27272 -53336 -13819 -930 -65157 -118502 -68093 37685
42947 37685 83159 54452 46480 119975 228166 290945 283999 235936 178378 129499 107884 126008
42935 126008 159299 145931 47547 -91968 -178229 -164174 -86772 492 85438 161652 188253
42924 188253 142055 79248 82297 157765 240119 282972 290372 271960 233543 209240 236763 296026
42912 296026 333084 345068 371620 398706 354853 225709 90057 5421 -62437 -145318 -184125
42901 -184125 -109610 35809 131821 113561 17389 -79596 -111881 -43338 105522 254118 330362
42890 330362 336981 319839 294947 252080 211233 218650 282426 351221 364646 304163 201279 117328
42878 117328 101362 140321 162005 113136 22821 -34407 -22169 35826 97205 133691 138767 134721
42866 134721 163425 249663 389808 591096 887458 1287229 1739650 2186431 2603707 2946074
42856 2946074 3099724 2973259 2619371 2193160 1798122 1444341 1146824 965955 918260 923644
42846 923644 890306 805506 705754 602971 483790 350703 224965 130060 97460 155914 278930
42835 278930 371590 357132 267391 207513 234064 305301 355443 377796 410250 463612 501510
42824 501510 492248 449979 410800 394778 418202 519784 728916 1016719 1338372 1736398 2331982
42813 2331982 3161593 4062051 4771409 5122695 5106265 4795768 4291736 3715160 3165702 2663764
42803 2663764 2181576 1733463 1384520 1170505 1061942 1005930 950436 839807 661922 502327
42793 502327 468751 544093 595022 548453 467559 414418 342469 204863 82390 89340 193969
42782 193969 247214 183769 92690 70006 91145 78309 36747 57477 191606 368287 460976
42771 460976 422716 327432 267407 244201 203039 150941 163955 259731 339066 307228 202172
42760 202172 138142 150933 163654 97488 -37361 -163854 -212909 -171996 -84752 -5890 49783
42749 49783 100674 145281 157547 144347 149601 172862 148784 56315 -17523 5553 70531 71055
42737 71055 15446 7447 79683 153913 171082 158031 144401 109838 50574 14140 20540 18875
42725 18875 -25126 -55383 3657 139770 266504 321752 318983 318779 368032 445564 465099 370059
42713 370059 223991 149540 171067 190270 139246 73096 62828 79064 59929 34212 81632
42702 81632 195816 274793 249395 157345 84392 78951 126608 170971 161008 105156 66526 81478
42690 81478 110247 98478 51145 4741 -31197 -50413 -14395 83322 153375 102942 -26197
42679 -26197 -107895 -111288 -123916 -189112 -241768 -245312 -272486 -372722 -455186 -404696 -253765 -139408
42667 -139408 -127156 -173472 -235473 -314014 -387574 -399350 -336342 -253285 -193246 -138820 -60702
42656 -60702 37419 138590 223050 243560 156233 7818 -75310 -39554 9728 -55404 -201528
42645 -201528 -270972 -191040 -58471 1974 -17274 -47077 -63778 -99780 -157523 -186532 -157756
42634 -157756 -108050 -85208 -85643 -79570 -71148 -87678 -116513 -104635 -38651 19673 14532 -19433
42622 -19433 -4497 64932 115268 103373 66255 39073 -6276 -91462 -162824 -168893 -165967 -249656
42610 -249656 -390406 -439618 -324154 -143672 -29277 13619 56523 111810 137035 139046 175272
42599 175272 249821 289895 245782 152829 70564 12955 -30015 -43580 -1205 91941 198376
42588 198376 285062 346384 396594 445208 474565 448923 361212 258815 195935 169423 135972
42577 135972 86164 58316 77865 130382 201070 285820 345666 313856 189946 74667 56763
42566 56763 104171 126076 106464 98163 101161 40860 -107613 -248374 -265945 -153403 2652
42555 2652 127506 200088 218450 187199 141584 134492 183519 260333 336249 399828 422144 359764
42543 359764 228618 129225 140782 215437 241268 196301 164551 194839 229505 206788 153293
42532 153293 116972 76975 -2292 -77894 -77916 -14293 40628 66594 92380 101313 51026 -13588
42520 -13588 10283 116550 175623 131634 88967 130490 174121 118759 27090 21026 65107 15104
42508 15104 -141541 -251134 -215674 -113955 -61996 -65765 -65649 -36496 15933 88603 154659 157799
42496 157799 84840 1669 -24891 -2349 23035 32788 32451 26149 32372 79846 145110 140090 18225
42483 18225 -138976 -200737 -135942 -31798 22766 17944 -10886 -43313 -78641 -112160 -133646
42472 -133646 -144175 -160423 -194509 -228225 -220495 -158897 -93593 -86768 -126543 -130435 -50267 61051
42460 61051 109730 59878 -49304 -156307 -221183 -240203 -244032 -266183 -296326 -285646 -213296
42449 -213296 -121093 -65624 -64512 -104309 -162346 -198098 -167034 -77788 1839 28569 29679 28651
42437 28651 -17694 -144250 -286409 -343884 -309140 -252622 -201233 -123705 -34649 -14476 -95596
42426 -95596 -204220 -253175 -237458 -207316 -197499 -214215 -249255 -279257 -284136 -278195 -284359 -280029
42414 -280029 -228749 -164510 -160077 -194472 -152823 -4040 124520 124830 65527 70511 122468 117660
42402 117660 61283 55453 107240 104675 7713 -81863 -92170 -88833 -131988 -142612 -20873 182128
42390 182128 327146 372387 386633 411040 420803 411247 409576 391153 288236 111043 -30100
42379 -30100 -64163 -44960 -53069 -84085 -92636 -86677 -103470 -126996 -103419 -25416 61550 131507
42367 131507 197328 252684 250919 167772 51594 -18821 -16694 10019 -1041 -50650 -72449 -14038
42355 -14038 86122 131342 78416 -17696 -79325 -82087 -36058 52614 154935 201910 159291
42344 159291 89028 67943 70289 11572 -103065 -166125 -115543 -10540 63447 83604 50876
42333 50876 -50169 -192056 -274949 -235292 -146754 -143162 -260509 -407913 -474448 -418346 -275168
42322 -275168 -128010 -53083 -53519 -64252 -47826 -40868 -65448 -57988 35750 145037 156379 86575
42310 86575 59830 111443 135335 61977 -24365 -14674 64276 104148 75506 44973 57054 81387
42298 81387 79209 57995 42992 36341 25548 12529 19382 68282 154145 236544 271468 254876
42286 254876 218500 183386 149060 135566 189162 311068 414526 402262 276529 132637 49530
42275 49530 25169 18186 9735 6553 11313 14830 10829 5577 12844 39896 75203 94286 84791
42262 84791 60817 43903 35434 18720 -15007 -52469 -67877 -41371 23391 90384 110217 65270
42250 65270 -5537 -39798 -10058 57327 114844 133043 113567 81607 67225 78027 84631 46798
42238 46798 -38003 -124654 -170008 -179096 -181998 -176165 -129987 -53848 -22696 -85016 -175458 -177256
42226 -177256 -67240 66220 159535 247513 357772 413467 330711 167030 67165 70218 71491
42215 71491 -10874 -127126 -187680 -180523 -148893 -118037 -96204 -96176 -107525 -93024 -53249 -43617
42203 -43617 -86492 -127544 -131384 -153713 -246981 -354844 -387753 -355406 -327421 -300808 -217547 -95972
42191 -95972 -27419 -33783 -34973 20055 85303 107314 92578 53585 -25315 -128194 -192498 -194586
42179 -194586 -176339 -152471 -80700 27364 64895 -21805 -127407 -124928 -42983 -2418 -28068
42168 -28068 -39449 -928 37301 45271 50573 54257 6593 -104153 -218239 -289054 -329882 -347542
42156 -347542 -304980 -198320 -112757 -142352 -281026 -432417 -505205 -471543 -360302 -227720
42146 -227720 -123339 -64094 -42680 -47616 -47342 20839 179993 333805 340787 197579 69542
42135 69542 88270 188179 211428 117458 6169 -28140 22804 125142 235149 287655 238194
42124 238194 135646 84892 117998 164617 168707 166212 211544 286001 326760 307258 246370 170447
42112 170447 106069 81821 96752 107299 77797 22170 -30971 -80493 -122269 -114510 -30980 73727
42100 73727 115552 89634 65008 70743 57847 -2377 -46200 7866 145306 260720 262999 147806
42088 147806 -17016 -147847 -199193 -193000 -194314 -238858 -288156 -272994 -175904 -52848 23820
42077 23820 28276 -9199 -38298 -32803 -9482 -2188 -11873 3600 70546 142528 137916 43008 -54785
42064 -54785 -61942 12799 77072 72497 33268 18906 32082 37896 35068 53999 88281 85937 28802
42051 28802 -29269 -37560 -19063 -20285 -29169 -7404 20043 -11403 -92109 -132164 -92988 -44491
42039 -44491 -46850 -50751 15990 121179 174401 166289 167937 201284 205444 149485 94930 108557
42027 108557 176271 244939 297380 338739 349037 303313 220971 154332 137786 171518 234348
42016 234348 287498 291307 249224 212448 211117 208319 158477 82111 36267 35359 54384 88715
42004 88715 144961 183501 146975 55612 -423 12010 20691 -35664 -109799 -119475 -64297 -2094
41992 -2094 52786 132410 234710 313648 349833 367769 376013 348277 279193 209299 175276 174016
41980 174016 189079 213514 235048 240116 243176 265302 273362 202460 67323 -13635 43191 173874
41968 173874 250549 236247 191402 161024 135527 110727 105252 108237 76810 3168 -70632 -119829
41956 -119829 -164747 -213397 -231228 -196899 -142530 -106620 -84271 -55233 -29742 -36213 -86591 -172672
41944 -172672 -268045 -320045 -282282 -180693 -105568 -105810 -129916 -105624 -34717 35069 88166 130666
41932 130666 133907 60730 -60330 -151178 -177699 -174443 -172367 -154385 -96089 -8389 76520 132478
41920 132478 146148 125013 99827 90026 71914 16459 -51058 -78482 -71569 -91548 -153936 -190306
41908 -190306 -142887 -47013 22146 45626 55554 62342 42880 -4764 -43303 -42461 -11032 27437
41896 27437 64261 96198 108613 93133 74738 92242 140494 155201 82300 -47473 -146252
41885 -146252 -171495 -163356 -171562 -191524 -198075 -193761 -178827 -116174 10957 134762 169138 128460
41873 128460 105786 133560 145637 92588 13732 -40545 -86389 -155332 -219321 -223586 -161075 -66811
41861 -66811 34358 130459 195215 201730 156355 94561 51803 44521 54883 33641 -39491 -97639
41849 -97639 -54112 57550 95627 5180 -89441 -63019 20835 7044 -118663 -224560 -241587
41838 -241587 -241331 -282825 -304386 -228575 -89374 13955 36416 3005 -52880 -111000 -151681
41827 -151681 -170102 -187465 -215024 -227951 -206212 -175708 -168694 -163292 -111679 -24426 23979 -8490
41815 -8490 -67746 -69447 -10463 24798 -27044 -130326 -202774 -214897 -196791 -166701 -114146 -57762
41803 -57762 -48631 -81043 -63808 60056 211590 265721 212545 150087 134917 133498 128615 172594
41791 172594 285337 373353 321489 135681 -57642 -138695 -87180 29987 125838 158114 155708
41780 155708 176887 229348 249107 175536 30582 -94210 -116847 -23164 128352 241241 242905
41769 242905 138961 2092 -99664 -149151 -156831 -129484 -83181 -55394 -71417 -115149 -157705
41758 -157705 -194545 -225587 -222104 -159611 -78226 -59729 -124979 -190606 -161549 -49457 39729
41747 39729 36413 -16562 -40371 -31667 -44126 -78147 -65641 16319 90871 87576 40468 15014
41735 15014 -7206 -82978 -185933 -238007 -249299 -311616 -439550 -529974 -509579 -411960 -267619
41724 -267619 -44466 222705 365272 270681 63454 -37134 7368 56077 34338 23869
41714 23869 93315 183007 214839 207573 212053 211138 158583 65770 -15199 -59228 -69636 -50207
41702 -50207 -25589 -51071 -143507 -230998 -233776 -176063 -148882 -166821 -139432 -10641 140189
41691 140189 189434 123243 39552 11444 16033 11956 19449 72996 137841 144322 91937 44990
41679 44990 17459 -54791 -187050 -269662 -197848 -31815 66214 41417 -674 38573 124356
41668 124356 172286 180643 207887 263420 299766 299855 298758 307384 275298 160979 1187 -124572
41656 -124572 -175942 -164690 -105431 -1963 113599 178495 169099 144248 178555 266125 333071
41645 333071 341154 328963 336175 335107 272578 151086 31042 -34321 -37781 -4003 36512 66758
41633 66758 96983 151299 227849 290165 313438 313215 303808 257078 139919 -25669 -176782 -270487
41621 -270487 -300930 -278844 -232517 -205097 -204246 -177275 -90757 -10745 -30441 -126588 -170467 -94666
41609 -94666 28730 100186 107525 93725 83565 94113 155112 254201 308640 261276 173066 150463
41597 150463 199976 223207 149855 13662 -103879 -147743 -103601 3165 106272 145812 137045
41586 137045 150664 207475 239544 182928 63173 -49783 -129753 -184450 -190373 -109420 34325
41575 34325 164305 249722 324856 384685 341598 153064 -66647 -157043 -110151 -60229 -76945
41564 -76945 -79508 8563 126985 174785 156053 134988 103820 7633 -124884 -191073 -162165
41553 -162165 -119792 -120206 -115262 -53272 19573 22245 -44048 -103797 -110444 -93808 -110201 -173576
41541 -173576 -237431 -241525 -182886 -123610 -104041 -79909 121 85623 82449 12236 3610 97237
41529 97237 173357 133339 47985 36863 88682 113792 111551 155092 236193 254390 169874 61740
41517 61740 13416 29494 89531 197116 333315 428960 435792 390691 375138 431891 531659
41506 531659 594174 544770 390001 231438 155794 123632 37321 -85519 -104106 46447 238920
41495 238920 300792 213379 96823 48391 73147 140192 219545 264340 229177 126661 24491
41484 24491 -25190 -24201 2486 40251 82294 122743 159447 187524 197783 201589 238923 326097
41472 326097 409647 418274 355915 292840 262208 224654 153907 95356 97388 132768 142926 128026
41460 128026 133185 164679 184314 181370 183573 188864 155847 88753 65532 132164 218689 221925
41448 221925 141820 72054 70232 100621 104707 70509 22854 -5658 15330 83961 134515 88657
41436 88657 -39619 -139789 -135543 -75534 -57814 -102898 -145959 -129103 -58900 13246 37232
41425 37232 7427 -17825 31756 140150 197329 132396 18826 -10573 68877 153501 147978
41414 147978 59149 -47305 -120198 -135549 -88838 -5113 70205 108622 110946 87444 57271
41403 57271 61257 129456 229724 293052 300281 297072 308084 291771 216242 132626 116946 160654
41391 160654 176346 114299 25842 -7646 24826 64543 67802 52382 54212 74549 97390 130724
41379 130724 183291 213542 165765 68705 28167 81277 121155 32117 -144079 -255280 -229507
41368 -229507 -137389 -69843 -37779 -13967 -3443 -30481 -92953 -161311 -204652 -207613 -180664 -152850
41356 -152850 -135585 -109397 -71207 -61430 -99944 -134804 -120889 -111363 -181114 -286258 -310796 -247654
41344 -247654 -211972 -257586 -305800 -294682 -272058 -277415 -251549 -150073 -45115 -17536 -33768
41333 -33768 -27435 -20152 -50799 -60033 26780 154253 204223 171284 142551 131552 72529 -26144
41321 -26144 -66016 -20519 11591 -45782 -148648 -225181 -272188 -311605 -329031 -305370 -251197
41310 -251197 -174977 -73598 22115 57490 34779 17184 28935 26654 -330 12807 98304
41299 98304 184225 198606 182133 220648 309046 359990 325938 245933 180164 149551 135865 104192
41287 104192 29490 -75312 -166989 -217970 -230850 -203407 -126954 -38915 -20146 -97690 -192618
41276 -192618 -207531 -130279 -15526 89363 154238 153962 110619 107769 189629 272509 231789 63221
41264 63221 -113016 -198979 -197204 -148027 -72125 4341 38014 18672 -10948 -9500 24507 79739
41252 79739 152395 224368 268569 295630 345348 406549 403622 310193 226327 271545 421610 525821
41240 525821 492475 389375 331345 325799 287842 182538 82098 65617 114053 142860 109191
41229 109191 41249 -24899 -84980 -135350 -150706 -119752 -73505 -53007 -69804 -113729 -169191
41218 -169191 -203465 -176933 -98851 -37302 -31065 -28024 30440 96240 69722 -36575 -83221 12416
41206 12416 152943 178460 58673 -95698 -186081 -222061 -260934 -307881 -309891 -232802 -115983
41195 -115983 -35971 -18236 -6840 56620 141277 159158 92830 35788 71294 153885 166233
41184 166233 74815 -30563 -57175 -16318 14768 714 -20761 -3751 46196 88862 104965
41173 104965 112302 128512 141698 132920 110817 98579 95735 85772 79825 109519 161872 167289 87061
41160 87061 -23074 -82228 -90856 -112688 -164667 -190944 -155840 -100572 -77519 -75216 -49172 2584
41148 2584 37015 26148 -13251 -43952 -39559 -1231 35048 18280 -66965 -176203 -250307 -274985
41136 -274985 -274352 -259645 -216231 -137050 -36134 74965 194828 307073 372423 360249 274857
41125 274857 145718 9301 -94570 -132318 -101017 -34306 27947 72294 112247 165264 230830
41114 230830 283651 292350 254860 204513 164064 112475 31884 -29472 166 104193 172729
41103 172729 140554 73030 66911 112648 118579 42944 -66616 -152261 -196400 -193060 -136797 -58315
41091 -58315 -16365 -28568 -48676 -29887 26133 94965 160309 204075 212913 215139 261099 339380
41079 339380 365407 291555 176960 99303 47814 -31461 -125800 -171569 -158394 -134840 -116146
41068 -116146 -70007 -3309 20784 -19275 -61722 -57060 -42550 -74057 -136892 -179228 -193603 -208388
41056 -208388 -227981 -236683 -238796 -241362 -218251 -149389 -80470 -80321 -142452 -191464 -193120 -197003 -252406
41043 -252406 -334795 -379236 -345779 -235333 -84775 36801 75443 58083 61967 96137 75328
41032 75328 -47197 -183370 -209404 -114021 19550 134245 215694 220103 95791 -109920 -255714
41021 -255714 -250588 -133505 2673 93166 91821 -26130 -200021 -297904 -259389 -168741 -128649
41010 -128649 -126159 -99695 -74455 -119251 -197791 -186892 -58620 61610 60757 -18512 -51463 12384
40998 12384 122067 208962 236217 189202 79347 -38500 -95175 -71183 -16627 -184 -44870
40987 -44870 -114429 -156255 -152616 -126049 -100354 -78706 -69307 -98275 -159935 -180390 -92307 52014
40975 52014 107073 4546 -148663 -183935 -57414 111715 171719 77731 -81801 -164714 -89671
40964 -89671 95607 252630 272205 161662 17126 -72158 -83602 -49364 -11341 12797 29807
40953 29807 39820 16044 -63201 -166712 -228072 -219097 -172992 -124457 -69041 -5626 26464 -742
40941 -742 -43263 -29539 43979 108335 111369 68540 20766 -14290 -29651 -1404 92518 230325
40929 230325 343901 369006 300187 193696 111141 64963 32132 12373 36753 105285 153843
40918 153843 119573 20590 -66429 -98565 -99363 -100670 -90572 -35756 65411 169329 221117 197329
40906 197329 120804 36574 -26523 -66979 -88998 -87496 -58670 -7625 59274 128991 167514 146559
40894 146559 97882 99264 177291 261449 273214 226990 194901 199988 203242 180871 150922 124134
40882 124134 89383 59074 74561 144759 218933 239784 194827 108822 20936 -25963 -16627 5154
40870 5154 -19251 -75309 -83215 -17271 37923 -4740 -110817 -162112 -99975 17149 92588 87012
40858 87012 32988 -14810 -32870 -41820 -66179 -84681 -46495 52263 142964 163892 133728 105099
40846 105099 74984 6300 -69075 -49894 96137 254714 286684 197051 116838 125991 168695
40835 168695 167368 150056 200984 320075 409894 406402 354306 323997 308809 253833 155619 77803
40823 77803 72307 126843 193713 238783 258099 273459 315747 386999 434338 389690 250159 100691
40811 100691 39895 88092 173874 205227 152663 71312 44757 104043 203869 278845 310423
40800 310423 328632 360692 396193 401854 360966 297862 260583 268247 281649 249256 176832 113994
40788 113994 72035 10638 -75450 -121447 -88547 -37977 -48266 -104278 -138152 -140570 -147158 -142359
40776 -142359 -77313 16358 28233 -87870 -243660 -315032 -255929 -104923 55577 134702 99532
40765 99532 26816 22459 76748 80024 631 -53732 -1034 86267 95184 38740 15603 53651
40753 53651 91742 95696 103354 150533 216430 253818 235671 172455 110839 104037 158619 225955
40741 225955 261328 260519 223599 135012 13980 -69355 -76821 -53305 -42605 -4839 112213 262694
40729 262694 347476 347543 333473 352917 381490 380022 333883 241044 125866 56348 76617 126891
40717 126891 108205 31167 16626 126853 276240 348192 331608 290379 253064 197846 119122
40706 119122 47071 2624 -24799 -47678 -55602 -31534 19186 66801 85792 82585 87760 117816
40694 117816 152344 153634 101519 8309 -86781 -137263 -123689 -72902 -24445 17166 65254 95365
40682 95365 61998 -21674 -83976 -95547 -102325 -127795 -122019 -60566 -12469 -31599 -51714 13545
40670 13545 122677 166758 135219 103755 87140 36115 -26007 -3196 112085 204361 205591
40659 205591 188453 234791 310575 337789 309341 265373 223234 194707 211271 269203 304895
40648 304895 284946 264953 294929 324540 283219 209885 208541 291007 353154 315746 216746 142539
40636 142539 123100 126342 120877 108096 100661 94396 71295 25650 -23242 -50804 -52794 -44437 -45517
40623 -45517 -75196 -139606 -203436 -199369 -101434 28986 107536 118023 100199 76949 52717 58389
40611 58389 120662 196277 216161 192094 195292 229521 226045 180280 179522 248097 272891 158346
40599 158346 -28021 -148670 -170923 -164113 -170567 -166410 -124586 -43551 69763 186736 245541
40588 245541 207627 114077 45772 42757 87977 136513 131648 37950 -99297 -169981 -119000 -11267
40576 -11267 60827 82792 83652 55783 -21803 -122074 -199239 -246036 -264196 -221841 -109713 -581
40564 -581 24640 -15419 -36837 -5174 48043 88963 91866 25516 -88919 -142838 -58299 82592
40552 82592 126210 53840 -436 62434 198923 311632 349652 300897 174441 24055 -78545
40541 -78545 -118302 -127444 -100015 4090 158475 265159 283895 286970 345677 435185 495757
40530 495757 518333 516035 471148 372604 264924 202419 181368 162260 134696 121267 137117
40519 137117 175377 212571 209181 134315 10621 -95798 -145591 -147188 -96301 40569 239907
40508 239907 380518 363809 246435 178873 219689 282114 274704 223457 212424 250896 263440
40497 263440 206175 136308 137781 206157 244776 173503 16809 -118671 -138746 -41661 72682
40486 72682 84260 -20807 -114292 -62129 112913 270534 349227 421135 519812 537964 393739
40475 393739 204134 158598 269311 383027 412657 409107 404254 343842 223209 146218 169311
40464 169311 201108 151006 83959 116508 224123 275221 231970 201870 277902 417374 512365
40453 512365 522026 497768 507315 562249 608283 572639 430481 236196 87393 50477 113401
40442 113401 206034 269653 308074 360790 426361 441448 356268 204703 69287 -577 -2895
40431 -2895 51392 132027 170714 119307 28372 4650 80290 180519 231464 242357 263521 315670
40419 315670 380506 416026 370066 230911 76072 12213 50663 105254 131441 188905 323990
40408 323990 464912 501848 424213 313083 231447 185863 172660 195115 236877 268424 284059
40397 284059 299500 316661 322913 320601 323080 319990 280830 207087 153861 170789 229544 247786
40385 247786 204599 195751 318923 514397 596494 472669 261798 143581 153875 199759 219202
40374 219202 226359 227069 194901 133461 78835 39088 6873 21333 127205 274173 351387 329417
40362 329417 276753 231433 160183 61103 -1694 517 21299 33427 70065 141432 206533 258389
40350 258389 335640 417962 424219 357916 332686 393330 434154 371938 280745 259410 271754 227169
40338 227169 132282 52783 -1476 -46430 -44899 37099 150101 230974 295129 369462 400986
40327 400986 336525 236677 204882 249984 315321 388589 477056 527452 490160 428489 449214
40316 449214 546658 618486 614249 571501 528855 499308 506907 556544 590452 563995 534434 579043
40304 579043 657343 662362 588051 535184 557764 608587 639841 659328 673198 656795 604119 549434
40292 549434 530805 568718 660200 752266 760039 666526 562718 532251 550085 559741 581315 652309
40280 652309 724245 726634 688786 689510 722152 719503 686172 697226 776081 865066 908491 895491
40268 895491 844906 806472 831239 884551 861785 759061 727943 858543 1013994 1017886 916906
40257 916906 900518 1028390 1200448 1344861 1470178 1566056 1610518 1654104 1759887 1891621
40247 1891621 1987121 2088968 2267963 2484531 2672822 2879029 3142271 3323456 3260349 3034121
40237 3034121 2872993 2844335 2857199 2912260 3104365 3409739 3721685 4079002 4594761 5149948
40227 5149948 5423921 5274746 4863371 4377540 3872383 3414878 3128827 3017777 2946145 2850463
40217 2850463 2785754 2749272 2669003 2578798 2584621 2650277 2645012 2598847 2663400 2829375 2951525
40206 2951525 3041454 3239500 3500056 3624097 3614229 3666402 3798760 3846613 3845803 4030876 4403779
40195 4403779 4704385 4871726 5120698 5492530 5773719 5953105 6293875 6837286 7317027
40186 7317027 7695440 8276865 9139769 9992029 10760832 11762609 13100201 14499522 15964237
40177 15964237 17943174 20588076 23517018 26579170 30131333 34318171 38950185 44390408
40169 44390408 51563199 60774250 71790072 85560163 104377322 129839664 162775206
40162 162775206 205815779 261750732 324765424 375405935 391066230 364732717 311144826
40155 311144826 253169834 204598958 166825727 136989157 113770589 96274813 82440066
40148 82440066 70643752 60925698 53533196 47660651 42382951 37643462 33617258 30020476
40140 30020476 26630628 23719915 21463310 19534470 17669144 16051688 14819674 13730946
40132 13730946 12617025 11658580 10941223 10216424 9356539 8597785 8092967 7645457 7108054
40123 7108054 6637862 6339719 6045413 5656227 5335815 5165179 4963162 4636717 4355563
40114 4355563 4197028 3977703 3632622 3402401 3423089 3465130 3309683 3072461 2924300 2793088
40104 2793088 2588572 2443858 2476329 2549081 2510025 2444649 2470591 2512840 2512417 2628253 2979517
40093 2979517 3391239 3655683 3870646 4257823 4788531 5234113 5464118 5471842 5232735 4774182
40083 4774182 4292834 3988595 3851607 3773281 3750102 3796804 3791448 3633917 3466670 3507513
40073 3507513 3713887 3820358 3676363 3361931 2999150 2633749 2301376 2049819 1869861
40064 1869861 1707242 1545480 1403306 1280397 1174980 1104081 1039107 896412 671823 498199
40054 498199 474937 527962 539692 519909 525341 506332 386812 233104 187697 266940 358886
40043 358886 397769 417938 452033 487490 516466 539968 536672 500792 482027 518539 569082 578701
40031 578701 561500 548319 515370 450030 424943 504254 618401 631113 507573 340285 235379
40020 235379 233457 304337 367193 361904 337077 395569 520585 566203 476711 381411 379969 375969
40008 375969 257560 113409 97099 172286 178767 90210 21701 18000 12888 -15670 -13335 32151
39996 32151 84658 159129 283266 378106 334890 204093 142509 166207 132322 -1915 -82402
39985 -82402 8457 176573 269253 281057 301949 351093 373222 351206 327750 332430 349716 352729
39973 352729 333240 303764 283755 275898 264008 251536 274588 338930 377788 331553 243214 204626
39961 204626 226652 240105 215520 195903 200752 177675 80347 -56765 -148778 -141077 -57516 13709
39949 13709 2969 -52167 -45417 41833 93642 27021 -76735 -102166 -81418 -114234 -163501 -94782
39937 -94782 89637 219348 189121 84508 28214 24324 17520 5034 14902 40356 58117 67082
39925 67082 70529 61215 45254 38712 37232 40390 93122 226789 367736 399294 322752 258196
39913 258196 266574 273841 206462 101156 26826 -15500 -51140 -58876 -6280 86622 171607 227619
39901 227619 258052 268445 274594 299690 342484 374081 369441 315874 212518 107144 96432
39890 96432 212904 340029 332707 203258 87772 49335 37491 32779 84305 181132 231103
39879 231103 210645 199432 216791 165954 10328 -132020 -155614 -103598 -46743 44216 193960
39868 193960 310254 310628 268337 294807 351841 320395 199022 96658 68483 86120 135435
39857 135435 219079 290650 309414 338326 465815 645888 737774 696214 601165 502764 370181
39846 370181 214830 132593 168923 240710 250826 204819 160439 127664 80613 26745 6136
39835 6136 35394 85798 113689 103938 88978 113144 164067 170463 103827 44372 80767 167139
39823 167139 163884 28162 -115967 -129531 -20697 86463 104235 56007 15320 11419 9714
39812 9714 -22902 -54323 -17402 92824 192252 206081 160512 136658 160281 186970 182329 165093
39800 165093 168397 195225 217091 198783 136418 86146 124341 252608 381290 445447 490209
39789 490209 583446 690189 716520 651235 570246 506610 414748 282528 185393 181412 217450
39778 217450 192529 75652 -78687 -198391 -241298 -205058 -128928 -70781 -51348 -27204 60818
39767 60818 213660 356085 391354 281204 87060 -71101 -114101 -64679 -5691 7698 -17711
39756 -17711 -42790 -33099 16997 69555 68028 5112 -52268 -37132 36896 102231 121789 105798
39744 105798 67859 18172 -11489 6994 47544 53252 11632 -38061 -69721 -91836 -101690 -72355
39732 -72355 -845 74345 121435 148370 176738 212367 247417 262630 228237 136552 32322
39721 32322 -26100 -34897 -37393 -54197 -66112 -64980 -69067 -78434 -64328 -19137 25921 49487 66227
39708 66227 86879 90936 61149 13213 -30958 -73116 -121665 -167181 -194663 -204090 -201400 -178691
39696 -178691 -119685 -29771 42723 33753 -61721 -152248 -135658 -30129 40687 17053 -15926
39685 -15926 35305 135313 198016 228591 274316 284659 160451 -62861 -213491 -190131 -64923
39674 -64923 42686 90175 80505 13597 -78671 -131439 -128679 -119298 -123959 -105979 -62792 -53114
39662 -53114 -91273 -107582 -65783 -30329 -58354 -111583 -138970 -159353 -188937 -172668 -75746 28802
39650 28802 54684 22404 -1775 -20756 -61263 -73533 6969 130689 177874 116732 24298
39639 24298 -32893 -45530 -4916 98985 217617 268771 235532 174772 125521 75215 17817
39628 17817 -21310 -27116 -10508 14735 24244 -28382 -154662 -279420 -311712 -255968 -190396 -154097
39616 -154097 -127653 -107526 -115077 -136392 -135194 -124887 -146382 -175068 -139602 -42265 31284 41175
39604 41175 40272 63391 63046 4131 -57685 -53614 210 40927 52720 71111 124750 212318 309887
39591 309887 374032 370773 325844 309218 344625 372283 328575 228449 143252 126597 179869
39580 179869 258453 298424 271514 220662 201419 192889 129039 19444 -45244 -32506 -23188 -80899
39568 -80899 -152564 -167043 -155174 -181663 -215844 -176879 -79585 -27507 -59068 -95418 -62937 11076
39556 11076 59712 71433 77784 85381 70606 30180 -3674 -6611 3307 -7810 -38418 -52707
39544 -52707 -38999 -33682 -57827 -61780 11033 119137 153390 80222 -22516 -98607 -195795 -355369
39532 -355369 -494803 -493263 -357529 -212592 -141293 -114440 -75201 -12396 59986 124362 142790
39521 142790 83578 -10794 -41188 30743 131763 177236 174663 182647 206406 196858 143241 105594
39509 105594 134873 199440 224445 189257 149459 156619 192249 210673 220470 267066 330979 307990
39497 307990 133802 -109356 -262145 -248664 -127718 -3234 66194 77503 61087 64144 116266
39486 116266 190788 220376 161476 33785 -95428 -151144 -99506 8672 66927 32600 -4703
39475 -4703 63573 199155 249201 155466 41465 47333 150616 212315 150674 5870 -133064
39464 -133064 -202215 -183166 -106049 -28825 16017 34662 14034 -90807 -255788 -335768 -215185
39453 -215185 11113 119522 34167 -83472 -60570 71216 157859 142150 98305 83268 64535
39442 64535 13267 -16101 48947 190236 300255 289865 178173 76848 87408 206284 330641
39431 330641 361966 293985 190479 101063 31087 -20377 -41041 -32811 -19273 -10704 3132 9504
39419 9504 -33436 -124502 -180338 -122776 12611 111389 119265 88834 80200 78375 43301 -8687
39407 -8687 -27467 -10019 -5793 -42847 -88820 -92989 -40562 40993 110684 147051 167035 205628
39395 205628 260091 271853 198147 89735 48492 102419 173108 184657 152251 128380 111252
39384 111252 64606 20 -26776 2256 46684 73336 88268 90697 52899 -21347 -65028 -22630
39372 -22630 67111 108264 58011 -36142 -100998 -101499 -42143 52172 138151 164337 105968 -12903
39360 -12903 -139517 -229743 -266905 -260025 -233359 -210184 -199617 -201006 -217094 -249803 -281706 -278573
39348 -278573 -223033 -140319 -80844 -76075 -111833 -140859 -121100 -48689 40471 100222 105692 61472
39336 61472 -8126 -71212 -104048 -107052 -95767 -66564 8030 125905 219608 221056 159979 142882
39324 142882 212311 278526 237130 120174 65975 140285 246235 236710 79529 -118681 -228826
39313 -228826 -206619 -99395 9825 54869 19635 -48935 -71931 -10842 90640 157007 167791
39302 167791 164938 177289 186812 188750 227861 320906 383711 313196 132747 -21486 -68160 -58521
39290 -58521 -65358 -77071 -52414 -9596 11462 27735 75994 128010 122868 68237 30505 28805
39278 28805 18542 -12648 -14792 32746 74368 65046 42667 61215 98692 93968 50663 41880
39266 41880 109562 201733 221669 121089 -55286 -203424 -243815 -186934 -111957 -75837 -61469
39255 -61469 -28099 13038 6931 -68036 -163101 -208805 -185011 -131369 -95899 -83050 -56279 10472
39243 10472 95218 153807 178022 208523 283907 391725 480057 508984 482177 433419 390053
39232 390053 350371 295223 217198 128693 42601 -34215 -79265 -53899 47972 166871 225213
39221 225213 202127 137956 76361 29019 -14361 -68710 -131540 -154413 -70950 103033 238898
39210 238898 235973 160285 149463 200907 179288 47529 -54627 -30172 7599 -99180 -310787
39199 -310787 -447391 -437075 -368737 -315672 -245034 -126796 -16630 23110 9177 -6125 -11198
39188 -11198 -25435 -53180 -82643 -101304 -89238 -29223 53959 95688 59143 -20410 -77730 -84123
39176 -84123 -58247 -33814 -33508 -55465 -67986 -33131 46086 110516 94394 -5681 -115858 -147146
39164 -147146 -82619 -197 8049 -62433 -134519 -157320 -162102 -189358 -212396 -182548 -114641 -67576
39152 -67576 -56131 -36633 26715 125300 223596 271131 219313 81025 -45041 -71096 -27469
39141 -27469 -8848 -31091 -25229 27620 50721 -11188 -108474 -157552 -132555 -55251 42461 111413
39129 111413 103951 42602 16634 71191 151589 191365 192344 173006 106732 -21852 -153835 -224534
39117 -224534 -255922 -305422 -353966 -328849 -227800 -140772 -136618 -187114 -219880 -204210 -169227
39106 -169227 -164879 -213437 -282417 -309107 -266118 -188915 -125190 -84582 -60513 -64819 -100534 -129051
39094 -129051 -110933 -60551 -18172 10649 40903 53641 11263 -79270 -167356 -220523 -244975
39083 -244975 -252798 -251290 -256406 -272956 -269633 -217669 -143315 -94119 -66473 -22984 30212 52188
39071 52188 51452 84273 153929 189399 156471 117428 132206 163172 141211 79883 49557 61203
39059 61203 51217 -16790 -100498 -148088 -167407 -192280 -211417 -173676 -62021 67920 136555
39048 136555 116668 50380 -3506 -23050 -19784 1247 55412 148105 247674 307621 316633 309874
39036 309874 317863 316947 258767 151980 79018 105086 194831 253490 232237 153204 49784 -59438
39024 -59438 -140662 -153887 -108289 -55086 -12005 46601 111459 125080 77316 37270 47040 64443
39012 64443 66720 118910 251290 352264 302762 164925 111738 198245 322408 388057 377938
39001 377938 282504 105561 -46572 -33312 118560 214735 146557 14469 -62094 -116490 -217987
38990 -217987 -308704 -292109 -203865 -158457 -172925 -168669 -119410 -79005 -72698 -67298 -53316 -65118
38978 -65118 -106921 -134649 -128055 -122508 -155025 -219304 -274084 -264402 -158297 -8091 56607 -37608
38966 -37608 -200503 -269727 -195194 -69000 8139 14004 -28913 -88766 -119400 -95134 -59888
38955 -59888 -74325 -114077 -100353 -36509 -19027 -85770 -148007 -122472 -49147 -15003 -27507 -35100
38943 -35100 -23255 -15156 -9334 10958 24590 -3496 -50995 -52775 5499 58768 45892 -12813
38931 -12813 -44475 -13972 35147 32519 -35013 -106310 -121905 -97983 -94911 -124135 -133034 -88039
38919 -88039 -21592 25632 60283 97667 109041 57239 -38141 -118013 -153578 -159774 -152543 -133753
38907 -133753 -109388 -81998 -31964 50314 115797 89653 -33097 -164149 -215724 -190954 -161733
38896 -161733 -179478 -229395 -257848 -224338 -134530 -38472 7050 -15243 -76759 -145625 -222823
38885 -222823 -322536 -424920 -470818 -414065 -271024 -109172 8207 56492 39247 -26442 -100517
38874 -100517 -124558 -73985 -90 18563 -25680 -55960 -11053 76084 125965 107883 53223
38863 53223 -929 -37521 -44178 -22287 -9350 -41325 -83310 -51135 69003 167144 125018 -33086
38851 -33086 -154729 -130641 -14382 49389 -5857 -101797 -119674 -43549 28891 13141 -62395
38840 -62395 -105730 -79336 -24127 21768 68237 120229 136623 87883 20322 5576 36601 30550
38828 30550 -55040 -156720 -180817 -112792 -20642 33617 54010 81850 128898 152636 100690
38817 100690 -19797 -124421 -118352 11807 177670 262215 211617 65537 -85187 -171099
38807 -171099 -190918 -190296 -190619 -159091 -75493 -4050 -38859 -171714 -279206 -274018 -212624 -202565
38795 -202565 -250404 -271603 -224707 -157102 -119404 -108226 -109091 -130099 -163297 -165482 -115659 -56714
38783 -56714 -46385 -91543 -155739 -206651 -233268 -239501 -240063 -240414 -210287 -111385 33638 141026
38771 141026 159028 122124 87661 65726 47963 55687 104848 159753 176844 161859 128425 42152
38759 42152 -116134 -262709 -283700 -191869 -116415 -125384 -153975 -136757 -109990 -122281 -128023 -57106
38747 -57106 57560 111034 66577 -9461 -46307 -35281 4951 64058 118999 128030 80545 25505
38735 25505 18957 56939 85318 68233 22886 -13337 -26704 -25874 -12715 23640 84344 150437
38723 150437 198916 215096 190533 133596 86081 93542 140830 154231 96160 17923 -21324 -39937
38711 -39937 -72419 -67401 49725 220839 277654 153980 -23590 -107947 -102606 -91548 -84294
38700 -84294 -33002 48221 91889 86657 79488 72557 14145 -92670 -160327 -130967 -54116 -11669
38688 -11669 -17330 -30858 -31743 -34806 -54106 -85047 -111963 -117302 -99094 -87615 -118885 -180872 -218049
38675 -218049 -207521 -196215 -232952 -293258 -312891 -279326 -242223 -231898 -215207 -156175 -84678
38664 -84678 -60997 -82692 -79000 -18184 26083 -32420 -154837 -202384 -111572 22843 77397
38653 77397 50755 22066 6539 -54339 -166840 -245428 -230922 -176764 -170724 -220254 -265324 -269232
38641 -269232 -243111 -201686 -150273 -112156 -118857 -160060 -178863 -137676 -68723 -37868 -65569 -101017
38629 -101017 -77916 11975 106804 135870 91028 36635 48100 135984 226348 222754 101936
38618 101936 -51054 -118048 -62938 41129 99753 89004 53332 43261 74460 122534 137707
38607 137707 92587 35529 54883 154689 215844 143001 8872 -32241 48555 133993 145016
38596 145016 132424 151889 160453 111219 66568 122175 263353 380609 398067 314652 153456
38585 153456 -42850 -186304 -208415 -157782 -153849 -231295 -304776 -303059 -255855 -212840 -156682
38574 -156682 -58106 41375 78529 70524 92652 160850 204960 171162 94056 42102 36569 58804
38562 58804 101955 165751 213053 186921 88421 -173 -180 73548 136052 135674 103615 100677 145128
38549 145128 205530 242790 240791 205882 153837 99814 56989 41486 66947 122776 169906 180818
38537 180818 176183 192300 217012 201000 143469 118796 184405 296309 358892 338430 282415
38526 282415 236697 193744 131834 61859 9463 -23265 -48050 -53833 -13181 67155 129952 127996
38514 127996 88529 81703 121995 144471 102300 43276 42847 94492 128109 116721 94376 79300
38502 79300 60776 61569 116818 173372 120948 -28149 -102198 6417 178490 230879 157393
38491 157393 82864 45556 -21838 -123835 -173200 -138852 -82081 -24379 83098 222012 277817
38480 277817 211589 138715 158739 215046 210297 160558 131915 111111 58630 25159 85358 193285
38468 193285 231679 188347 158642 171342 139974 22076 -83943 -64922 57001 165452 194780
38457 194780 174713 158111 160607 169302 172365 166925 151182 121553 84634 67992 98394 159370
38445 159370 195604 181814 161200 179351 200313 139834 -15375 -166754 -201737 -109210 17305
38434 17305 78081 57369 18189 14608 29106 20422 10933 61719 150937 158658 24789 -147228
38422 -147228 -220804 -206050 -213958 -266627 -267275 -158635 -2626 121473 205401 265881 292438
38411 292438 280232 246857 185711 74768 -38836 -49672 61309 175341 190468 148840 136591
38400 136591 136315 80165 -7078 -33309 19047 84872 137697 210520 290906 304891 237018 172743
38388 172743 172980 180042 105365 -41899 -173016 -236010 -263795 -319106 -422821 -526945 -545286
38377 -545286 -433655 -251642 -113750 -64266 -38741 28752 107898 126526 87296 68957 118783
38366 118783 197503 238991 221936 167698 103900 55024 43160 63357 63990 -14620 -166705 -305268
38354 -305268 -345562 -302205 -275336 -327634 -403190 -400464 -308520 -221467 -209508 -226220 -179244 -59802
38342 -59802 48498 80780 60616 47485 57300 63782 51350 28278 -3571 -52067 -99780 -100965
38330 -100965 -37343 46039 90018 91703 92501 107293 111734 103412 120712 173280 201733 151608
38318 151608 53431 -21493 -56041 -76226 -68344 8970 124691 175350 120909 46989 40420 66707
38306 66707 39185 -39026 -85542 -66652 -29973 -13342 -2776 5565 -21969 -90881 -148097 -156064
38294 -156064 -146710 -161967 -189483 -205504 -232476 -284198 -286583 -144373 106532 296281 306192
38283 306192 195701 99660 53436 -8747 -108039 -163162 -103553 23451 107780 105836 63265
38272 63265 25398 -14540 -66299 -95838 -66693 -1055 40795 31168 -10333 -64903 -133356 -197077
38260 -197077 -201084 -107219 50282 183286 218273 144416 19064 -61634 -30471 80041 155975
38249 155975 126327 49043 28616 67371 67061 -17248 -105064 -111458 -69176 -60882 -79539 -49231
38237 -49231 31267 67346 13351 -50760 -37061 26132 53818 36643 33269 57336 58068 13866
38225 13866 -33337 -54316 -72326 -96934 -83998 -9400 68803 81913 52185 59913 123916 175501
38213 175501 151371 58951 -57806 -166704 -243746 -266838 -243981 -219359 -219581 -208314 -122321
38202 -122321 47762 225871 303050 228193 59797 -77921 -109589 -74002 -53553 -57441 -26011
38191 -26011 52244 100648 62765 -14757 -61131 -85897 -128666 -148313 -66961 80272 149724
38180 149724 79906 -14567 -2154 83951 106117 20534 -80354 -115666 -113712 -132710 -152913
38169 -152913 -100482 50345 240665 379228 402402 297725 108455 -76930 -169945 -145801
38159 -145801 -66102 -25646 -63139 -119733 -92509 61697 275615 430646 466483 425901 392944
38148 392944 399610 401684 339715 210586 73835 -4355 -962 66526 165798 251477 263377 171162
38136 171162 28569 -64189 -79118 -99817 -202123 -336057 -388825 -337645 -257541 -183660 -67024
38125 -67024 99319 208199 166633 29245 -81978 -140535 -197391 -234133 -163469 5641 123292
38114 123292 79475 -54988 -136725 -130511 -101561 -80746 -38993 18693 31253 -25539 -93080
38103 -93080 -103993 -53093 25916 105971 163448 174941 151354 140531 161985 170252 120589 42390
38091 42390 -536 -6546 -40463 -138578 -252263 -298852 -241680 -115882 -4343 11268 -83465
38080 -83465 -204468 -242956 -190607 -149219 -184695 -220838 -141198 33883 157647 149549 90102
38069 90102 84347 109744 75216 -18792 -77172 -57935 -27456 -44509 -72368 -54701 -13178 -2745
38057 -2745 -13006 8516 52765 48753 -22815 -82762 -50812 54028 141051 144715 66854 -49148
38045 -49148 -151001 -196883 -173925 -102477 -14561 65751 119892 135123 120888 106345 104543 94058
38033 94058 53246 -2858 -42170 -63271 -100592 -180419 -284083 -357008 -353181 -277608 -184049 -118720
38021 -118720 -72299 -12547 42615 32870 -47190 -110869 -81663 5705 60576 66129 87224 152680
38009 152680 198226 152223 33242 -69673 -91289 -41559 23175 61221 77222 96030 114374
37998 114374 106194 84550 111851 206325 277571 222778 70293 -45664 -51091 2103 43162
37987 43162 70406 101769 115720 91754 54021 29456 11414 710 23435 67757 74156 43919
37975 43919 77155 217734 331801 257106 35530 -124584 -107086 5255 83914 96154 67253
37964 67253 10480 -54077 -89829 -98560 -119606 -142455 -96196 33801 156845 196167 184805
37953 184805 184567 181400 134605 70391 44450 54528 67217 90026 133279 137205 33871 -134958
37941 -134958 -256892 -301907 -343375 -419334 -467912 -429504 -331342 -230917 -143069 -66311 -22030
37930 -22030 -18169 -21104 -12783 -34301 -118644 -213627 -234617 -178624 -123674 -112660 -97205 -22626
37918 -22626 73850 95370 9014 -102207 -131504 -74234 -30332 -78248 -179416 -230578 -186345
37907 -186345 -94400 -20885 17482 42452 71735 104030 127355 132185 126238 130506 144358 132136
37895 132136 77861 36134 75864 175832 236491 207963 143997 103980 68477 463 -66343
37884 -66343 -68979 -14213 31032 33558 16963 -2671 -43955 -115992 -196433 -264986 -319623 -352828
37872 -352828 -352989 -339537 -354264 -398707 -416233 -360240 -252915 -153376 -91076 -54817 -28176 -7520
37860 -7520 7033 16477 21540 29836 57623 110511 168221 202873 208381 196947 168256 101798 -8484
37847 -8484 -122163 -174624 -139255 -57205 6895 32577 50839 88264 130918 154110 160891 166323
37835 166323 161143 123555 62931 20306 16611 21433 -13561 -97285 -181250 -199157 -132080 -38112
37823 -38112 -960 -36575 -70943 -33025 51384 94774 64063 15383 9433 37996 53360 33954
37811 33954 -7014 -54266 -101404 -136816 -139515 -92440 -1622 89117 113533 42139 -74011 -152250
37799 -152250 -176387 -205559 -271664 -319447 -288598 -215189 -192050 -243367 -298277 -292485 -240129 -184770
37787 -184770 -129451 -57428 7911 19390 -17926 -38079 -5398 25295 -16575 -104964 -140276
37776 -140276 -89357 -36574 -62092 -129767 -155711 -140832 -150631 -184863 -165800 -67079 39515
37765 39515 98045 141005 197635 213486 139412 40470 25025 95897 155173 139636 74804 5807
37753 5807 -49549 -81089 -90590 -118187 -198034 -285086 -294377 -218724 -135496 -85882 -26729 72540
37741 72540 163899 193001 170897 129155 67469 -571 -10430 74143 185812 228887 202468 179418
37729 179418 183283 162883 89003 3882 -45911 -69757 -96011 -114571 -94729 -44608 -18650 -57270
37717 -57270 -132381 -169066 -128488 -57110 -34829 -82801 -152278 -199845 -227864 -238880 -205070 -122316
37705 -122316 -55403 -78358 -185258 -296718 -339797 -294804 -192887 -106926 -115770 -224348 -332480
37694 -332480 -330006 -214688 -79962 -8126 -20322 -102742 -216284 -294714 -302765 -291259 -325708
37683 -325708 -365502 -298450 -109815 70312 126774 93897 81125 123222 163034 145655 74793
37672 74793 -5924 -50174 -42679 -17173 -19197 -41752 -34997 12538 57610 84631 135063 215868
37660 215868 249923 181993 79525 52660 107425 148375 102609 -21316 -170906 -279703 -284404
37649 -284404 -183808 -67607 -23672 -34550 -27946 812 -176 -29804 -35708 -21519 -47606 -111500
37637 -111500 -132782 -87849 -58222 -97131 -140728 -113642 -43483 -998 7476 15875 23603 18979
37625 18979 29363 71927 94167 40685 -52220 -105578 -116098 -147377 -219244 -282486 -296525 -263221
37613 -263221 -191509 -98060 -35835 -47562 -90440 -80829 -18025 12111 -33679 -102696 -141070 -161829
37601 -161829 -187603 -202242 -201245 -220214 -263748 -270415 -205405 -129773 -112263 -123080 -90774 -27363
37589 -27363 -13649 -76464 -157346 -199374 -197214 -161721 -102337 -52212 -46676 -62011 -35631 33649
37577 33649 67388 21465 -39273 -29388 36117 68796 34987 -3083 22875 106023 190426 240242
37565 240242 252912 226357 157015 78051 61076 142306 256236 283740 179429 19872 -93009
37554 -93009 -142327 -178597 -225822 -259041 -261771 -246484 -214143 -149239 -67747 -13715 14153 74276
37542 74276 182922 257779 217450 99877 17220 12485 24137 -13660 -94776 -166240 -176780
37531 -176780 -99022 39883 141370 109282 -36281 -168786 -201757 -174939 -168161 -188638 -191483
37520 -191483 -163382 -124678 -79969 -29276 -6791 -42606 -95975 -94366 -43584 -36012 -132277 -285719
37508 -285719 -402938 -434947 -393424 -325142 -292014 -329040 -392865 -391339 -290141 -150040 -37136
37497 -37136 47729 113564 118902 35410 -73173 -116298 -97380 -91682 -120962 -137059 -127392 -141583
37485 -141583 -191665 -216158 -183962 -153083 -170701 -187300 -144028 -90696 -127673 -255695 -369537
37474 -369537 -398672 -379892 -381085 -418591 -469362 -508224 -504393 -425872 -282740 -138678 -49482
37463 -49482 -9154 20035 45529 43307 7960 -29618 -41882 -38923 -44678 -48626 -10694 70025
37451 70025 118116 58891 -67590 -125400 -45329 80519 116379 54031 -4684 -10535 -16019 -49343
37439 -49343 -38488 79243 237044 304630 247822 156735 124075 152236 185445 186412 161055 131934
37427 131934 106798 73073 25297 -4859 30188 127487 210747 199710 91332 -44521 -131347
37416 -131347 -130590 -51723 45160 79114 24761 -51989 -73169 -47935 -45645 -86014 -120825 -126083
37404 -126083 -139075 -178401 -194888 -148812 -84230 -68481 -93296 -101606 -93997 -134112 -236330 -311898
37392 -311898 -266451 -120098 7442 21731 -61657 -150951 -172200 -125265 -64181 -35602 -35458
37381 -35458 -21331 32854 96110 102461 21330 -99351 -174748 -171382 -139925 -150402 -207514 -247652
37369 -247652 -214253 -117363 -17755 31238 21878 -13662 -38997 -48702 -67468 -108709 -144976 -139963
37357 -139963 -104167 -87739 -108977 -119928 -66337 36325 114233 117075 65451 15557 -3216
37346 -3216 -6180 -20482 -48218 -65074 -49025 -1373 61839 126074 173504 173357 104346 -5399
37334 -5399 -81932 -68537 17813 101758 119015 68458 3031 -24305 -7940 14051 8643 -17319
37322 -17319 -38364 -51040 -70997 -97247 -108599 -98523 -85335 -78876 -63961 -32843 -13683 -47423
37310 -47423 -143911 -267370 -355991 -362057 -298716 -245747 -273084 -350188 -370184 -279935 -144739
37299 -144739 -58727 -33555 -13884 33807 97797 162655 221692 257754 258570 249201 270629 325636
37287 325636 374255 375527 308453 172950 10452 -95510 -91914 -25226 7714 -28713 -92473
37276 -92473 -144740 -182402 -191632 -144749 -63603 -15067 -8727 35572 168507 314457 359474 304105
37264 304105 258395 289786 337725 299186 160965 15417 -47051 -32914 -13476 -12921 19994
37253 19994 102209 138584 34906 -137796 -200637 -106721 -12730 -53920 -151544 -144989 -42745
37242 -42745 -8706 -116331 -245980 -257446 -165376 -88231 -87895 -121867 -122835 -72121 -2121 37185
37230 37185 9574 -86480 -209922 -287569 -252527 -107854 41983 67696 -45193 -168537 -181674
37219 -181674 -109932 -57783 -45220 -2508 80414 104613 1315 -156751 -235821 -180589 -28254
37208 -28254 160433 319322 367234 266235 92989 -14167 -4404 28370 -37109 -201048 -341980
37197 -341980 -355278 -260217 -158539 -115294 -116546 -133836 -171861 -224966 -240499 -185235 -117520
37186 -117520 -120970 -177282 -182643 -96200 8880 63200 84570 102591 84954 8803 -60590 -48114
37174 -48114 16131 45140 27614 22639 41385 34734 2946 14736 82148 104523 -2760 -180591
37162 -180591 -290002 -272344 -192235 -140724 -146489 -179290 -198459 -183707 -138265 -79311 -29473
37151 -29473 -12975 -42709 -98241 -135824 -146277 -183145 -292082 -427448 -497125 -487300 -470410
37140 -470410 -472338 -416384 -252175 -68009 6332 -35026 -92622 -117053 -145558 -185352 -169975
37129 -169975 -73866 16721 14202 -46108 -66510 -36961 -41076 -113772 -170810 -115051 32119 148501
37117 148501 144700 47637 -45000 -64745 -17860 46256 85176 80443 28926 -60034 -161357 -244736
37105 -244736 -292101 -297894 -261064 -196421 -146462 -146847 -170374 -140804 -27581 100584 149431 107232
37093 107232 42804 9610 -3060 -23683 -50144 -66146 -74772 -95410 -144849 -229892 -336512
37082 -336512 -420399 -437466 -394980 -342146 -297973 -226990 -109385 7155 66533 83466 113681
37071 113681 164027 186310 154408 93351 25335 -62570 -177750 -288150 -353474 -365709 -341761
37060 -341761 -299015 -253705 -221025 -199384 -171115 -131543 -100198 -91765 -94004 -87350 -71392 -61030
37048 -61030 -68786 -96011 -126876 -130772 -91429 -32426 12737 52205 117730 191914 205652 132245
37036 132245 37640 772 19569 33999 10963 -35355 -80675 -103867 -85767 -41275 -33098 -101926
37024 -101926 -194632 -215609 -147377 -69591 -53573 -84251 -97241 -55615 20854 74308 55161
37013 55161 -21491 -74273 -46769 14499 24874 -10938 -11769 34711 30117 -90915 -253795 -343221
37001 -343221 -348153 -333020 -312588 -250405 -164204 -131537 -169615 -192755 -132800 -40263 -9578 -45526
36989 -45526 -72677 -63241 -80561 -169794 -260029 -229168 -52450 159371 274819 259347 170278
36978 170278 76092 12109 -11024 446 23604 41008 62999 105880 155049 178841 174342 166380
36966 166380 161923 141547 100186 58171 22108 -26640 -88676 -128784 -123007 -91262 -59860 -22252
36954 -22252 36019 99866 141221 153384 144814 118879 81471 46590 13939 -32037 -79282 -80179
36942 -80179 -20292 40176 40291 7427 18490 86488 142340 130285 72235 28058 29989 65619
36930 65619 95789 83930 33870 -1838 21531 79697 104484 63956 -16448 -103753 -182287 -228623
36918 -228623 -215692 -162014 -133831 -168748 -223715 -224202 -148290 -45465 12791 -8908 -83399 -144089
36906 -144089 -150531 -131588 -140921 -173804 -166553 -88649 3355 27138 -36165 -135131 -209083 -236029
36894 -236029 -235717 -240744 -254452 -236550 -152543 -34787 43485 62624 80177 139842 202987 206196
36882 206196 148269 75960 14269 -37063 -59447 -28865 29918 61393 62952 96263 189212 273137
36870 273137 261305 162535 65404 16424 -30682 -125623 -231538 -272853 -248481 -234174 -266819
36859 -266819 -290070 -247304 -172799 -134693 -126219 -85346 -5613 49817 48465 28475 20244 -676
36847 -676 -50205 -89680 -86366 -66089 -59488 -46599 -7492 20610 1231 -25328 3082 65171
36835 65171 83110 43318 13482 38012 92243 153646 240989 345002 382133 277469 73073
36824 73073 -90754 -103270 22914 175823 245846 206790 108546 6426 -79412 -137406 -144676
36813 -144676 -104390 -62648 -41903 5118 113035 210770 200607 118103 107188 214402 311739
36802 311739 274702 145244 44914 2796 -34357 -69932 -45594 44418 119273 110597 34863
36791 34863 -45136 -79377 -45927 35251 89056 40301 -92830 -203029 -215715 -168318 -143033
36780 -143033 -159253 -167705 -123500 -27317 90053 191023 248329 265944 276150 295752 297758
36769 297758 248844 159136 65182 -21870 -111273 -182294 -188019 -122809 -43598 -525 17981 41903
36757 41903 56515 26757 -35919 -81034 -87764 -79311 -68256 -37447 14281 58656 91568 148279
36745 148279 229640 263796 198853 99623 81004 154708 212133 168175 57131 -36645 -82812
36734 -82812 -101583 -107671 -113025 -153948 -251106 -349126 -357553 -267475 -177075 -169695 -203153 -165948
36722 -165948 -26985 124333 196699 204705 222315 262760 261082 174064 46932 -37036 -40317
36711 -40317 8518 45079 8506 -107666 -224514 -243024 -166502 -104972 -120853 -137334 -67937
36700 -67937 27376 21358 -79848 -140049 -99982 -55581 -92644 -157712 -159485 -108578 -77243 -85923
36688 -85923 -108827 -140210 -175348 -166652 -82340 14886 25689 -59683 -158188 -207097 -216525 -211944
36676 -211944 -185409 -117605 -12407 95479 148660 103630 -10363 -94475 -79019 5313 85552
36665 85552 133680 151864 123231 47553 -13375 -4977 33759 31203 -503 750 24948 7772
36653 7772 -43727 -60334 -49041 -97767 -214468 -282439 -226397 -118085 -58277 -48866 -45441 -46115
36641 -46115 -54344 -34434 15943 20248 -66279 -163851 -173852 -121455 -98734 -110843 -81058 14486
36629 14486 112445 155584 143628 99470 53736 52216 111829 177773 183772 140125 103831 85097
36617 85097 52318 9630 -5967 6431 16022 21166 36106 34784 -12981 -64017 -47230 20933
36605 20933 54975 29816 57 -4645 1693 48506 190241 373040 444804 351266 211230
36594 211230 138941 106136 55613 32298 88256 150521 118285 36228 38436 149188 263883
36583 263883 313581 325042 312570 233348 88759 -26243 -29083 55115 143197 187424 184547
36572 184547 139275 62345 -17317 -66362 -63220 -1816 92043 152044 125151 46128 15985 85581
36560 85581 194021 243822 208846 144268 109020 102226 74045 -8128 -109125 -159127 -143590
36549 -143590 -124047 -141376 -144899 -78158 3287 -7996 -102216 -148166 -82657 -2742 -16451 -91871
36537 -91871 -130953 -119882 -108934 -90741 -10406 113443 181486 147146 77698 55231 81880
36526 81880 112309 118724 83940 -15229 -160699 -262370 -238594 -123338 -41118 -63259 -128660
36515 -128660 -130909 -55991 5777 -17667 -87671 -113196 -76207 -49146 -83102 -131418 -117921 -42851
36503 -42851 26930 49258 32661 -15592 -99699 -183889 -198846 -134301 -74139 -95855 -173064 -223736
36491 -223736 -222778 -213069 -226804 -255480 -288877 -322097 -320483 -241492 -112368 -27283 -30240 -49515
36479 -49515 955 91460 114257 40438 -32452 -11345 70638 108557 70189 29647 56631 122053
36467 122053 139893 73226 -36826 -134485 -199536 -227239 -200008 -112989 -9903 43620 24343
36456 24343 -34239 -89607 -124886 -134429 -109327 -55009 143 32735 44122 39507 13002 -24058
36444 -24058 -26639 34772 121269 160489 131493 80199 52268 50136 62426 92283 133981 154383
36432 154383 127633 70351 19222 -10510 -23548 -19464 4866 38650 67239 91667 117907 136470
36420 136470 136000 129064 137674 155757 152640 116991 74795 57926 72435 101836 125666 131334 122154
36407 122154 115235 118109 110646 67675 -4370 -74456 -124630 -151944 -138082 -60863 51581 122780
36395 122780 114460 79110 90743 147103 179557 143300 56148 -41687 -119774 -149580 -112766 -32532
36383 -32532 41162 94686 162572 255182 316184 294867 234028 228892 297300 341940 265859 94436
36371 94436 -46582 -58873 48709 196695 316766 388504 422196 431083 417200 368692 272604
36360 272604 145707 51140 58150 167234 290944 334098 287862 219960 176566 132161 50833
36349 50833 -42506 -91212 -86816 -72994 -73082 -64330 -40763 -52612 -140615 -257555 -304858 -241701
36337 -241701 -113473 26983 169016 290849 315346 186678 -24021 -159044 -140480 -48456
36327 -48456 -6955 -37534 -71387 -69816 -61721 -64711 -43016 24613 90122 97169 63076 48490
36315 48490 65643 71654 46332 20335 16797 14421 -11476 -48866 -68609 -51942 12920 118978
36303 118978 207774 201362 103644 22542 41982 111058 116939 32600 -75500 -156651 -207985 -212345
36291 -212345 -145591 -63440 -82925 -229380 -376500 -392869 -288428 -164939 -85229 -56119 -79453
36280 -79453 -132518 -136475 -38687 88353 116464 24695 -88745 -154220 -198513 -249587 -267544
36269 -267544 -216140 -134759 -88729 -93468 -123370 -149092 -134808 -52765 60024 111564 63980
36258 63980 -17989 -68992 -109056 -167775 -192361 -123892 -17240 23715 6306 28660 101335
36247 101335 113522 10351 -108217 -124757 -51300 27860 81162 116208 105512 24849 -66342
36236 -66342 -77130 -6782 66870 112890 174356 260051 295240 220224 80920 -21195 -36872
36225 -36872 339 23020 -9492 -74321 -101480 -55986 3323 -3597 -53897 -46132 39680 100465
36213 100465 71039 27524 52186 87334 42182 -19315 51662 245425 372243 313523 161887
36202 161887 61545 33910 36074 77764 171346 243447 213803 119641 59240 46978 25526
36191 25526 -8892 -6342 23958 15289 -35471 -58553 -41757 -58324 -126600 -151468 -70436 32472
36179 32472 39169 -42427 -112367 -122272 -101217 -72125 -25858 34460 91440 146753 199720 208248
36167 208248 134431 20747 -42511 -25825 20636 53736 77072 85372 39919 -67079 -174871
36156 -174871 -219487 -202349 -161841 -111094 -45656 10224 15208 -29791 -72506 -73454 -52111 -48276
36144 -48276 -58132 -45185 -12375 -15129 -74794 -123090 -90324 -22474 -29466 -115590 -155609 -75479
36132 -75479 35630 60442 19035 5532 23619 5236 -39754 -25912 50953 85517 24429
36121 24429 -53619 -66019 -37385 -26917 -34352 -46956 -101736 -217914 -323138 -328886 -243287 -144545
36109 -144545 -84461 -81715 -157581 -293219 -389345 -358955 -238627 -128084 -51067 27341 74490
36098 74490 9562 -139980 -227472 -178807 -92151 -88232 -152508 -200371 -222456 -270525 -342795 -377806
36086 -377806 -348436 -285079 -210347 -119855 -31151 13634 11680 13642 49659 82084 61339 -666
36074 -666 -48134 -61385 -87703 -182855 -333302 -449826 -447570 -332572 -195941 -114130 -71347
36063 -71347 -339 114418 209874 224687 171674 110464 74032 52361 34997 32899 53047 80541
36051 80541 100147 115952 134122 141783 120302 67740 -7094 -95103 -167568 -167955 -69541 59537
36039 59537 99335 7171 -132749 -209225 -194883 -132399 -60883 -9721 -28083 -142718 -288711
36028 -288711 -352306 -299978 -210871 -165467 -161582 -169102 -204338 -290922 -384278 -404104 -337054 -252962
36016 -252962 -210807 -190083 -132436 -24542 81703 125345 103457 78088 107316 170189 184307
36005 184307 110650 11347 -25138 10815 62608 104848 165870 246928 282453 216256 76988
35994 76988 -59976 -154448 -203262 -188384 -85781 69906 184489 196668 142162 99701 95212
35983 95212 90586 55340 11303 -3571 11678 26734 28967 42992 94758 169863 220954 214630
35971 214630 160855 95028 43371 15219 18600 61358 130451 187930 205469 197828 204831 238957
35959 238957 267492 254660 207398 164194 145469 134371 110192 82084 73975 84550 82440 44563
35947 44563 -16592 -69851 -92364 -70255 2556 99001 153371 127278 76884 99058 196846 259599
35935 259599 211865 119930 90182 117632 124383 110004 145012 215661 206346 81456 -33711
35924 -33711 -29506 32026 37300 11688 60482 171541 222695 176992 132306 156588 199009 202200
35912 202200 184638 155468 60046 -104470 -207175 -121285 103335 295310 356560 323934 270944
35901 270944 237538 243072 281071 292635 213776 63101 -68543 -120777 -107396 -59132 15976
35890 15976 98076 133179 77690 -54378 -199039 -282017 -261222 -160088 -50496 26066 99421
35879 99421 192562 236528 140704 -58438 -204881 -199675 -94818 14552 107000 191624 225899
35868 225899 163132 45904 -28293 -22257 24494 81418 155165 223309 210995 75061 -123844
35857 -123844 -272254 -314554 -286202 -243533 -190939 -95951 35742 135270 143831 89918 52542
35846 52542 52531 32354 -43092 -125698 -162238 -177489 -216410 -243737 -185350 -58127 29933 24841
35834 24841 -9299 -5723 339 -58970 -164024 -228831 -216365 -167166 -126095 -102886 -101076 -123174
35822 -123174 -138965 -107740 -48263 -29254 -66878 -93816 -71162 -67709 -156041 -272816 -279326 -158667
35810 -158667 -55966 -87186 -186292 -203641 -104249 7343 38856 10333 -7790 5365 17201
35799 17201 4590 -14748 -3249 67756 204561 382966 545726 623034 577708 441424 297406
35788 297406 210991 178191 155587 130585 130013 159559 180819 168855 146320 124191 55330 -92993
35776 -92993 -253025 -320196 -294511 -280113 -335674 -404059 -414929 -377778 -327780 -251514 -135124
35765 -135124 -36138 -27692 -92461 -141141 -127155 -83708 -55370 -54755 -87798 -159448 -238039 -264796
35753 -264796 -221158 -149642 -90389 -31754 56082 165144 244718 236354 115647 -70603 -212138
35742 -212138 -224795 -141542 -70866 -57357 -42112 17943 65740 36496 -24066 -17375 58231 101032
35730 101032 48478 -51440 -124035 -148290 -125113 -37473 103032 216845 225418 139780 35699
35719 35699 -36846 -73605 -71996 -31473 7702 -9789 -77757 -130520 -134589 -124418 -128733 -123065
35707 -123065 -92920 -86377 -145910 -227075 -247882 -193517 -111130 -26227 61061 111529 69937 -33942
35695 -33942 -94092 -71752 -52570 -114671 -214057 -265569 -272426 -290559 -312375 -289093 -247453 -270445
35683 -270445 -347490 -352884 -222861 -65263 -18419 -62527 -62482 30485 118851 112992 59949 67907
35671 67907 151254 215400 187233 106311 66759 99933 145207 129817 52278 -21729 -34644 2396
35659 2396 24670 -12249 -77263 -92563 -22918 77207 120947 82515 12307 -30402 -27055 14000
35647 14000 75095 116191 87042 -13024 -112662 -138204 -87512 -9878 58333 100413 90039
35636 90039 10843 -100208 -176266 -189698 -162647 -117368 -61314 -16979 -13780 -42479 -64621 -74676
35624 -74676 -103311 -149373 -165325 -131398 -88326 -65556 -30778 46169 123402 131747 61616 -37504
35612 -37504 -117860 -152883 -124319 -40226 47568 84670 62772 2150 -83694 -166729 -183283 -95634
35600 -95634 38292 110959 75545 -28624 -137022 -194011 -155539 -33752 72902 73438 4972
35589 4972 -22802 -81 -27579 -134687 -209214 -171867 -111409 -149744 -255219 -302775 -260545
35578 -260545 -192242 -110899 30403 201968 287889 248107 176298 148895 121644 40863 -37930
35567 -37930 -30425 45650 110872 144921 176717 196266 176085 153802 187514 238733 210494 111114
35555 111114 65070 126739 195839 180803 145786 202849 330163 405814 384222 331369 296507
35544 296507 252433 179647 123471 130800 185917 240828 270034 274776 269108 276463 305829 323966
35532 323966 288815 211043 134660 59958 -43570 -135262 -104572 71450 243575 240970 67615
35521 67615 -121028 -204607 -186175 -118624 -35450 31397 39104 -24054 -121237 -210500 -275243 -305346
35509 -305346 -289624 -242660 -201628 -175264 -126035 -25711 94620 173742 186416 162287 145955
35498 145955 150910 153592 131741 103177 106584 136454 130024 47986 -62222 -127617 -147462 -169398
35486 -169398 -185271 -131119 -1132 118234 159577 149882 134206 94428 5444 -84942 -109462
35475 -109462 -80008 -57439 -49192 -19029 16571 -1998 -57295 -37556 113097 294327 358640
35464 358640 280090 159603 92959 91626 116349 123913 73591 -55710 -224460 -339669 -334597
35453 -334597 -232342 -116284 -52065 -51966 -93575 -142730 -167120 -162379 -168975 -230093 -319205 -341975
35441 -341975 -237311 -54327 101149 177279 198067 196817 185849 190362 241782 307183 287215
35430 287215 140225 -31375 -85423 -12636 63494 57082 14817 13924 33106 -13464 -142150
35419 -142150 -262553 -278455 -184446 -51133 51690 96271 86591 41329 -13453 -60378 -107979
35408 -107979 -172712 -233383 -228474 -127871 6758 73804 47861 4571 15146 57884 64863
35397 64863 19028 -42366 -97313 -154861 -205565 -212396 -165290 -102633 -61454 -39208 -17382 11450
35385 11450 52451 106363 143502 123292 62797 37927 79033 111245 53639 -56046 -103115
35374 -103115 -48039 32779 61948 49644 45710 61371 76823 88019 102997 111021 92705 55345
35362 55345 32393 46709 85158 105519 65132 -43592 -178544 -279837 -318475 -300106 -231541
35351 -231541 -121914 -20811 -3923 -88408 -195954 -233510 -183893 -87725 24908 136068
35341 136068 206977 211370 192148 219573 289447 322552 274084 184152 104682 37922 -26597 -74669
35329 -74669 -105514 -154202 -229829 -276841 -249826 -188406 -161403 -169149 -163267 -137080 -125232 -126085
35317 -126085 -99757 -48775 -30867 -70670 -115239 -105203 -49891 -7493 -19208 -76156 -125205
35306 -125205 -106623 -19540 56056 46388 -18606 -55854 -64911 -120815 -217627 -231520 -101533 48761
35294 48761 62195 -45883 -132931 -133327 -106456 -103691 -101824 -76993 -45995 -11238 52964 134234
35282 134234 177047 169658 162674 170652 132786 20261 -84798 -82257 16369 109722 129054 89362
35270 89362 43368 30866 56712 84198 70218 32939 50122 154848 270692 297647 231817
35259 231817 150430 107339 98806 107794 119420 107360 67214 53465 120279 231247 293021 277365
35247 277365 241595 225067 202946 160872 137522 158198 194513 229466 293745 384882 416147
35236 416147 319067 152594 34629 -4715 -26259 -63036 -84746 -77161 -72045 -81590 -77797 -63547
35224 -63547 -94124 -185853 -261225 -240332 -149619 -83292 -78530 -84209 -45918 29267 99604 139163
35212 139163 144066 113523 45424 -53016 -155075 -216636 -204267 -136229 -79463 -79247 -101509 -77464
35200 -77464 -236 65511 78126 73960 96462 110788 43767 -102491 -231197 -257676 -197713
35189 -197713 -132332 -116608 -146887 -190832 -213884 -186589 -103240 -1749 57881 45736 -18827
35178 -18827 -100928 -182801 -254556 -295123 -287441 -248325 -221398 -231596 -255105 -241139 -160857 -32632
35166 -32632 95769 183281 215049 197361 146470 84037 30369 -9698 -49962 -102674 -160206
35155 -160206 -206757 -238879 -255768 -238057 -169101 -82884 -52854 -107248 -181958 -191395 -130244 -68072
35143 -68072 -51658 -55616 -35622 10066 52031 73621 79842 80946 89634 122835 185079 252347
35131 252347 282592 240398 116250 -56655 -200790 -240683 -173537 -75787 -22204 -19667 -37072
35120 -37072 -63747 -96464 -95128 -11817 133000 251448 276971 216996 115704 13012 -46520
35109 -46520 -20654 74294 149038 125487 16521 -107830 -205579 -273632 -300465 -268255 -201822
35098 -201822 -160854 -165527 -167374 -113266 -10403 88627 139492 128085 65522 -13997 -66909 -76775
35086 -76775 -71029 -86900 -130296 -180583 -221146 -246691 -251988 -233822 -196722 -140527 -56131 43053
35074 43053 101493 71913 -16960 -84419 -97929 -105624 -148916 -191718 -182871 -153363 -182340 -269890
35062 -269890 -313745 -239545 -101384 -11553 -5883 -25789 -12225 33192 73359 73445 10980 -104172
35050 -104172 -205036 -205360 -91206 50490 121096 111944 97609 144529 245551 330650 326393
35039 326393 222500 97231 55185 115258 179279 139359 -2070 -149096 -224267 -216923 -137477
35028 -137477 7967 181011 307136 346126 333402 319454 298170 232339 126506 28968 -30712
35017 -30712 -62453 -70456 -29389 73050 196171 275871 284749 242700 175665 91424 3508 -48819
35005 -48819 -36258 7646 2431 -90953 -215790 -277334 -245120 -172569 -121447 -100648 -86784 -71695
34993 -71695 -65902 -72494 -79781 -72347 -36990 29805 106339 151350 142250 95076 29140 -68684 -210825
34980 -210825 -348727 -391196 -302600 -154140 -49795 -15757 7114 65501 125105 121450 57901
34969 57901 15221 55238 144109 194879 168899 103109 42993 -10489 -71784 -122899 -128297 -87249
34957 -87249 -44319 -46142 -98754 -160336 -166819 -82773 51110 136555 114525 35718 155 31697
34945 31697 59706 36259 14865 67795 163012 189866 103210 -22239 -100766 -140153 -193713
34934 -193713 -252765 -256141 -195393 -138330 -129847 -131795 -98532 -59863 -72723 -124166 -148649 -128915
34922 -128915 -112964 -127516 -139635 -122709 -102025 -105154 -116061 -112406 -105669 -108947 -107136 -99388 -127568
34909 -127568 -210044 -284530 -279592 -216807 -175455 -175453 -169090 -137757 -111852 -87063 -10216 119559
34897 119559 215564 218129 178443 170330 176557 135692 60283 22644 38014 46532 20588 13526
34885 13526 69352 141956 151646 90997 27440 10298 16039 -4333 -50203 -68280 -23227 51371
34873 51371 93799 97155 115838 176236 221078 184522 97846 59137 95321 119558 57221 -41537
34861 -41537 -72713 -30529 -16038 -90600 -187896 -204058 -127237 -30095 37292 86949 128091 125511
34849 125511 55774 -33284 -66883 -38069 -16245 -53718 -118503 -140763 -102891 -55675 -55284 -112635
34837 -112635 -203093 -294590 -354424 -356219 -304222 -234429 -168626 -86140 24771 105948 78516
34826 78516 -38443 -120974 -86712 4552 44907 22235 -427 -9476 -47924 -109388 -132443 -118950
34814 -118950 -149007 -233146 -258801 -162214 -56972 -81682 -191137 -229880 -170965 -135435 -182655
34803 -182655 -234101 -235634 -246948 -299994 -299644 -173258 -25493 -17280 -141418 -243278 -243594 -216921
34791 -216921 -235860 -251827 -184438 -52195 55861 101515 125383 163660 195407 191691 177025
34780 177025 200900 258757 286291 244892 168907 96890 2610 -142352 -266754 -250155 -85722
34769 -85722 88114 146622 98900 19730 -57508 -126298 -157234 -133412 -85621 -31939 61025
34758 61025 190520 259496 199327 94487 74299 123691 130675 97599 151184 319177 443249
34747 443249 381964 194280 47185 20012 68704 116015 106842 25743 -76773 -114730 -70810
34736 -70810 -25479 -41267 -74614 -53783 12589 64353 74808 44214 -38699 -156047 -228923
34725 -228923 -208079 -159814 -175833 -227216 -202705 -79034 42175 71453 20574 -53935 -114351
34714 -114351 -131645 -88364 -17666 22835 34548 71059 133727 152625 102094 54639 69308
34703 69308 97738 66816 -2173 -33692 -19804 -22287 -69518 -124901 -156974 -176690 -195503 -199766
34691 -199766 -181771 -153209 -112025 -34549 77966 174182 199417 155494 100182 94115 149107
34680 149107 214806 217102 126798 -11764 -137003 -240576 -344927 -419771 -383599 -216126 -17398
34669 -17398 94699 115277 128277 173957 207155 189492 154889 151730 166861 148999 83178 6919
34657 6919 -32317 -10056 64664 141858 153051 78297 -19356 -60450 -39536 -11143 2988 38057
34645 38057 107558 153143 106312 -27186 -172481 -257362 -259067 -199509 -121266 -64269 -50470
34634 -50470 -86776 -171188 -274698 -327086 -265681 -116593 6810 13908 -73491 -158229 -170803
34623 -170803 -117030 -49380 -17276 -30099 -50620 -38273 -2740 15172 17497 50472 111467 118465
34611 118465 20271 -117045 -194820 -205626 -199390 -168335 -62206 97273 217716 261819 282441
34600 282441 312790 309430 240202 150235 92158 54287 8410 -28031 -33882 -42211 -96440 -179684
34588 -179684 -239673 -256373 -237772 -180998 -94946 -37950 -69054 -165812 -241980 -247349 -208335 -172107
34576 -172107 -153172 -139078 -112634 -61517 7444 61924 76237 68580 84041 144257 232806 318201
34564 318201 365759 340565 234066 86884 -40324 -116809 -147112 -143702 -118268 -81602 -26228
34553 -26228 65636 166417 193684 108694 -8915 -52240 -26457 -17146 -43064 -48708 -44212 -120217
34541 -120217 -274145 -348710 -239348 -66786 -21893 -101394 -133326 -37727 78858 99003 34357
34530 34357 -46861 -114792 -140519 -68387 87078 192992 146617 24511 -15168 53101 110809
34519 110809 84358 30103 11579 2022 -38098 -75445 -69381 -60368 -109753 -188542 -210057 -158136
34507 -158136 -104871 -101275 -122049 -129420 -124014 -108890 -63235 12334 70687 78073 64751 77234
34495 77234 108148 113714 78981 22806 -48111 -143430 -245502 -301493 -275740 -190321 -102301 -52128
34483 -52128 -39752 -39830 -30818 -11286 4810 867 -34598 -98086 -159070 -177582 -154893 -141005 -152765
34470 -152765 -115035 41682 232413 268992 101522 -85442 -96490 24896 69975 -54770
34460 -54770 -234521 -325219 -313302 -269027 -231440 -191362 -135990 -65414 10083 70244 104783
34449 104783 129502 148760 121593 23892 -74679 -80426 -20624 -19382 -107830 -165460 -99888 16053
34437 16053 60075 27381 -6259 -18796 -39884 -63676 -64311 -66222 -103256 -133402 -90661 -2227
34425 -2227 47149 56422 104856 202766 259739 231678 193965 216750 255186 228457 142933 70488
34413 70488 49102 62746 84793 91213 61233 8963 -16407 -3732 -18822 -119119 -254695
34402 -254695 -310404 -239371 -110019 -22648 -15046 -50459 -69435 -48214 -19020 -29650 -80534
34391 -80534 -122009 -119900 -91745 -63071 -27079 24036 66104 80698 92927 124127 132668 57295
$$ [...]
##END NTUPLES=NMR SPECTRUM
##END=
