##TITLE=31Pdec_70-2024
 CDCl3+DMSO-d6, 64 sc
 6.9.2024
##JCAMPDX= 6.0         $$ Bruker NMR JCAMP-DX V2.0
##DATA TYPE= NMR SPECTRUM
##DATA CLASS= NTUPLES
##ORIGIN= UXNMR, Bruker Analytische Messtechnik GmbH
##OWNER= root
$$ XWIN-NMR		Version 3.5
$$ Fri Sep  6 14:10:44 2024 Russian Standard Time (UT+4h)  she@DPX200
##.OBSERVE FREQUENCY= 81.013821
##.OBSERVE NUCLEUS= ^31P
##.ACQUISITION MODE= SIMULTANEOUS
##.ACQUISITION SCHEME= undefined
##.AVERAGES= 64
##.DIGITISER RES= 17
##SPECTROMETER/DATA SYSTEM= spect
##.PULSE SEQUENCE= zgpg30
##.SOLVENT NAME= CDCl3
##.SHIFT REFERENCE= (INTERNAL, CDCl3, 0, 198.062)
##AUDIT TRAIL= $$ (NUMBER, WHEN, WHO, WHERE, WHAT)
$$ ##TITLE= Audit trail, XWIN-NMR		Version 3.5
$$ ##JCAMPDX= 5.01
$$ ##ORIGIN= Bruker BioSpin GmbH
$$ ##OWNER= she
$$ F:/spectra/data/she/nmr/P31/2/pdata/1/auditp.txt
$$ ##AUDIT TRAIL=  $$ (NUMBER, WHEN, WHO, WHERE, WHAT)
(   1,<2024-09-06 14:09:49.78 +0400>,<she>,<DPX200>,
      <continue with go, POWCHK disabled, PULCHK disabled
       configuration hash MD5:
       00 E9 B6 7A A2 85 ED C7 34 08 36 98 17 FE 4E 26
       data hash MD5: 32K
       B0 14 72 B4 BE 37 63 B9 A4 FA 11 77 A7 3D 02 BF>)
(   2,<2024-09-06 14:09:52.18 +0400>,<she>,<DPX200>,
      <Start of raw data processing
       efp BC_mod = 2 LB = 1.5 FT_mod = 6 PKNL = 1 PHC0 = 2677.461 PHC1 = 63.68747 SI = 64K 
       data hash MD5: 64K
       F4 02 45 F1 A6 94 79 9D 34 E3 8D 67 F9 6E 8B 01>)
(   3,<2024-09-06 14:10:09.31 +0400>,<she>,<DPX200>,
      <pk PHC0 = -0.4248152 PHC1 = 0 
       data hash MD5: 64K
       10 F0 97 12 6D A8 6F 20 28 08 45 6A F7 D5 F6 3E>)
(   4,<2024-09-06 14:10:17.00 +0400>,<she>,<DPX200>,
      <abs ABSG = 5 
       data hash MD5: 64K
       A1 B9 C4 0C 27 3C 7B 5C 0D B9 3A B0 46 36 50 0D>)
$$ ##END=
$$ 
$$ hash MD5
$$ D3 F8 CB C4 21 FE BD 43 0E CA 33 0F ED 2A 70 32
##$RELAX= 
##$RELAX= 
##$RELAX= 
##$RELAX= 
##$RELAX= 
##$RELAX= 
##$RELAX= 
##$RELAX= 
$$ Bruker specific parameters
$$ --------------------------
##$DU= <F:/spectra>
##$EXPNO= 2
##$NAME= <P31>
##$PROCNO= 1
##$TYPE= <nmr>
##$USER= <she>
##$AMP= (0..31)
100 100 100 100 100 100 100 100 100 100 100 100 100 100 100 100 100 100 
100 100 100 100 100 100 100 100 100 100 100 100 100 100 
##$AQSEQ= 0
##$AQ_mod= 1
##$AUNM= <au_zg>
##$AUTOPOS= <>
##$BF1= 81.014009
##$BF2= 200.13
##$BF3= 200.13
##$BF4= 200.13
##$BF5= 200.13
##$BF6= 200.13
##$BF7= 200.13
##$BF8= 200.13
##$BYTORDA= 1
##$CFDGTYP= 0
##$CFRGTYP= 5
##$CHEMSTR= <none>
##$CNST= (0..31)
1 1 145 1 1 1 1 1 1 1 1 1 1 1 1 1 1 1 1 1 1 1 1 1 1 1 1 1 1 1 1 1 
##$CPDPRG= <waltz16>
##$CPDPRG1= <>
##$CPDPRG2= <waltz16>
##$CPDPRG3= <>
##$CPDPRG4= <mlev>
##$CPDPRG5= <mlev>
##$CPDPRG6= <mlev>
##$CPDPRG7= <mlev>
##$CPDPRG8= <mlev>
##$CPDPRGB= <>
##$CPDPRGT= <>
##$D= (0..31)
0 1 0 0 0 0 0 0 0 0.06 0 0.03 2e-05 3e-06 0 0 0.0002 0 0 0 0 0 0 0 0 0 
0 0 0 0 0 0 
##$DATE= 1725617283
##$DBL= (0..7)
120 120 120 11 120 120 24 19 
##$DBP= (0..7)
150 150 150 150 150 150 150 150 
##$DBP07= 0
##$DBPNAM0= <>
##$DBPNAM1= <>
$$ [...]
##$SUBNAM3= <"">
##$SUBNAM4= <"">
##$SUBNAM5= <"">
##$SUBNAM6= <"">
##$SUBNAM7= <"">
##$SUBNAM8= <"">
##$SUBNAM9= <"">
##$SW= 400.765351723535
##$SWIBOX= (0..15)
0 1 3 0 0 0 0 0 0 0 0 0 0 0 0 0 
##$SW_h= 32467.5324675325
##$TD= 32768
##$TD0= 1
##$TE= 0
##$TE2= 300
##$TE3= 300
##$TEG= 300
##$TL= (0..7)
0 120 53 12 22 120 120 120 
##$TP= (0..7)
150 150 150 150 150 150 150 150 
##$TP07= 0
##$TPNAME0= <>
##$TPNAME1= <>
##$TPNAME2= <>
##$TPNAME3= <>
##$TPNAME4= <>
##$TPNAME5= <>
##$TPNAME6= <>
##$TPNAME7= <>
##$TPOAL= (0..7)
0.5 0.5 0.5 0.5 0.5 0.5 0.5 0.5 
##$TPOFFS= (0..7)
0 0 0 0 0 0 0 0 
##$TUNHIN= 0
##$TUNHOUT= 0
##$TUNXOUT= 0
##$USERA1= <user>
##$USERA2= <user>
##$USERA3= <user>
##$USERA4= <user>
##$USERA5= <user>
##$V9= 5
##$VALIST= <valist>
##$VCLIST= <CCCCCCCCCCCCCCC>
##$VD= 0
##$VDLIST= <DDDDDDDDDDDDDDD>
##$VPLIST= <PPPPPPPPPPPPPPP>
##$VTLIST= <TTTTTTTTTTTTTTT>
##$WBST= 1024
##$WBSW= 4
##$XGAIN= (0..3)
0 0 0 0 
##$XL= 0
##$YL= 0
##$YMAX_a= 20877
##$YMIN_a= -18257
##$ZGOPTNS= <>
##$ZL1= 120
##$ZL2= 120
##$ZL3= 120
##$ZL4= 120
##$ABSF1= 198.0616
##$ABSF2= -202.7028
##$ABSG= 5
##$ABSL= 3
##$ALPHA= 0
##$AQORDER= 0
##$ASSFAC= 0
##$ASSFACI= 0
##$ASSFACX= 0
##$ASSWID= 0
##$AUNMP= <proc_1d>
##$AZFE= 0.1
##$AZFW= 0.5
##$BCFW= 0
##$BC_mod= 2
##$BYTORDP= 0
##$COROFFS= 0
##$CY= -3
##$DATMOD= 1
##$DC= 0
##$DFILT= <>
##$DTYPP= 0
##$F1P= 0
##$F2P= 0
##$FCOR= 1
##$FTSIZE= 65536
##$FT_mod= 6
##$GAMMA= 0
##$GB= 0
##$INTBC= 1
##$INTSCL= 9.790993e-09
##$ISEN= 30
##$LB= 1.5
##$LEV0= 0
##$LPBIN= 0
##$MAXI= 10000
##$MC2= 0
##$MEAN= 0
##$ME_mod= 0
##$MI= 50
##$NCOEF= 0
##$NC_proc= -9
##$NLEV= 6
##$NOISF1= 182.463
##$NOISF2= 159.3651
##$NSP= 0
##$NTH_PI= 0
##$NZP= 0
##$OFFSET= 198.0616
##$PC= 4
##$PHC0= 2677.036
##$PHC1= 63.68747
##$PH_mod= 1
##$PKNL= yes
##$PPARMOD= 0
##$PSCAL= 0
##$PSIGN= 0
##$REVERSE= no
##$SF= 81.0140089999434
##$SI= 65536
##$SIGF1= 159.3651
##$SIGF2= -187.1042
##$SINO= 113.3802
##$SIOLD= 16384
##$SREGLST= <1H.CDCl3>
##$SSB= 0
##$STSI= 65536
##$STSR= 0
##$SW_p= 32467.5324675325
##$SYMM= 0
##$S_DEV= 0
##$TDeff= 32768
##$TDoff= 0
##$TI= <>
##$TILT= no
##$TM1= 0
##$TM2= 0
##$TOPLEV= 0
##$USERP1= <user>
##$USERP2= <user>
##$USERP3= <user>
##$USERP4= <user>
##$USERP5= <user>
##$WDW= 1
##$XDIM= 65536
##$YMAX_p= 397121567
##$YMIN_p= -48566651
$$ End of Bruker specific parameters
$$ ---------------------------------
##NTUPLES= NMR SPECTRUM
##VAR_NAME=  FREQUENCY,     SPECTRUM/REAL,   SPECTRUM/IMAG
##SYMBOL=    X,             R,               I
##VAR_TYPE=  INDEPENDENT,   DEPENDENT,       DEPENDENT
##VAR_FORM=  AFFN,          ASDF,            ASDF
##VAR_DIM=   65536,         65536,           65536
##UNITS=     HZ,            ARBITRARY UNITS, ARBITRARY UNITS
##FACTOR=    0.49542278885378, 1,            1
##FIRST=     16045.7642231865, 0,            0
##LAST=      -16421.768244346, 0,            0
##MIN=       -16421.768244346, -48566651,    0
##MAX=       16045.7642231865, 397121567,    0
$$ Real data points
##PAGE= N=1
##DATA TABLE= (X++(R..R)), XYDATA
$$ [...]
9351 -15577926 -8036626 -320484 4001757 4956883 4765847 4688084 4448689 3716786 2427563
9342 2427563 372988 -1733414 -1480871 2817155 9184632 13503995 13929638 11985901 9607548
9333 9607548 7379855 5749348 5438762 5894947 5338881 3154484 537011 -1720628 -4133145
9324 -4133145 -6654248 -8196684 -9075870 -11560099 -16187371 -19511607 -17987204 -13041853
9316 -13041853 -9649546 -9823384 -9715580 -4157959 6948094 17742196 21747990 17648555
9308 17648555 9731796 3144650 -527614 -3006503 -6043114 -9574068 -12400113 -13215495
9300 -13215495 -11149072 -6596266 -1494099 2298037 4651910 6157704 6224516 4048167
9292 4048167 1050521 10204 1434534 2851190 2191249 -40510 -2392449 -4157634
9284 -4157634 -4840239 -4175607 -3584509 -5365347 -9298538 -12328682 -13026612 -13934691 -17398943
9275 -17398943 -21169209 -20783875 -15044904 -6704898 1143838 6744441 8609350 5948739
9267 5948739 665480 -3370642 -4076435 -3136899 -3825744 -7588597 -12817779 -16465254 -17217373
9258 -17217373 -17350663 -20103856 -24270502 -23459194 -13373028 1227092 10149173 8663423
9250 8663423 1852568 -2682562 -3262342 -3216754 -4322111 -4942166 -4120077 -3761328 -5430944
9241 -5430944 -7551633 -7830955 -6883751 -7060446 -8464086 -8698642 -6542998 -3411037 -892937
9232 -892937 404248 -1078980 -7408441 -16717888 -22592819 -21167442 -16126541 -12807306
9224 -12807306 -10101387 -3650664 4684076 7436963 2058560 -5756422 -10832528 -14039299
9216 -14039299 -16397589 -14576062 -7127793 477465 3151329 4193337 9251688 15499450
9208 15499450 14580322 5297774 -4010097 -6357014 -3062292 1379960 5481439 9361127
9200 9361127 11677008 10988311 7839184 3940494 1209950 1689619 5418838 8384772 6384138
9191 6384138 1524492 903535 7557955 16288985 19864231 16238490 8798953 3044901
9183 3044901 3723458 10819908 17013876 13856867 2481812 -6730248 -7587262 -5590648
9175 -5590648 -8238064 -13675644 -15020208 -11554428 -8316957 -7073323 -5339835 -3582057
9167 -3582057 -5757389 -11594076 -14956409 -12169725 -6715653 -3310896 -2162877 -1869403
9159 -1869403 -3404307 -7372895 -10723212 -10343483 -7659494 -5824171 -4373804 -1075941
9151 -1075941 2082288 -197549 -8831732 -17654658 -20238410 -16542000 -10841869 -5577544
9143 -5577544 27790 6738450 13755454 20081262 24799971 25876119 21485625 13666069
9135 13666069 8160163 8527944 11931816 12949072 10291786 6985543 4713960 1856641
9127 1856641 -1863063 -2550234 2866206 10499990 11995650 3834573 -7853466 -13002540
9119 -13002540 -7643647 2310358 7218508 3434885 -3454893 -5317258 -424542 5755120
9111 5755120 8052626 6984194 5690730 4644912 2323637 -768610 -2622770 -3874101
9103 -3874101 -7351529 -12370949 -13313805 -6749013 2501738 6084593 1934069 -4360316
9095 -4360316 -7940763 -9980998 -12684318 -13412240 -8639337 -1730189 -699926 -7301209
9087 -7301209 -13770053 -13170199 -8337029 -6328774 -7747114 -7470526 -4184264 -2559166 -5436965
9078 -5436965 -9680423 -11490392 -10887962 -8892007 -5133111 -1060665 -834552 -5280835 -8995557
9069 -8995557 -7718491 -4864362 -5621353 -7859936 -5493421 712549 2940270 -2301812
9061 -2301812 -8894255 -9352216 -3316734 4864674 12616414 19378753 23243728 21778083
9053 21778083 15880086 9973830 7846863 9466058 11876014 12366509 10688383 8619905
9045 8619905 7790959 8530559 10726840 14182241 17198167 16767410 12195457 6960764 4550697
9036 4550697 4044245 2888140 2308909 5410541 10451311 11268369 5514385 -2168680 -6895940
9027 -6895940 -9018670 -10560682 -10601205 -7692760 -3374390 701717 6413861 15553360 24357653
9018 24357653 26268213 19703145 9367922 225605 -6122251 -9245834 -8566361 -5851703
9010 -5851703 -5518552 -9611367 -14194612 -13503073 -7266369 -1572236 -1899868 -7097723 -11601806
9001 -11601806 -12253504 -10409989 -7548037 -2433702 5146617 10805497 9650045 2767398
8993 2767398 -4220372 -8228806 -9993512 -9028772 -3374990 4293049 6538695 492971
8985 492971 -7716875 -11608352 -12506129 -14464609 -15969182 -13171903 -8009049 -5859564 -6875641
8976 -6875641 -6771346 -5378377 -7032514 -12046745 -15005386 -13086907 -9412032 -5970451
8968 -5970451 37815 9310800 16061084 15525902 11430065 10638226 13400388 14233747 10764035
8959 10764035 6635292 5965061 8904085 13070311 16532040 18723951 20017377 20756914
8951 20756914 20372260 18320146 16045460 15961581 17786275 18454244 16888361 15944690 17761527
8942 17761527 20136987 19873314 16784917 11790715 4480000 -3763723 -7713837 -4619214
8934 -4619214 -286602 -2833785 -11112976 -15298023 -9460506 1906652 10976850 14788348
8926 14788348 14318063 10530596 5043540 1414181 1891613 4384275 5243329 3765890 2120073
8917 2120073 2485347 6054907 12876479 20283559 23037435 17898382 7772738 -644585
8909 -644585 -3313368 -1884096 -969529 -3602622 -8877583 -13043407 -13212960 -10335142 -7757094
8900 -7757094 -6924100 -6151071 -3903381 -1076242 836217 1502419 497763 -3073012 -7855428
8891 -7855428 -9824529 -7205781 -3558529 -3002051 -4539096 -4701987 -3858192 -5224522 -8485239
8882 -8485239 -9503596 -6866296 -3928107 -3007992 -2036409 826294 3185469 1990359 -1824335
8873 -1824335 -5237356 -7285993 -8476602 -8423229 -7362885 -8068668 -12567940 -18241627 -20869310
8864 -20869310 -20556140 -20647115 -21360503 -19193069 -13348875 -8184574 -7259011 -8602139 -8398792
8855 -8398792 -6425569 -4995494 -4814741 -4994071 -5633556 -7351529 -9143011 -9340332 -7900327
8846 -7900327 -5309918 -376543 7731685 15845540 18710336 14879678 7794085 905691
8838 905691 -4901708 -8745110 -8992648 -7059986 -8064538 -14451954 -21462328 -22071862 -14679467
8829 -14679467 -3437453 6529731 11008411 6712241 -5334312 -17288709 -20435677 -14160292
8821 -14160292 -5313079 800354 3932410 3693515 -2411280 -13178120 -21669659 -22887062
8813 -22887062 -19131375 -14088839 -6678140 3674626 10163838 5134377 -7735959 -15563674
8805 -15563674 -11655512 -2501862 2159665 199743 -4622681 -9499390 -13195435 -13600702
8797 -13600702 -9690529 -4455888 -2095837 -3121831 -5006666 -6436790 -7843942 -8595122
8789 -8595122 -7078096 -3842803 -1896166 -2999771 -5525161 -6857480 -6593205 -6400230 -7508385
8780 -7508385 -9426890 -11172901 -12856347 -15060308 -16915496 -16631379 -14799248 -14739884 -17009074
8771 -17009074 -15895451 -6144575 7525630 13615197 8161475 43678 -1325964 1932554
8763 1932554 1566410 -4026483 -9558861 -12812498 -16658240 -21013314 -20664210 -13856917 -7048318
8754 -7048318 -7163236 -12924170 -17413721 -16499301 -11623577 -6555805 -4515801 -6970702 -12331519
8745 -12331519 -16404912 -16060266 -12022466 -7164503 -3384181 -1309831 -1512527 -4297425
8737 -4297425 -9044744 -14701230 -19970530 -22568478 -20070630 -12711134 -4174322 1242578
8729 1242578 1392146 -3443819 -10766109 -16163766 -16224084 -12123241 -8011004 -5476884 -2858349
8720 -2858349 -530193 -2140712 -8167276 -12674441 -10363989 -3762525 386204 -888573
8712 -888573 -6168732 -13800103 -21561236 -24495261 -19083607 -9138081 -2375974 -1115339
8704 -1115339 -1027719 1007521 3097624 3262928 3018482 3902280 4429680 2999335 955772
8695 955772 463320 1281848 1320384 -955405 -5271546 -9160449 -9068271 -4064630 2153898
8686 2153898 5859223 8895523 15401653 23322503 24816707 16715212 5395638 -1502397
8678 -1502397 -3885213 -6537780 -11330660 -15755716 -16810421 -13395811 -6933523 -1612179
8670 -1612179 -1146388 -3243184 -946665 7801625 16083751 17252887 14072717 13421081 15331240
8661 15331240 13944237 7792718 2209181 1023156 1818836 1150550 -146800 921619
8653 921619 5158135 10662718 14511991 14185062 9625508 4432865 2676643 4055817 4474840
8644 4474840 1757607 -1553518 -1625993 2339330 7443186 9200857 4905432 -3133698 -8617415
8635 -8617415 -7873091 -4178269 -2598589 -2377462 1075254 7806795 12593946 12879411 11666475
8626 11666475 11125004 9164229 5087614 3242376 6912496 12536240 14370273 12106360
8618 12106360 9812747 9579604 10047599 9330264 5838582 -1714325 -11118169 -15348746 -9368916
8609 -9368916 2116091 8178706 3592254 -6199579 -12575234 -12765320 -10168659 -8670062
8601 -8670062 -9044660 -10025930 -11192946 -14209282 -20722564 -28760131 -32528727 -27514845 -15526370
8592 -15526370 -3426360 2866674 2300819 -2268847 -7137804 -10055382 -10898737 -10459373
8584 -10459373 -8748371 -5592320 -2654515 -2221403 -3104638 -1080952 4364598 7214532
8576 7214532 2628268 -5241648 -7963586 -3678977 2065895 5353313 7477221 8919596
8568 8919596 6528918 -327527 -6459844 -8110436 -9296928 -15603829 -24208233 -25888879
8560 -25888879 -16546040 -1766942 10722458 18740387 24030285 26784260 25418555 20593223
8552 20593223 16055766 14633120 15264870 15246664 14144641 13575646 13528522 11537092 6760077
8543 6760077 2700947 3341906 7593211 10481425 9779065 8414361 9316877 10661984 8478319
8534 8478319 2583941 -2440389 -2243555 2633854 7472291 8335832 5959367 4272477 5185372
8525 5185372 6350813 5165589 3157396 3792780 6896913 8542979 6561678 2940480
8517 2940480 126515 -1910168 -3892177 -5475755 -6453037 -6925737 -5502313 -881060 3797866
8508 3797866 2914686 -3100526 -6515851 -3435378 -770924 -6053351 -14717461 -15644145 -7201307
8499 -7201307 1120004 3071092 2507956 3630938 3362640 -1308512 -5567992 -3698437 570724
8490 570724 -1469107 -10338531 -17107581 -15808592 -10605387 -8198237 -8194014 -5176249 2171271
8481 2171271 8520075 8774627 4451678 1409165 2483822 4697484 4190815 1707731 1095815
8472 1095815 3585312 6620536 8464090 10548648 13746854 15450037 13249389 9483213
8464 9483213 8526624 10143273 8999891 1600652 -8638840 -14419983 -11515742 -2235121
8456 -2235121 6888637 10404275 7987397 4002472 3048666 6117571 10997472 14945245
8448 14945245 15809404 12106026 4573403 -2463976 -3629176 2649605 12653539 20704355
8440 20704355 23123523 19848011 14255873 11113618 12277708 14141726 11668246 5311891
8432 5311891 1144833 3084083 7995490 10511590 9974968 9585144 10555175 10869380 9356729
8423 9356729 7442089 6238932 4733812 1913582 -1531122 -4758372 -7999872 -10778710
8415 -10778710 -10666765 -5854652 1855843 8386775 11355946 11430759 10328585 9129453 8340362
8406 8340362 7774652 5938691 1113733 -6099951 -12416945 -14962061 -14017492 -12023545 -10768212
8397 -10768212 -10509877 -10932824 -11416042 -10674089 -7791178 -3975179 -2005551 -3277925 -6222888
8388 -6222888 -8240767 -8530175 -8414821 -9396197 -11437227 -12801571 -11248468 -5972663 1043335
8379 1043335 5977917 6118445 1958921 -3589720 -7691235 -9447448 -10229269 -12424189 -16833394
8370 -16833394 -20785370 -19975918 -13192642 -4337635 1486791 3329152 4493028 7587539
8362 7587539 10982038 10692332 5038228 -3101912 -8667882 -9184565 -7126834 -6969853 -9924581
8353 -9924581 -12679982 -11519607 -6088343 1408201 8404473 11844274 8456631 -1610822
8345 -1610822 -12596197 -17831203 -16391432 -12514528 -9307794 -6496044 -3907113 -2775638
8337 -2775638 -2660565 -1163718 1597666 1966458 -1584157 -5089593 -4077812 848077 6042753
8328 6042753 9639433 11246826 9445390 3476928 -4022284 -9389062 -11869999 -12392229
8320 -12392229 -10402151 -5626716 -1152837 -185325 -780674 1317865 5084301 4902268 -469426
8311 -469426 -5168989 -4607846 -1782938 -2076679 -5497663 -8029980 -8655657 -11221366 -19346451
8302 -19346451 -31216919 -39451252 -36413672 -21716054 -4727409 3202227 160002 -5176848
8294 -5176848 -4565549 1091756 5581823 5758380 2812263 -1516710 -5709926 -7324865 -5328745
8285 -5328745 -2890397 -4330225 -9485973 -13791434 -13603753 -9294828 -3933672 -1128203
8277 -1128203 -2988114 -7737946 -10529726 -9014319 -6389724 -6129283 -6147316 -2573906 2548186
8268 2548186 3052260 -2017942 -6483288 -5585498 -1543477 1177859 1763579 1956667 2603966
8259 2603966 3495100 3934453 2252548 -2101637 -5359165 -2828114 3189239 4380430 -1888592
8250 -1888592 -7633707 -5506384 351226 1018218 -3660656 -5988885 -3013232 481
8242 481 -708159 -1597243 1697922 7758141 12561338 15268954 17603218 20233137 22522253
8233 22522253 23757940 22455224 16463395 5947938 -5191002 -12559170 -14806458 -13317544
8225 -13317544 -10505763 -9262748 -11340387 -14627103 -14622250 -10601271 -7701890 -10314257 -15721192
8216 -15721192 -17403611 -12991010 -5895558 -628701 206767 -4142575 -11411157 -15767783
8208 -15767783 -13066193 -7102086 -6191488 -12333820 -18321112 -17878687 -14093914 -13645642 -16110893
8199 -16110893 -14848316 -7568729 81936 3165771 4570308 9543164 16010601 15627995
8191 15627995 5009767 -8114490 -12522937 -5593157 4691991 9231601 6816204 3210827
8183 3210827 3575410 7539208 10639563 8687489 1064506 -8405261 -13595819 -10783197
8175 -10783197 -2082194 6633214 11453483 12951062 13131957 12285152 10153198 8027375
8167 8027375 7179189 6267382 2887915 -2633678 -7370774 -9625020 -10233688 -9972264 -8453268
8158 -8453268 -6446011 -6533520 -9795513 -13863725 -15823704 -15051674 -11637827 -4603779 5598789
8149 5598789 14822668 18728577 17441397 13951559 9619616 5002467 3408440 8117656
8141 8117656 15934177 19149897 15514586 11088725 10970595 12605829 11848687 10349519 11518543
8132 11518543 13213793 11051523 6634082 5525793 7967992 8643667 5976962 4473896
8124 4473896 5940068 5279107 -1288485 -9411006 -12563458 -10595880 -7599543 -4740999
8116 -4740999 -594481 3635936 4879476 3610511 3798399 7346694 12234307 15920193
8108 15920193 16937501 13593100 5620125 -2276577 -3151842 3832441 11187627 11491143
8100 11491143 5300269 -1563004 -5919100 -9022364 -11757693 -11924621 -7489196 -593857
8092 -593857 3474013 1456407 -4438988 -8941233 -9431808 -8140981 -8184096 -9150167 -8487054
8083 -8487054 -5999867 -4060518 -3357883 -1341997 4083071 11457013 17499967 20293447
8075 20293447 19746526 16487293 11510684 5999304 838672 -3021232 -4224721 -2786508
8067 -2786508 -1684257 -4092945 -9201835 -13715418 -17031943 -20564418 -21851783 -15746091
8059 -15746091 -4170628 1934606 -3989388 -13776437 -14651666 -6301450 279259 -700424
8051 -700424 -3604599 -2552842 153808 347050 -657604 -56615 652195 -662569 -1610159
8042 -1610159 461623 2366969 -567272 -6160598 -7830674 -4643620 -2523233 -4729531
8034 -4729531 -7197042 -5748399 -2993413 -4197046 -9110247 -11916715 -8506410 -804468
8026 -804468 6309324 10326402 12545628 15212345 18393908 20098199 18995874 15986243
8018 15986243 12813023 10266416 8457621 7716498 8171000 9445025 11677232 15319338
8010 15319338 18683982 17888831 11683436 4473002 1405811 1968947 2115469 1206754 1814330
8001 1814330 3178433 1064062 -4411578 -6849123 -2529016 3913867 6615053 6384724
7993 6384724 6646762 6159247 2435693 -900771 1674194 7015972 5403319 -5411401
7985 -5411401 -15969234 -17975316 -14532543 -13026069 -13757190 -11969795 -7269846 -3752669
7977 -3752669 -2034203 2069580 10141762 17807524 20425256 18057467 13063795 6477011
7969 6477011 -794951 -6042940 -7005110 -4640442 -1554898 1014583 2804142 2768672 309614
7960 309614 -2690139 -3766338 -3435712 -4143498 -5616977 -4357849 1071644 6981761 8885750
7951 8885750 7063231 5370531 5717691 6537915 6311175 5523287 4495805 2134894 -1565870
7942 -1565870 -3971612 -2884394 192914 1927932 1192936 -953571 -4254852 -9232589
7934 -9232589 -14213712 -15480690 -11631546 -5778571 -2191679 -2176420 -3937347 -4665579 -1891173
7925 -1891173 5014514 13067317 17290312 16095541 13602673 14603808 18597031 21052965
7917 21052965 19388038 15165269 11275107 9552185 10478534 12570241 12781392 10399630
7909 10399630 9447029 13217931 17236644 13357009 2062722 -5487672 -1332747 8467464
7901 8467464 12077888 7268511 2203206 2784572 6279280 7999276 7704547 6811348 4411643
7892 4411643 -190013 -4342371 -5276414 -4460245 -5333292 -7993972 -9284839 -7539397 -4566656
7883 -4566656 -3132878 -4491779 -7939264 -10873206 -10033593 -5047293 -179486 193787 -2346952
7874 -2346952 -1920451 3460106 8947445 9761938 7489198 6400723 6369693 4138316 494734
7865 494734 498290 4986876 6912596 95582 -11400270 -17507961 -14662428 -9118649 -7570144
7856 -7570144 -9763915 -12465793 -15413800 -18722605 -18179458 -9674857 2680357 9408448
7848 9408448 7657405 4388613 5375243 7031268 3496695 -3175203 -6079738 -3690667
7840 -3690667 -266262 2525876 7047648 12319357 12762184 7154069 2411594 4073293
7832 4073293 8152574 7821301 4175267 3830337 8067729 11465396 11106631 10203508 10796291
7823 10796291 8993684 1101829 -9784603 -17480375 -20301078 -20928888 -20540202 -17468909
7815 -17468909 -11381986 -4758681 753307 6286629 12210551 14878824 9913500 -1193476
7807 -1193476 -10128483 -9313341 -57463 8662638 10156474 6764088 4923085 5727831 4600255
7798 4600255 217873 -1514079 4586068 14768008 20439487 18496119 13079476 8224467
7790 8224467 4154862 1495203 3489353 10673327 16899216 14926161 4941742 -5485387
7782 -5485387 -9506054 -6903188 -2548871 -1203238 -3756902 -6902330 -6529096 -2599777
7774 -2599777 30913 -2754197 -8768377 -11993147 -10284687 -7615449 -7925270 -9909071
7766 -9909071 -10092855 -8625440 -8473312 -9560329 -7624457 -449163 7394382 8681658 1582625
7757 1582625 -8680976 -15963937 -18579789 -18121667 -15769329 -12040547 -8576777 -7201561
7749 -7201561 -7456661 -7636569 -8168145 -10821106 -13873195 -11888854 -2929137 6985796 10369034
7740 10369034 7421904 4441151 4096152 2672166 -1974192 -5176436 -1704277 6383594
7732 6383594 12545392 14511378 15794761 19112631 22558077 22791149 18476280 9912314
7724 9912314 -976562 -8929373 -7787569 2140881 11973594 13346272 8000841 4431313
7716 4431313 6093920 7672359 3499258 -5048062 -12638647 -16624589 -17578548 -16201107
7708 -16201107 -13669057 -13555947 -19200913 -28918982 -36746189 -38233083 -33190325 -23130016
7700 -23130016 -9466199 4951019 15854968 21058373 21875376 19732596 13867177 4383629
7692 4383629 -4811685 -9155667 -8329912 -5231094 -876905 6427288 16470837 24641201
7684 24641201 25930155 20454153 13591451 10639157 11991886 13916805 13607998 12033259
7676 12033259 10925893 8969635 4147702 -857310 -235303 6573046 12691579 13037831
7668 13037831 11414281 13766623 18060747 17370719 11241218 6701176 7708321 10613655
7660 10613655 11802208 13031023 15925310 17259473 14389192 10677059 10222447 10684973
7652 10684973 7012107 16808 -4563309 -4556804 -3423228 -3811862 -4116458 -2565259 -559139
7643 -559139 28303 110088 1958353 5941972 9959377 11475640 9834389 7052742 5865438
7634 5865438 6512126 6783058 5937372 6104554 7955263 7962140 3436883 -2071209 -2926779
7625 -2926779 383742 2091845 -325361 -3612128 -5012671 -5655467 -6188644 -4192487 1334921
7616 1334921 6886578 8716282 7132210 4292139 1191389 -562036 2162164 9186621
7608 9186621 14111775 10757238 1129786 -6944435 -9085141 -7446189 -5324126 -3030532
7600 -3030532 74897 2935151 4109239 4207114 5693422 10581789 18205900 24735466 25851535
7591 25851535 21264745 15794963 14333089 16366750 17303542 14671540 10770506 9065271
7583 9065271 10173811 12406515 14765048 17877919 22123141 25783624 25783255 20563659 12026023
7574 12026023 4278784 768995 2854022 9701844 17706795 21041103 16021413 5688711
7566 5688711 -2306563 -3105734 2063779 9647481 17027276 21250146 19169577 11693926
7558 11693926 4457430 1350055 477080 -899364 -1590052 -421483 -433322 -3648669 -5497100
7549 -5497100 -1312458 4385645 3101110 -4396578 -8632462 -5632140 -1794248 -2491441
7541 -2491441 -4487581 -3755333 -3058276 -6061425 -10072471 -11005916 -10757953 -13035066 -15714832
7532 -15714832 -14416171 -10982643 -11130468 -15034934 -17304760 -15884929 -14097811 -13395009
7524 -13395009 -11022433 -6703522 -5138590 -8489104 -11546084 -8609413 -1611701 2907524
7516 2907524 2618086 1112291 2083096 5464755 9025738 10915218 10608336 9498313 10462291
7507 10462291 14903748 20335857 22699821 20843763 16739424 11673318 5221431 -1264700
7499 -1264700 -3569228 197834 5250880 4574102 -2386359 -8579352 -7653498 -734716 6263535
7490 6263535 9303960 8033990 3524142 -2178235 -5373525 -3571252 699956 2379593
7482 2379593 818732 665466 4462707 8212363 7222443 3393911 2669817 6620972 10677222
7473 10677222 10750042 8009153 5921123 5114277 2978877 -2659326 -10682298 -17312792 -19421666
7464 -19421666 -17452130 -14717058 -13610941 -13710885 -14249448 -16218822 -19646882 -20647865 -15259149
7455 -15259149 -6286586 -2200597 -7398293 -16548707 -20915902 -17992706 -12204707 -8006927
7447 -8006927 -5984619 -5317533 -6037646 -7140022 -5214339 2123904 12105048 18533068 18040603
7438 18040603 12878654 6805480 184918 -8700995 -18379694 -23372763 -20072807 -11612700
7430 -11612700 -4802180 -2839699 -2958507 -1200877 2523849 5136889 4916300 3802062
7422 3802062 4949072 8597871 11105361 8744358 2450570 -2446365 -2373978 -498587 -3320167
7413 -3320167 -11816555 -18309989 -14320681 -652939 12788540 17433474 13851992 8051307
7405 8051307 2857424 -3451683 -10923724 -15269561 -13730917 -10249768 -11034777 -16437741
7397 -16437741 -20936425 -20564847 -16484445 -11105696 -5122092 -50074 409975 -5104248
7389 -5104248 -12062662 -14364976 -11248207 -7537256 -8027792 -13599911 -21474079 -26827772
7381 -26827772 -25281416 -16645833 -6046676 627591 1983844 533885 -1366044 -2355988
7373 -2355988 -449125 5526669 12803774 16301707 14165322 9486126 6354244 6401696 8954188
7364 8954188 11686436 10939252 4482352 -5190552 -12845047 -16381287 -18151990 -20031422
7356 -20031422 -20499868 -17991440 -14130218 -11684366 -11504646 -13046485 -15551104 -16927744
7348 -16927744 -13948071 -6125340 2164596 5869919 4705735 2685083 3228333 6312454
7340 6312454 9381016 9424678 5068274 -1843475 -7419732 -9643246 -10267296 -11888414 -14468840
7331 -14468840 -16088415 -15898926 -14769270 -13860024 -13830713 -14573604 -14691567 -12426885 -8239016
7322 -8239016 -5019021 -4263121 -3502043 439808 6550851 10141714 8093328 2048668 -3702142
7313 -3702142 -6540721 -7567999 -9507105 -12432580 -12598649 -7331138 -314564 1364923
7305 1364923 -3830557 -9462931 -9491516 -5723920 -4117734 -6482918 -9441178 -9870105 -7895326
7296 -7895326 -5536549 -5274423 -8734608 -14008120 -15867040 -11877429 -6687156 -6410636 -10004352
7287 -10004352 -10444733 -3683710 7920807 20321271 30740213 36011601 34053397 28695603
7279 28695603 27400322 31303388 32560203 25352168 14875583 10096416 10837247 8618567
7271 8618567 -444565 -10042381 -12652893 -9098139 -5770633 -5382525 -4842871 -1943853 -150028
7262 -150028 -4414953 -13802785 -21105608 -20380640 -12999173 -5003647 11659 3274807 6697421
7253 6697421 8932342 6649807 -1335007 -12008894 -19886635 -20938869 -15695943 -8523896
7245 -8523896 -3324709 -506831 1198578 1596396 -68477 -2151758 -1704826 1419159 4565168
7236 4565168 6658019 8954400 10284247 5905167 -5493957 -16790208 -19252767 -13434723
7228 -13434723 -8603951 -10741499 -15394511 -14626316 -7769817 -1645974 -1347662 -4665009
7220 -4665009 -6441183 -5325386 -3787079 -3057544 -1354895 2396502 5769053 5571610 2095528
7211 2095528 -1153576 -1341289 1606766 6253998 11139448 14848826 16131781 14661977
7203 14661977 11150294 6652486 2223940 -1234060 -3678276 -5984051 -8243134 -8594782
7195 -8594782 -5236872 637569 5411667 6604169 4684537 1530523 -1556782 -4367142
7187 -4367142 -7649394 -12427997 -18164100 -21718049 -19676002 -12158676 -3524649 942062
7179 942062 -828126 -5569188 -6295645 1533509 13657512 19296850 12739935 606823
7171 606823 -5949119 -4134776 90294 2606243 5328573 9384034 11255001 8709108
7163 8709108 4836680 2352622 -1210620 -7975766 -13507227 -11935330 -5116023 -1014325
7155 -1014325 -3589635 -9157646 -12890922 -14388720 -15514061 -16224320 -14841029 -10950853
7147 -10950853 -6209578 -2331997 983406 5497481 11400697 15801278 15985297 13573577
7139 13573577 12629505 13580623 12711730 8815088 6054076 7395731 8926360 4826654 -4282522
7130 -4282522 -12110263 -14446785 -12362382 -8671339 -5056600 -2636667 -2271354 -3779073
7122 -3779073 -6295760 -8690426 -8602550 -3517225 4850080 9957059 7739022 2332801 635017
7113 635017 3284148 5701796 6286316 7768907 10761381 11797513 8882901 4170162 -195616
7104 -195616 -4569102 -8812476 -11032372 -10981727 -10855498 -10940484 -8337935 -2287068 2748656
7095 2748656 2174858 -2952693 -7615763 -8315568 -5089635 -413638 1755024 -2098246 -11532723
7086 -11532723 -21483097 -26714729 -26267517 -22993059 -20327348 -20186342 -22091748 -23322253
7078 -23322253 -21431058 -17110794 -12908217 -9373026 -5334431 -1996914 -2689313 -7047648
7070 -7047648 -9411185 -5828994 123198 1418173 -4542656 -14564943 -24020824 -29673432
7062 -29673432 -29761114 -24526948 -16559416 -8896419 -3237273 -695423 -2263001 -6713955
7054 -6713955 -9988154 -9226838 -6325322 -5141943 -6039790 -5598300 -1448776 4689246 8996712
7045 8996712 9213758 6080257 1910765 -1961215 -6074999 -10767672 -14150827 -14025986 -11494778
7036 -11494778 -10183220 -11437420 -12700382 -11331982 -7556679 -2791320 2213214 6286034
7028 6286034 7616835 6408989 5601813 7335045 10517819 12886206 13195026 10665866 5371317
7019 5371317 310449 -426311 2762897 4842709 3431702 2220511 4737690 9157876
7011 9157876 12596665 15971865 20075248 20860884 14207774 2690640 -7627456 -14797885
7003 -14797885 -20305284 -23469723 -22634585 -20180917 -19935184 -20326946 -16302661 -7941551 -1327447
6994 -1327447 -481607 -3614494 -7369035 -9320909 -6356242 3077493 14008883 18316079
6986 18316079 14974169 11605776 13873868 18527943 19290655 14694028 7294171 -550310
6978 -550310 -7124794 -10983039 -12475545 -12835766 -10976731 -5415154 -62676 -2225151 -12467642
6969 -12467642 -22074997 -23660110 -18938331 -12764311 -5683101 2626879 8188169 7542769
6961 7542769 3910104 2289711 1726160 -1074877 -3442049 297821 8762961 13965608
6953 13965608 12308584 8644137 8106328 9648759 9825890 8381298 7347141 7398319 7139924
6944 7139924 4393171 -2406878 -12274820 -21131405 -25101239 -23878691 -19079154 -11166017
6936 -11166017 -1313924 5626032 4999951 -1157999 -6192795 -7424544 -7892280 -9180704
6928 -9180704 -7955504 -1494805 7799191 15465291 18842918 16589526 8932842 381890
6920 381890 -2638416 230177 2084478 -1196665 -4288705 -146214 9595861 17126750
6912 17126750 18300020 14456232 6994671 -3315823 -12530098 -15631126 -13244773 -10887812
6904 -10887812 -10636773 -8929799 -4142625 -652997 -2230575 -6117883 -7827399 -8196519
6896 -8196519 -10690968 -13899961 -12415220 -5330788 1081098 1194409 -2691868 -3622524 1075867
6887 1075867 7069580 9288445 8331709 8796966 12343006 15068551 12566502 5415232 -2172812
6878 -2172812 -7552115 -10953338 -12705528 -12525111 -11537228 -11494027 -11303500 -7980822 -2276064
6869 -2276064 822517 -402786 -737688 4112768 9728320 8482272 482846 -7114688
6861 -7114688 -10547515 -12501440 -14640813 -14443711 -11749306 -11655073 -16848576 -22537724 -23815690
6852 -23815690 -23398609 -26221183 -29812307 -26839057 -15920757 -3726417 3588427 5672226
6844 5672226 4477853 822933 -4120869 -8122450 -10331196 -11304126 -9928058 -4168952
6836 -4168952 3965653 8434845 6513079 2838065 3436712 8250217 12354269 12690788 10706609
6827 10706609 9216575 9032522 8696151 6435338 2407350 -1113448 -2638178 -3808529
6819 -3808529 -6810056 -10052224 -9427913 -3987958 2768595 7436166 8924513 6089559
6811 6089559 -1747588 -10462766 -13016371 -8881780 -6234516 -10264389 -14391772 -9407208
6803 -9407208 2408594 9953366 8546123 4747166 5443708 9253761 11177696 10220700
6795 10220700 8915947 8579512 7950712 4808210 -2349245 -12389707 -20936728 -24018355
6787 -24018355 -22322448 -19074662 -14363386 -5868116 4579115 10298710 7464582 -686307
6779 -686307 -9017053 -15354824 -18284028 -15644242 -9071681 -5083730 -6509366 -6935726 105183
6770 105183 9571799 10220361 582740 -8388959 -8227557 -3114865 -1305049 -2441134 303061
6761 303061 8208026 13805686 10448073 539678 -7832927 -9856592 -7344194 -4656108
6753 -4656108 -3918536 -4472921 -5066740 -5202043 -4817735 -3684407 -1241574 3220374 9706199
6744 9706199 16271508 19501835 17722541 13469797 11024079 11201694 10326314 5063598 -3325798
6735 -3325798 -10488443 -13273249 -11535013 -7228250 -3128668 -1252334 -1171936 -866069 20778
6726 20778 -290759 -1719403 -703384 4654383 10300379 11078985 8314351 7843982 11036959
6717 11036959 13091095 11164245 8831224 9988362 12967233 14251291 14385341 15971866
6709 15971866 18321046 18508532 16298928 13984008 12377380 10821472 10202036 11754476
6701 11754476 13374937 11608461 7527933 6174675 9341588 13287384 14894094 15599648
6693 15599648 17161517 17894959 16138314 13818363 13240689 13470097 13269379 14343459 17411123
6684 17411123 17852563 10468569 -2706449 -13909464 -17938291 -14837213 -6239709 5168479
6676 5168479 13249401 12093930 3586390 -3817167 -5188945 -3159233 -1061577 1619904
6668 1619904 4498961 3481772 -2785624 -8752143 -9440824 -8127273 -11000825 -17188516
6660 -17188516 -19968373 -16068172 -8188535 434569 8337998 13199933 12514338 7710624
6652 7710624 3226555 624857 -2691724 -8362623 -14323093 -17968776 -18906225 -17858392
6644 -17858392 -15560829 -13026627 -10360278 -5757488 1245969 6413163 4858810 -1817665
6636 -1817665 -7033905 -8086469 -8542135 -10894194 -12274037 -9864531 -6002858 -4851331
6628 -4851331 -7334739 -11801752 -16381831 -18456048 -15478237 -9084878 -4976559 -5780124
6620 -5780124 -7262755 -4628548 836375 4961793 7329113 10449052 14555830 17366002
6612 17366002 17539946 15072738 10140008 4759172 3020785 5654936 7005044 2487226
6604 2487226 -3007856 -370518 10516874 19120906 17142389 7855671 495901 -332295
6596 -332295 3161190 7137119 9983060 11887042 12891537 11973366 8194197 2949006 -228991
6587 -228991 583107 3587121 6595428 10294265 15295412 18292494 15675351 9647949 5556698
6578 5556698 3686651 -270913 -5985108 -6652395 546498 8155781 7385797 -850167 -8842072
6569 -8842072 -12582253 -13468199 -11657521 -4714346 6239549 14657789 15496745 10768609
6561 10768609 6017245 3814819 2874458 1311842 -1994689 -7889182 -15622337 -21232847
6553 -21232847 -20212891 -12733560 -4085487 1102950 2924829 3202841 1498905 -2512383
6545 -2512383 -4889413 -870235 7366404 11542743 7603184 603875 -3001933 -3008094 -1837271
6536 -1837271 1372585 7060461 9706481 3943323 -5439209 -7913732 -1994065 2573401
6528 2573401 -580760 -5583424 -4041673 3247336 9856874 13756354 17288295 20386993
6520 20386993 20436759 17696274 15295528 13988312 11301895 6026785 47591 -4298134
6512 -4298134 -5790100 -3834694 349758 2479010 -1220317 -8604730 -12721923 -9238442
6504 -9238442 -713606 7004932 10619905 10997725 10726261 11216333 11857380 11744418 11668177
6495 11668177 12788458 13232551 9009651 171394 -6880458 -6533941 -1402818 1156353
6487 1156353 -1447817 -5375686 -7714125 -10703485 -17358040 -26483746 -33828956 -35904146
6479 -35904146 -31712740 -23189459 -15019870 -11620382 -12852570 -14446562 -13547505 -11792179
6471 -11792179 -11789429 -12759195 -11667443 -7640226 -3484930 -2851156 -6525154 -11513719 -13848689
6462 -13848689 -12339004 -8711035 -3918245 3365896 12878079 19978616 20244753 15475826
6454 15475826 11290960 9639703 8034086 5799858 5847008 9112434 12063192 11613510 8314621
6445 8314621 2873058 -5724483 -15751195 -20951097 -17240935 -8057516 435458 6129427
6437 6129427 9312089 8218050 1728080 -5926554 -8908676 -7151795 -5042403 -3870467
6429 -3870467 -860036 4889542 10914627 15802494 19721335 20309878 14022479 3042478
6421 3042478 -4929969 -6358013 -6248284 -9787264 -14452289 -14652313 -10404859 -6482455 -5276583
6412 -5276583 -5273536 -5295716 -5738418 -5918366 -4091243 -498214 2526429 3817470 4274512
6403 4274512 4230385 2300820 -2420609 -8677285 -14198717 -17541176 -18697937 -18794889 -19005954
6394 -19005954 -18991938 -16998636 -12441960 -7623856 -5746778 -7859619 -12499702 -17078714
6386 -17078714 -18712769 -15663001 -9747510 -5500994 -4871204 -4771434 -2387536 -312923 -2435890
6377 -2435890 -6808375 -7943867 -5609172 -5613470 -10972164 -17612498 -20591782 -19543658 -15523973
6368 -15523973 -7531193 3862719 13211716 15144104 10625093 4781568 532779 -2273727
6360 -2273727 -3678730 -3638941 -3786663 -5236800 -5541408 -1357456 6594219 14301346 18974097
6351 18974097 19582732 14818716 5223669 -3578454 -5108780 -129468 3939263 2515863
6343 2515863 -1450748 -3241980 -2328164 -611385 1489508 4653692 8761970 13035956
6335 13035956 16032254 15158776 9459969 3287304 2781924 7258317 8737444 2313664
6327 2313664 -7786019 -15521733 -21261786 -27885533 -32991983 -31554626 -24628959 -19434949
6319 -19434949 -20830809 -26969989 -32938639 -34727462 -30406113 -21812950 -14905337 -14311227
6311 -14311227 -17617108 -18913415 -17300337 -16894611 -18469973 -17206992 -10834138 -4646190
6303 -4646190 -4791049 -10077379 -14058559 -12917375 -8090710 -2831963 725204 1891966
6295 1891966 1163167 -617293 -3742082 -9037927 -14916679 -17099088 -13124985 -5719452
6287 -5719452 54546 1827731 790125 -802558 -1116576 886302 4423833 7018288
6279 7018288 7380347 7347246 9253678 12211895 12892698 9551431 3660710 -2020117 -5485021
6270 -5485021 -6088467 -4809840 -3844816 -4605268 -6102048 -6192586 -4142702 -1154859 1156145
6261 1156145 2082112 2300000 3540925 6463413 8168759 4086803 -5726516 -14378386 -15378217
6252 -15378217 -10683898 -7722169 -9054357 -9664012 -5396236 731573 3468382 2908624
6244 2908624 3188919 5650769 7360563 5689844 789128 -6173851 -13625556 -18249500
6236 -18249500 -16950219 -11460740 -7508208 -7479775 -7227353 -2747137 3379844 6245794 6570536
6227 6570536 8764326 12020234 9981863 1048272 -6951670 -6315259 394166 4343875
6219 4343875 1829225 -3262844 -6773711 -8605036 -9497412 -8387066 -4901885 -1434093
6211 -1434093 -789493 -3442205 -8001691 -12639649 -15453683 -15303720 -12932811 -9620344 -4625188
6202 -4625188 3738597 13998882 20965711 20443754 12955513 2402900 -7031142 -12501882
6194 -12501882 -13626112 -12699866 -11633296 -8726118 -1610360 6723837 9552865 5440549
6186 5440549 513206 -1124602 -4049776 -13836798 -26907704 -34343638 -33546880 -29585430
6178 -29585430 -25996334 -21371450 -15893370 -14017319 -17133942 -19008051 -13508868 -3809428
6170 -3809428 1197796 -1584006 -6258507 -6527798 -3287778 -1712209 -3580251 -5497933
6162 -5497933 -3899398 913615 6045297 9032044 8577271 4330124 -2142246 -7491422
6154 -7491422 -9853900 -10964759 -12667716 -12591673 -6911210 2912780 10373387 11812501 10131142
6145 10131142 9288681 9369460 9345259 10353048 12718533 13381151 10446286 7445600 8696476
6136 8696476 12627340 13948186 10472920 3748981 -4620017 -12454191 -15174589 -10285587
6128 -10285587 -2324648 2164311 2999817 3679304 2561219 -4761024 -14567931 -16253610
6120 -16253610 -7175276 2444902 3589553 -587536 -3194836 -5272517 -11219899 -17949306
6112 -17949306 -17666716 -9503974 -682555 3506137 4653466 6124709 8356981 9862197
6104 9862197 8906405 4164230 -2659326 -5524468 204666 10636814 16202450 12184348
6096 12184348 2641227 -6503318 -13718974 -19406758 -21243719 -15770514 -3742915 8561214
6088 8561214 14164003 11601710 6361598 5153242 8221982 9232618 4126896 -2826786
6080 -2826786 -5236751 -4357702 -7125007 -14757160 -19596745 -15772144 -7839887 -4413131
6072 -4413131 -6379268 -6856552 -2108495 2926755 1984762 -3482894 -6467488 -4325480 -2195571
6063 -2195571 -5129798 -10393239 -11191930 -6375445 -1824951 -1751468 -3063331 -472348 6398991
6054 6398991 13828723 18900445 20276460 16753765 9291042 2869257 1908408 4523438
6046 4523438 5440071 4040610 4891688 9952642 14964422 15174032 10903262 5491076 669907
6037 669907 -3968380 -8974937 -14024470 -17342952 -15843989 -8380369 651414 4089631
6029 4089631 -377555 -8081593 -13730666 -16516611 -17513999 -16013793 -11392123 -5654473
6021 -5654473 -928154 3258318 7144327 7653316 2134262 -6153972 -10309794 -7309066
6013 -7309066 -184617 6794578 11691243 13563182 11183129 4741680 -2983159 -8328691
6005 -8328691 -8908391 -4560199 1984355 5676445 3061333 -3480483 -7357657 -4715853
5997 -4715853 1650717 6103645 6245543 4004265 1995158 492807 -2256532 -7637144
5989 -7637144 -14394259 -18606781 -17057176 -11334295 -7217451 -8540687 -12695271 -14023624
5981 -14023624 -10786867 -6229680 -3084817 -528855 2219350 2945551 159748 -2861595
5973 -2861595 -1976663 1199278 1432746 -1361171 -779952 6929501 17224098 23529543 24720647
5964 24720647 22734404 17274355 8515859 1895929 3151019 9330152 11353241 6033777
5956 6033777 -597915 -3162050 -3757404 -6211273 -9265948 -9754049 -8451956 -8112850 -8275321
5947 -8275321 -6362474 -2332860 1574825 4689101 8067042 11213544 11474662 7051683
5939 7051683 -735156 -8114237 -11557846 -11011027 -10326842 -12259179 -13405947 -8114746 2025501
5930 2025501 7991728 5209705 216514 1134644 6389792 8869407 7587310 7913942 11867265
5921 11867265 15555960 16456745 16673546 17712908 17558342 14646421 10254110 5576997 710074
5912 710074 -2379150 -616214 4685546 7684200 5687948 2732583 2744755 3241676 -330324
5903 -330324 -6897547 -10648457 -8447107 -3181245 -357328 -3569091 -12401547 -22517558
5895 -22517558 -28183246 -26586052 -20031106 -13510744 -10521854 -11076854 -12413445 -11388895
5887 -11388895 -7501143 -3634547 -2537531 -3215335 -2852653 -1258967 -102660 1553925
5879 1553925 6328046 12535712 14252592 9544835 4038202 3101244 4432596 2359188
5871 2359188 -3649699 -9240397 -11849944 -12586208 -12447668 -10757619 -7189161 -2257416 3855350
5862 3855350 10297172 14231109 13758962 11773978 13403370 18993361 22598827 18884513
5854 18884513 9729544 2362521 1428295 4146133 4239879 524970 -704211 5668636 14406304
5845 14406304 14541373 3809362 -7288311 -8682536 -2535401 2670335 4692346 7402471
5837 7402471 11538446 13878738 14895298 19028302 25837978 28046405 21355291 10563963
5829 10563963 2657831 -1248270 -3360819 -3133354 1222168 7663244 11660946 11952750
5821 11952750 11412738 12405973 14046185 14341100 13289253 13298607 16642882 21811928 22877322
5812 22877322 14955597 925527 -10133061 -12621757 -9669921 -6856628 -4344249 796901
5804 796901 6956436 8192120 2326579 -5636564 -9700955 -9224507 -7239990 -5151611 -1846656
5795 -1846656 3132664 8127837 11007318 10492774 5892371 -2400229 -11190201 -15071741
5787 -15071741 -10986989 -1995700 5450195 8376584 9542643 12058469 14209782 12112203
5779 12112203 6074015 960774 65856 1564082 2042810 1084735 758614 2331910 5226506
5770 5226506 8060458 9196559 7339984 3273654 160988 239709 1674869 816917 -2257036
5761 -2257036 -2819288 2433505 9990097 12701550 8280695 2076068 34523 1068585
5753 1068585 -799246 -7645721 -14492165 -15475379 -9988515 -1572432 5847465 8633207
5745 8633207 4263139 -4590206 -9610506 -5418717 2654088 4186019 -3554861 -13341920
5737 -13341920 -18263899 -18614085 -17411385 -14911641 -10761823 -7290012 -6645488 -7008940 -4943152
5728 -4943152 -272964 3450806 2388913 -4273065 -12534709 -15276511 -9279450 -933965
5720 -933965 -358908 -8454011 -14977611 -12073268 -4327014 -1355342 -5207492 -10205218 -11443071
5711 -11443071 -7963403 -678609 6917815 8304113 383234 -10689372 -15354519 -11254393
5703 -11254393 -3521804 3163725 7050877 6169291 35624 -6203344 -6582337 -3343693
5695 -3343693 -4053522 -9505145 -12468643 -9785754 -7081271 -8295869 -8954785 -4989290 -1059848
5686 -1059848 -3484620 -10046314 -13654380 -12653587 -11146404 -11572334 -12805052 -13757801 -13593829
5677 -13593829 -10085265 -2958274 2701936 1866362 -2562947 -2841627 2823808 8035732
5669 8035732 7564007 3951035 2919722 6030464 10255970 12506440 12590847 12802626 15450584
5660 15450584 20109218 23643282 23985823 22727458 22249952 21994126 20327944 18411946 18237502
5651 18237502 17790339 13096458 5606349 2560840 7894059 16717697 21498570 20429208
5643 20429208 16522338 11280308 3822207 -4399379 -8472706 -5418976 1431974 5540536
5635 5540536 4225088 1115213 1101045 4164255 6037211 4758066 3836901 7178471 12972489
5626 12972489 15577069 12594030 7035380 2745001 852575 979165 2437886 3066737
5618 3066737 160780 -5451432 -8885324 -6993613 -2600889 -755063 -2697009 -5909697
5610 -5909697 -8196237 -8731310 -6590951 -1914157 1776395 -139789 -7961894 -16670951
5602 -16670951 -20708892 -18027835 -9984556 -208592 6195197 5828056 1150097 -942831
5594 -942831 3431428 10858041 15237753 14533314 10888691 6164699 485525 -5613928 -10525605
5585 -10525605 -13060074 -12600568 -8357735 -939129 5783138 7390967 3881266 -728727
5577 -728727 -3962048 -6809619 -9407069 -8874326 -4011032 1078315 1568773 -1792831 -4404435
5568 -4404435 -4474246 -4423607 -6291485 -9238105 -11747713 -13436851 -14438223 -15355188 -17538393
5559 -17538393 -20689555 -20676787 -13326604 -709199 10034763 15046918 17336017 20745635
5551 20745635 24174560 24116291 19799260 13135378 6092953 718133 -658988 1797459
5543 1797459 4270303 3632698 1338141 690838 2460729 5910841 11391013 17823900 19826932
5534 19826932 12715494 56651 -8648553 -8428538 -2858367 2848147 7927428 13285518
5526 13285518 16959587 16017582 11047039 5764818 2896304 2263302 2266330 1892728 1674057
5517 1674057 3196069 6940878 10784557 12331061 12618823 14715436 17807853 16215901
5509 16215901 7105860 -3396816 -6050402 63912 6152842 4963880 -208554 -656083
5501 -656083 5851620 12442334 12420952 7088122 2256891 234199 -1008877 -2378189 -2016179
5492 -2016179 501602 2357411 1275051 -1917501 -5415993 -7604535 -5300799 3992273
5484 3992273 15449456 18097985 7502109 -7139320 -14255966 -14126196 -14770165 -17464113
5476 -17464113 -16176517 -10418148 -7687612 -10544777 -11124187 -3489124 6611544 10441137
5468 10441137 8270069 6057325 5517263 4858828 5434050 9716854 14785439 15280821 11904437
5459 11904437 10138901 10896573 9141225 2321581 -6083250 -12568092 -17241357 -19737923
5451 -19737923 -17320400 -10178376 -4053459 -3823781 -7395907 -9112248 -6810228 -2622045
5443 -2622045 1042620 3190473 3389667 2169214 1477663 2292500 2403816 -1063773 -7189470
5434 -7189470 -11517897 -10940559 -6457326 -806332 4533240 8719711 9668455 5447675 -2151687
5425 -2151687 -7739235 -7807296 -4950004 -4332781 -6353665 -5833231 413700 8123829 10340855
5416 10340855 5955741 371211 -1821898 -1604022 -2309509 -4489547 -5979457 -5798794 -5748691
5407 -5748691 -7638827 -10090100 -9474214 -4336827 2442553 7280302 10510331 14742149
5399 14742149 19151703 19598282 15873233 14280350 19166975 25202437 23318481 12816301
5391 12816301 2090658 -2531012 -3216863 -4820534 -7826636 -9701610 -9477469 -7984392
5383 -7984392 -6053171 -5011759 -6789668 -11183627 -14918144 -15459608 -13734279 -11170151
5375 -11170151 -6848281 -614145 3661053 2486508 -656893 1876423 11539012 20022091
5367 20022091 18186425 6255814 -6705502 -11726397 -6702933 3954247 13843531 18928981
5359 18928981 19223525 16808272 12188575 3825016 -7595275 -16079474 -14754153 -3914536
5351 -3914536 8254637 14770711 17196451 20958600 25255774 22687354 10121201 -4549828
5343 -4549828 -10186636 -4935233 2718329 4715512 1538587 -1042050 78957 2889426
5335 2889426 4048130 2614472 97939 -1449606 -693860 2649582 7461391 10984204
5327 10984204 10138256 4577344 -1534734 -2367232 3847152 12436824 16325382 12150742
5319 12150742 2440229 -7019885 -11411749 -9938547 -6003813 -3770990 -3850433 -3248336 -5219
5310 -5219 3680310 3973131 -297238 -6743537 -11305579 -10422872 -3838777 3356659 4318252
5301 4318252 -1658198 -7499865 -7163932 -2885455 -49406 1548838 5551984 10504573
5293 10504573 10851629 6676115 5203291 10240154 16238183 16579989 13055199 12521456 17056844
5284 17056844 22009786 22683233 19253989 15018770 12129575 9648247 5043516 -2621045
5276 -2621045 -11393122 -18758736 -23885237 -26084858 -23305190 -15570568 -8164606 -6563261
5268 -6563261 -8881185 -8664207 -4877867 -2585180 -2913539 -245568 7328350 12488061 9225095
5259 9225095 2538882 614886 2327323 725842 -4339079 -6330632 -4048420 -4418354
5251 -4418354 -11143585 -17946103 -17073046 -9791877 -4334750 -6002678 -12568749 -18099908
5243 -18099908 -18868336 -15948267 -13461756 -14473377 -18482644 -22801745 -25292527 -25132582
5235 -25132582 -22510948 -18991181 -16710865 -15724260 -13868203 -10831656 -9788350 -12311908
5227 -12311908 -14236601 -10429763 -2057765 4911634 7294589 6642008 4537072 713253
5219 713253 -3895597 -6631449 -6670921 -5682807 -4287553 -1370071 2340542 3832196 2539467
5210 2539467 2146396 5316359 8895707 7011405 -1635352 -11187351 -13842684 -7932550
5202 -7932550 -621000 -909074 -9342307 -17260354 -17765180 -13736389 -11589133 -11028141 -6935883
5193 -6935883 706097 5696845 4386994 -516241 -5353179 -8839037 -9410424 -5698129
5185 -5698129 -1250898 -2473652 -9502330 -15071186 -14929597 -12968853 -12764908 -11124145 -5292309
5176 -5292309 -269426 -1987200 -7526710 -9181569 -5227155 21069 4073681 6867082
5168 6867082 5425810 -3894438 -17498235 -26032951 -25229845 -19571496 -14180574 -9173919
5160 -9173919 -3947784 -962453 -1785028 -3876432 -4802629 -5940584 -8601108 -9924741 -6596514
5151 -6596514 -54540 6028530 11395087 17927692 23929811 24556821 18587276 10916673
5143 10916673 6847916 6632789 7229423 7158633 7346320 8155857 7771169 4040226 -2703227
5134 -2703227 -9012430 -10892736 -7546444 -2290073 1047908 2141264 3186982 4450830
5126 4450830 3346447 -1342401 -6925715 -10207893 -11333702 -12130061 -12473538 -10899124 -7326754
5117 -7326754 -2394228 4362909 12237115 16748680 13845275 6157363 207357 -2569991
5109 -2569991 -6477562 -12566322 -15593408 -12570834 -8126443 -7506692 -9892321 -12995744
5101 -12995744 -18209463 -25253247 -27546658 -20792832 -11713103 -9316675 -10797408 -6248609
5093 -6248609 4388357 10553603 8073549 5241521 7986749 9449257 1042553 -13619376
5085 -13619376 -23292853 -23054587 -17533648 -13609501 -15008356 -21244495 -27449965 -27606096
5077 -27606096 -21154857 -13552163 -8064032 -1701014 7529657 15041561 16558308 15751648
5069 15751648 18654951 23835239 24491700 17971923 7421327 -3554074 -11774334 -12588630
5061 -12588630 -4538137 4888186 5473446 -3021730 -10520484 -9844898 -4257169 -422827
5053 -422827 -58185 -1589292 -4927663 -10139576 -14289445 -14005480 -10325518 -7813314 -8840756
5044 -8840756 -10947263 -10390018 -6794731 -3127246 -1682169 -1802102 -2068156 -2712072 -3955282
5035 -3955282 -3853058 -1149370 883539 -2066888 -8094467 -10403648 -6959623 -3458356
5027 -3458356 -4643175 -8260695 -10818373 -13652286 -18462872 -21487463 -17929994 -9407787
5019 -9407787 -2067414 447555 -1637683 -6690371 -11491697 -12162799 -9432697 -8978728 -12311588
5010 -12311588 -12629676 -5321189 3364733 5613887 4297986 6667199 10842152 9919261
5002 9919261 6245534 8760003 16811286 19676248 13832977 8204370 8772199 9779423
4994 9779423 5333260 -1027283 -4820403 -9079941 -16507291 -20961097 -15537182 -3895387
4986 -3895387 4578192 7140044 7882125 8559872 6608819 1309216 -3940057 -5681894 -3357583
4977 -3357583 1044713 3942285 2488844 -1853348 -4177837 -2383932 207621 291858 -853196
4968 -853196 -672292 317002 520806 709370 2491313 5670256 9391489 13465528 16713423
4959 16713423 16795054 13418919 8888484 4266871 -1552485 -7998436 -12394923 -14719284
4951 -14719284 -17925851 -21767312 -21698262 -16491645 -11410472 -10375201 -10204964 -6729439 -1938127
4942 -1938127 -439654 -2421760 -4416860 -4309626 -2371593 -155339 -635327 -5898190 -12857233
4933 -12857233 -15675514 -14158263 -14308965 -18568017 -22010855 -21049068 -18611080 -16718553
4925 -16718553 -11719410 -2557288 3502887 377751 -7517909 -12311314 -13470750 -14522279
4917 -14522279 -14475555 -10599575 -5589183 -3980630 -4425258 -2629562 694472 1175765 -2474118
4908 -2474118 -8351257 -14793043 -19307705 -18343430 -12776084 -8696667 -8405507 -6904545 -1887087
4899 -1887087 805544 -2516431 -6693262 -8308288 -12803809 -22194473 -26545705 -18897887
4891 -18897887 -8284285 -5268806 -4952153 1293705 7612301 3764855 -5867566 -10843303
4883 -10843303 -13069002 -18453353 -20797269 -14815841 -13094568 -25044000 -32578894 -18373080
4875 -18373080 -3000275 -8604085 5397938 107503438 279286786 397121567 368414796
4868 368414796 242255901 139345572 107458048 100402516 75710151 46964058 36916699
4861 36916699 35876647 27182864 16534825 14642124 16028138 12775973 9959109 12817855
4853 12817855 14788353 10635787 7202363 10357652 14426333 14171353 14464506 18627504
4845 18627504 19585430 12651123 5928065 7707495 13247690 14104867 11818586 12235097 13919340
4836 13919340 12491529 10463705 13012718 18469024 21528827 22047276 23061398 23720264
4828 23720264 21369347 17624648 15779634 14579420 10304628 3093652 -3385191 -6543593
4820 -6543593 -5703093 -1051099 5087942 8831176 9044194 7785779 5155235 -1120722 -9132926
4811 -9132926 -12393383 -9266685 -6122854 -6984231 -7025804 -1732545 4327375 4666377 1044795
4802 1044795 -910979 -1494513 -4613080 -9386047 -11617175 -10801461 -8673052 -3774658 5066318
4793 5066318 12362752 11036179 2649042 -4594094 -6923538 -7015457 -6139081 -2241797 3839759
4784 3839759 7656863 7839467 7202256 6268488 2217900 -4133377 -6731525 -2466024 4075031
4775 4075031 6855139 5412556 3240565 2628911 3338777 3746884 1897411 -2240023 -5288415
4766 -5288415 -4115229 -483057 1768277 3218602 7048106 11102106 9075346 1438499
4758 1438499 -2439061 2769906 9917518 9537110 3059768 -879829 537241 2561023
4750 2561023 2154342 1350653 1377668 413473 -1393995 -610045 3540317 6819147 6246862
4741 6246862 4645130 5957564 9439985 11719131 11890143 11267272 10328392 9253255 9428393
4732 9428393 10723897 9200408 2115423 -5877317 -6801258 178345 7713543 10806985
4724 10806985 12483515 16056130 17701633 12392600 3335103 -1393089 -97515 1458215
4716 1458215 289722 621418 6017615 13196457 17503670 19926029 23777222 27319805
4708 27319805 25206473 16697806 7761298 3987840 4666205 5500221 5061353 6157311 10878256
4699 10878256 16190390 16480534 10824327 5416220 6324332 11188103 11830608 5072281 -3412448
4690 -3412448 -7387787 -7690353 -8680523 -11123722 -12973020 -14408511 -16913690 -18656550 -16015795
4681 -16015795 -9694602 -4569630 -2610279 -166919 6078507 13808059 17678586 15039096
4673 15039096 7704961 42797 -3682397 -2176899 1393729 2371001 -202006 -2993215
4665 -2993215 -3160214 -1244530 1225287 3939201 6083997 5241924 431584 -5461855 -8505879
4656 -8505879 -7998534 -6518519 -6775212 -9333556 -12141939 -11956399 -8342336 -6175110 -10242883
4647 -10242883 -16516089 -14532582 -2062495 8443776 4661269 -8480983 -15008823 -9227112
4639 -9227112 -751412 2569591 5463575 13568478 20595930 16425950 2651507 -9566873
4631 -9566873 -14497040 -15415090 -14447850 -8942861 257968 6106255 5081198 2574578 3844191
4622 3844191 5730600 3038772 -1948268 -3153967 -689734 -244300 -4048637 -8679935
4614 -8679935 -11060127 -10857988 -7506508 -910565 4650912 3439622 -3739075 -9963557
4606 -9963557 -11817462 -12584604 -13987125 -11733942 -3605407 4107076 4483655 265968 -611671
4597 -611671 2452375 1916412 -6214217 -16530739 -22013058 -22579560 -22848502 -24846245 -26569300
4588 -26569300 -26301437 -25011603 -24113190 -22974787 -20101122 -16235814 -14475089 -16061184
4580 -16061184 -17205408 -12525604 -1697966 9962345 18142678 23439997 26999796 26277411
4572 26277411 19280968 10649259 8258213 13684208 20106636 20502229 14873818 8636399
4564 8636399 6537073 8955511 11989258 10689264 4187013 -2480549 -3950670 -1299138
4556 -1299138 126366 -879056 -98867 3684876 4445738 -2895308 -13490142 -16747231
4548 -16747231 -8552067 4476855 12717310 12557602 7773722 4722613 6869971 12324429
4540 12324429 16127525 15712035 13607068 13564244 14974898 13496630 7436868 1273544 1244012
4531 1244012 7823919 13647334 10013399 -3438275 -16029941 -15641541 -2353027 10166461
4523 10166461 9773547 143059 -4526573 1890395 10291663 9744725 2080952 -2002519
4515 -2002519 2228300 9278798 13194202 14774207 16978962 18692483 17161904 13341597
4507 13341597 10247816 7473267 1674049 -7470911 -15220526 -16479778 -10517025 -1022371
4499 -1022371 6349001 6933985 769697 -5994553 -6266570 249614 6748688 7514059 3731062
4490 3731062 158428 -711486 882574 4359956 8701394 11846791 12843380 13085632 13299699
4481 13299699 11443478 6265591 665641 -1857898 -2103128 -2750993 -3100582 -942822 1831839
4472 1831839 1302024 -1033711 874976 8027931 13719463 13124128 10040664 10382929 13833904
4463 13833904 16787209 19560139 24464311 28737183 26092899 15956969 6072382 4277869
4455 4277869 11035957 21079754 28894124 30970226 26200318 17305278 10324287 9629286
4447 9629286 13446527 16057210 14235226 9807582 5892951 2883368 -371698 -2849762
4439 -2849762 -1552539 3844729 8501766 6576013 -2431150 -12920061 -18701191 -17987203
4431 -17987203 -13123062 -7368860 -2902610 -596898 -254223 -1250177 -3493581 -7236119
4423 -7236119 -11489378 -13501776 -10935110 -4610027 1490388 3369064 547127 -3399536
4415 -3399536 -4407137 -2404583 -1315600 -3900241 -8071904 -9904481 -8606010 -5793922
4407 -5793922 -1356591 5607596 11750222 10523207 565142 -10888837 -15911810 -14049373
4399 -14049373 -9596058 -4222264 3045781 10643400 14693990 14392325 12922819 12688639
4391 12688639 13346104 14845327 18266740 22328050 22766102 17383446 9243324 3009714
4383 3009714 165974 -667424 -919076 -1332687 -2080722 -1978740 345217 2869709 487007
4374 487007 -8359858 -17694739 -20266239 -16172617 -11187772 -7773308 -3238567 2617107
4366 2617107 4228601 -1783939 -9757743 -11027427 -4625172 2780850 6230691 6478430
4358 6478430 4832432 -96476 -8243996 -15310476 -17491512 -15936098 -13436405 -9715734
4350 -9715734 -3845890 1162443 1002046 -3700357 -8186237 -9985706 -10097894 -8236850 -2390362
4341 -2390362 5655155 9477085 5302991 -3489491 -11198609 -15358956 -15523513 -11355264
4333 -11355264 -5670366 -4969628 -11595731 -18288747 -16457704 -8228146 -4025976 -8512752
4325 -8512752 -15387231 -17568666 -16459011 -17652486 -21851608 -24643430 -23315531 -19747034
4317 -19747034 -16835105 -15138905 -13636620 -11770979 -9716116 -7619952 -5724953 -5172221
4309 -5172221 -7559145 -12581457 -16514337 -14961008 -7989132 -831046 2033725 1913310
4301 1913310 2908856 5370994 5633932 2124182 -1657579 -1533139 2234326 5726565 5935465
4292 5935465 3303347 437438 -900162 -1640259 -3927344 -7391116 -8318433 -4331751 1351500
4283 1351500 3105856 -216347 -4751861 -7847044 -10882062 -14755800 -16567762 -13620414
4275 -13620414 -8144352 -4948320 -5772993 -8531312 -10896589 -11920073 -10840308 -7202704
4267 -7202704 -2463002 763669 1839880 3039692 6496521 11148710 13778035 12965930
4259 12965930 11040731 11186497 12862167 11722594 5137107 -3633889 -8665693 -7851108
4251 -7851108 -3997763 -498518 920928 -1252710 -7499493 -13796690 -13450219 -5192759
4243 -5192759 3981790 7250973 6060040 5841306 6600530 3572147 -3450099 -7583059 -3769443
4234 -3769443 3907499 6896697 2232093 -4612800 -6284843 -1384152 4258265 3601576
4226 3601576 -4373308 -13848096 -18804880 -19159435 -19025456 -20427704 -21362459 -19586470 -15406508
4217 -15406508 -10153845 -4285535 1941083 7454345 10853406 11073004 7866541 2996004
4209 2996004 28158 484907 860345 -3271015 -10406644 -14502920 -13929767 -14276916 -19923836
4200 -19923836 -27295488 -30108810 -27522633 -22530833 -15482013 -5184620 4973381 8433376
4192 8433376 3753201 -3565678 -8538740 -11251219 -12769524 -11813115 -8279757 -5603401
4184 -5603401 -5949476 -6499316 -4297016 -1683282 -2475560 -5263627 -5786758 -4594198 -6378613
4175 -6378613 -11247749 -12455496 -5324587 5791337 12762244 13233553 11539193 11577688 12367215
4166 12367215 11046074 7759864 5876598 7694787 11136834 11780637 8224723 4002655
4158 4002655 3066730 4679722 4741004 1373355 -3249467 -6505331 -8287607 -9887947 -11807960
4149 -11807960 -13084937 -11508558 -5241839 3702545 8879426 5755435 -2072116 -7069360
4141 -7069360 -7620687 -8456701 -11162651 -11137885 -6319989 -1877802 -1773884 -1910767 2430018
4132 2430018 7573725 6820842 820025 -4719387 -8394947 -12535905 -16299943 -17961402
4124 -17961402 -21388574 -29775736 -34238637 -21394222 5310926 24451022 22504645 10016719
4116 10016719 4585427 8028835 10828972 11052344 15209462 23408274 27019457 22460564
4108 22460564 16770084 16441693 19016792 19565932 18825755 20238950 23469029 25440317 25221075
4099 25221075 24299026 23600603 22819874 21666706 20204609 18827670 18351010 18559052 16653599
4090 16653599 9714178 -632550 -8636698 -10655850 -8716201 -6928301 -6911297 -8016234
4082 -8016234 -9270632 -9027923 -5044507 2504599 9623043 12483429 11563261 9610739 7141817
4073 7141817 3212657 -212322 1149063 7809502 14356528 15550790 12270829 8892053
4065 8892053 6756373 3911017 520592 -159521 2381970 3579434 862195 -293270
4057 -293270 7038718 19500974 24655469 16096170 2411867 -2820270 3148747 10919207
4049 10919207 11837503 7261461 4281226 6180620 9727604 10555397 8881731 8994212 13335059
4040 13335059 18292043 17589567 10042471 1815612 -361106 3524792 8085020 9536549
4032 9536549 8699117 7577562 6004750 2932060 -487034 -893864 3684569 10825814 15702684
4023 15702684 16859114 18159188 22587158 26029558 22148738 13387469 10641249 18887070
4015 18887070 28966189 29031939 19800213 11566388 8762070 5704301 -2095555 -10345864
4007 -10345864 -12803862 -10055483 -7345764 -6955045 -6689011 -4522003 -1654758 -891592 -3284400
3998 -3284400 -6717878 -8151385 -7420463 -7182072 -7966015 -6069278 517956 6712927 5856844
3989 5856844 -589235 -4581384 -2782208 -184373 -957715 -1934741 1184430 6019031 6734398
3980 6734398 2425170 -2147227 -3070607 -1184128 118543 -1262135 -4362240 -6288637
3972 -6288637 -5666838 -4747726 -6189178 -8052573 -5292188 2977768 11129341 13451869 9847759
3963 9847759 3605536 -2950420 -8224413 -10126618 -8383644 -5907162 -4917621 -3533444
3955 -3533444 905021 6591988 8372374 3841514 -3439687 -6775000 -2236539 6953879
3947 6953879 12225125 8325781 81855 -2841299 2053945 7832638 8594479 6500128
3939 6500128 5881024 6196796 5207390 4320944 5399075 5712176 1602742 -5196670 -9898959
3930 -9898959 -11175525 -10594101 -7919677 -2440044 2578513 2371963 -2763188 -7864486 -9684966
3921 -9684966 -8821889 -6776626 -5069690 -5804205 -8713426 -9401935 -5332498 -1374524 -3448265
3912 -3448265 -8629862 -8991573 -4609619 -4452360 -12924935 -23356679 -27836077 -26777041
3904 -26777041 -24877623 -23259376 -20200072 -15618271 -10497898 -4576776 2135799 7989026
3896 7989026 12240757 16199925 19743732 20005619 16032475 11528294 10208391 11358890
3888 11358890 12665986 14299629 16934651 18392560 15841705 9657761 2305365 -4780518
3880 -4780518 -10621572 -13235688 -11978405 -9879738 -10681896 -14493228 -18491524 -20394477
3872 -20394477 -19037320 -13541655 -5062192 1797011 2459187 -2772597 -9027213 -11324019
3864 -11324019 -7586349 839988 9467293 13094259 10568703 6228206 4658326 5390988
3856 5390988 4897506 2116171 -786109 -1832529 -393974 4125661 11484112 18579627
3848 18579627 21029964 17241432 9411406 1183233 -3847045 -2754966 4168581 11641515
3840 11641515 13461206 9184332 4400981 3831697 6586931 8976722 9298383 8170977
3832 8170977 6237494 3924394 2623636 3885841 7292687 10702524 13072338 15589676
3824 15589676 18763352 19453732 13358977 1338828 -8956585 -10100593 -2636926 6343355
3816 6343355 11354087 12206727 10244574 5529673 -547538 -3897535 -2172965 1867867
3808 1867867 4405836 5782746 8359896 11026570 9984850 4502924 -1890029 -6152845
3800 -6152845 -8382845 -9321286 -8594186 -6674714 -5704945 -6480122 -6719735 -4515972 -2109794
3791 -2109794 -3618543 -8982340 -12350250 -7948983 2848204 11497642 10041937 -1135793
3783 -1135793 -13434825 -17588796 -11131896 257893 7412964 4674678 -5137451 -12308002
3775 -12308002 -9084178 1930038 9950206 7524553 -2007502 -9614800 -10659686 -7637605
3767 -7637605 -4756095 -3072232 -954100 3119796 9056250 15244908 19506829 20397241
3759 20397241 18078957 14440235 12579242 14900710 20154788 23456245 21703625 18087110
3751 18087110 17833735 20148439 19283301 14310272 11965984 16834414 23935529 25480416
3743 25480416 20865538 14929786 9734007 4044453 -1051817 -2273578 288334 2558357
3735 2558357 1544369 -2470074 -7777518 -11542160 -9917410 -2581419 4147839 3864524
3727 3864524 -1179547 -3149975 539500 5492103 8772836 11937910 14856802 14049214
3719 14049214 9891225 8864657 14672732 22147162 24031983 19979445 15214385 13493622
3711 13493622 14575391 15997415 14939740 10860719 7630735 9622375 14692257 15711290
3703 15711290 10643268 5659452 5785854 8425053 9869684 12185806 18185819 24352670
3695 24352670 24963272 20311730 15713571 14974942 18836959 26016884 31306074 27370855
3687 27370855 14280514 2789746 1716136 6777070 9381357 10888985 17574229 25602134
3679 25602134 24498540 15044031 9640537 12075609 10779882 -1511256 -13926985 -12982728
3671 -12982728 -2577594 2973226 9455 -2335197 1442997 6175052 6362924 4246469
3663 4246469 4494046 7175246 9175471 8444112 4605165 -1298268 -6096052 -6731929 -4652569
3654 -4652569 -4877777 -9082091 -12464413 -9532308 -786880 8438681 14054099 15821793
3646 15821793 14964735 11831357 6563740 607554 -3813335 -5869300 -6942582 -8459389
3638 -8459389 -9417947 -7626492 -3484462 -325230 216756 1007391 5266533 11084089 13062755
3629 13062755 9114785 2831641 -1339434 -2922720 -4500107 -7644366 -10890223 -11183705
3621 -11183705 -7115345 -1052412 2726687 2840738 2206971 2876380 1578082 -5855174 -16594386
3612 -16594386 -22247985 -19223932 -13192704 -11069042 -12648096 -13536272 -13015695 -14352083
3604 -14352083 -18682288 -22941445 -23870410 -20882570 -14906845 -7323083 -407334 3798817
3596 3798817 5872512 8466293 12895826 17671491 20396098 19643659 15392427 9548813
3588 9548813 5693241 6029921 8564221 9334187 7190627 4132396 1493175 -1151234 -3500098
3579 -3500098 -4532891 -5333339 -8115632 -11751929 -12527181 -10555459 -10442991 -13095900 -12215846
3570 -12215846 -3342260 8025439 12926482 10452401 6772365 4995201 2886907 -130497
3562 -130497 -911266 1472222 4023018 5697510 9008665 13482966 13597618 7010150 -299228
3553 -299228 -1766116 909056 1683777 -339134 -1102106 721371 2322797 2639322 3914189
3544 3914189 6429577 6612809 2417375 -3029736 -5300202 -3398892 1304690 8061088
3536 8061088 15825684 21181921 20576259 14704372 8511025 6387808 8639915 12707432
3528 12707432 16190118 17858925 17027255 13686707 9392806 6691213 6661106 7367755 5664185
3519 5664185 737481 -4651471 -6743843 -4376464 136482 3613800 5438880 8080413
3511 8080413 13475732 18939478 18347847 8972043 -3670309 -9930628 -5555168 3989074
3503 3989074 9003409 4604916 -5484339 -12968757 -12609900 -6519253 -732917 2277073
3495 2277073 5432543 10274701 12124124 6378742 -2820935 -6544620 -3289684 -167851
3487 -167851 -524925 1598367 10299584 18582391 17762047 11284701 10441794 18353304 26790472
3478 26790472 28828987 26371113 23254881 18411663 9858174 395117 -4913117 -4111266
3470 -4111266 1387092 9016608 15480297 18180336 18461205 20344682 24018032 24173650 17378224
3461 17378224 7328630 -506563 -5784439 -10680608 -13785338 -12089120 -7281324 -4548124
3453 -4548124 -5580654 -7541443 -8506222 -8828497 -7081643 -488104 8927381 13965513 11016445
3444 11016445 5021256 2437240 3112349 3290571 3408570 7243944 14365644 19000877 17453508
3435 17453508 12624567 9660597 10109468 11790683 11797636 8117700 749618 -6960297 -10192719
3426 -10192719 -7831423 -4018799 -2706399 -2634479 -95827 5232679 10434980 14182555
3418 14182555 17831616 21840065 24442326 24494349 22924566 20744480 18180481 16455604
3410 16455604 17762904 22267309 27271515 30479808 32244567 33752590 34894737 34606859
3402 34606859 31390819 23352734 10528256 -2354306 -8826595 -7637976 -3652719 -879994
3394 -879994 1309770 3418208 2373069 -3441963 -9715614 -11168245 -8056574 -3668191
3386 -3668191 1502085 8192714 13625610 13873606 9692524 5242674 2292371 91201
3378 91201 -873173 -47627 -15468 -3167840 -6874804 -7653948 -8073922 -12645291 -18651553
3369 -18651553 -19375047 -15764453 -15549979 -19835923 -20448800 -13452884 -5656350 -3127612 -2198327
3360 -2198327 2120423 6765212 6938679 5333144 7146458 10658941 10455644 6417983 2350198
3351 2350198 -1227606 -6007857 -10414584 -12039789 -13175552 -17166380 -21322172 -20264255
3343 -20264255 -14696269 -10160805 -8394774 -6468060 -3277553 -205847 3657005 10021720
3335 10021720 15736222 15571540 10441539 5996462 3321581 -1482152 -8223311 -11355872
3327 -11355872 -9459342 -8095291 -10389359 -11811715 -7754416 -261358 6058199 9259848
3319 9259848 8389740 2599383 -4747085 -7082270 -3568339 -1165575 -3627807 -4670992
3311 -4670992 2298476 13115960 18215497 15181348 9368803 4982312 2147027 838515
3303 838515 1208613 812296 -2923163 -7921049 -9829972 -8355358 -6646242 -5385138 -2455335
3294 -2455335 2057092 5503924 7235332 8842522 9817453 7707213 3027411 -568911
3286 -568911 -1734939 -2595994 -3719279 -2835019 -246685 -594198 -6118377 -11858578 -11275015
3277 -11275015 -4615455 1434578 1320086 -4284779 -9804379 -9585570 -2774154 5127003
3269 5127003 7073728 2328630 -2258112 -622593 4717471 5806326 -1034230 -11532857
3261 -11532857 -19069776 -20967065 -18693968 -14573227 -10098335 -6241607 -3563168 -1916376
3253 -1916376 -806689 -88617 72410 -150569 -7773 1273757 3684270 6076976 6642544
3244 6642544 4060313 -1447145 -8050472 -13355369 -15720240 -14941882 -12096343 -8887232
3236 -8887232 -6914485 -7117387 -9412367 -12379780 -13308824 -9673561 -2135851 3986321 2599415
3227 2599415 -5959174 -13081052 -10227046 887420 9367083 7290013 -2018722 -9469982
3219 -9469982 -11067604 -10288700 -11509934 -14875186 -17569006 -17116060 -12834201 -6110879 318370
3210 318370 4749961 7782473 9732702 8171936 910964 -9429303 -17348131 -20754043
3202 -20754043 -21644661 -20567423 -15102498 -5325539 3680618 7523021 7518382 7475658 8406249
3193 8406249 9030877 8585685 6115226 -113981 -8717024 -13112470 -8033632 2706484
3185 2706484 9278697 6928849 608820 -1923289 1546352 7421001 11853697 14338110
3177 14338110 16172731 17057604 14886956 9611198 5519733 6737522 10801204 10550167
3169 10550167 3525595 -4429239 -7135598 -5855525 -5936818 -9090452 -13130950 -16910074
3161 -16910074 -20949081 -24476530 -25750265 -24225373 -19271163 -9052569 5035053 15217168
3153 15217168 14474619 6020771 -24803 761454 3575196 3686241 2729241 3578189 4790327
3144 4790327 3926994 2565283 4143688 8887670 13758171 16201248 16080950 14740735 13047134
3135 13047134 9943743 3897169 -2882869 -4194688 2471894 10219919 10244238 3915090
3127 3915090 683396 3817775 6061099 1858023 -3774281 -3062729 4137631 13070585
3119 13070585 21826245 30141996 34429920 30741117 20772078 9508990 -1201881 -11532152
3111 -11532152 -18212444 -16561870 -8005842 -410587 39919 -5915622 -13268247 -17335133
3103 -17335133 -16118168 -11475040 -7994643 -8241250 -9730669 -8730974 -5277174 -1536784
3095 -1536784 2478020 7426313 10717227 9026006 3918441 129269 -1392633 -3885737
3087 -3885737 -8370656 -12078827 -13923710 -16208397 -19179048 -18855425 -13232145 -7007622
3079 -7007622 -6715348 -12887938 -19376635 -19401931 -11203603 864422 9915545 12307385 10215903
3070 10215903 7882143 6744200 6165546 6746610 9065861 10533034 8197826 4189295
3062 4189295 3472416 6362267 8636617 9219774 11372451 15016359 15013610 10111728 6658468
3053 6658468 8769589 11103282 7583713 2073445 2640228 8399030 10523973 5791849
3045 5791849 1322044 4189291 12343347 18575397 19466703 17585857 17038056 18853075 19785760
3036 19785760 15281458 5012781 -4754105 -6400390 1099040 10997567 15596715 12933486
3028 12933486 6998063 2868730 1871890 1141430 -1650045 -4059394 -2290945 1240854
3020 1240854 -1140442 -11361702 -20862050 -21628067 -17298495 -16701171 -20039491 -20005659 -14939758
3011 -14939758 -11230629 -11602315 -10364081 -3581958 4194398 7804550 8812023 9575580
3003 9575580 6631732 -2971268 -13496580 -16297616 -11119923 -4862806 -1138197 2154262
2995 2154262 6107388 8619003 9088350 9231945 8503414 4212598 -2611950 -6551945 -4850149
2986 -4850149 -1155774 -540994 -4091679 -9640038 -14496951 -16208971 -13774224 -9335313
2978 -9335313 -5957531 -3376124 624283 4548478 3748354 -2063760 -6946057 -6882420 -5086495
2969 -5086495 -5805766 -7205991 -4939216 387336 4268553 5025973 4975553 5920708 7421124
2960 7421124 8878685 9945856 9529551 7436817 6015742 6898488 7145569 2315900 -7202884
2951 -7202884 -16583108 -22828331 -26757825 -28837787 -27448865 -22528206 -17324306 -14706310
2943 -14706310 -14073652 -13119191 -10603541 -6683515 -2578838 -210259 204729 2135410 9080406
2934 9080406 18431270 22617385 17828813 8574035 2106476 1236736 4046824 7363639
2926 7363639 8369477 5749777 1715042 499990 2883060 4989242 4509084 4401356 7224834
2917 7224834 9528264 6612094 355587 -2936831 -1138228 2326955 4766992 6329819
2909 6329819 5799767 207174 -9606405 -18002122 -21651771 -23555511 -27140574 -30108826
2901 -30108826 -28008003 -21455472 -15604862 -13310828 -12366426 -9576054 -4963074 -1545784
2893 -1545784 -2507544 -8391776 -15641103 -18547781 -14606354 -7625384 -3602719 -3888607 -4774603
2884 -4774603 -3581004 -1764726 -898049 787758 4766560 7548181 4002692 -4915671
2876 -4915671 -11829328 -11509478 -6573249 -2846368 -1893344 -891350 1872290 4416563 3413726
2867 3413726 -2936327 -13520936 -23947818 -29010061 -27933975 -25598578 -25753455 -25385083
2859 -25385083 -20291638 -13998993 -14166206 -20162772 -22251377 -15745381 -8083652 -6761667
2851 -6761667 -7364861 -1331174 9268357 14013086 9362136 2467459 -814281 -3370540
2843 -3370540 -9597913 -17388190 -21348832 -19842527 -15517948 -11941681 -12041753 -16532410
2835 -16532410 -21335852 -19822471 -10706631 -1157723 1236583 -2238662 -3678817 600881
2827 600881 4974853 1642719 -8680629 -15584018 -10141525 3460634 10959208 4525431
2819 4525431 -7369254 -10670116 -3344507 3888009 3095811 -2197844 -5137075 -4822990
2811 -4822990 -3915504 -3087944 -2597525 -4763786 -9854495 -12858457 -9142234 -934613 5669295
2802 5669295 7584741 5283149 88136 -4749579 -3969121 3161890 8946273 5714169
2794 5714169 -3863527 -10719834 -11646719 -11006457 -11493994 -10661685 -7061015 -2756235 1732141
2785 1732141 8364112 15304019 16184948 9141338 1218092 -336357 3080248 5458552
2777 5458552 5266292 5431338 6524935 5357402 401910 -5284069 -7670191 -6364370 -4816513
2768 -4816513 -6572694 -11411298 -15259510 -14614253 -10494183 -6313082 -2493132 3634612
2760 3634612 12003699 17568417 16214920 10427438 6289448 6199345 7110870 5436323 1453149
2751 1453149 -1743902 -2857697 -4985468 -12109800 -22266757 -26769066 -19543748 -5660497
2743 -5660497 4043669 6173875 6856331 10199086 12067062 8653314 4052812 3292200 3442855
2734 3442855 -724359 -6213558 -5795050 -552589 1182725 -2272146 -3125810 1805589 3797184
2725 3797184 -4698326 -16900393 -19876355 -11710262 -2077496 2259551 3738874 5375239
2717 5375239 4514622 -1073537 -7122358 -8085470 -4880249 -2554055 -2536373 -2187625 -1007263
2708 -1007263 -2208583 -7432229 -13901963 -18083531 -18891487 -16029709 -8757900 1351703
2700 1351703 9544262 13002271 14621717 18102882 21088506 17879810 8748019 1628934
2692 1628934 2946391 10631806 18458373 23671795 26824806 26760425 20889278 10671479
2684 10671479 2717931 2462965 8616485 15152476 17144308 13397569 5236629 -4744307
2676 -4744307 -13113559 -17187337 -16989090 -14472953 -10737377 -5872454 -1938523 -3016187
2668 -3016187 -9689035 -15663702 -13968184 -6071412 -511944 -1684581 -4604746 -3148465
2660 -3148465 1014597 2149712 286137 1849312 10696681 22617766 29282402 25192882
2652 25192882 11529875 -3809301 -11090031 -7671224 -1577062 -2087537 -7572972 -8092480
2644 -8092480 -132582 7971775 7667268 1001868 -4191955 -4846906 -3340275 -1332256 1393713
2635 1393713 3740700 3990189 3127728 3828814 6736590 10491336 14115928 16589653 15857901
2626 15857901 11475125 6488945 3531128 1325745 -1228841 -607580 6050885 13399638
2618 13399638 12792780 4530373 -2101958 -2274664 -1602863 -5592657 -10413921 -10030278 -7245801
2609 -7245801 -9971502 -18448907 -23693600 -19662192 -11180253 -7212217 -10165776 -14993373
2601 -14993373 -16362731 -13046421 -6163733 2898917 11451598 15212748 11874485 4286964
2593 4286964 -2107627 -4831722 -5371591 -4946498 -2316160 3065044 8415986 10310431 8471078
2584 8471078 5265939 3078631 3717504 8206942 14851078 19595144 21042497 22942596
2576 22942596 28260925 33005302 30809937 22584887 15970056 14638147 13741121 8210075
2568 8210075 824360 -1585273 2895590 9544196 12677628 10413617 5018835 875699
2560 875699 1348587 5825593 10331027 12083570 12345596 13572805 15162542 14079010 9283696
2551 9283696 3694000 1251887 3004869 6793770 10494108 14386223 19246969 22946826
2543 22946826 21612065 15063187 8369432 5863704 5927131 4462297 1216339 -1219755
2535 -1219755 -2968162 -6499404 -10992247 -11863329 -6801260 1507747 9241696 14285421
2527 14285421 14923585 10180455 2764065 -2138886 -2256486 741336 5475248 11522260
2519 11522260 15847871 14573184 9556769 6966093 7485390 5038624 -1765512 -4913160
2511 -4913160 951914 9007765 9866581 4766255 1234977 686275 -461796 -943081 3805945
2502 3805945 11630156 15190513 13689693 13490337 15824473 13791408 5042628 -1587438
2494 -1587438 2235912 12679769 19778070 20162950 17639444 14725696 10252611 4072004
2486 4072004 -1381717 -4381166 -5059819 -3337858 1152980 6943279 11252192 13172361
2478 13172361 14304465 15661600 15764258 13009174 8874838 6977551 8540308 10368011
2470 10368011 9017635 5985145 5719692 8265090 8016838 2167796 -3613988 -2363984
2462 -2363984 4028989 7342893 4426793 133319 -1228240 -1175859 -2036039 -2263756 -35489
2453 -35489 2588464 2770897 1538025 2069993 5078152 8460498 10303270 10340704 9483152
2444 9483152 9010191 9113496 8126334 5185748 3239434 5957200 11464688 13538948 10249114
2435 10249114 6565424 5984473 4558393 -2662590 -13140468 -19692954 -19361563 -14813783
2427 -14813783 -8855810 -2546330 2010247 1833810 -3124627 -9197241 -12365973 -10798530
2419 -10798530 -5427248 -530602 -1833855 -10175520 -18274510 -18347907 -12668002 -11519202
2411 -11519202 -19517303 -28884722 -29287233 -20795416 -13077690 -13471517 -20060591 -26515072
2403 -26515072 -29564376 -29448177 -26096441 -19475088 -13604769 -15095296 -24368050 -31714368
2395 -31714368 -27202074 -13336767 -2398641 -975554 -3159676 -1050607 4272397 6620723
2387 6620723 4498256 1107478 -2322250 -6815404 -10637791 -10188536 -6010287 -2724654
2379 -2724654 -2523406 -3474829 -4822254 -8760729 -15162760 -19144881 -16719627 -9801183 -3202340
2370 -3202340 696317 2061693 1017125 -2209300 -5947234 -8118930 -7759084 -4461825
2362 -4461825 1723472 8169213 9710063 3818301 -5173585 -9977942 -8588763 -6214117
2354 -6214117 -8377772 -14177376 -17768390 -15279987 -8575696 -2637562 -1033922 -4189438
2346 -4189438 -10048542 -14940899 -15290823 -10870854 -5932024 -4801712 -6549635 -6577980 -3360691
2337 -3360691 -112701 944010 1803565 4048637 5058161 2283602 -1976817 -4167474
2329 -4167474 -5096293 -7282235 -8950764 -6328533 -992600 894159 -2873184 -7800566
2321 -7800566 -9270738 -7220903 -3410132 1220881 5052550 6103929 5527431 6696820
2313 6696820 9339174 9044262 4449380 118554 -322623 759166 -50754 -1867611 -2979258
2304 -2979258 -5125307 -9313324 -11200118 -6703301 210697 1715625 -2910546 -6587089
2296 -6587089 -4711708 -395294 1594491 859527 -769611 -3126897 -6458452 -8832637
2288 -8832637 -7626752 -2648838 3636354 8127345 8817661 5967310 2218219 249097
2280 249097 -177068 -1650665 -5519820 -10309423 -13644056 -13884592 -9920762 -1950397 6618247
2271 6618247 10430160 7078514 -505869 -7514839 -11468027 -11964597 -8695137 -2354597
2263 -2354597 3747676 6142286 5366339 5050380 6288084 5698219 842309 -4767864 -5274749
2254 -5274749 -458794 3350171 1458679 -2873396 -2574261 4421384 13141482 17663196
2246 17663196 16539904 12119449 7190132 3451880 1493995 832594 622135 806997 1798995
2237 1798995 3164829 4048349 4712125 5688250 5425236 1437734 -5487353 -10991088 -12360024
2228 -12360024 -11461212 -10951729 -10402567 -8370948 -5486619 -2525131 1992038 8466033 12497050
2219 12497050 9218839 810655 -4904976 -3916779 -111126 1024702 -1064426 -3500905
2211 -3500905 -4655712 -4697931 -3491631 -556447 3530387 7092714 8165962 5146483 -1547116
2202 -1547116 -7827313 -8502829 -3379319 1176238 -836437 -7896467 -13205280 -12900036 -8898280
2193 -8898280 -4097403 1111751 5947745 6408074 -960136 -13366424 -23112246 -25305452
2185 -25305452 -22422680 -20714166 -23617224 -29072124 -31659861 -26967153 -15859153 -5189247
2177 -5189247 -1923774 -5329447 -7697337 -4588833 -770804 -2475049 -7452000 -8675386
2169 -8675386 -5826914 -5466887 -9398831 -10952348 -5907999 102798 117460 -3961366 -5701037
2160 -5701037 -4296041 -3665982 -4356670 -3479452 -1477145 -2277232 -6755632 -11653529 -14891980
2151 -14891980 -16558325 -14911685 -7633832 2152358 7276461 5743259 3084138 3485892
2143 3485892 4231972 2108522 114175 3114221 9960039 14434447 12700084 6784921
2135 6784921 1651043 695012 3043783 4299896 1345639 -3755882 -7194529 -9780812
2127 -9780812 -15051202 -21056177 -20803340 -13277292 -6999905 -7957159 -10313469 -5670095 3547580
2118 3547580 8064098 5924862 3773926 4974644 5478265 2736243 228659 -219673 -3370384
2109 -3370384 -12564271 -21725502 -21439528 -10921233 1039700 6286850 4615211 1392269
2101 1392269 1590735 6751136 14806255 21192196 21549217 15018094 4966182 -3921728
2093 -3921728 -9144135 -11024596 -10648993 -8171107 -3537644 1732914 4633420 3197895
2085 3197895 -1216181 -4627471 -3755970 1001042 5854267 7455818 6675742 7446595 11058457
2076 11058457 13350227 9891453 2799472 -1032630 1404787 5988066 7869601 7295528
2068 7295528 6762852 5832878 2343238 -3226265 -8128797 -10972017 -11935704 -10422588 -5711325
2059 -5711325 515594 5273175 7792827 9360431 9836944 7162015 850963 -6261922
2051 -6261922 -10662812 -11325337 -9908669 -8660456 -8177703 -7100479 -4866649 -4302452 -8567608
2042 -8567608 -14819042 -15138722 -6640959 3283756 6114333 3120269 1530283 2639827
2034 2639827 1211886 -3992084 -7250102 -5311848 -2596231 -3531122 -5664158 -4865523 -2800460
2025 -2800460 -4070040 -8655136 -11963764 -11077653 -7374845 -3972757 -3341670 -6266727 -10618026
2016 -10618026 -12176450 -8809994 -2819431 2300047 5595938 7558800 7858999 6828693
2008 6828693 6987479 9779493 12197693 10031225 3795676 -1614416 -2947087 -1724923
2000 -1724923 -1564459 -4642719 -10587077 -16520286 -18005126 -12036243 -44286 12642735
1992 12642735 20357280 20229538 13514549 5115226 333242 175435 569662 -2398950 -7524728
1983 -7524728 -10329328 -8845372 -5688088 -4836557 -7798176 -12631444 -15909570 -16234459 -16017714
1974 -16017714 -18286716 -21569439 -20576480 -13049874 -3165883 3501289 5708838 5623102 5408995
1965 5408995 6794260 10307976 12327509 7291095 -3477074 -10202696 -7357467 -2902547
1957 -2902547 -7295711 -17407799 -21126574 -15846057 -11185880 -12854303 -15593315 -15440330
1949 -15440330 -17322355 -23958695 -27276550 -19868544 -7683242 -1633329 -1995629 -1321433
1941 -1321433 1203924 -222375 -5090467 -5463793 337565 3232098 -3350054 -13698339
1933 -13698339 -18130811 -14769003 -8059921 -977772 5417985 8300425 5135107 -1773159
1925 -1773159 -7185091 -8651938 -7417254 -5277647 -3817045 -5090504 -9245424 -12338118
1917 -12338118 -10153815 -3868056 1270514 2566155 2004569 1944149 2125140 1550899 260374
1908 260374 -1877774 -5680040 -10722841 -14734562 -15927218 -14575595 -11867911 -8662274
1900 -8662274 -5336549 -996848 6666910 17767761 26671730 26420470 18234600 12195992
1892 12195992 15256144 22125143 22320998 13672215 3715224 -1008878 -1354659 -881536 -341703
1883 -341703 768399 1367076 910991 1841082 6465516 12604612 15370161 13018593 8723760
1874 8723760 6464818 7106488 9055884 11165631 13609984 16222149 17362954 15585918
1866 15585918 12096932 9743713 8595353 4416439 -6018992 -19030281 -26548585 -24781900
1858 -24781900 -17582557 -10784638 -6557832 -4658413 -5442659 -8437252 -10413759 -8751916
1850 -8751916 -5772932 -6339840 -11394170 -16820056 -18836384 -17793474 -16051752 -14537330
1842 -14537330 -12698395 -10502822 -9228661 -10480048 -14505957 -19195201 -21383898 -20057792
1834 -20057792 -17663307 -17216781 -18766161 -19850908 -18719810 -15752375 -12344979 -9740089
1826 -9740089 -8366868 -7230990 -4909821 -2206940 -2126675 -5503662 -8730687 -8530505 -7082887
1817 -7082887 -8755527 -12993188 -14761059 -11757997 -6783071 -2532646 1421307 5189855
1809 5189855 6481018 4261519 1129899 -344856 -877900 -1914278 -2563207 -1460865 676441
1800 676441 2675451 4920956 7601946 9170005 8729100 7675763 6715590 3790675 -2296065
1791 -2296065 -8596596 -11389272 -10632671 -7975920 -2928072 4863965 11606560 12728195
1783 12728195 9727084 9049583 13914054 21077580 25749247 25785832 20924251 12331894 4047139
1774 4047139 810809 2629455 4499073 2840205 -842709 -3785304 -5732736 -7016005
1766 -7016005 -6506443 -4238810 -3125876 -5021962 -7526868 -7897097 -7799940 -10109277 -12387758
1757 -12387758 -8442460 2873005 14279463 17564766 12431815 5985295 4436042 7044183
1749 7044183 8275428 4715347 -1211142 -4581054 -4026523 -2949363 -4591264 -7692088
1741 -7692088 -8323532 -4898244 301203 4093434 5225136 4190797 1885604 -575374
1733 -575374 -1446058 816623 5484438 8725696 6337191 -1555698 -9284564 -10701756 -5325221
1724 -5325221 1951642 6759807 8535982 7955293 4470484 -1792748 -8302611 -12853145
1716 -12853145 -16359028 -20430960 -23650042 -23164141 -19080404 -14260777 -10174674 -5946565
1708 -5946565 -1468957 1548126 2034275 383104 -3398433 -9228604 -14067999 -13304506 -6983522
1699 -6983522 -1407051 -1735291 -5452631 -6332517 -2942413 641232 1763083 2633255 5840840
1690 5840840 9578552 9599543 4914772 -199631 -395065 4689485 9295873 7909707 2744941
1681 2744941 2198176 10156318 19703899 21147370 14617760 9734325 12448418 17363840
1673 17363840 15630396 6581930 -2315368 -5249525 -4028446 -4339893 -8615371 -13413959
1665 -13413959 -13117340 -6061310 3190925 8680649 9878363 11585867 16748083 22288324
1657 22288324 23606868 20508388 16398537 13709352 12360590 10738279 6140200 -3073318
1649 -3073318 -13127800 -15912218 -8470498 1396051 3962097 -351808 -3552746 -2679495
1641 -2679495 -2352086 -5038196 -7142936 -6967205 -8854559 -15340672 -21867013 -23882899 -23993589
1632 -23993589 -26799857 -31051330 -32317099 -29771172 -25038202 -17867570 -8770394 -2826837
1624 -2826837 -4289268 -9217416 -9710783 -4254149 1934751 5535255 7898911 10011497
1616 10011497 11022104 11661756 13163576 13009759 8049218 1739652 1236724 6571886 10199688
1607 10199688 8988728 8802058 13900993 19291318 18577483 13548244 10530428 11586006
1599 11586006 14279022 16486123 16950297 14511975 10920836 10840042 14957811 16878497 11285307
1590 11285307 1456678 -5937767 -9481239 -11110727 -9695784 -3371794 4251987 7158082
1582 7158082 5078153 2773018 2429037 2336404 1635794 532345 -2791516 -9395213 -15156664
1573 -15156664 -15629030 -13781986 -15369746 -17681253 -11964105 2083651 13481303 14339818
1565 14339818 8617191 2879712 -3271436 -11927581 -19077939 -19336056 -14302343 -9732037
1557 -9732037 -7006583 -2858784 4316033 12306863 17637158 17091958 9185947 -2666080
1549 -2666080 -11256576 -13245522 -12819176 -14460184 -15828163 -12271973 -4965626 909586
1541 909586 3800736 6209839 9057370 10696269 10429851 8485449 3906826 -2801833 -6454863
1532 -6454863 -2052539 7667859 14489244 14132686 8936846 2250584 -4330010 -8577073
1524 -8577073 -8451084 -6043888 -5689068 -7802492 -9676026 -12100188 -18575777 -27051328 -29746042
1515 -29746042 -23904105 -16202404 -13112225 -13147031 -12748075 -13433766 -17141525 -19506658 -14911028
1506 -14911028 -5504203 1217000 2058814 -362980 -3945415 -8487761 -11348722 -8343807
1498 -8343807 -365455 6010963 6429640 3435270 1710979 2235704 3094295 3014635 1629096
1489 1629096 -1835590 -7622349 -13647551 -16058641 -11997009 -2299762 8013317 13003830
1481 13003830 10985530 5709854 1391798 -1518506 -3673554 -2917533 2510688 8563721
1473 8563721 9021030 4819539 3787469 9195169 14286664 11597932 2749238 -5530371
1465 -5530371 -10877603 -14998138 -16897128 -13566861 -7097209 -4372573 -7890696 -12069628
1457 -12069628 -11148967 -6525125 -3264608 -2831462 -2944028 -2363649 -1998059 -2247114 -2402532
1448 -2402532 -2103453 -806588 3267468 10554756 17000854 17003849 10021105 1286490 -4495520
1439 -4495520 -6802912 -5880050 -137075 10045607 19355154 22592919 20812749 18366451
1431 18366451 15506583 9119525 386739 -4508460 -3422258 -2511831 -7480851 -14677383
1423 -14677383 -16240632 -11800375 -8921477 -11964372 -16521339 -17163733 -15766869 -17841092
1415 -17841092 -23215964 -25408385 -20348580 -11745442 -6259023 -6169870 -9066390 -12654139
1407 -12654139 -16363636 -18582072 -16287461 -9399696 -2737050 -636407 -1202257 617285
1399 617285 5013170 6650123 2754502 -2459785 -3751874 -1631865 17900 63817 -285713
1390 -285713 -1758109 -5632868 -8688826 -5107643 5200088 14723469 17036467 13738228
1382 13738228 10258414 8229611 5708864 2692151 1906594 4188582 6530593 5751801
1374 5751801 2133251 -1541793 -3420158 -4305019 -6363712 -10295800 -13775185 -13396025 -8610088
1365 -8610088 -2821296 224887 232682 -461139 -552166 -1147615 -3839648 -8617000 -13539880
1356 -13539880 -15715135 -13192062 -7005987 -951181 1693518 869304 -1441550 -3876228
1348 -3876228 -5677780 -5295855 -1748093 2571860 3183036 -1187312 -6508208 -8095086 -5873166
1339 -5873166 -3291858 -2235091 -1503555 -159037 480527 -459659 -993980 787824 2441123
1330 2441123 -629903 -7930185 -12297975 -8165824 824206 5741224 2696305 -4224691
1322 -4224691 -9608492 -12046131 -12412035 -11388459 -10665535 -12789500 -17192001 -19491530 -17399637
1313 -17399637 -14172637 -13202649 -12704392 -9877187 -6925205 -7336210 -8608574 -5460670 604566
1304 604566 2304268 -2028201 -5495709 -3703256 -1615365 -4623684 -8642057 -5718233
1296 -5718233 3723287 10881480 9662333 2226951 -5925420 -11010995 -10820027 -4872929
1288 -4872929 3407711 8587620 9367662 9844054 12849666 15296207 12948379 7257174 3668963
1279 3668963 4137924 5018671 2682139 -1925277 -5356656 -5589054 -2237466 4659538 13306910
1270 13306910 19140867 18619866 13828830 10025629 8351715 4768414 -2592939 -9429166
1262 -9429166 -11550368 -11159293 -12326443 -13288651 -9210449 -1123822 4552161 5664094 6838863
1253 6838863 10687870 12993175 9852063 3908779 -655352 -4353363 -8834833 -11623568
1245 -11623568 -10191838 -7780636 -8845420 -11372106 -10609524 -8585768 -11972630 -20451843
1237 -20451843 -25324418 -21932431 -16371894 -16161586 -20014512 -21526741 -18708121 -14630850
1229 -14630850 -11263273 -7861309 -4491534 -2652939 -2134703 -577388 3010676 6489756
1221 6489756 7334744 6044690 5972232 9710328 15623593 18557261 15160359 8239341 4051640
1212 4051640 5153004 8184600 9447194 9941744 12861471 18093926 22018420 22118422 19365240
1203 19365240 15966479 12866210 10331422 9508116 11548036 14982983 15610227 10867100
1195 10867100 4033506 1660640 5921160 12007963 14763338 14855932 15292483 14981821 11101384
1186 11101384 6181046 6213844 11278839 14593156 12696060 10097189 10732768 11315745 8082818
1177 8082818 4437432 5274214 7802290 5661652 56854 -1167836 4404658 9886621
1169 9886621 8910491 3208083 -2272421 -6726021 -12096134 -17388291 -18546292 -13664468
1161 -13664468 -6085226 -1664324 -2964406 -6254685 -5661406 -1106385 422485 -6017154
1153 -6017154 -15671440 -19727536 -16512576 -11572395 -7828921 -2857546 2974564 3436002
1145 3436002 -4248000 -12796931 -13146694 -5733625 1650363 4304986 3301626 -110030
1137 -110030 -6090452 -12042277 -12996755 -8400474 -4273640 -5954690 -11662022 -15921321 -17053093
1128 -17053093 -18023593 -20884515 -23661826 -23342025 -19647765 -14582825 -9652150 -5205101
1120 -5205101 -2010303 -1670190 -4935569 -10662663 -16919064 -22199638 -25267594 -25227459 -22528194
1111 -22528194 -18445503 -12766543 -4144355 5671633 10732560 7333932 -326904 -4962948
1103 -4962948 -5329694 -5714262 -7142669 -5637281 -815635 405001 -7050186 -18180004
1095 -18180004 -23662930 -20720298 -13632646 -6222173 784296 6334713 8393147 6929727
1087 6929727 3948258 895948 -910020 1056388 7031848 11464944 8482338 619047
1079 619047 -3631100 -1567023 495307 -2571751 -7607835 -9648050 -9834798 -11963640 -15303939
1070 -15303939 -16310955 -14694116 -12433621 -8969663 -3204563 1006111 -2095983 -11050792
1062 -11050792 -17221839 -16112940 -13462245 -16625153 -23745098 -25934384 -18556936 -6460966
1054 -6460966 1711019 1611376 -4445111 -10853606 -13701997 -13500216 -13508794 -15435762 -17669824
1045 -17669824 -18069849 -16722363 -14596002 -11381374 -7191902 -5069236 -8185031 -14305335
1037 -14305335 -16514910 -11071790 -2158245 3020329 2070592 -1555719 -3806591 -3837426 -3055492
1028 -3055492 -2541935 -1961897 -271867 2492774 4111756 2117765 -2551658 -5602824 -4423683
1019 -4423683 -1270216 388764 670223 1714538 3179148 3001357 1632167 1401254 2062789
1010 2062789 1425773 478937 2657709 6874285 7149786 2140061 -587798 5394591 15425877
1001 15425877 19818809 16995961 13943125 14825148 16161269 14221958 11013568 10287349
993 10287349 11943086 13221256 12478222 9461104 4347536 -1317413 -4759490 -4964538 -3900368
984 -3900368 -3366592 -2470265 288650 4160008 6932555 7256448 5072006 1141525 -2949156
975 -2949156 -5804335 -7775346 -9707572 -10094149 -6487473 -410890 2983265 2062888 1617035
966 1617035 5558603 10364935 10130705 5463241 2106373 2084089 1916236 -117977 -525922
957 -525922 3494986 8913605 10648673 8016930 4560889 2782333 1576083 -1225467 -5196895
948 -5196895 -6627042 -1725860 8703713 18147039 19576821 12262534 2297976 -3700352
940 -3700352 -3966472 -766346 3382759 7344934 10639357 12644421 12507257 9946325 6887439
931 6887439 7353787 13209350 19888211 19540843 10080379 -1487270 -7078961 -6733666 -6690455
922 -6690455 -9676247 -11347462 -7358272 -568393 1590447 -4041054 -12596602 -16885161
914 -16885161 -15429922 -13417348 -15885542 -21667441 -25176879 -22962781 -16487059 -8886183
906 -8886183 -1675172 4515719 8430206 9361130 8486629 7359712 6172788 4968222 5070632
897 5070632 7208635 9364690 8925261 6255473 3693179 1681964 -1104636 -3953270 -3922051
888 -3922051 -533728 2273561 632632 -4828274 -10553268 -14166119 -15369205 -14454415 -11955287
879 -11955287 -8904770 -5940711 -2876177 -41570 1259105 710810 -115207 -135168 -431765
870 -431765 -2099335 -4158405 -5323362 -5923826 -6051841 -4086155 124642 2915137 1436235
861 1436235 -1228378 -264903 2677426 1077127 -6375428 -12982645 -13033701 -8531118 -4613719
852 -4613719 -3055887 -3349570 -5724004 -9074920 -9523229 -5434876 -1113719 -1275562 -4386417
843 -4386417 -5782360 -4786008 -3746655 -2233240 2096823 8001831 11542871 11730226 10136045
834 10136045 6275271 -263269 -4219744 639527 10416124 13298945 5664466 -2349278
826 -2349278 -1569132 4119426 6472076 5954054 7552785 9294394 5300274 -2378569 -5359276
817 -5359276 -2155365 -246167 -3502144 -6466126 -4310964 -610632 -438360 -1866150 17766
808 17766 4749706 7757101 7552159 6731083 7190712 8584757 10773590 14039925 16851499
799 16851499 16287822 11139729 3019797 -5272352 -11060631 -12265295 -8481847 -1570960
791 -1570960 5770272 11529591 14028488 11720854 4917647 -3340277 -9649645 -12834530
783 -12834530 -13444085 -12233210 -10395559 -9551872 -9712892 -8750969 -5718502 -2990363 -2850112
774 -2850112 -3661281 -2303348 963004 3381137 4418938 5658085 6161514 2375943 -5946349
765 -5946349 -13293831 -13998654 -7999412 451787 7202059 9504257 5927947 -1668450 -7667787
756 -7667787 -7813275 -4591302 -4571301 -10197207 -17012569 -19763695 -18464668 -16618079 -15612304
747 -15612304 -13827422 -10745652 -8903881 -10546908 -14190682 -16283771 -15433823 -13167506
739 -13167506 -10786651 -7611034 -3153336 680784 1260985 -1453690 -4713979 -6133889
731 -6133889 -6114855 -7032285 -10622600 -16135705 -20593694 -21119802 -17582841 -12691264 -9005761
722 -9005761 -6428438 -3379099 331963 3193800 4242474 4091134 3568467 2716113 1525014
713 1525014 355537 -1080841 -4083416 -9304590 -15277770 -19517310 -20933912 -20456206 -19172217
704 -19172217 -16534722 -11287722 -4454996 -339696 -2790752 -10255149 -16424307 -16907607
696 -16907607 -13676267 -11499909 -11869517 -12799054 -13013238 -12989407 -12565900 -11139532 -10126399
687 -10126399 -11321920 -12434897 -8837540 -1373467 2298885 -2733154 -11685854 -16543625
679 -16543625 -16009437 -14227402 -12411181 -7902084 -716363 5072076 7246748 7624622 7311362
670 7311362 4934599 1330082 694880 4018063 6061712 2985766 -993604 192174 4348860
661 4348860 3461266 -4220186 -10806893 -9438215 -3546665 -1996821 -7532970 -13853452 -13921605
652 -13921605 -8333785 -3947503 -5051097 -7866434 -5391939 2956708 9514275 7782933
644 7782933 1018371 -2067371 1178217 4752349 3559248 879826 3323493 11269179
636 11269179 18106746 18033806 11571061 3586271 -1576758 -2720123 -1675787 -1439470 -3462160
627 -3462160 -6515308 -8764722 -10230610 -11785391 -12270262 -8676612 293954 12107389
619 12107389 22118957 26482635 23802706 15818284 6802473 585512 -2438206 -4158944
611 -4158944 -4930528 -3398676 -558118 -536087 -4941405 -8966742 -6531181 1829067 9518853
602 9518853 11905918 10509510 9004634 8464761 7843661 6393103 3744826 -424492 -4968403
593 -4968403 -7143183 -5801286 -3343795 -2508939 -2458055 -377232 3932321 7769838 9570273
584 9570273 10352717 10599819 8478277 2753739 -4430042 -9597205 -11712715 -12239381 -12269060
575 -12269060 -11547229 -10195661 -9495917 -10256345 -11531428 -11714942 -10188316 -7237695 -3067154
566 -3067154 2016546 6613206 8622031 7215627 3793534 303952 -2941055 -6894533
558 -6894533 -11372882 -14095694 -12532919 -6068154 3810455 14365993 22060955 23521067
550 23521067 17864767 8143950 -574169 -4772528 -3949858 372484 5639409 8900107
542 8900107 8633002 6466360 5539957 6588887 7122758 5153712 2050939 349699 -21342
533 -21342 -1540614 -5495335 -10056090 -12160195 -10577617 -6973819 -4234937 -3701203 -4154342
524 -4154342 -3888387 -3150458 -3198116 -3402549 -1689324 1544175 2629198 -495638 -4786819
515 -4786819 -5859731 -3634658 -1537859 -1254149 -1314456 -404749 898590 1610534 722202
506 722202 -3843153 -13349759 -24565088 -31172328 -30522635 -26622741 -24761934 -25220282 -24087667
497 -24087667 -18643469 -10090778 -2191408 1237260 -1329702 -7542063 -12590233 -13479397
489 -13479397 -11452282 -9667215 -9649005 -10761153 -11787431 -11950566 -11405492 -11463322 -13195770
480 -13195770 -15475051 -16040520 -14765783 -13618800 -12996079 -11072990 -7692427 -5349049 -4685010
471 -4685010 -2999433 211033 584956 -4268096 -9271854 -8450271 -3756169 -1178054 -529717
462 -529717 3394602 10224738 12610852 6990746 -1105607 -4964316 -3965048 -392050 4992206
453 4992206 10557481 12410468 9920259 8423183 11882899 16386661 15397742 8388278 41076
444 41076 -5917895 -7700596 -3918258 3385085 7177532 3258256 -2488345 -1415120 4798892
435 4798892 6105451 -781592 -7351631 -5657269 1586242 7077735 9017658 10093581
427 10093581 10836295 9753721 7865689 7963746 10060616 11406193 10580934 8392527 5083468
418 5083468 -228478 -6919661 -11959413 -12398309 -7772104 -203976 6895189 10831553 11688359
409 11688359 12096325 13964666 16002557 15501500 11822587 6826905 2414594 -1046395 -4228588
400 -4228588 -7978451 -12586054 -16792988 -17920466 -14313556 -7696645 -2047910 179239
392 179239 259544 1588897 6067871 11874395 14853220 12647331 7290407 2812590 667116
383 667116 -757715 -2254560 -2274259 -525812 -214533 -3905616 -8874457 -9848896 -5825784
374 -5825784 -1111806 463874 -610701 -2182563 -4008143 -6772122 -9352989 -9513945 -7101833
365 -7101833 -4817499 -5223258 -7815974 -9825886 -9677929 -8672456 -8692243 -9254613 -8375612
$$ [...]
##END NTUPLES=NMR SPECTRUM
##END=
