##TITLE=31Pdec_70-2022
 CDCl3, 24 sc
 25.8.2022
##JCAMPDX= 6.0         $$ Bruker NMR JCAMP-DX V2.0
##DATA TYPE= NMR SPECTRUM
##DATA CLASS= NTUPLES
##ORIGIN= UXNMR, Bruker Analytische Messtechnik GmbH
##OWNER= root
$$ XWIN-NMR		Version 3.5
$$ Thu Aug 25 10:22:27 2022 Russian Standard Time (UT+4h)  she@DPX200
##.OBSERVE FREQUENCY= 81.013821
##.OBSERVE NUCLEUS= ^31P
##.ACQUISITION MODE= SIMULTANEOUS
##.ACQUISITION SCHEME= undefined
##.AVERAGES= 24
##.DIGITISER RES= 16
##SPECTROMETER/DATA SYSTEM= spect
##.PULSE SEQUENCE= zgpg30
##.SOLVENT NAME= DMSO
##.SHIFT REFERENCE= (INTERNAL, DMSO, 0, 248.564)
##AUDIT TRAIL= $$ (NUMBER, WHEN, WHO, WHERE, WHAT)
$$ ##TITLE= Audit trail, XWIN-NMR		Version 3.5
$$ ##JCAMPDX= 5.01
$$ ##ORIGIN= Bruker BioSpin GmbH
$$ ##OWNER= she
$$ F:/spectra/data/she/nmr/P31/1/pdata/1/auditp.txt
$$ ##AUDIT TRAIL=  $$ (NUMBER, WHEN, WHO, WHERE, WHAT)
(   1,<2022-08-25 10:20:28.54 +0400>,<she>,<DPX200>,
      <created by zg, POWCHK disabled, PULCHK disabled
       configuration hash MD5:
       00 E9 B6 7A A2 85 ED C7 34 08 36 98 17 FE 4E 26
       data hash MD5: 32K
       09 23 52 88 CA AE B6 D8 1A 8C 1D E3 55 52 75 F6>)
(   2,<2022-08-25 10:20:35.20 +0400>,<she>,<DPX200>,
      <Start of raw data processing
       efp BC_mod = 2 LB = 1 FT_mod = 6 PKNL = 1 PHC0 = -10265.51 PHC1 = 88.85633 SI = 64K 
       data hash MD5: 64K
       EC A7 F8 86 07 CA AE 8F BA 5C 38 EF 45 CD 5B 51>)
(   3,<2022-08-25 10:20:51.18 +0400>,<she>,<DPX200>,
      <pk PHC0 = 1.13706 PHC1 = 0 
       data hash MD5: 64K
       7E C7 95 95 6F 4E 2C 1D 37 4D 0F B8 6F A3 39 CE>)
$$ ##END=
$$ 
$$ hash MD5
$$ 5F 70 8F 3B 58 5B F8 97 5A 6B AC 4E B9 8A F2 B2
##$RELAX= 
##$RELAX= 
##$RELAX= 
##$RELAX= 
##$RELAX= 
##$RELAX= 
##$RELAX= 
##$RELAX= 
$$ Bruker specific parameters
$$ --------------------------
##$DU= <F:/spectra>
##$EXPNO= 1
##$NAME= <P31>
##$PROCNO= 1
##$TYPE= <nmr>
##$USER= <she>
##$AMP= (0..31)
100 100 100 100 100 100 100 100 100 100 100 100 100 100 100 100 100 100 
100 100 100 100 100 100 100 100 100 100 100 100 100 100 
##$AQSEQ= 0
##$AQ_mod= 1
##$AUNM= <au_zg>
##$AUTOPOS= <>
##$BF1= 81.014009
##$BF2= 200.13
##$BF3= 200.13
##$BF4= 200.13
##$BF5= 200.13
##$BF6= 200.13
##$BF7= 200.13
##$BF8= 200.13
##$BYTORDA= 1
##$CFDGTYP= 0
##$CFRGTYP= 5
##$CHEMSTR= <none>
##$CNST= (0..31)
1 1 145 1 1 1 1 1 1 1 1 1 1 1 1 1 1 1 1 1 1 1 1 1 1 1 1 1 1 1 1 1 
##$CPDPRG= <waltz16>
##$CPDPRG1= <>
##$CPDPRG2= <waltz16>
##$CPDPRG3= <>
##$CPDPRG4= <mlev>
##$CPDPRG5= <mlev>
##$CPDPRG6= <mlev>
##$CPDPRG7= <mlev>
##$CPDPRG8= <mlev>
##$CPDPRGB= <>
##$CPDPRGT= <>
##$D= (0..31)
0 1 0 0 0 0 0 0 0 0 0 0.03 2e-05 3e-06 0 0 0 0 0 0 0 0 0 0 0 0 0 0 0 0 
0 0 
##$DATE= 1661408428
##$DBL= (0..7)
120 120 120 11 120 120 24 19 
##$DBP= (0..7)
150 150 150 150 150 150 150 150 
##$DBP07= 0
##$DBPNAM0= <>
##$DBPNAM1= <>
##$DBPNAM2= <>
##$DBPNAM3= <>
##$DBPNAM4= <>
##$DBPNAM5= <>
##$DBPNAM6= <>
##$DBPNAM7= <>
##$DBPOAL= (0..7)
0.5 0.5 0.5 0.5 0.5 0.5 0.5 0.5 
##$DBPOFFS= (0..7)
0 0 0 0 0 0 0 0 
$$ [...]
##$SUBNAM2= <"">
##$SUBNAM3= <"">
##$SUBNAM4= <"">
##$SUBNAM5= <"">
##$SUBNAM6= <"">
##$SUBNAM7= <"">
##$SUBNAM8= <"">
##$SUBNAM9= <"">
##$SW= 501.771253377433
##$SWIBOX= (0..15)
0 1 3 0 0 0 0 0 0 0 0 0 0 0 0 0 
##$SW_h= 40650.406504065
##$TD= 32768
##$TD0= 1
##$TE= 0
##$TE2= 300
##$TE3= 300
##$TEG= 300
##$TL= (0..7)
0 120 53 12 22 120 120 120 
##$TP= (0..7)
150 150 150 150 150 150 150 150 
##$TP07= 0
##$TPNAME0= <>
##$TPNAME1= <>
##$TPNAME2= <>
##$TPNAME3= <>
##$TPNAME4= <>
##$TPNAME5= <>
##$TPNAME6= <>
##$TPNAME7= <>
##$TPOAL= (0..7)
0.5 0.5 0.5 0.5 0.5 0.5 0.5 0.5 
##$TPOFFS= (0..7)
0 0 0 0 0 0 0 0 
##$TUNHIN= 0
##$TUNHOUT= 0
##$TUNXOUT= 0
##$USERA1= <user>
##$USERA2= <user>
##$USERA3= <user>
##$USERA4= <user>
##$USERA5= <user>
##$V9= 5
##$VALIST= <valist>
##$VCLIST= <CCCCCCCCCCCCCCC>
##$VD= 0
##$VDLIST= <DDDDDDDDDDDDDDD>
##$VPLIST= <PPPPPPPPPPPPPPP>
##$VTLIST= <TTTTTTTTTTTTTTT>
##$WBST= 1024
##$WBSW= 4
##$XGAIN= (0..3)
0 0 0 0 
##$XL= 0
##$YL= 0
##$YMAX_a= 8202
##$YMIN_a= -8279
##$ZGOPTNS= <>
##$ZL1= 120
##$ZL2= 120
##$ZL3= 120
##$ZL4= 120
##$ABSF1= 0
##$ABSF2= 0
##$ABSG= 0
##$ABSL= 0
##$ALPHA= 0
##$AQORDER= 0
##$ASSFAC= 0
##$ASSFACI= 0
##$ASSFACX= 0
##$ASSWID= 0
##$AUNMP= <proc_1d>
##$AZFE= 0.1
##$AZFW= 0.5
##$BCFW= 0
##$BC_mod= 2
##$BYTORDP= 0
##$COROFFS= 0
##$CY= -3
##$DATMOD= 1
##$DC= 0
##$DFILT= <>
##$DTYPP= 0
##$F1P= 0
##$F2P= 0
##$FCOR= 1
##$FTSIZE= 65536
##$FT_mod= 6
##$GAMMA= 0
##$GB= 0
##$INTBC= 1
##$INTSCL= 5.30512e-09
##$ISEN= 30
##$LB= 1
##$LEV0= 0
##$LPBIN= 0
##$MAXI= 10000
##$MC2= 0
##$MEAN= 0
##$ME_mod= 0
##$MI= 50
##$NCOEF= 0
##$NC_proc= -3
##$NLEV= 6
##$NOISF1= 182.463
##$NOISF2= 159.3651
##$NSP= 0
##$NTH_PI= 0
##$NZP= 0
##$OFFSET= 248.5645
##$PC= 4
##$PHC0= -10264.37
##$PHC1= 88.85633
##$PH_mod= 1
##$PKNL= yes
##$PPARMOD= 0
##$PSCAL= 0
##$PSIGN= 0
##$REVERSE= no
##$SF= 81.0140089999908
##$SI= 65536
##$SIGF1= 159.3651
##$SIGF2= -187.1042
##$SINO= 113.3802
##$SIOLD= 16384
##$SREGLST= <1H.CDCl3>
##$SSB= 0
##$STSI= 65536
##$STSR= 0
##$SW_p= 40650.406504065
##$SYMM= 0
##$S_DEV= 0
##$TDeff= 32768
##$TDoff= 0
##$TI= <>
##$TILT= no
##$TM1= 0
##$TM2= 0
##$TOPLEV= 0
##$USERP1= <user>
##$USERP2= <user>
##$USERP3= <user>
##$USERP4= <user>
##$USERP5= <user>
##$WDW= 1
##$XDIM= 65536
##$YMAX_p= 289921412
##$YMIN_p= -5534126
$$ End of Bruker specific parameters
$$ ---------------------------------
##NTUPLES= NMR SPECTRUM
##VAR_NAME=  FREQUENCY,     SPECTRUM/REAL,   SPECTRUM/IMAG
##SYMBOL=    X,             R,               I
##VAR_TYPE=  INDEPENDENT,   DEPENDENT,       DEPENDENT
##VAR_FORM=  AFFN,          ASDF,            ASDF
##VAR_DIM=   65536,         65536,           65536
##UNITS=     HZ,            ARBITRARY UNITS, ARBITRARY UNITS
##FACTOR=    0.620285442955139, 1,           1
##FIRST=     20137.2065510736, 0,            0
##LAST=      -20513.1999529914, 0,           0
##MIN=       -20513.1999529914, -5534126,    0
##MAX=       20137.2065510736, 289921412,    0
$$ Real data points
##PAGE= N=1
##DATA TABLE= (X++(R..R)), XYDATA
$$ [...]
42785b27637j13819J11465K60090J31971j11076j81922n1558P7825P4620j4442
$$ -227637 -341456 -229991 30099 162070 50994 -130928 -182486 -104661 -30041 -44483
42775d4483q8036q4853r530M2898k9529j53690j15995J16809K74536J43817r9339
$$ -44483 -132519 -217372 -226902 -184004 -213533 -367223 -483218 -366409 -91873 51944 -47395
42764d7395j29225O8083K11317J41263k0512j17138j34117j03727k6507N8039
$$ -47395 -176620 -108537 102780 244043 223531 106393 -27724 -131451 -157958 -99919
42754i9919P2220K2066J098L9827N9954O646o9709q9282k6981Q2158J56390J10461
$$ -99919 -27699 -5633 -4535 35292 95246 101892 32183 -57099 -84080 -1922 154468 264929
42742B64929l7267j37648q0974M8008Q7861K6215j6724L838Q803m4077q2327l5043
$$ 264929 227662 90014 9040 57048 144909 171124 154400 158238 167041 122964 40637 5594
42730E594O1831J09514N0884p1833j41740q4422K5671N0884k791Q720J10928J30158
$$ 5594 67425 176939 227823 155990 14250 -70172 -44501 6383 3592 12312 123240 253398
42718B53398k5664j80319j41932Q892O8595J7448k3936k9402m5248l4774L5866
$$ 253398 227734 47415 -94517 -85625 -17030 418 -23518 -52920 -98168 -132942 -97076
42707i7076N2026p9838k11843j52315O709L4499m4412j2051J31357J55640J4521
$$ -97076 -45050 -124888 -336731 -489046 -482337 -447838 -492250 -504301 -372944 -217304 -202783
42696b02783o0967N1059J81768J67905O9079m506m8028o2686j8735J6418o6939
$$ -202783 -263750 -212691 -30923 136982 206061 201555 153527 90841 72106 88524 21585
42685B1585j89153j45955M5553J33110K9745o0060j2105K3922n3622q4771M4919
$$ 21585 -167568 -313523 -267970 -134860 -105115 -165175 -177280 -153358 -206980 -291751 -246832
42674b46832J53868O0621r1110o2369R6077J49570M9883m7289n5477k5660Q120
$$ -246832 -92964 -32343 -123453 -185822 -89745 59825 109708 62419 6942 -18718 -10598
42663a0598N6187P5134O328j03505j48869j11970n6473o305O4103J36971J43122
$$ -10598 45589 120723 127051 23546 -125323 -237293 -293766 -300071 -235968 -98997 44125
42652D4125N5487o1275j07228m8800L1049J6237q1505j13546r564R5973O7322
$$ 44125 99612 38337 -68891 -117691 -86642 -70405 -151910 -265456 -275020 -179047 -111725
42641a11725q124L4305J57252J89670J03745P915o8733j51162j55101j8398Q3937
$$ -111725 -119849 -85544 71708 261378 365123 373038 304305 153143 -1958 -20356 63581
42630F3581l1836j92423r8556J41795J51013o7156j23160N7836R3373j42645k47854
$$ 63581 31745 -160678 -259234 -117439 33574 -33582 -156742 -98906 -5533 -148178 -396032
42619c96032l785K03314M7454j67356n8268J71107J41034j2572O3813K50152J74377
$$ -396032 -399817 -196503 -149049 -316405 -374673 -203566 -62532 -75104 -11291 238861 413238
42608D13238p9277j06067R0066J12606j17688k49322j27828J36j2868o728Q3847
$$ 413238 333961 227894 317960 430566 312878 63556 -64272 -64136 -77004 -83732 115
42597A15P7565o2344j02674L7113J19593J3793p5320J2722J19044P9145Q863M7414
$$ 115 77680 15336 -87338 -50225 69368 83161 7841 20563 139607 218752 227615 275029
42585B75029P8587m0994j85276j47921J7756Q5614q110j17718j23127n3277N92
$$ 275029 353616 312622 127346 -20575 -2819 82795 74685 -43033 -166160 -219437 -218845
42574b18845j1409o5183q2170j2153R2664J42435J32127J13688P8929q661r4469
$$ -218845 -230254 -295437 -377607 -389760 -297096 -154661 -22534 91154 170083 161422 66953
42563F6953q8484j9822J2228R356K9744K1225q8561j75002n3282J68036J70177
$$ 66953 -21531 -41353 -29125 -19769 9975 31200 -57361 -232363 -285645 -117609 52568
42552E2568q0451k31991o7149J74592J83443K7636k6182N6731R6961K8377m6667
$$ 52568 -27883 -259874 -327023 -152431 31012 58648 32466 89197 186158 214535 167868
42541A67868o8592p1707n8744m675M1726J7628k2843J2858P7957M5395p1305j19969
$$ 167868 99276 27569 -31175 -35850 5876 23504 661 13519 91476 136871 65566 -54403
42529e4403m6410K5986l059o6233n5296J4475N5873N3488N6477O3710J9572o9615
$$ -54403 -100813 -74827 -77886 -144119 -199415 -184940 -129067 -75579 -19102 44608 64180 -5435
42517e435j07856m2628M2599L8554k9531l9632M3647J23115J21673P7572M4020
$$ -5435 -113291 -155919 -113320 -74766 -104297 -143929 -100282 22833 144506 222078 266098
42506B66098l082q2501j23622o6109K1572L1567k2812m6120k2750j9577m4271
$$ 266098 263016 180515 56893 -9216 12356 43923 21111 -25009 -47759 -67336 -111607
42495a11607k3334O7716J52858J52943O1833p1192j61792j17998N1731J74906
$$ -111607 -134941 -67225 85633 238576 300409 229217 67425 -50573 1158 176064
42485A76064Q3460j43482k35008o9358J60239J94777L0211j11435q0472M1467
$$ 176064 259524 116042 -118966 -188324 -28085 166692 196903 85468 4996 46463
42475D6463Q8291K6727l4358j9593J1937k0907p4287l8551P4697J20902K9165
$$ 46463 134754 161481 127123 107530 119467 98560 24273 -14278 60419 181321 210486
42464B10486q7680r3444q949M7970L0163j8389n4357o1917k9069K8817N7611L3462
$$ 210486 122806 29362 20413 68383 98546 80157 25800 -36117 -65186 -36369 21242 54704
42452E4704k317k1549n2814r6223q3982K700O9497M6637j201M554K4088l795l2081
$$ 54704 52387 30838 -21976 -118199 -202181 -199481 -129984 -83347 -84548 -79994 -55906 -59701 -91782
42439i1782k179K1853l6755j00154m0200J02271J64301R6613J767m4223o5521
$$ -91782 -93961 -72108 -108863 -209017 -249217 -146946 17355 113968 115735 71512 5991
42428E991q6143q2161m3032Q380M9818N2750j0978r2283p5268N2038J34659O2064
$$ 5991 -80152 -162313 -205345 -196965 -147147 -94397 -105375 -197658 -272926 -220888 -86229 -24165
42416b4165o3142q7907k5315L0210P9570J43395J32758q039j37378j06124r788
$$ -24165 -87307 -175214 -200529 -170319 -90749 52646 185404 177365 39987 -66137 -75925
42405g5925k3094q6171k4919R5099M7143j44257j90264J4097K16976J79188j7471
$$ -75925 -99019 -185190 -210109 -115010 -67867 -212124 -402388 -388291 -171315 7873 -9598
42394i598j37102q3357O2928J56818Q7519j06444k10617p0370J63588K06087L3295
$$ -9598 -146700 -230057 -167129 -10311 77208 -29236 -239853 -310223 -146635 59452 92747
42383I2747j07729q3016k4228n8566j19290j00037o781J08151J97768J76823N577
$$ 92747 -14982 -97998 -122226 -180792 -300082 -400119 -406900 -298749 -100981 75842 81419
42372H1419j68776j52006O492P7292P875l0512L0969O1183O930j2586L6068K6440
$$ 81419 -87357 -239363 -232871 -155579 -147704 -178216 -147247 -86064 -79134 -91720 -55652 -29212
42360b9212n5040m6152P5408J05841k4890j04746j1628O5557k3366j09196j6275
$$ -29212 -84252 -130404 -54996 50845 25955 -78791 -90419 -24862 -48228 -157424 -173699
42349a73699J04552L7361j16093j11355M0687J37718J24351R5190O0515k9852
$$ -173699 -69147 -31786 -147879 -259234 -218547 -80829 43522 138712 199227 169375
42339A69375j05098o0115L4149K7405n8379q1433k7621L05p833K5776Q5716P6868
$$ 169375 64277 4162 38311 65716 7337 -74096 -101717 -101412 -109245 -83469 2247 79115
42327G9115j299n8749o5943n3959j2580O0194P0971l6447j25866l8785J29853
$$ 79115 77816 19067 -46876 -100835 -113415 -53221 17750 -18697 -144563 -183348 -53495
42316e3495J37615m3241j84353j35343L701Q3321R0970P1090K0257n1370p4187
$$ -53495 84120 40879 -143474 -278817 -275116 -191795 -100825 -29735 -9478 -60848 -135035
42305a35035k0006L5670J9625l8493o5224m4869j4313J6J551P507L2682O6862
$$ -135035 -155041 -119371 -99746 -138239 -203463 -248332 -262645 -262629 -261078 -253571 -220889 -154027
42293a54027O9126J6076n1366o8822l1378O448J3541J9780N5096Q7037N6077l0522
$$ -154027 -84901 -68825 -120191 -189013 -220391 -213943 -200402 -180622 -125526 -38489 17588 -12934
42281a2934q0908l0413N3829N0587l1493m9725M8091J16371K9968j07153j23689
$$ -12934 -93842 -124255 -70426 -19839 -51332 -101057 -52966 63405 93373 -13780 -137469
42270a37469n3749n0183r4178l3254J09692J32436N2o9265M1891J57374J01548
$$ -137469 -191218 -241401 -335579 -368833 -259141 -126705 -126653 -195918 -154027 3347 104895
42259A04895l4144p8388m4533l5716m6995l5103m2100q0501l7088J29756K36423
$$ 104895 70751 -7637 -52170 -87886 -134881 -169984 -212084 -292585 -329673 -199917 36506
42248C6506J19918q2126j16068J4564Q8996K4019m2585j0557M9702M7000q345
$$ 36506 156424 74298 -41770 -27206 61790 85809 43224 32667 82369 129369 121024
42237A21024o0967p4146l2587K6265J3401q3656j30927k5012J23463J29695R199
$$ 121024 60057 -14089 -46676 -20411 -7010 -90666 -221593 -246605 -123142 6553 15752
42226A5752n0367K9862J28302J17123Q499j07449j54901r6823K7654R4794K6521
$$ 15752 -34615 -4753 123549 240672 249171 141722 -13179 -110002 -82348 12446 38967
42215C8967q6158r4202P63O8337N5654L3684M2457L3639j2820m6001m7880n9618
$$ 38967 -47191 -141393 -140630 -72293 -16639 17045 59502 93141 80321 34320 -13560 -73178
42203g3178p2133j3741J04217J49479N2416o9803o6528L4962P4294j5328j25825
$$ -73178 -145311 -159052 -54835 94644 147060 77257 10729 45691 119985 104657 -21168
42192b1168j30215l8240M6562P1824P1156O9900L5029m9249j16319q7278J9811
$$ -21168 -151383 -189623 -143061 -71237 -81 69819 104848 55599 -60720 -147998 -128187
42181a28187J00884P2298n8761j92784j88508N032K24341K14302l6423k16525
$$ -128187 -27303 44995 -13766 -206550 -395058 -390026 -165685 48617 12194 -204331
42171b04331r1179J59437K06405M8183n6560l9742o1383j21618l0762J68846J63297
$$ -204331 -295510 -136073 70332 118515 61955 22213 -39170 -160788 -191550 -22704 140593
42160A40593r6895k24614L389K53865J63092q2580q9906Q6434R4573q1413j31525
$$ 140593 43698 -180916 -177527 76338 239430 156850 66944 153378 247951 166538 35013
42149C5013L949N3095o6819j00873O6046J87617P8688q1033p0579K0690p917j26345
$$ 35013 38962 92057 25238 -75635 -9589 178028 256716 175683 105104 125794 117877 -8468
42137h468j61543q6422j2673J2181K4289K7162N132L850P2082J60630J81087J30238
$$ -8468 -170011 -256433 -269106 -256925 -232636 -205474 -200342 -196492 -124410 36220 217307 347545
42125C47545O9834J9411m8563j33874j99688k19879j85906r4319K7899J17219
$$ 347545 417379 436790 388227 254353 54665 -165214 -351120 -445439 -417540 -300321
42115c00321J35244J06690O5404R477n1632o6220k1101J248o4736j35487p3045
$$ -300321 -165077 -58387 7017 16494 -35138 -101358 -122459 -121211 -185947 -321434 -394479
42104c94479R2188J66395O6224m4560N015J27919J13511l8054j18357m7372J4316
$$ -394479 -302291 -135896 -69672 -114232 -109217 18702 132213 94159 -24198 -71570 -57254
42093e7254m1160q2085J9921J50823J41429L8130k1028o1307j59617j98276k1498
$$ -57254 -98414 -180499 -160578 -9755 131674 169804 148776 87469 -72148 -270424 -291922
42082b91922K32521K68143P6590o9488o0771n3186j00329n6812O6966L9880j53579
$$ -291922 -59401 208742 285332 215844 155073 101887 1558 -55254 11712 51592 -101987
42071a01987j97135K9156J82259l824k60470k13932K6453J13165N7086J23636
$$ -101987 -299122 -269966 -87707 -91531 -352001 -565933 -539480 -426315 -369229 -245593
42061b45593K78360K19425o3908k17050p3226J01437M2690j38408j78917m0899
$$ -245593 32767 252192 188284 -28766 -101992 -555 42135 -96273 -275190 -316089
42051c16089J02133J25117O4144K7755O3537R2475o809k08789l08613j66526R2575
$$ -316089 -213956 -88839 -24695 3060 66597 159072 152263 -56526 -365139 -531665 -439090
42040d39090K33657J89925P0883k3975o7129n2400j1145j2198m5754q242J02202
$$ -439090 -205433 -15508 55375 31400 -35729 -88129 -99274 -111472 -157226 -165468 -63266
42029f3266J25903N234p1166L8292J73996J29762j3139n5629k3610o1864j23129
$$ -63266 62637 67871 -3295 34997 208993 338755 325616 269987 246377 184513 61384
42018F1384o3557N9207Q3334M0556N6294N9416p7215k05987q7494J57658J75820
$$ 61384 -2173 57034 140368 180924 237218 296634 219419 13432 -74062 83596 259416
42007B59416n6296j93854p6010P4641O8007q448m7644q0488q2661M3735K01405
$$ 259416 203120 9266 -66744 7897 75904 67456 19812 -60676 -143337 -99602 101803
41996A01803J43122j12605k45016j21680J6563q578m5188M9855J43220J02668
$$ 101803 244925 132320 -112696 -234376 -217813 -226391 -271579 -221724 -78504 24164
41986B4164L9024N9260O0239k0979l1192J00929J64224N188j87331j89931r1470
$$ 24164 63188 122448 182687 161708 130516 231445 395669 400857 213526 23595 -67875
41975f7875o9108o2385L5446R0527l4997j52135j2888K31105K16550n8472k22002
$$ -67875 -136983 -199368 -163922 -73395 -108392 -260527 -273415 -42310 174240 115768 -106234
41964a06234q5914J20531J31055j9815j31395j10672j8075M1916K2598j2435L9873
$$ -106234 -192148 -71617 59438 39623 -91772 -202444 -220519 -178603 -156005 -168440 -128567
41953a28567J48334J42988k5093j59295r8574K7791K5256l2146M8041K02599J94317
$$ -128567 19767 162755 137662 -21633 -120207 -92416 -67160 -99306 -51265 151334 345651
41942C45651K0233p9216k6084k858q8386j10906J6918J05156K528j36645j07997
$$ 345651 365884 286668 260584 257726 169340 58434 75352 180508 183036 46391 -61606
41931f1606J6053M3460p956J1144Q1360O1497j7903J2800J31817J10249j01923
$$ -61606 -45553 -2093 -10049 1095 82455 143952 126049 138849 270666 380915 278992
41920B78992k43964j38071K5389J0j18650p6416R1550J18683k8241q4261N8607
$$ 278992 35028 -103043 -77654 -77644 -196294 -272710 -181160 -62477 -90718 -174979 -116372
41909a16372J61042M3649j09770p1280N0682K0935j08579j01366M9289J23034
$$ -116372 44670 88319 -21451 -92731 -42049 -21114 -129693 -231059 -181770 -58736
41899e8736N4387Q720N8757P0606k1872q5511l1590K8835n549m7916J0474J05940
$$ -58736 -4349 4371 63128 133734 111862 26351 -5239 23596 18047 -29869 -19395 86545
41887H6545J13215L7303l1353o1855p0773m5852J0975K9580l8923j24960j17551
$$ 86545 199760 237063 205710 143855 73082 27230 38205 67785 28862 -96098 -213649
41876b13649p076J10025J39952O4561n7869j33430j09883l0729K2188L1995L8685
$$ -213649 -220725 -110700 29252 93813 35944 -97486 -207369 -238098 -215910 -183915 -145230
41865a45230M9730M0779L0874N8538Q6701L8984o0166r1837j2913P9074P8285
$$ -145230 -95500 -54721 -23847 34691 121392 160376 100210 8373 -4540 74534 152819
41854A52819j6439j32826j84085j00897R1209K28216J60199m1573j49800o9753
$$ 152819 136380 3554 -180531 -281428 -190219 37997 198196 156623 6823 -62930
41844f2930O1455Q9074K3704l8150o0674o8765q0110r2905r4233o0873M391M8297
$$ -62930 -1475 87599 111303 73153 12479 -56286 -136396 -229301 -323534 -384407 -380016 -331719
41832c31719L3256o85j38K4376N1754J02379J51420R8417n4273j18652J5603J62489
$$ -331719 -298463 -299148 -299286 -274910 -223156 -120777 30643 129060 74787 -43865 -28262 134227
41820A34227R7454q3188j18430o629K2752q7565j58777j06617l0892L4217J52313
$$ 134227 231681 148493 30063 23434 46186 -41379 -200156 -306773 -337665 -303448 -151135
41809a51135K47865J57114m5530r9983R652K5766j12039j48757J2699J15740J0951
$$ -151135 96730 253844 208314 108331 117983 143749 31710 -117047 -104348 11392 22343
41798B2343p1186N1876J71664O4690j02161p1771N5898K5713j21703j51073m5554
$$ 22343 -48843 3033 174697 239387 137226 65455 121353 147066 25363 -125710 -171264
41787a71264J0626k8148l9802J3987N3954N1785L4750j1722p9756p4311L0533
$$ -171264 -160638 -188786 -228588 -214601 -160647 -108862 -74112 -85834 -165590 -239901 -209368
41776b09368R4912L1785k7260M2734J37209J18496N7788O3966N3905n9363j28763
$$ -209368 -114456 -82671 -109931 -67197 70012 188508 246296 310262 364167 304804 176041
41765A76041n255J50842R6871q5145j30532l6406k5154j29149j56665n6128J0348
$$ 176041 170786 321628 418499 333354 202822 166416 141262 12113 -144552 -200680 -190332
41754a90332k4137m0839J4315N5674O7672J36872K29531J78119m2565k32025k29576
$$ -190332 -214469 -255308 -240993 -185319 -117647 19225 248756 426875 384310 152285 -77291
41743g7291r8277J0278L2087o943m6191l0096K1076J6513m5909k8697J10060J72845
$$ -77291 -175568 -165290 -133203 -140146 -186337 -216433 -195357 -178844 -224753 -253450 -143390 29455
41731B9455P247k05936j97169k2224N6633J1782M3078J71778J92668N4731m3885
$$ 29455 36702 -169234 -366403 -388627 -331994 -320212 -277134 -105356 87312 142043 98158
41720I8158n950K4418m4550j02129p6709o2428r7972p0219M8188J07588M8441
$$ 98158 92208 116626 72076 -30053 -106762 -169190 -267162 -337381 -289193 -181605 -133164
41709a33164K3246J17831J80911Q5738m9414o9285k1244j7971l4947j7520k6152
$$ -133164 -109918 7913 188824 274562 225148 155863 134619 116648 81701 64181 38029
41698C8029r4398r6013N0688J82935J10763p4802j33740l9201K4680j1316j5761
$$ 38029 -56369 -152382 -101694 81241 192004 117202 -16538 -55739 -31059 -42375 -58136
41687e8136Q1822J57562R9193j2674l3132L5205O4420r333j09429j30974o7683
$$ -58136 23686 181248 280441 267767 234635 269840 334260 324927 215498 84524 16841
41676A6841j317M781l4606o6867o0818j3408O0668J18772J10837M5332p571j4508
$$ 16841 15524 20305 -14301 -81168 -141986 -155394 -94726 24046 134883 180215 172644 158136
41664A58136k0787m5198j6847R4863J70847R1370o7184j34375j00027r2465j23809
$$ 158136 137349 92151 75304 170167 341014 432384 365200 230825 130798 38333 -85476
41653h5476o2015J09830K08678J10980o9225j60509j47475r8286j8513R0707J42128
$$ -85476 -147491 -37661 171017 281997 212772 52263 -95212 -193498 -212011 -121304 20824
41642B0824P6204j4840j4280L8667L6968P509N5807J43768J11658n7444j74488
$$ 20824 97028 82188 67908 106575 143543 151052 206859 350627 462285 404841 230353
41631B30353j16524r892k9347j29048j25729L824P7852j5379j43901j17212N0344
$$ 230353 113829 103937 74590 -54458 -180187 -176363 -98511 -113890 -257791 -375003 -324659
41620c24659J73973J52135O6178K6038L2026L3497L0849M4080L9158k8288j19799
$$ -324659 -150686 1449 67627 93665 125691 159188 190037 234117 273275 244987 125188
41609A25188j42723p3729O783J9208j7880k0065M6932J05420M1420j44397k90799
$$ 125188 -17535 -91264 -84481 -65273 -83153 -103218 -56286 49134 90554 -53843 -344642
41598c44642k34777j0131J79521J95408R2746o894o8422j00916o3115O7112J81793
$$ -344642 -579419 -589550 -410029 -214621 -121875 -128769 -197191 -298107 -361222 -294110 -112317
41587a12317J39552k8132j30362o4977N4099P2159N842r366O4396J12506M4303
$$ -112317 27235 -897 -131259 -196236 -142137 -69978 -64136 -73502 -9106 103400 147703
41576A47703o6691q6637j8328L335p9101j44199o6934Q4916J40594P1313R251
$$ 147703 81012 -5625 -23953 -20618 -99719 -243918 -310852 -225936 -85342 -14029 -4778
41565d778J9262L961r9933j69424o5425J27612J85408N1742q1040l8844J03545
$$ -4778 14484 18445 -81488 -250912 -316337 -188725 -3317 48425 -32615 -71459 32086
41554C2086J43620L1130q7708r1816l0331k569q29L0412N4536l610r9413j15438
$$ 32086 175706 206836 119128 27312 -3019 -5588 -6417 23995 78531 74921 -24492 -139930
41542a39930o1182n6821r6915k9376J60779K59220J37523m2664r9668j00301j54611
$$ -139930 -201112 -257933 -354848 -384224 -223445 35775 173298 130634 30966 -69335 -223946
41531b23946j52567J8750J72489P1811j39223j22826J01188J82342J0619j37704
$$ -223946 -376513 -357763 -185274 -113463 -252686 -375512 -274324 -91982 -81363 -219067
41521b19067p8813L8941P2995R8605J50341R8055n8823r8613M4955J26667K736
$$ -219067 -297880 -258939 -185944 -87339 63002 161057 102234 3621 48576 175243 177979
41510A77979j14507l8129O3402j4273j34001o2389J21900J69570M9631p7065j33770
$$ 177979 63472 25343 88745 74472 -59529 -121918 -18 169552 219183 142118 8348
41499H348j33415m9081R1763J27405o485j20107n3879N9391L9411l3806j0817
$$ 8348 -125067 -174148 -82385 45020 38535 -81572 -135451 -76060 -36649 -70455 -81272
41488h1272L2583k0005m4084R5793K12569O0162k06148k24365M185J37479M9282
$$ -81272 -48689 -68694 -112778 -16985 195584 255746 49598 -174767 -170582 -33103 16179
41477A6179l4854K0335O2354j8899r0517l1476O6939Q1239M0216K1387J6612j0865
$$ 16179 -18675 1660 64014 45115 -45402 -76878 -9939 71300 111516 132903 149515 138650
41465A38650m9022p4398q5559q2459p4328q1130p5013L018J11310J18835K4684
$$ 138650 89628 15230 -70329 -152788 -227116 -308246 -383259 -380241 -268931 -150096 -125412
41454a25412l470Q4761J10416j1475q2271L4850J37313L0094r8026P851J89113
$$ -125412 -128882 -44121 66295 54820 -27451 7399 144712 174806 76780 84631 273744
41443B73744J16396j43250k33901r1041J9479n915q091M9136J4443r5189p0936
$$ 273744 390140 246890 12989 -78052 -58573 -64488 -72579 -23443 -9000 -104189 -175125
41432a75125R4571J58157M0546n7709k8015m678o3169r1214m6194l3228n2113
$$ -175125 -80554 77603 118149 60440 32425 27747 -35422 -126636 -172830 -206058 -258171
41421b58171K1505J34540P1987j36929j78997M6398K32866J39594n6786q6915
$$ -258171 -236666 -102126 -30139 -167068 -346065 -299667 -66801 72793 16007 -70908
41411g0908R380L5777j9698k8469L4065P9360N5299j5129p1228m2640O3102J05572
$$ -70908 -61528 -25751 -45449 -73918 -39853 39507 94806 79677 8449 -34191 28911 134483
41399A34483j5855j66953j44511L928O0573K160K919Q1435O1786p3330j14880
$$ 134483 118628 -48325 -192836 -188908 -128335 -126175 -123256 -41821 19965 -53365 -168245
41388a68245L690P8670q672r3986k2722J07045J32869N3540m3626r9691o2036
$$ -168245 -164555 -85885 -94557 -188543 -211265 -104220 28649 82189 38563 -61128 -123164
41377a23164P1734J63771R1099k9046j3097M5286p2525k63241k09947N9835J75406
$$ -123164 -51430 112341 203440 174394 161297 206583 134058 -129183 -339130 -279295 -103889
41366a03889M5345k872J64810K36982L0949j61665q9496L4232m6412j73055j02816
$$ -103889 -58544 -61416 103394 340376 371325 209660 120164 154396 107984 -65071 -167887
41355a67887M1810L3362l6832K5107J24428P6203k5292o08N5100k8828j30206
$$ -167887 -126077 -92715 -129547 -104440 19988 96191 70899 70291 125391 96563 -33643
41344c3643m1907J16136P8648j01271j53291n3357m156k4242N6944K16330K20311
$$ -33643 -75550 40586 119234 17963 -135328 -188685 -192841 -217083 -160139 56191 276502
41333B76502K1009j52705j51548p4538k8707K1342R1385R0004j5758j16768j20816
$$ 276502 297511 144806 -6742 -81280 -109987 -88645 2740 92744 76986 -39782 -160598
41322a60598o3142o453M8055J00555J05309L7914m9470p5308r217R2984J29084
$$ -160598 -223740 -230193 -182138 -81583 23726 61640 12170 -63138 -72355 20629 149713
41311A49713N7977l9034o4764m8455p5554j04516j7950J39578J72188K8144j13209
$$ 149713 207690 168656 103892 55437 -20117 -124633 -142583 -3005 169183 197327 84118
41300H4118j18993o7651n2188k6689M0742O1408k095m1161K738L3321L785K0026
$$ 84118 -34875 -102526 -154714 -181403 -140661 -79253 -81348 -122509 -119771 -86450 -82665 -62639
41288f2639J12128J20783l4317j82705j65384o6557j6934K4176J07747J27421
$$ -62639 49489 170272 135955 -46750 -212134 -278691 -295625 -271449 -163702 -36281
41278c6281J7486p5330k5670M9539R452n8405j9101N6341L6907l7361p2922r2790
$$ -36281 -18795 -94125 -119795 -70256 -60804 -119209 -138310 -81969 -45062 -82423 -155345 -248135
41266b48135j01283M667J87371J90024m7087j77700L0177K55072J00708k40942
$$ -248135 -349418 -344751 -157380 32644 -14443 -192143 -161966 93106 193814 -47128
41256d7128k82862j9983J15968m096o1124R1235J87057O0099o6356j876Q1085
$$ -47128 -329990 -349973 -234005 -238101 -299225 -207990 -20933 39166 -27190 -29066 52019
41245E2019k0613j78927j62950j1993O9710M5492M4121J08185J42925R3707K9501
$$ 52019 31406 -147521 -310471 -322464 -252754 -207262 -163141 -54956 87969 181676 211177
41234B11177L2737Q6445R9093J8920r5674j39155q7778j6872J6920L0775K8503
$$ 211177 243914 330359 429452 448372 352698 213543 125765 108893 125813 156588 185091
41223A85091l3034j32088j51457m4114P7440J06391Q3622P8244N2403l4491j07305
$$ 185091 152057 19969 -131488 -175602 -98162 8229 91851 170095 222498 188007 80702
41212H0702r5169n9429o8035n8068L1323J05124N4297m9686o7646j0931J4716
$$ 80702 -14467 -73896 -141931 -199999 -168676 -63552 -9255 -58941 -126587 -137518 -122802
41201a22802j20N914K3024N045k1754j7109j7813n2673o0887q400K7735M609Q483
$$ -122802 -122922 -117008 -93984 -88939 -110693 -127802 -145615 -198288 -259175 -267575 -239840 -235231 -226748
41188b26748Q3942J22424N4658j5446j1676k4573q8102m7444J39643K15336R911
$$ -226748 -142806 -20382 34276 18830 7154 -17419 -105521 -152965 -13322 202014 211925
41177B11925k14418j40687Q0818P4353j40384j95342J6608K02454J61491L6541
$$ 211925 -2493 -143180 -62362 11991 -128393 -323735 -307127 -104673 56818 93359
41167I3359j239N959k2556m9292l4402q482K6424R0583J10601L692j29150j09590
$$ 93359 92120 98079 75523 26231 -8171 -16653 9771 100354 210955 214647 85497 -24093
41155b4093K2918N4323n5699j10750m267J18953R7845l5041j47148j62779q3053
$$ -24093 -1175 53148 -2551 -113301 -117568 1385 99230 64189 -82959 -245738 -328791
41144c28791K6915O0663n364m0524N9773J86662J70723M7767j8724q135j9493
$$ -328791 -301876 -241213 -246577 -287101 -227328 -40666 130057 177824 159100 150965 131472
41133A31472m1110J6780J00208O8728m8101r2608n5615o2402j01472l6414J06923
$$ 131472 90362 107142 207350 276078 227977 135369 79754 17352 -84120 -120534 -13611
41122a3611J39385K4142o9743o5007o2753q8404l1171Q9828Q1837q6677j72561
$$ -13611 125774 149916 80173 15166 -47587 -135991 -167162 -77334 4503 -82174 -254735
41111b54735k6083J60822J45501j8871j09121n5468L9295R6703J13950Q5538J0179
$$ -254735 -280818 -119996 25505 6634 -102487 -157955 -118660 -21957 91993 177531 187710
41100A87710o0532p4011m7330k9983l6596n1906n3431j0618P6305J28713O2299
$$ 187710 127178 53167 5837 -24146 -60742 -112648 -166079 -176697 -100392 28321 90620
41089I0620p6480j34817m5685Q2929J10053K9751m7339m0289J8341L9488o910
$$ 90620 14140 -120677 -166362 -83433 26620 56371 9032 -31257 -12916 26572 19662
41078A9662n9576n9383l0273j6240Q286P1542J02342L1483n2918k9652J8928p1918
$$ 19662 -39914 -99297 -129570 -145810 -137524 -65982 36360 67843 14925 -14727 4201 -67717
41066f7717k14423j54147P9448J58263o419q9713R6875K62626J21084j30037j56728
$$ -67717 -282140 -436287 -356839 -198576 -204995 -294708 -197833 64793 185877 55840 -100888
41055a00888k3937J828n5149K475J15912P7386n7902o4167M4077O4623j3915m0759
$$ -100888 -124825 -122997 -178146 -175671 -59759 17627 -40275 -104442 -60365 4258 -9657 -50416
41043e0416k1460n8194o8927P3965K23219J47968n0200r6220j4788l3584j13406
$$ -50416 -71876 -130070 -198997 -125032 98187 246155 195955 99735 84947 51363 -62043
41032f2043k9879J43804J19617o6603r3851N8816P2529j15978j89989k3396J17752
$$ -62043 -91922 51882 171499 104896 11045 69861 142390 26412 -163577 -186973 -69221
41021f9221P6511L2365P3690J5498j65679j76189P9166K52824R4938j44621j40925
$$ -69221 7290 39655 113345 128843 -36836 -213025 -133859 118965 213903 69282 -71643
41010g1643J9576P4388J4286j7400j4546l0221j3154N5155N8444l4698o6483K6173
$$ -71643 -52067 22321 36607 19207 4661 -25560 -38714 16441 74885 40187 -26296 -123
40998a23O5343n4207j59050r7636N895L597j8583M5597Q9593R128o7111k121Q8974
$$ -123 65220 11013 -148037 -245673 -239778 -236181 -254764 -209167 -119574 -110446 -177557 -179678 -90704
40985i0704M0494p6931j00527m7569k6210k2345K0008M6608J0996K761Q0079J24450
$$ -90704 -50210 -127141 -227668 -275237 -301447 -323792 -303784 -257176 -246180 -243419 -163340 -38890
40973c8890M0989n0857j2797P4688O0904k4003n4247k3869k270J1459L1578K248
$$ -38890 2099 -48758 -61555 13133 74037 50034 -4213 -28082 -30352 -18893 12685 14933
40961A4933q0502r1530L0448J44739J12280K610n0359n6146p2925n1085M9912
$$ 14933 -65569 -157099 -126651 18088 130368 132978 82619 26473 -46452 -97537 -47625
40950d7625J16897M2545p5997p9581K136K1161l8944n8933P853P1313M0111p2721
$$ -47625 69272 111817 35820 -43761 -41625 -20464 -59408 -118341 -110488 -39175 936 -71785
40938g1785j66962j34888L0530J89207J91971O7818l0426n1277o7595r0341n3581
$$ -71785 -238747 -373635 -343105 -153898 38073 105891 75465 24188 -43407 -133748 -187329
40927a87329N209k9747j13428o3645J19265K09422J15737K1596N0766O5855m3468
$$ -187329 -182120 -211867 -325295 -388940 -269675 -60253 55484 77080 127846 193701 150233
40916A50233j31835n4668P1295P3972q46k8656l8577r4498j09639k090J03496
$$ 150233 18398 -36270 35025 108997 108151 79495 40918 -53580 -163219 -165309 -61813
40905f1813N0394q7030j20739l1411N7734R6946J15946R7469K0880l8262r855
$$ -61813 -11419 -98449 -219188 -250599 -192865 -95919 20027 117496 138376 100114 90259
40894I0259L9793K1034j6557J7024O8515J5087j27762k14842j62832k9058P4043
$$ 90259 130052 151086 134529 151553 220068 235155 107393 -107449 -270281 -299339 -225296
40883b25296P2583j6704p9683j5517J14204J43561M2087k9925L8802J48428J45197
$$ -225296 -152713 -169417 -249100 -264617 -150413 -6852 35235 5310 44112 192540 337737
40872C37737K6296r4380j32428q0017J2488O2962M0199J6665M6341M0901q2182
$$ 337737 364033 269653 137225 57208 69696 132658 172857 189522 235863 276764 194582
40861A94582j91816j00535J05631J51765p629j28994p5563J0107J62l1226j3756
$$ 194582 2766 -97769 7862 159627 151998 23004 -52559 -42452 -42290 -73516 -87272
40850h7272j3295n0121l0910L6834J1665j04203j19074J2758R0728K2893j4618
$$ -87272 -100567 -150688 -181598 -144764 -133099 -237302 -356376 -343618 -252890 -229997 -244615
40839b44615Q0950J40900M9131k8765M7838J28804M5923q6524p9955K4322P7572
$$ -244615 -163665 -22765 26366 -2399 45439 174243 220166 133642 53687 78009 155581
40828A55581O3028K1903o5805j53197r3200R4705J58621m684j55588r5648K6276
$$ 155581 218609 240512 174707 21510 -71690 23015 181636 176952 21364 -74284 -48008
40817d8008K1542o505Q2555J42398l358j93031j56282M6106J36736N3598l4036
$$ -48008 -26466 -32971 49584 191982 188624 -4407 -160689 -114583 22153 75751 41715
40806D1715m1129k1066J1337O5159O3806l6609j16132o7097K3276M4720N4428
$$ 41715 586 -20480 -9143 56016 119822 83213 -32919 -100016 -76740 -32020 22408
40795B2408J00827N4633j42611k59268r2487J59630J60604n3136j47028K779J88186
$$ 22408 123235 177868 35257 -224011 -316498 -156868 3736 -49400 -196428 -193649 -5463
40784e463K26541J58530Q0081K170r1516j89100k51139j98429R760K23985K04473
$$ -5463 221078 379608 459689 461859 370343 181243 -69896 -268325 -258565 -34580 169893
40773A69893k6034j47147l642J46593N0699j33312j22272K9545P3974k363k7088
$$ 169893 143859 -3288 -6930 139663 190362 57050 -65222 -35677 38297 35934 8846
40762H846J2048r93l2045L2035J09414K8499j43350j67580m358J45254J47724
$$ 8846 20894 19901 -12144 19891 129305 157804 14454 -153126 -157484 -12230 135494
40751A35494N8276m0185j08102q8262L4968J46804J31128L3612l7261p3798r8250
$$ 135494 193770 153585 45483 -42779 -7811 138993 270121 303733 266472 192674 94424
40740I4424o3352K2774K8398p7205j10414K5588J30578K8425j12708n8685Q7913
$$ 94424 31072 53846 82244 5039 -105375 -79787 50791 79216 -33492 -92177 -4264
40729d264Q0718l8995m8110M2897L4581p6166r8629k773M2179k4208q1189o0336
$$ -4264 76454 37459 -10651 32246 66827 -9339 -107968 -110741 -68562 -92770 -173959 -234295
40717b34295j6831J6673M2588J0120r0162j19230J6855J59170J06337o1021j05477
$$ -234295 -251126 -234453 -191865 -181745 -271907 -391137 -374282 -215112 -108775 -169796 -275273
40706b75273N32P6805L8242l4854p3722o6597N929J07018J15051J9553k193J22400
$$ -275273 -274741 -197936 -159694 -194548 -268270 -334867 -328938 -221920 -106869 -87316 -89509 32891
40694C2891J88250M7159j06418n2504P3610L3627q8519p0652J9532l1126j51757
$$ 32891 221141 268300 161882 109378 182988 216615 128096 57444 76976 45850 -105907
40683a05907j04547P3331J41028Q3678Q0879J21761M9247p3973n3066K9990p9678
$$ -105907 -210454 -137123 3905 87583 168462 290223 339470 265497 212431 242421 162743
40672A62743l10232l05527o221K32296J84756L1225j7443r269l3567l1490K6409
$$ 162743 -147489 -453016 -459237 -226941 -42185 -10960 -28403 -37672 -71239 -102729 -76320
40661g6320L4681l8885o1649L1564J10878N8993n7942j10120o6582R927L3456
$$ -76320 -41639 -80524 -142173 -110609 269 59262 1320 -108800 -175382 -165455 -131999
40650a31999l5400j11692n2029J11888J51126j3936j40947l9453J03103M1697
$$ -131999 -167399 -279091 -331120 -219232 -68106 -82042 -222989 -262442 -159339 -117642
40640a17642r6790m6425J18552J27046l076l3758L5550K088j08925p6137P7480
$$ -117642 -214432 -260857 -142305 -15259 -18335 -52093 -16543 -14455 -123380 -199517 -122037
40629a22037R7348m3052j02332j4102K8205l3656l5628M6359L1553r5214j17412
$$ -122037 -24689 -67741 -170073 -184175 -155970 -189626 -225254 -178895 -147342 -242556 -359968
40618c59968K3052J19998P5268L6500P1414M1213r2599j53241n7863M7120O4344
$$ -359968 -336916 -216918 -141650 -105150 -33736 7477 -85122 -238363 -296226 -249106 -184762
40607a84762Q0566J28998R5093l7534j06383l3611O5055J05394J31888J38422
$$ -184762 -104196 24802 119895 82361 -24022 -57633 7422 112816 244704 383126
40597C83126M3528j00364j24005k3429J6767p1611j49097j17090k5949P9990J90027
$$ 383126 426654 326290 202285 178856 195623 124012 -25085 -142175 -168124 -88134 101893
40586A01893K08207N9224j09186r7212J5747O541q5867m0472J05137R3734p3217
$$ 101893 310100 369324 260138 162926 178673 185214 99347 58875 164012 257746 184529
40575A84529j16522J9279P2099m7166r5563M3617J49561P1730k8476k1739l8849
$$ 184529 68007 87286 159385 112219 16656 60273 209834 281564 253088 231349 192500
40564A92500j54582j78486N304J72390P9032j64038k59153j08146J34345K67309
$$ 192500 37918 -140568 -135264 37126 116158 -47880 -307033 -415179 -280834 -13525
40554a3525J96507j088j20774n9749K7613l0291j23512n5533P3727K4141j25829
$$ -13525 182982 181894 61120 1371 28984 -1307 -124819 -180352 -106625 -82484 -208313
40543b08313q5192J18152J62780P970l8498R7788J08023j20647k65660j22553
$$ -208313 -293505 -175353 -12573 -4603 -43101 54687 162710 42063 -223597 -346150
40533c46150N3924J7049p4979j0702R7836Q7688O2101J33448J52001k281j33981
$$ -346150 -292226 -275177 -350156 -360858 -263022 -175334 -113233 20215 172216 169935 35954
40522C5954n1710P5698M881j54694j31147N4421J44905N3881o8828j10509r7035
$$ 35954 -15756 59942 64823 -89871 -221018 -166597 -21692 32189 -36639 -147148 -244183
40511b44183o6159k4661N022K1439O6981J26962J04696k0065j24286j13290l6836
$$ -244183 -310342 -335003 -329981 -308542 -241561 -114599 -9903 -29968 -154254 -267544 -304380
40500c04380L4049J05995J67269J40562J7239q8043r0554l4124P415J7153J666
$$ -304380 -270331 -164336 2933 143495 160734 72691 -17863 -51987 -44572 -27419 -25753
40489b5753k1089n408M7530N0349j8020k6594Q0840J21408m0045k04783j33338
$$ -25753 -46842 -52250 -4720 45629 27609 1015 81855 203263 163218 -41565 -174903
40478a74903L4956J1655j30894r5068R5629J43907K3146m736R1829P2439o5571
$$ -174903 -139947 -128292 -259186 -354254 -258625 -114718 -91572 -96308 -4479 67960 2389
40467B389m4001J50756J86142l1977j87196j13372m1287j10016j13095N6416J64892
$$ 2389 -41612 109144 295286 263309 76113 -37259 -78546 -188562 -301657 -245241 -80349
40456h0349P4577p363N2975P0004n4777j03641K7449R0233n1486j33489L2082
$$ -80349 -5772 -13135 39840 109844 55067 -48574 -21125 69108 17622 -115867 -83785
40445h3785J89863Q1528j11326j08311J2671M1290J9626O5953Q6289j4406q4510
$$ -83785 106078 187606 76280 -32031 -19360 21930 41556 107509 193798 179392 94882
40434I4882M567Q2884k8749j84923j55889J0931J27268J52207J17158r534j67912
$$ 94882 99449 182333 153584 -31339 -187228 -176297 -49029 103178 220336 210802 42890
40423D2890j59580L5810J52060M1611r0562n6837J8939j463l710R8395J33266
$$ 42890 -116690 -80880 71180 112791 22229 -34608 -15669 -17132 -20842 77553 210819
40412B10819r667j37419r5951m3428j10292j17049O6556K09816J03596n4033p519
$$ 210819 201152 63733 -32218 -75646 -185938 -302987 -236431 -26615 76981 22948 15429
40401A5429J11053N6758p3281m4752P9525Q5771m406m2040n5749j17747j02592
$$ 15429 126482 183240 109959 65207 144732 230503 226097 184057 128308 10561 -92031
40390i2031Q4378K29495J03126j43620k06002q4322O764K3136N8394P3954j4305
$$ -92031 -7653 221842 324968 181348 -24654 -108976 -102212 -79076 -20682 53272 38967
40379C8967j01541m4160O8154N9454l3127n7873j8974j0918j3044L1408O8089
$$ 38967 -62574 -106734 -38580 20874 -12253 -70126 -89100 -100018 -113062 -81654 -13565
40368a3565N5063P1612J31704R1866p7512j65588o0610M1316k1474j02369m9349
$$ -13565 41498 113110 244814 336680 259168 93580 32970 74286 52812 -49557 -98906
40357i8906R889n1416q9249J1280O4462o8065j52414L6552K79174K42005J3409
$$ -98906 -89017 -140433 -229682 -218402 -153940 -222005 -374419 -337867 -58693 183312 196721
40346A96721q4424j9335Q483k0513J9469P9657J7364j02222j07598k8961j8004
$$ 196721 112297 92962 101445 80932 100401 180058 197422 95200 -12398 -41359 -59363
40335e9363o4381n3960J437K4119L2291M5735k641q6176l8795J29796J52334n1197
$$ -59363 -123744 -177704 -176267 -152148 -119857 -74122 -76763 -162939 -201734 -71938 80396 29199
40323B9199j68112O977K06672J38114m2939o4054j5967r9565j90921q8705O2486
$$ 29199 -138913 -131936 74736 212850 169911 105857 89890 -9675 -200596 -289301 -226815
40312b26815K7834p3978r437J15861P3310m1339j6924L6997p7648j91096l3552
$$ -226815 -198981 -272959 -282396 -166535 -93225 -134564 -151488 -114491 -192139 -383235 -416787
40301d16787K18633J76685j07237k22450n1114J36946J77788J54502R6270m1510
$$ -416787 -198154 -21469 -128706 -351156 -402270 -265324 -87536 66966 163236 121726
40291A21726j40010m9776R6351O9895m4337o199J20636Q2139p9986q7578P4120
$$ 121726 -18284 -68060 28291 98186 53849 47650 168286 250425 170439 82861 156981
40280A56981J31838j3482j73250k08602j50919k6659J25590J41186m9567j96062
$$ 156981 288819 275337 102087 -106515 -257434 -284093 -158503 -17317 -66884 -262946
40270b62946o1551J53649J07123j04572j02638J26433K14740K9872j46159j02541
$$ -262946 -324497 -170848 -63725 -168297 -270935 -144502 70238 100110 -46049 -148590
40260a48590L1451P6254L3272l5205q8415m9102R9084J87845P5013r4623r2480
$$ -148590 -117139 -40885 -7613 -42818 -131233 -180335 -81251 106594 181607 86984 -5496
40249e496L1960P0080J6504M254m944j27329k48434j55583Q4101K04870J45229
$$ -5496 26464 96544 113048 117302 112358 -14971 -263405 -418988 -334887 -130017 15212
40238A5212O6970M1319J2583k007L6179K4657j13607k13534j00816Q7953J10383
$$ 15212 82182 123501 136084 134077 170256 194913 81306 -132228 -233044 -145091 -34708
40227c4708M034l0571J9136M4930O6220J05473J6999k28834l22134n5310K48058
$$ -34708 -30674 -61245 -42109 2821 69041 174514 191513 -37321 -359455 -414765 -166707
40216a66707J79405j01403j40806O8756J48095L170r5112m1249n371l8746k0635
$$ -166707 12698 -88705 -229511 -160755 -12660 -9490 -104602 -145851 -151222 -189968 -210603
40205b10603K7011j5001n7611N3244J76627Q3252q4660k1133J74677J35453j30725
$$ -210603 -183592 -198593 -256204 -202960 -26333 56919 -27741 -48874 125803 261256 130531
40194A30531k46052r5268M5466K5683m719L1981L2768O242O7569J40441O0019
$$ 130531 -115521 -210789 -165323 -139640 -144359 -112378 -79610 -73368 -5799 134642 194661
40183A94661o3502l885J19513Q111k36682k19523O1661J76004k2619j67712j0261
$$ 194661 131159 127274 246787 254898 18216 -201307 -139646 36358 13739 -153973 -164234
40172a64234K02485J69867l4581j72680j67710o6100O9855J29194L8692p6556
$$ -164234 38251 208118 173537 857 -166853 -232953 -163098 -33904 4788 -71768
40162g1768l8237R6843J30505M7356j6426m3823r2541q6623L9931J16333j5956
$$ -71768 -110005 -13162 117343 164699 148273 104450 11909 -74714 -34783 81550 65594
40151F5594j69826r0030R2619Q4293n4515n5108M7373K5819m8782N7474K20682
$$ 65594 -104232 -194262 -101643 -17350 -71865 -126973 -79600 -53781 -102563 -45089 175593
40140A75593J14708j74790k41152l9118O8473m2606r9247L1984J49065J21922
$$ 175593 290301 115511 -125641 -164759 -96286 -138892 -238139 -206155 -57090 64832
40130F4832M6098m7989k06265k74460o7649J98992J38006j58401k13164O7803
$$ 64832 110930 62941 -143324 -417784 -485433 -286441 -148435 -306836 -520000 -452197
40120d52197K63451J45493j4927K2549J16147Q2242k2789j02757j56205j28005
$$ -452197 -188746 -43253 -58180 -35631 80516 162758 139969 37212 -118993 -246998
40110b46998M3245K02055J38791m0522o4575L8138K0682j07396j21775l1823l0317
$$ -246998 -203753 -1698 137093 96571 31996 70134 90816 -16580 -138355 -170178 -200495
40099b00495o6673M7628J84616P0342j57440j16976J36625J81799k9596j05536
$$ -200495 -267168 -219540 -34924 35418 -122022 -238998 -102373 79426 49830 -55706
40089e5706P9766K09404J22538J7206k2902j44167k85602j84894Q6928J46080
$$ -55706 24060 233464 356002 373208 350306 206139 -79463 -264357 -177429 -31349
40079c1349n5590j46946Q807J28881P5056M4571Q8443j183j98881j95021L0792
$$ -31349 -86939 -233885 -225078 -96197 -21141 23430 111873 110690 -88191 -283212 -252420
40068b52420J30771J2987j0580J58627K06333r4j63843j02363k4976p2432p3270
$$ -252420 -121649 -108662 -119242 39385 245718 245624 81781 -20582 -45558 -117990 -191260
40057a91260M8302R5985J4411J9641J52877J60191k7107j44550p3363k0760q7656
$$ -191260 -142958 -46973 -32562 -12921 139956 300147 273040 128490 55127 34367 -53289
40046e3289j00887j893L5343j7793J6177J23044Q5666o8283p2110P6347R6398
$$ -53289 -154176 -156069 -120726 -138519 -122342 702 86368 18085 -54025 22322 118720
40035A18720n1394j15373m9833m9387q4020N1211K26471J09290j87928k17972
$$ 118720 67326 -48047 -97880 -147267 -231287 -180076 46395 155685 -32243 -250215
40025b50215K6851J10986m1718m7943J59232J90539l2931j08402P9187J39588
$$ -250215 -223364 -112378 -154096 -202039 -42807 147732 114801 6399 85586 225174
40015B25174o6176j64833j203O9188j17178k08519n612J76979J04477j2939o870
$$ 225174 158998 -5835 -7038 62150 -55028 -263547 -269159 -92180 12297 -642 -7512
40004g512k8318j12914m6414J37058J14946r6121j01185J29403J59396r6666j85434
$$ -7512 -35830 -148744 -195158 -58100 56846 -39275 -140460 -11057 148339 51673 -133761
39993a33761L9055J34568r2997k25542k5320J40570K3218o3643J02009K21606
$$ -133761 -94706 39862 -53135 -278677 -303997 -163427 -140209 -203852 -101843 119763
39983A19763Q4227l2146O1075R8176p3731j67034k7566O3326l4222n5098P6952
$$ 119763 203990 171844 232919 331095 257364 90330 62764 126090 91868 36770 113722
39972A13722M6283j83993j93748J00335J99704r0172k74058m8709J74685N6836
$$ 113722 160005 -23988 -217736 -117401 82303 -7869 -281927 -330636 -155951 -99115
39962i9115q6739M7134J88531Q1239j6932J06290J73207j6283j68462o8701K1643
$$ -99115 -185854 -138720 49811 131050 114118 220408 393615 377332 208870 140169 161812
39951A61812p3956j02445M3972N6468j39346j51677J08592J68935j20398k33391
$$ 161812 87856 -14589 29383 85851 -53495 -205172 -96580 72355 -48043 -281434
39941b81434P4562K74793K0735k24599o6632J19542k8724j51309J05929L65080
$$ -281434 -206872 67921 88656 -135943 -202575 -83033 -111757 -263066 -157137 207943
39931B07943J94873j27810j80848j08452j60154j36475J04340K04250l7211j84689
$$ 207943 402816 275006 94158 -14294 -174448 -310923 -206583 -2333 -39544 -224233
39921b24233P1406L13401J45503j07860n7959N3237o0894j13024J36723K88773
$$ -224233 -152827 160574 306077 198217 140258 193495 132601 19577 156300 445073
39911D45073R003k95407j80609N8638q722j69466o3693J15151P8585L0845J66464
$$ 445073 454076 158669 -21940 36698 27976 -141490 -205183 -90032 -11447 19398 185862
39900A85862J76557j16695k62808L4020K87279N8268k50484j42446R5944J4222
$$ 185862 362419 245724 -17084 16936 304215 362483 111999 -30447 65497 79719
39890G9719j52143k7523J27300k7054j73825M0606K40583j2276l50793k24158
$$ 79719 -72424 -99947 27353 299 -173526 -132920 107663 95387 -255406 -479564
39880d79564J44297K32710J33303J84381K09125n9431k86570q3157K21928J40916
$$ -479564 -335267 -102557 30746 215127 424252 364821 78251 -4906 217022 357938
39870C57938j12357q9799M9311n8345k16202q5878R9138k035j36104L2176K03472
$$ 357938 245581 155782 205093 146748 -69454 -155332 -56194 -58229 -194333 -162157 41315
39859D1315N43k61058j31666J38703R7697p2996R409J54236K7797j31793P922
$$ 41315 41858 -219200 -350866 -212163 -114466 -187462 -178053 -23817 3980 -127813 -119891
39848a19891J75274K1316j64659q185K10141J06278o5934L6518J36488p3010k37338
$$ -119891 55383 76699 -87960 -96145 113996 220274 154340 190858 327346 254336 16998
39837A6998j0972K08355P754k28781n3291J73610l319k31006n0245J84147Q437
$$ 16998 6026 214381 222135 -6646 -59937 113673 110354 -120652 -170897 13250 21687
39826B1687k11454j677K46795J9684k85974r5372K40816J27836j43563k4389J86995
$$ 21687 -189767 -191444 55351 75035 -210939 -306311 -65495 62341 -81222 -105611 81384
39815H1384k4092k92063n3379K92329Q7664l02723j36174L23853L06201o7736
$$ 81384 57292 -234771 -288150 4179 91843 -210880 -347054 -23201 283000 215264
39805B15264j15422J07029M7725j88884j04671J43169O9852j39622k6674J72691
$$ 215264 99842 206871 254596 65712 -38959 104210 174062 34440 7766 180457
39795A80457P003k19776k1063K45547J9226l37453j83130J82524J05487j72927
$$ 180457 187460 -32316 -53379 192168 211394 -126059 -309189 -126665 -21178 -194105
39785a94105m6259K31771P2050k44771j17019J74707M8659j75077P5807L81877
$$ -194105 -240364 -8593 63457 -181314 -298333 -123626 -74967 -250044 -174237 207640
39775B07640P3059l91923j85617L28874K47612k11719j89263J75949J07873k46054
$$ 207640 280699 -111224 -296841 32033 279645 67926 -121337 54612 162485 -83569
39765h3569j43186K53134K00063j59420j20551J67520N4147k47569r5585K20396
$$ -83569 -226755 26379 226442 67022 -53529 113991 168138 -79431 -175016 45380
39755D5380K6798l04742j2001M71132K07642m28542l35545L11923L85899j71360
$$ 45380 72178 -232564 -244565 226567 434209 5667 -329878 -17955 367944 196584
39745A96584l86062q3795J7347j46418P844L37337J99895j62674k2705L41474
$$ 196584 -189478 -273273 -255926 -402344 -394500 -57163 142732 -19942 -42647 298827
39735B98827J31959l41862j74643L62961K86739k20084j74018K83845J72562l85837
$$ 298827 430786 88924 -85719 277242 563981 343897 169879 453724 626286 240449
39725B40449l76629J60127K49335j26497r7054K95387K02651k72334k46027J76732
$$ 240449 -136180 23947 273282 146785 49731 345118 547769 275435 29408 206140
39715B06140J13292l07586j92571K97093K29022k32658j33156L50778K29012l18538
$$ 206140 319432 11846 -180725 116368 345390 112732 -20424 330354 559366 240828
39705B40828k54578K76462K37171k41699j52120L16329J23035m70512k94164M22606
$$ 240828 -13750 262712 499883 258184 106064 422393 545428 74916 -219248 203358
39695B03358L89908l01181l74959J68879J39536m35041l63947L24326M31391n2640
$$ 203358 593266 292085 -82874 86005 225541 -209500 -573447 -249121 182270 129630
39685A29630j5912M53150K33246m56592l37675L84666L05420m56452m41365L21284
$$ 129630 113718 566868 800114 343522 5847 390513 695933 239481 -201884 119400
39675A19400L64132l62002m23689K78161L83355j92318j68824M20365K73385m49455
$$ 119400 483532 121530 -302159 -23998 359357 167039 -1785 418580 691965 242510
39665B42510l14477M84086L74358m81717m11896M65308L88994n78877n88728M04376
$$ 242510 -71967 412119 786477 304760 -107136 358172 747166 168289 -420439 -16063
39655a6063N32843l36236l82084N13242N14712m59644m89122N25774N75968m92650
$$ -16063 516780 180544 -201540 311702 826414 366770 -122352 403422 979390 486740
39645D86740o07042M46728N46738n69691p07059M98050Q20868k29322n07756M88173
$$ 486740 -120302 326426 873164 303473 -403586 94464 915332 686010 178254 666427
39635F66427O69862l94179n63332N67568P75516l63852n30960Q26176J429201
$$ 666427 1336289 942110 378778 946346 1721862 1358010 827050 1653226 3082427
39626C082427N78380J62653M66686l31427j777482j284004O55977P39030r98156
$$ 3082427 3660807 3823460 4290146 3958719 2181237 897233 1553210 2292240 1294084
39617A294084j051496Q15432R77362r64189j211015Q37054J263315p08590j089887
$$ 1294084 242588 1058020 2035382 1071193 -139822 697232 1960547 1251957 162070
39608A62070R75164J352562q89573j420514Q04659J288440j041952j407747J307819
$$ 162070 1137234 2489796 1600223 179709 984368 2272808 1230856 -176891 1130928
39599A130928J924482q46705j468379J490820K093272j155055j688438K168121
$$ 1130928 3055410 2208705 740326 2231146 4324418 3169363 1480925 3649046
39591C649046L075938r54766j662197L472052N227932M33482p81274N061605O290959
$$ 3649046 6724984 5770218 4108021 7580073 12808005 13241487 12460213 17521818 23812777
39582B3812777m99126K9091J3001517J8624224R712921J6732618N8967462R2559443
$$ 23812777 23313651 23342742 36344259 54968483 64681404 81414022 140381484 232940927
39574B32940927N6980485l2784022r2661327p6293833k7126682o252873j4290551
$$ 232940927 289921412 257137390 164476063 88182230 61055548 54802675 40512124
39567D0512124j5572319k985965K372051m176236o558463o85045J095812l942585
$$ 40512124 24939805 21953840 24325891 20149655 13591192 12906147 14001959 10059374
39559A0059374m993379K46678K059701j892579l060955P60300J951693j485356
$$ 10059374 5065995 5312673 7372374 5479795 2418840 3179140 5130833 3645477
39551C645477k552670O88962J802552j117198k134118O36083J723002p21414j665017
$$ 3645477 1092807 1781769 3584321 2467123 333005 969088 2692090 1970676 305659
39542C05659O39919J496502p43830j619278M97096J385724n65621j375040N36593
$$ 305659 945578 2442080 1698250 78972 576068 1961792 1396171 21131 557724
39533E57724J379443m28135j301790L43110J164095l40287r98565N78058J293779
$$ 557724 1937167 1509032 207242 550352 1714447 1374160 375595 953653 2247432
39524B247432j43009n87003J258684K028087n2640j830331j000161J34606m78115
$$ 2247432 2104423 1517420 2776104 4804191 4751551 2921220 1921059 2055665 1577550
39515A577550j049385p3399O23602k41551p77516K19436Q20662j81911q81510
$$ 1577550 528165 454766 1078368 836817 59301 278737 1099399 917488 35978
39506C5978k5066O10756j70646o89352J40264O37499k26145p32614J68731P53715
$$ 35978 10912 621668 451022 -238330 -98066 539433 313288 -419326 -250595 503120
39496E03120r7078p16580P7343P22292M352o43369p736O30100J08031m63293p9364
$$ 503120 406042 -310538 -233195 489097 493449 -149920 -157656 472444 580475 117182 37818
39485C7818K47175k46847m61816K19550N19259j98452n38495K21318O41731j00771
$$ 37818 284993 38146 -423670 -204120 315139 116687 -421808 -200490 441241 340470
39475C40470n82495J06018N95769p4256n92012M0807N66063n3994o20414l7633
$$ 340470 -242025 -136007 459762 385506 -206506 -165699 400364 346370 -274044 -311677
39465c11677O04272J78705l88819m9960L77006k4149m39567l9468L35617q6211
$$ -311677 292595 471300 82481 32521 409527 385378 -54189 -93657 241960 155749
39455A55749m01476J60315O10480N5066n59474k17506L18483P6146l17438k1918
$$ 155749 -245727 -85412 525068 580134 20660 -196846 121637 197783 -119655 -141573
39445a41573L49040L8245l21975p414L58346R6555j75262J43532L64168j05588
$$ -141573 207467 245712 -76263 -83677 274669 371224 195962 339494 703662 598074
39435E98074m92279j03475L25879L7667l52561j38231J43926q6248k55524J31453
$$ 598074 105795 2320 328199 365866 13305 -124926 19000 -67248 -322772 -191319
39425a91319L95257J6193k72817R5921L77971l4799m03768p8098K52486m3734
$$ -191319 203938 220131 -52686 43235 421206 386407 -17361 -95459 157027 113293
39415A13293k89305J03008L77933j09582n53796j60688L57337J23922l10111j02983
$$ 113293 -176012 -73004 304929 195347 -358449 -519137 -161800 -37878 -347989 -450972
39405d50972L23228K29810m1261P2804J77770j41131k98129J47791M45146j8148
$$ -450972 -127744 102066 60805 133609 311379 170248 -127881 19910 465056 446908
39395D46908m74366j32972L62872J48310l06510k00933R7724p2400l06081j2272
$$ 446908 -27458 -160430 202442 350752 44242 -156691 -58967 -131367 -437448 -449720
39385d49720L05873J3458l41927l4657M20078K14863k44247j50876J95422O7055
$$ -449720 -143847 -130389 -472316 -506973 -86895 127968 -116279 -267155 -71733 -4678
39375d678k61158j17915K17254R6215k03413m1436L22175K45537q3537j03298
$$ -4678 -265836 -383751 -166497 -70282 -273695 -315131 7044 252581 169044 65746
39365F5746L1330r1586j98036Q3108L19230K4877l34244j46115K08838R6112j79226
$$ 65746 97076 5490 -192546 -109438 209792 234669 -99575 -245690 -36852 59260 -119966
39354a19966k5993K50947O2083k87517j68632J85462J66989o8943k0946J38529
$$ -119966 -145959 104988 167071 -120446 -289078 -103616 63373 -5570 -26516 112013
39344A12013k334j76205L1115K74172P2681k19636o9534J92860M837l30428k14607
$$ 112013 109679 -66526 -35411 238761 311442 91806 22272 215132 219969 -110459 -325066
39333c25066J26745J30815l1003J03224K94872Q4169k42384j69177O3713k7571
$$ -325066 -198321 -67506 -98509 4715 299587 383756 141372 -27805 35908 8337
39323H337j99634q511K35418M7899k34474o6063K37923Q9616k39618j44453J62000
$$ 8337 -191297 -199808 35610 83509 -150965 -217028 20895 110511 -129107 -273560 -111560
39312a11560J03165j37003l4871J96228N1828j97086p359L03079Q3426l82871
$$ -111560 -8395 -145398 -180269 15959 67787 -129299 -136658 166421 249847 -133024
39302a33024l24586J36862K44717k7141n2819K05388K03458o8617r5112J19561
$$ -133024 -457610 -320748 -76031 -103172 -155991 49397 252855 184238 89126 208687
39292B08687O8928k39036k78979M310J35005Q894j3449J17976R5453o2858m9999
$$ 208687 277615 38579 -240400 -236090 -101085 -92191 -105640 12336 107789 44931 -5068
39281e068Q0185K0649j47036j11736K8913k7023j49881l6349J40618M6186j22000
$$ -5068 75117 95766 -51270 -163006 -134093 -161116 -310997 -347346 -206728 -160542 -282542
39270b82542J6066K61877J83035o6367m6959J24113K9785k09883j62844Q7322
$$ -282542 -266476 -4599 178436 112069 65110 189223 219008 9125 -153719 -66397
39260f6397J26334o890J2880R2012n5633k35553r5880J43711O0782j56201n8385
$$ -66397 59937 53047 65927 157939 102306 -133247 -229127 -85416 -24634 -180835 -239220
39249b39220J90765J20088j47304j40266O7244N4323j01237k4189J51962L5966
$$ -239220 -48455 71633 -75671 -215937 -148693 -94370 -195607 -219796 -67834 -31868
39239c1868j98367j03536J59316J05926j32853o0365K11753J67121j18373j24261
$$ -31868 -230235 -333771 -174455 -68529 -201382 -261747 -49994 117127 -1246 -125507
39229a25507J15214J02698j43838j44061R5494J15380p3506k7394K05251J26410
$$ -125507 -10293 92405 -51433 -195494 -100000 15380 -58126 -85520 119731 246141
39219B46141k35166l05279K0986K19089P4790m2090N5636J06238L802l9260n287
$$ 246141 10975 -294304 -273318 -54229 20561 -21529 34107 140345 144147 104887 99600
39208I9600q7569j87296m7666J63717Q6390j19839k6373K19288J07026k65400
$$ 99600 12031 -175265 -222931 -59214 27176 -92663 -119036 100252 207278 -58122
39198e8122k96657O4827K44212N7131n8075P8388J08045j09762k29212q2946O7386
$$ -58122 -354779 -289952 -45740 11391 -46684 31704 139749 29987 -199225 -282171 -214785
39187b14785Q6819J35772J94479N2591j70253j31727P8113M3890k06577k30082
$$ -214785 -127966 7806 202285 254876 84623 -47104 31009 74899 -131678 -361760
39177c61760J9604J20309l3334q6610O3617J10298k5357o1774N9644R4662L9991
$$ -361760 -342156 -221847 -255181 -341791 -278174 -167876 -193233 -255007 -195363 -100701 -60710
39166f0710J20430K31015O0907k37814k11460P5379J22119j05042j35349J05669
$$ -60710 59720 290735 351642 113828 -97632 -22253 99866 -5176 -140525 -34856
39156c4856J69927m7093j24469O1998J26822m8757r9204P7815J10783j01065j68091
$$ -34856 135071 87978 -36491 25507 152329 103572 4368 82183 192966 91901 -76190
39145g6190M0390J40977l3272j37075R561J11364L916o8393K294n565j01808k914
$$ -76190 -35800 105177 71905 -65170 -55609 55755 59671 -8722 -6428 -11993 -113801 -116715
39133a16715K30719J66703j91966k93185K9637K44557L8247j81953o0487J22066
$$ -116715 114004 280707 88741 -204444 -174807 69750 107997 -73956 -134443 -12377
39123a2377M3831j03788p6562k9537j03386q3845J33758K36664L2960j70061r0647
$$ -12377 31454 -72334 -148896 -178433 -281819 -365664 -231906 4758 37718 -132343 -222990
39112b22990P1374N3549k4397K0527P0373j1761r6101o2164j6696j9610M1806
$$ -222990 -151616 -98067 -122464 -101937 -31564 -43325 -139426 -201590 -218286 -237896 -196090
39101a96090J35664N4901j45097j38596Q7728J50291n9328j63672K3332J73258
$$ -196090 -60426 -5525 -150622 -289218 -201490 -51199 -110527 -274199 -250867 -77609
39091g7609O3519m0343O4337J23141o6924k50480j77247j8421K1710O3386J88417
$$ -77609 -14090 -54433 9904 133045 66121 -184359 -361606 -380027 -358317 -294931 -106514
39080a06514J76123n0173j63667J7695J67901J4646j76627q9089R3124N7977q3376
$$ -106514 69609 19436 -144231 -126536 41365 56011 -120616 -209705 -116581 -58604 -141980
39069a41980o7680K8053Q001k4066R8014K11144R1157j19560j51896o0907n4629
$$ -141980 -209660 -181607 -173606 -197672 -99658 111486 202643 83083 -68813 -129720 -184349
39058a84349q3595J1647J27991O1637r9952j09243K8252R7231L7249k5599l1793
$$ -184349 -267944 -256297 -128306 -66669 -166621 -275864 -247612 -150381 -113132 -138731 -170524
39047a70524k1339Q876O6034O6823l1668j08362n3492M9132P2270M6148N0825
$$ -170524 -191863 -182987 -116953 -50130 -81798 -190160 -243652 -194520 -122250 -76102 -25277
39036b5277M3838l7154j18069r5687o771M3913M0452L4871M6352N6795M0634k5903
$$ -25277 18561 -18593 -136662 -232349 -239120 -195207 -154755 -119884 -73532 -16737 23897 -2006
39024b006j08392r7527L4257J25837M2837q4143n2837O8727O3224m7422m9502
$$ -2006 -110398 -207925 -173668 -47831 -4994 -89137 -141974 -73247 -10023 -57445 -106947
39013a06947O7315J00038J0673k6895K6724K3668m9410l6909O2084P5990M146
$$ -106947 -39632 60406 71079 44184 70908 94576 45166 8257 70341 146331 150477
39002A50477K7116J28345P4636j50677k61302j19777O2525Q7439K0484k0988l7644
$$ 150477 177593 305938 380574 229897 -31405 -151182 -88657 -1218 19266 -1722 -39366
38991c9366k4139M9672R0223p625j05769l538J58916O9040k01670k58447l2430
$$ -39366 -63505 -13833 76390 68765 -37004 -40542 118374 187414 -14256 -272703 -305133
38980c05133J10823J546q3175M8653J84238J21128j0068n4048r2396j82869j73747
$$ -305133 -194310 -192764 -275939 -227286 -43048 78080 68012 13964 -78432 -261301 -435048
38969d35048Q810J78193J73363O9830j9664q8274r4470L0046J67177J15919n1703
$$ -435048 -426238 -248045 -74682 -4852 -24516 -112790 -207260 -177214 -10037 105882 54179
38958E4179p5160M0336M3932p0757m1389J45490J86334K132j26839p7346n1454
$$ 54179 -20981 19355 63287 -7470 -48859 96631 282965 285097 158258 80912 29458
38947B9458j08054l2913J72517J92138k9998j35740J9334J15301j7660q3396Q7589
$$ 29458 -78596 -111509 61008 253146 223148 87408 106742 222043 204383 120987 208576
38936B08576J74218m6066k50364j21413J05839Q2599o7326m8171O1783J6742j18526
$$ 208576 382794 336728 86364 -35049 70790 153389 86063 37892 99675 116417 -2109
38925b109j21563k1111K0107K6931Q5674J02186j0432j09096o3559m408o6012
$$ -2109 -123672 -144783 -124676 -97745 -12071 90115 79683 -29413 -92972 -97380 -163392
38914a63392j15836p424J30266J25235N9946P7065J07389M2500l5088l1773m0697
$$ -163392 -279228 -286652 -156386 -31151 28795 105860 213249 255749 220661 188888 148191
38903A48191j37996j96592j11350P483N1045Q5815J41203R1060p4115j40527k2422
$$ 148191 10195 -186397 -297747 -290264 -239219 -153404 -12201 78859 4744 -135783 -158205
38892a58205P4600K6102J106R6236J06203q5795k25069q7940J29923J32413k7540
$$ -158205 -83605 -57503 -56397 39839 146042 60247 -164822 -252762 -122839 9574 -17966
38881a7966j10621p3503j7116L7706Q4613M6808m6393k5706J11017J31791k6636
$$ -17966 -128587 -202090 -219206 -181500 -96887 -50079 -96472 -122178 -11161 120630 93994
38870I3994j10013R298R0343m0587j65630o2962J10401J18627K9631N515l302
$$ 93994 -16019 -6721 83622 43035 -122595 -185557 -75156 43471 73102 78617 75315
38859G5315o7181n9911Q3263J62949M7882o5381O15Q2609r584j37584r6587K2970
$$ 75315 8134 -51777 31486 194435 242317 176936 177551 260160 250576 112992 16405 39375
38847C9375L3951k3048l0888m0632j07816j15911J283R8413Q2971P4156J17953
$$ 39375 73326 50278 19390 -21242 -129058 -244969 -243686 -145273 -62302 11854 129807
38836A29807O1608j00643j20588N3358J16005o2012j68014J685J67709P6862n9458
$$ 129807 191415 90772 -29816 23542 139547 77535 -90479 -88794 78915 155777 96319
38825I6319j1135K9830j22406k09087Q564K41371J36952j03183r6164N8516L3517
$$ 96319 85184 115014 -7392 -216479 -207915 33456 170408 67225 -28939 29577 63094
38814F3094r8783n6442P8965M2203o9623J3174J75535J02743j23212j55616M387
$$ 63094 -35689 -92131 -13166 29037 -40586 -27412 148123 250866 127654 -27962 -23575
38803b3575N5264l7820l9554N8583L8049q7430q4304M6034O3273o6454j23183
$$ -23575 31689 -6131 -45685 12898 50947 -36483 -120787 -74753 -11480 -77934 -201117
38792b01117k8065P5814J18429J46575J17350l2888j75583j49509m3974k9829
$$ -201117 -229182 -153368 -34939 111636 228986 196098 20515 -128994 -172968 -202797
38782b02797m0154O4196J66086Q0840p4065o1954O3363R5863O9804J29672J68671
$$ -202797 -242951 -178755 -12669 68171 -5894 -67848 -4485 91378 161182 290854 459525
38771D59525J0708j91805j70744k2254l7459j76702j65424q444N5242K2546Q0932
$$ 459525 470233 278428 107684 85430 47971 -128731 -294155 -302599 -247357 -224811 -143879
38760a43879J69008O5717j34911j29909M0796M5873j37912j83246l090J18093
$$ -143879 25129 90846 -44065 -173974 -133178 -87305 -225217 -408463 -411553 -293460
38750b93460N7418K9566J18853J05421q5215j90280n7536R1232M6614o3678m0807
$$ -293460 -236042 -206476 -87623 17798 -67417 -257697 -315233 -224001 -177387 -241065 -281872
38739b81872O7202J09034P3541K4525k9522p3849m8942L8764J01029J00054O3714
$$ -281872 -214670 -105636 -32095 -7570 -37092 -110941 -159883 -121119 -20090 79964 143678
38728A43678j4972j29591j57361j1147J49161R4722j08981j71129q279J47437
$$ 143678 128706 -885 -158246 -169393 -20232 74490 -34491 -205620 -213899 -66462
38718f6462J07563l7193j01698m1884N7387J02693O5229P640J2468M0292l0221
$$ -66462 41101 3908 -97790 -139674 -82287 20406 85635 93275 105743 146035 115814
38707A15814j62388j49737M4601J67966O7588n1921J3178J09057J3276j59622
$$ 115814 -46574 -196311 -151710 16256 83844 31923 45101 154158 167434 7812
38697G812j72250p4451m8866l9757R1002K11890J21639m6477k6312J02230N3591
$$ 7812 -164438 -238889 -287755 -327512 -236510 -24620 97019 50542 24230 126460 180051
38686A80051j46096k07290p3730M0571N7018P7925P9562m4333j79691j22333L9934
$$ 180051 33955 -173335 -247065 -206494 -149476 -71551 8011 -36322 -216013 -338346 -298412
38675b98412O1933j3482M1540J66458R9495j05958j34747K4582N9834q4883j08083
$$ -298412 -236479 -249961 -208421 -41963 57532 -48426 -183173 -158591 -98757 -183640 -291723
38664b91723Q4673J99592P3993o6923l4681M1859K9580J9288P0318N8682n7428
$$ -291723 -207050 -7458 66535 -388 -35069 6790 36370 55658 125976 184658 127230
38653A27230j21377o5838k8771o9744o6719M635L166o3206R818K26321K88103
$$ 127230 5853 -59985 -88756 -158500 -225219 -220584 -217418 -280624 -270806 -44485 243618
38642B43618O0825j75905j47220K7809Q3847P792l8604j0979K0480L9785P1396
$$ 243618 304443 128538 -18682 9127 92974 100766 62162 51183 71663 111448 182844
38631A82844Q5185M5399j4605m7902n6094n2277l3527p680J4597L3954J7389p9309
$$ 182844 268029 313428 298823 250921 194827 142550 109023 101343 115940 149894 167283 87974
38619H7974j77878j10863J02166J99645N8844q8259l3669O1599j0060r2893M1759
$$ 87974 -89904 -200767 -98601 101044 159888 71629 37960 99559 89499 -3394 38365
38608C8365K18913J23133j25575j47676M6980R3190r1739k12364j42064p0285
$$ 38365 257278 380411 254836 107160 154140 247330 155591 -56773 -198837 -269122
38598b69122o5838K1279J57464J05448r8933j18720J13356K50143J04144o9545
$$ -269122 -334960 -313681 -156217 -50769 -149702 -268422 -155066 95077 199221 129676
38588A29676l8846O3115N5315L872P446R117j5518J5259N6517m8655k27611k07916
$$ 129676 90830 153945 209260 213132 220578 229695 214177 229436 285953 237298 9687 -198229
38576a98229J4641J25507K0456l3823Q7892J41967J408p5473P5776J90895L1565
$$ -198229 -183588 -58081 -37625 -71448 16444 158411 159819 84346 160122 351017 382582
38565C82582j87533j63583P329N0961k8451m8153n179k0881p4990o2573P75L6956
$$ 382582 195049 31466 38795 89756 61305 13152 7973 -12908 -87898 -150471 -149696 -112740
38553a12740M7021M1471j9047q9053l5900J08550J21985m8567j54600l5789J19537
$$ -112740 -65719 -24248 -43295 -132348 -168248 -59698 62287 13720 -140880 -176669 -57132
38542e7132R6871j4776l6116q380n0388j01848n1209L9334N4472K7853L3087K2756
$$ -57132 39739 24963 -11153 -19533 -69921 -171769 -222978 -183644 -129172 -101319 -68232 -45476
38530d5476m1917n6956M2008J13607J8473j40853j74118p9063J2906N8715R9801
$$ -45476 -87393 -144349 -102341 11266 29739 -111114 -285232 -364295 -351389 -292674 -192873
38519a92873J22977Q3809J3978j3905J1928M4084L1061m9599j41837j19253M4198
$$ -192873 -69896 13913 27891 13986 25914 69998 101059 51460 -90377 -209630 -165432
38508a65432J67536R3916m2337r778J23997R0259j09817j83433m1393N0171p1044
$$ -165432 2104 96020 53683 43905 167902 258161 148344 -35089 -76482 -26311 -97355
38497i7355j97820j18047N5371J17488Q5760Q1739R8654O8109K132o3080j20615
$$ -97355 -295175 -413222 -357851 -240363 -154603 -72864 25790 93899 96031 32951 -87664
38486h7664j17317l22J19455O8755q5989r2557Q4070J93991J02435l8328r5371
$$ -87664 -204981 -205303 -85848 -17093 -103082 -195639 -111569 82422 184857 146529 51158
38475E1158j24465j41031m5099J10928J06899o1729j14096N7719J94115R7208
$$ 51158 -73307 -214338 -259437 -148509 -41610 -103339 -217435 -159716 34399 131607
38465A31607p3737j18049q8419q1884m2207M2634M4832k9710J5434J89308K23347
$$ 131607 57870 -60179 -148598 -230482 -272689 -230055 -185223 -214933 -199499 -10191 213156
38454B13156L1789j11626n2115m739r6912r6387J09599K05835j2999k13931o3571
$$ 213156 244945 133319 81204 76465 -20447 -116834 -7235 198600 185601 -28330 -91901
38443i1901J85281J27561j01584r9263R4237J14774o2094j27504k2300N530r8098
$$ -91901 93380 220941 119357 20094 114331 229105 167011 39507 17207 22737 -75361
38432g5361j10400K7908J10675N2294N723M1009L9701k9561l4635M8966O1581
$$ -75361 -185761 -157853 -47178 5116 10839 51848 91549 61988 27353 76319 137900
38421A37900o1135j60556r8605M5825J05865L2212q2729j11640j2752J15319J37694
$$ 137900 76765 -83791 -182396 -136571 -30706 1506 -81223 -192863 -205615 -90296 47398
38410D7398N7681j2573n7896j55360k36340j12107J65091K59676M4216j59448
$$ 47398 105079 92506 34610 -120750 -357090 -469197 -304106 -44430 -214 -159662
38400a59662o3468J44314J36032k9761o5155N3861J17322P5504N0353M2349m1599
$$ -159662 -223130 -78816 57216 27455 -37700 16161 133483 208987 259340 301689 260090
38389B60090j33091q7156L0326L3066n8706o7266J6241M2642K483K1375P8677
$$ 260090 126999 39843 70169 103235 44529 -22737 -6496 36146 38629 60004 138681
38378A38681K2907j24258j58124k0818J08003R8626K9050R10o423l3240m9366
$$ 138681 161588 37330 -120794 -141612 -33609 65017 94067 94977 88554 55314 5948
38367E948k8990m70J7084L9237O5923P3378M4716l2171j41142j82701n7312J41652
$$ 5948 -23042 -23512 -6428 32809 98732 172110 216826 184655 43513 -139188 -196500 -54848
38355e4848J71949k5748k04784j47632M1211J29178Q2282K2318j569j5141q820
$$ -54848 117101 91353 -113431 -261063 -219852 -90674 -8392 13926 12357 -2784 -11604
38344a1604J2343j5410p2710k2282J42394J99663K6833j68473j51432q073L8456
$$ -11604 739 -14671 -87381 -109663 32731 232394 259227 90754 -60678 -68751 -30295
38333c0295j8696m8468m9273p7510n8884O4011J39605L4493r1519k7274J12162
$$ -30295 -48991 -97459 -146732 -224242 -283126 -219115 -79510 -45017 -136536 -163810 -51648
38322e1648O9566j06911j46030j5257M9638l8324r9763j9963Q5597R3086L4771
$$ -51648 17918 -88993 -235023 -250280 -200642 -238966 -338729 -358692 -273095 -180009 -145238
38311a45238p017q33N3158J06911O4577o8229j18101J6662J69111J34209j7423
$$ -145238 -152255 -153088 -99930 6981 71558 3329 -114772 -98110 71001 205210 187787
38300A87787p0224q29M6703K8000L400l9371j29383j58536k2853J52856J63080
$$ 187787 117563 116734 163437 191437 194837 155466 26083 -132453 -155306 -2450 160630
38289A60630K5429q1137r5968p6220k0611P3599Q7853m1240j42347n7468P0407
$$ 160630 186059 104922 8954 -67266 -87877 -14278 73575 32335 -110012 -167480 -97073
38278i7073L5782o0083m712J11921N8671q1207l8077J30266J02883j31928k23363
$$ -97073 -61291 -121374 -126086 -14165 44506 -36701 -74778 55488 158371 26443 -196920
38267a96920m0455J24035N4359p1308l0875R9979J39134P6559o97n8023o8266
$$ -196920 -237375 -113340 -58981 -130289 -161164 -61185 77949 154508 153811 95788 27522
38256B7522j447O2311k464j40241j58049k9911O8030O1096O8233J40538J61506
$$ 27522 26075 88386 85922 -54319 -212368 -242279 -174249 -113153 -44920 95618 257124
38245B57124Q0450L941k1427p9704j61965j18545O4493J75865Q6591o0028q7585
$$ 257124 337574 341515 320088 240384 78419 -40126 24367 200232 286823 226795 139210
38234A39210k8641o502l9071p6342r8470q6307j5349O4190O7733K5182M2765J03640
$$ 139210 110569 104067 64996 -11346 -109816 -196123 -211472 -147282 -79549 -54367 -11602 92038
38222I2038Q3108j9461o2703j1013R468m6280n8733K3006P5528K3188l1239o510
$$ 92038 175146 155685 92982 81969 91437 45157 -13576 9430 84958 108146 76907 70397
38210G0397R993o0820j28390q6429J683J1446m2562m5084L8407J24837J31631
$$ 70397 80390 19570 -108820 -195249 -193566 -182120 -224682 -269766 -231359 -106522 25109
38199B5109O1117k5350q3802j27593j72112j54958j372K06729K63054J16907k8993
$$ 25109 86226 60876 -22926 -150519 -322631 -477589 -478961 -272232 -9178 107729 78736
38188G8736j7551L5410k0357q5069r17J23989P3793r4564j38391l7046M769o1298
$$ 78736 61185 96595 76238 -8831 -9748 114241 188034 93470 -44921 -81967 -77198 -138496
38176a38496o4057M6551R9919M849j13208j35555q2705J2060J36870J92918Q6868
$$ -138496 -202553 -156002 -56083 -51234 -164442 -299997 -382702 -370642 -233772 -40854 46014
38165D6014o2473n7012N0118L6248q6895p8564R1466J62543K6904r7164o4927
$$ 46014 -16459 -73471 -23353 12895 -74000 -152564 -61098 101445 128349 31185 -33742
38154c3742l7761j40146j98247m4452J72253K16280J09267K7249J5819M968k3929
$$ -33742 -71503 -211649 -409896 -454348 -282095 -65815 43452 70701 86520 91488 67559
38143F7559n2449r0934j06638j9509J25472J42190k4244j73497j23779M7293J57292
$$ 67559 15110 -75824 -182462 -201971 -76499 65691 41447 -132050 -255829 -208536 -51244
38132e1244J55537Q3547l5793j37570j05585L6691Q3519n8850j92365j05689J09820
$$ -51244 104293 187840 152047 14477 -91108 -54417 29102 -29748 -222113 -327802 -217982
38121b17982K03976J15620o068m9022l5288j5629p682j6886k9512j9939j3362
$$ -217982 -14006 101614 95546 46524 11236 -4393 -12075 -28961 -58473 -78412 -91774
38110i1774o3500j24841o7477J08561K08408J00242q2265j26748l3522K7331j4416
$$ -91774 -155274 -280115 -347592 -239031 -30623 69619 -12646 -139394 -172916 -145585 -160001
38099a60001n8286j7387O0976Q8373N9915L4378K8961n445q6514j30657n6636
$$ -160001 -218287 -235674 -174698 -86325 -26410 7968 36929 31484 -55030 -185687 -242323
38088b42323O2192P0869k3039l8992P2025J07874n0865j86544o0234J77749J94288
$$ -242323 -180131 -109262 -132301 -171293 -99268 8606 -42259 -228803 -289037 -111288 83000
38077H3000p418j12854j1414O5195l1477j31743n3984J19344K03643J46930K384
$$ 83000 75582 -37272 -48686 16509 -14968 -146711 -200695 -81351 122292 269222 271606
38066B71606j48742j78235j3126J83319J47576j02508k52363j36802M2868O0340
$$ 271606 122864 -55371 -68497 114822 262398 159890 -92473 -229275 -186407 -126067
38056a26067j7187p799Q4964J21875M4070r1487j86093j39181N5024K14242J43556
$$ -126067 -143254 -151053 -66089 55786 99856 8369 -177724 -316905 -261881 -47639 95917
38045I5917o5873j26075J9463J13315J0250r6203j7679J22021J17749N199n5848
$$ 95917 30044 -96031 -76568 36747 46997 -49206 -66885 55136 172885 178084 122236
38034A22236n0134n8207p3687m7363l620K5573O5636R2871J7121j21975j30930
$$ 122236 72102 13895 -59792 -107155 -110775 -85202 -19566 73305 90426 -31549 -162479
38023a62479K8551J12798m0238k20466j50244Q2445J64715L4587o3114K3576J48554
$$ -162479 -133928 -21130 -61368 -281834 -432078 -349633 -184918 -150331 -213445 -189869 -41315
38012d1315J14965m9905j55109r4649L9346Q1565k51o6938o569R4173P7767l4748
$$ -41315 73650 23745 -131364 -226013 -186667 -105102 -105353 -172291 -178860 -84687 -6920 -41668
38000d1668p1617K4216J21169J09592L0783l4116o0528m2097P664J2340o5512
$$ -41668 -113285 -89069 32100 141692 172475 138359 77831 35734 43398 55738 -9774
37989i774j04976J5260J77980J64276m79q7973l6917k98k3422J0819Q5502L5132
$$ -9774 -114750 -99490 78490 242766 242287 154314 117397 117099 93677 104496 189998 225130
37977B25130j11056j21342J5738L1913j34775j87049J8755J97482J09659n4835
$$ 225130 114074 -7268 8470 40383 -94392 -281441 -262686 -65204 44455 -10380
37967a0380m4193M3319K3907n473R3547J65270K3300j74541j70873l4728N319
$$ -10380 -54573 -11254 12653 7180 100727 265997 289297 114756 -56117 -90845 -85526
37956h5526k7262L0440J16180O0275n6025k5979R2127O7596q6488j38113l8722
$$ -85526 -112788 -82348 33832 94107 38082 12103 104230 171826 85338 -52775 -91497
37945i1497L1204M270J775N8946O0712j8592n7299n17P1538J01749J02724N6666
$$ -91497 -60293 -56023 -54248 4698 65410 46818 -10481 -10998 60540 162289 265013 321679
37933C21679n7483j57910j42732m7257K2370N0264O7494M1797l6727o8933n199
$$ 321679 264196 106286 -36446 -83703 -61333 -11069 56425 98222 61495 -7438 -12637
37922a2637L8232j2237k6493Q3168J44291N589j48973p0779J27792J54049J0596
$$ -12637 25595 13358 -13135 70033 214324 219913 70940 161 127953 282002 292598
37911B92598o8738n2758r5803j58416n9626J11516O3752j76121k30409M0512L05604
$$ 292598 223860 171102 75299 -83117 -142743 -31227 32525 -143596 -374005 -333493 -27889
37900b7889K67897N3214q3391j25597j57974j25981K1775J38663O3105j18797
$$ -27889 240008 293222 209831 84234 -73740 -199721 -177946 -39283 23822 -94975
37890i4975j84944p3684P8106J32950P7709l643j2128O8700J33220P5332n5552
$$ -94975 -279919 -353603 -275497 -142547 -64838 -68481 -80609 -11909 121311 196643 141091
37879A41091j14291o2448O673L0604K7969k256p6752j24178n1507P5551R1196
$$ 141091 26800 -35648 -28975 1629 29598 27342 -49410 -173588 -225095 -149544 -58348
37868e8348j0429n4380L8442J37378J24323N4734J7647p442o2114j09442j10630
$$ -58348 -68777 -123157 -84715 52663 176986 231720 249367 241925 179811 70369 -40261
37857d0261r0698n9623J7925J12099J12988L752p2509j3130Q3055O5297l8370
$$ -40261 -130959 -190582 -172657 -60558 52430 56182 -16327 -29457 53598 118895 80525
37846H0525o4661M1326J38519P2147j14826k07525p4831J37249J51243q2619k84178
$$ 80525 15864 57190 195709 267856 153030 -54495 -129326 7923 159166 76547 -207631
37835b07631j88630J03187K59159J42383o1326j31277o0105K6866O3206P1591
$$ -207631 -396261 -293074 -33915 108468 47142 -84135 -144240 -117374 -54168 17423
37825A7423P5662N7824l566p9612r1546l931R0632O5211m6741p3420K7628P8425
$$ 17423 93085 150909 147343 67731 -23815 -27746 62886 128097 81356 7936 35564 113989
37813A13989l7646j63804j04025O5890J22917L3029n3240o7910o1026k0376J03048
$$ 113989 76343 -87461 -191486 -125596 -2679 30350 -22890 -90800 -151826 -172202 -69154
37802f9154K07743J24488r4637j97599q2906P9795J25644Q6523M4050j1312q2513
$$ -69154 138589 263077 168440 -29159 -112065 -32270 93374 179897 223947 212635 130122
37791A30122r3020j3512O3471N8169Q122k0050k0825r099Q499m893p5469j29610
$$ 130122 37102 23590 87061 145230 153352 133302 112477 103378 111877 106984 31515 -98095
37779i8095p2228M1542O2548j4248m0649K7076N3960k6196q3538j6515O9606M0883
$$ -98095 -170323 -128781 -66233 -80481 -121130 -94054 -40094 -66290 -149828 -166343 -96737 -55854
37767e5854m8804o2451O992O9311R8102J20785J10703K5440q1702j07662m0919
$$ -55854 -104658 -167109 -160117 -90806 7296 128081 238784 264224 182522 74860 33941
37756C3941L7782P6976Q6330O3801q645q7270q0811J4162O5614l3572j95106k18796
$$ 33941 71723 148699 235029 298830 290185 202915 122104 136266 201880 168308 -26798 -245594
37744b45594n7860R7671O8650o6321r0155L6701J40237J13909N3030N0543M2773
$$ -245594 -303454 -205783 -137133 -203454 -293609 -256908 -116671 -2762 50268 100811 143584
37733A43584k8835p0257n316M7737m0573j59785j06166Q6833J88513J13878O773
$$ 143584 114749 44492 39176 86913 46340 -113445 -219611 -132778 55735 169613 176386
37722A76386k3358l1644o5006o0529O030L4564m1408j32291j17913p354R9517
$$ 176386 153028 121384 56378 -4151 1879 36443 -4965 -137256 -255169 -262523 -163006
37711a63006J40007J19607P1204K7854j461m2707j04437j32122p9363n95J5049
$$ -163006 -22999 96608 167812 195666 194205 151498 47061 -85061 -164424 -165019 -149970
37700a49970j3536J3273J03400J38537M4724r3208j38148o3984L5290P0245M9418
$$ -149970 -163506 -150233 -46833 91704 136428 43220 -94928 -158912 -123622 -53377 -3959
37689c959M1385N9025K6811r1771j83550j12699N4695J01814k9937j45960q7314
$$ -3959 37426 96451 123262 31491 -152059 -264758 -210063 -108249 -138186 -284146 -371460
37678c71460M9093R1707M3572R144L113j3153j4632J7435J5351m0068k6789J13436
$$ -371460 -322367 -230660 -187088 -177944 -174831 -187984 -202616 -185181 -169830 -209898 -236687 -123251
37666a23251K08863R2712j11442j55824k7861P8788P6072L7103j205o2229r3848
$$ -123251 85612 178324 66882 -88942 -116803 -38015 38057 75160 73955 11726 -82122
37655h2122k4271P3202O6743j7854n3889l3758l7185m0342L1870J14507P7672
$$ -82122 -106393 -33191 33552 15698 -38191 -71949 -109134 -149476 -117606 -3099 74573
37644G4573m8655j22874j09731o2114K6144J43377J51226r576j34420m6776P3543
$$ 74573 25918 -96956 -206687 -268801 -242657 -99280 51946 42370 -92050 -138826 -65283
37633f5283k0440j79254q7108J60483J82571k7762q2360J20930K17584J3224j89651
$$ -65283 -85723 -264977 -352085 -191602 -9031 -36793 -119153 1777 219361 232585 42934
37622D2934j16145N8048O4924l4254n4481j7198j9204k0903J0531k3798j41104
$$ 42934 -73211 -15163 49761 15507 -38974 -56172 -75376 -96279 -85748 -109546 -250650
37611b50650j66725j5383J44999J68582J29327R9485L657j45394j54839J9008
$$ -250650 -417375 -432758 -287759 -119177 10150 109635 113292 -32102 -186941 -167933
37601a67933J35127N1992m8819k1921j4678j24611j39767P6686K58387J40572
$$ -167933 -32806 19186 -29633 -51554 -66232 -190843 -330610 -253924 4463 145035
37591A45035q4583r2055M1946L5245p4523l6221J16994J15074o3101j54091n0979
$$ 145035 60452 -31603 10343 45588 -28935 -65156 51838 166912 103811 -50280 -101259
37580a01259P1211Q2698M7680L1105J9612L7061J04919J12972l8900k15007k04876
$$ -101259 -30048 52650 100330 131435 151047 188108 293027 405999 367099 152092 -52784
37569e2784o1009j3307q4386p2878Q0484J88205J21148j6428p5599m2691J3644
$$ -52784 -113793 -127100 -211486 -284364 -203880 -15675 105473 89045 13446 -29245 -15601
37558a5601L1166k4035j08807j09900q308N4049L915r385J21624K10109N1800
$$ -15601 15565 -8470 -117277 -227177 -235485 -181436 -177521 -186906 -65282 144827 196627
37547A96627j89333j95316L822R7459J1256k4374P0966R3756m4691j43417o0491
$$ 196627 7294 -188022 -184200 -86741 -75485 -99859 -28893 64863 20172 -123245 -183736
37536a83736P1480J09527R7119O7644o2432k48508k47578Q742K19797J22716j14816
$$ -183736 -112256 -2729 94390 162034 99602 -148906 -396484 -387742 -167945 -45229 -160045
37525a60045j57587O012J06114K6235p1589l7057P2282J18268O0879l0819o7570
$$ -160045 -317632 -311620 -205506 -179271 -250860 -287917 -215635 -97367 -36488 -67307 -134877
37514a34877k2516L9745L6526j6119k2286L8219O7367N236p4595q9317o4912n3442
$$ -134877 -157393 -117648 -81122 -97241 -119527 -81308 -13941 -8705 -83300 -172617 -237529 -290971
37502b90971l1765K6494O8111M9413K8133O1818R0045L5034m4684l3755M7748
$$ -290971 -322736 -296242 -228131 -178718 -150585 -88767 1278 36312 -8372 -42127 5621
37491E621P0444R27n7061m3169l0162p8708j10742k0307J45040K15207J10678
$$ 5621 76065 76992 19931 -23238 -53400 -132108 -242850 -263157 -118117 97090 207768
37480B07768n3859j13565m9052K0767J6736j2686k776J3792k3556p8706o5786
$$ 207768 153909 40344 -8708 12059 28795 16109 13333 27125 3569 -75137 -140923
37469a40923K387K6255j2236j4372N8560R3571l5j20660j03360L4318J14667N7630
$$ -140923 -138536 -112281 -124517 -138889 -80329 13242 13207 -107453 -210813 -176495 -61828 -4198
37457d198k4526k0329K7039L0667J0099K1646K1873o1028j61564j36591O390R4136
$$ -4198 -28724 -49053 -22014 8653 18752 40398 62271 1243 -160321 -296912 -290522 -196386
37445a96386M0900l3407j4217K4838k6376j00547n5694P9926J42477Q3160J3877
$$ -196386 -155486 -188893 -203110 -178272 -204648 -305195 -360889 -280963 -138486 -55326 -41449
37434d1449N489P500j0105K748M8454M3953k6338n4231K1337J06856R7516K1462
$$ -41449 -35960 -28460 -38565 -35817 12637 56590 30252 -23979 -2642 104214 201730 223192
37422B23192l9265p1035q7105n8110K2820Q2171N9895m088m6486o8619q2225n7364
$$ 223192 183927 112892 25787 -32323 -9503 72668 132563 128475 81989 13370 -68855 -126219
37410a26219l339q158j01341j63835q5001O0533J08685K9372n4130l6829O6649
$$ -126219 -129558 -137716 -239057 -402892 -487893 -427360 -318675 -289303 -343433 -380262 -313613
37399c13613J64053J61199L6461j04477j08714L2185J48981J18733K4911M803
$$ -313613 -149560 11639 48100 -56377 -165091 -132906 16075 134808 159719 164522
37389A64522L9958K1646n5998j04760r1326n2202l670M7307M6938l3860j10065
$$ 164522 204480 226126 170128 65368 -25958 -78160 -81830 -34523 12415 -21445 -131510
37378a31510p7052L6811J11155R1027J6156n6475p5849j1372P2205M8691o6784
$$ -131510 -208562 -171751 -60596 30431 46587 -9888 -85737 -97109 -24904 23787 -42997
37367d2997q0678P9433J85831L4652j95462j79662N4124J76143O7366n7784o6256
$$ -42997 -123675 -44242 141589 176241 -19221 -198883 -144759 31384 98750 40966 -25290
37356b5290q8036j78629j48889P3872K15885N2144j96216j63735J09336K50836
$$ -25290 -113326 -291955 -440844 -366972 -151087 -98943 -295159 -458894 -349558 -98722
37346i8722J12926o4319o0308M5067Q5485O7621P7096Q9154L1598n6575p4038
$$ -98722 14204 -50115 -110423 -65356 20129 87750 164846 254000 285598 229023 154985
37335A54985j8795J8055l288l5323m2022m0287l7790j3293K3811K6591j4505n3485
$$ 154985 136190 154245 150957 115634 73612 33325 -4465 -17758 6053 32644 18139 -35346
37323c5346o3427o1737m7477j685K7013m5158j64358j40432O9442K21507J03927
$$ -35346 -98773 -160510 -207987 -209672 -182659 -227817 -392175 -532607 -463165 -241658 -137731
37312a37731j22078j32495P4553J82271M8809r9862n7640O2905P6297K5556L1251
$$ -137731 -259809 -392304 -317751 -135480 -86671 -186533 -244173 -181268 -104971 -79415 -48164
37301d8164L5333o2043j49280m6011J76849K63581J30341n5637j38757j26136
$$ -48164 -12831 -74874 -224154 -270165 -93316 170265 300606 244969 106212 -19924
37291a9924q1041m0318m1758q2973o5511P1481J95092J33048m0939q0987O5266
$$ -19924 -100965 -141283 -183041 -266014 -331525 -260044 -64952 68096 27157 -53830 11436
37280A1436J78590J00308o2199j40372j32024j18612j01117l5471O4019J44972
$$ 11436 190026 290334 228135 87763 -44261 -162873 -263990 -299461 -235442 -90470
37270i0470J69499J07324k8247j19596n5282P1866M8513j21067j64366N2398K68823
$$ -90470 79029 186353 158106 38510 -16772 55094 103607 -17460 -181826 -129428 139395
37259A39395J76356j29845k82864j49001M5703Q2130P370k7719j023J0976k1843
$$ 139395 315751 185906 -96958 -245959 -200256 -118126 -110756 -138475 -139498 -128522 -150365
37248a50365o2960p0363k3504N7439R8479M9958j3965K4163J28101J26241k1353
$$ -150365 -213325 -283688 -307192 -249753 -151274 -101316 -115281 -91118 36983 163224 141871
37237A41871j28875o0899N1524L0338n1082j1134R2385L8386j52531j99101j3778
$$ 141871 12996 -47903 3621 33959 -17123 -28257 64128 102514 -50017 -249118 -262896
37226b62896J29943L0468j26903j00980J5786J7423k0837Q9489K38445J63247
$$ -262896 -132953 -102485 -229388 -330368 -314582 -297159 -317996 -228507 9938 173185
37216A73185o6889j19918M5227J10134m9604j61226n0668O1679j6626r8741J9929
$$ 173185 106296 -13622 31605 141739 92135 -69091 -119759 -58080 -74706 -173447 -153518
37205a53518J60665O4852j43048j63917j9380L8544p491M5731J95088K00380M157
$$ -153518 7147 71999 -71049 -234966 -254346 -215802 -223293 -177562 17526 217906 222063
37194B22063j54129j13097L429L9179K2876L3772M6927J4900l8890p8541r4326
$$ 222063 67934 -45163 -41734 -2555 20321 54093 101020 115920 77030 -1511 -95837
37183i5837n9729L1799R5477N6560o588J8034N9974k3723j58746j27865N8632
$$ -95837 -155566 -123767 -28290 28270 21682 39716 99690 75967 -82779 -210644 -152012
37172a52012J43958L3089o1536R246Q8121N943j17180p9971O6444J22221N8203
$$ -152012 -8054 25035 -36501 -27255 60866 66809 -50371 -130342 -63898 58323 116526
37161A16526Q631J8207R285k9571j7778M5269M7314n5841j48602j02359N9713
$$ 116526 125157 143364 152649 123078 105300 150569 197883 142042 -6560 -108919 -49206
37150d9206J91846J77850K7468j43885k08964j31285k170L9761m2602j21678l9098
$$ -49206 142640 320490 347958 204073 -4891 -136176 -138346 -98585 -141187 -262865 -301963
37139c01963J75302K85807J30705j35858k18852q1237J9878o0735j40193l5866
$$ -301963 -126661 159146 289851 153993 -64859 -146096 -126218 -186953 -327146 -363012
37129c63012J07699N8063r4335o7405J36895K11551K5432j75928j49101K0589
$$ -363012 -255313 -197250 -291585 -358990 -222095 -10544 14888 -161040 -310141 -289552
37119b89552J12130Q9010O0336O0417L5896j8654m5287j4021M4847P2972K3356
$$ -289552 -177422 -88412 -28076 32341 68237 49583 4296 -9725 35122 108094 131450
37108A31450q1538j33249o0764M3148L4220n7208o4496M1809R9584K4736n0316
$$ 131450 49912 -83337 -144101 -100953 -66733 -123941 -188437 -146628 -47044 -22308 -72624
37097g2624l209P7811M7982o4380j18419o6462K0385P1975O8983K4749j1565J0168
$$ -72624 -75833 1978 49960 -14420 -132839 -199301 -178916 -106941 -37958 -13209 -24774 -14606
37085a4606N2487J4211j04233j53262k8276J67937K40719J28884m9444j33171
$$ -14606 37881 52092 -52141 -205403 -233679 -65742 174977 303861 254417 121246
37075A21246o1036P6777J15472o15j28355j08721j114J0464p9328q7471M0278
$$ 121246 60210 136987 252459 251844 123489 14768 13654 24118 -55210 -142681 -102403
37064a02403J24573M3778q1600j06659o3737j6167Q4656K28956K34075J4352k00298
$$ -102403 22170 65948 -15652 -122311 -186048 -202215 -117559 111397 345472 359824 159526
37053A59526j59005K7804O5817o0375r6403M6152J63495J04164k6399q4229q4652
$$ 159526 521 28325 94142 33767 -62636 -16484 147011 251175 224776 140547 55895
37042E5895q2026m4964L1126M7946l1478p5972J9554J40553J04605o3652j64710
$$ 55895 -26131 -71095 -39969 7977 -23501 -99473 -79919 60634 165239 101587 -63123
37031f3123j03822N524K7257k8965o2145j5316Q5754J67938J54735L5342q4785
$$ -63123 -166945 -161421 -134164 -163129 -225274 -240590 -154836 13102 167837 203179 118394
37020A18394p8073K2664L2322j20557k43322j33236J00100J66030K2686o4005
$$ 118394 40321 62985 95307 -25250 -268572 -401808 -301708 -135678 -112992 -176997
37010a76997N5188J82472J10727l8264l9232M5984j0678j83994k06832J255K03831
$$ -176997 -121809 60663 171390 133126 93894 139878 129200 -54794 -261626 -260371 -56540
36999e6540K03435P8770k0094q8607j59591j65525n3784Q8391J48261J30091R3969
$$ -56540 146895 225665 205571 116964 -42627 -208152 -261936 -173545 -25284 104807 198776
36988A98776N4966K2886L4267O4995K0185j06987j75300q4367P1267J22678K3089
$$ 198776 253742 276628 310895 375890 396075 289088 113788 29421 100688 223366 246455
36977B46455j37092k27291j49962P3106K51270J95918j7270j15655j3279O6820
$$ 246455 109363 -117928 -267890 -194784 56486 252404 235134 119479 106200 173020
36967A73020m8251k06811j78882m845R8281N9386j1935l1418n968M6892R7740
$$ 173020 124769 -82042 -260924 -265769 -167488 -108102 -120037 -151455 -157423 -110531 -12791
36956a2791Q0716p889o1351k3404O252m9575q8531o045R8510P9924m553j4508
$$ -12791 67925 60036 -1315 -24719 -18467 -68042 -156573 -162618 -64108 15816 11263 -3245
36944c245J1289m9836j30394o3342R5027J17875j0664n4458P7368J70728N9173
$$ -3245 8044 -41792 -172186 -235528 -140501 -22626 -33290 -87748 -10380 160348 219521
36933B19521j08256j15399n570L1001l3099o5571k1504L971l3265m4485L3814
$$ 219521 111265 -4134 -9704 21297 -11802 -77373 -98877 -94906 -128171 -172656 -138842
36922a38842J16166Q7545j5290m7358K4560O0291l5730j41965r5789K9819K0257
$$ -138842 -22676 64869 49579 2221 26781 87072 51342 -90623 -186412 -156593 -136336
36911a36336j17642j25293R2685K66529J51278q4105j06319P9065J64074K3246
$$ -136336 -253978 -379271 -286586 -20057 131221 47116 -59203 19862 183936 207182
36901B07182j34265j22185j9907K2325K94k9606p4743j24813q5841P8284K37026
$$ 207182 72917 -49268 -69175 -46850 -46556 -76162 -150905 -275718 -361559 -283275 -46249
36890d6249K39476R9907n2078j38970j64132j30961l3944Q4494J43295J02350
$$ -46249 193227 293134 241056 102086 -62046 -193007 -226951 -142457 838 103188
36880A03188N495n9711m4231J0172J4238n4650j11909p3727L3918J22660J50432
$$ 103188 108683 48972 4741 14913 29151 -25499 -137408 -211135 -177217 -54557 95875
36869I5875J19581K5144j03604j62281q5593L4243O1653J2562k171J0290n3155
$$ 95875 215456 240600 136996 -25285 -110878 -76635 -14982 -2420 -4591 5699 -47456
36858d7456j61456j47190J5725J33284Q4622P327N4740J34344P1398q5264j34482
$$ -47456 -208912 -356102 -340377 -207093 -122471 -115144 -60404 73940 145338 60074 -74408
36847g4408m2719K4788q261k2588N6820J05765R654j11766n8918J31630K07417
$$ -74408 -117127 -92339 -100600 -123188 -66368 39397 49051 -62715 -121633 9997 217414
36836B17414M8486j65365k03716p4254M3431N9932L5579K6613K0787K1150N2441
$$ 217414 265900 100535 -103181 -177435 -134004 -74072 -38493 -11880 8907 30057 82498
36825H2498O7154j4364j38132j42696q601Q0973K3325k8884P6278K09649J41552
$$ 82498 149652 135288 -2844 -145540 -154141 -73168 -49843 -78727 -2449 207200 348752
36814C48752r2617k35142j78267p0898m4349m3368J3461Q2979R2275N5316J6317
$$ 348752 256135 20993 -157274 -228172 -272521 -315889 -302428 -219449 -127174 -71858 -55541
36803e5541k4421o5592p2648m1781j8926j9073m412L4323O1939Q0479J25803J64718
$$ -55541 -79962 -145554 -218202 -259983 -278909 -297982 -302394 -268071 -206132 -125653 150 164868
36791A64868J12444j5663r3448o9507l5962n5462n7962M929L9296l5436j20207
$$ 164868 277312 261649 168201 98694 62732 7270 -50692 -45763 -6467 -41903 -162110
36780a62110p0186P7290J55487J07947L3946Q586q294o4121j22324j19554m8330
$$ -162110 -232296 -155006 481 108428 142374 150960 142666 78545 -43779 -163333 -211663
36769b11663M6440J09321J02556L7291j7459k388M8084L5702o9792j67960j30271
$$ -211663 -165223 -55902 46654 83945 66486 64098 112182 147884 78092 -89868 -220139
36758b20139M6704K19826K42530J15474k9842r3169j01461j16833j16605m9371
$$ -220139 -173435 46391 288921 404395 374553 281384 179923 63090 -53515 -102886
36748a02886L1301J3121q9023j24780l0122P2928P6216N4294J07780J51185L8964
$$ -102886 -71585 -58464 -147487 -272267 -302389 -229461 -153245 -98951 8829 160014 198978
36737A98978j55578k00656n5940N2322j7351r7281J0711J90437J68761m9468j55507
$$ 198978 43400 -157256 -213196 -160874 -178225 -275506 -264795 -74358 94403 44935 -110572
36726a10572J3279K20989J62099j10804k69770j54509N4310J13792J0077r4902
$$ -110572 -97293 123696 285795 174991 -94779 -249288 -194978 -81186 -71109 -166011
36716a66011r4216j7715N9764R7483Q4490K5212m7439p1588R88J40879K23509
$$ -166011 -260227 -277942 -218178 -120695 -36205 -10993 -58432 -130020 -129032 11847 235356
36705B35356J27025j09795k77016k18992l2729O4671L5172L1062J01396R3098
$$ 235356 362381 252586 -24430 -243422 -276151 -211480 -176308 -145246 -43850 49248
36695D9248o1616j62394k8354J80517J67447n4670j82679p9513N6744M4176j6012
$$ 49248 -12368 -174762 -203116 -22599 144848 90178 -92501 -172014 -115270 -71094 -87106
36684h7106L4592J21836P6064o3675j00836M442P3916j0989j32448j12569L6392
$$ -87106 -52514 69322 145386 81711 -19125 -14683 59233 48244 -84204 -196773 -160381
36673a60381J35204P5081n4765r8460l9439r477q5371j56077p1509J21262K13882
$$ -160381 -25177 49904 -4861 -103321 -142760 -152237 -237608 -393685 -465194 -343932 -130050
36662a30050J17923k3155n7008k2366k4578l5607K5557R6319M6246p9295r3345
$$ -130050 -12127 -35282 -92290 -114656 -139234 -174841 -149284 -52965 -6719 -86014 -179359
36651a79359L3451J08021J6952r6974p3381K1054M1996K0666P1997J44268Q2723
$$ -179359 -145908 -37887 -20935 -117909 -191290 -170236 -128240 -107574 -35577 108691 191414
36640A91414r1591j85321j25631m5082l5465j7366O8787J27288P6339J703J3453
$$ 191414 99823 -85498 -211129 -256211 -291676 -309042 -240255 -112967 -36628 -34925 -21472
36629b1472O8874O6452J6416p412J244J4982M9270R0570M9092q5752j50144k5444
$$ -21472 47402 113854 130270 122858 124102 139084 188354 278924 328016 242264 92120 66676
36617F6676J44024J36143k4483j26961r9054n4932n2003k7875J8957M690n9456
$$ 66676 210700 346843 322360 195399 96345 41413 -10590 -38465 -19508 -14818 -74274
36606g4274o3585j725J6458k3117k0366K4888L496o4252k3155J24023J70768M1115
$$ -74274 -137859 -139584 -123126 -146243 -166609 -141721 -138225 -202477 -225632 -101609 69159 110274
36594A10274q3902q0639o1436j06238r0947L9071R5842k6488j06583N5695K66458
$$ 110274 26372 -54267 -115703 -221941 -312888 -273817 -177975 -204463 -311046 -255351 11107
36583A1107K19391k2712j50461q4126j681J7365M8266P4735N110q7581m2277Q3822
$$ 11107 230498 207786 57325 -26801 -28482 -11117 37149 111884 116994 29413 -12864 70958
36571G0958P9310n5283j08408l6987k4121j09807r6697P2077J60065J9700j53195
$$ 70958 150268 94985 -13423 -50410 -74531 -184338 -281035 -208958 -48893 -29193 -182388
36560a82388j37179j6042K1014L906O4801J50912J12511j0076l4891N7956R3301
$$ -182388 -319567 -335609 -314595 -310689 -245888 -94976 17535 7459 -27432 30524 123825
36549A23825j3566j28498j12297j7414J7505j9365j1759R2092J81219J26343k8091
$$ 123825 110259 -18239 -130536 -147950 -130445 -149810 -161569 -69477 111742 238085 209994
36538B09994j08856n5804n021o5897j33491n7732Q8012R9917k2690n7186Q3776
$$ 209994 101138 45334 40313 -25584 -159075 -216807 -128795 -28878 -51568 -108754 -24978
36527b4978J90796P6110j21228j26754P3372K21764J49382l0821j24497j07353
$$ -24978 165818 241928 120700 -6054 67318 289082 438464 407643 283146 175793
36517A75793q9359j13592j08067k8299N6093O3207J7873k533M006j7110n3395
$$ 175793 86434 -27158 -135225 -163524 -107431 -44224 -26351 -28884 -24878 -41988 -95383
36506i5383l3338L5207N6792J0297q497M0226N9127j5325r4594r1795o0468o0332
$$ -95383 -128721 -93514 -36722 -26425 -34922 5304 64431 49106 -45488 -137283 -197751 -258083
36494b58083k3950R2065J60633P6561k6617K7823J46740J02321q0916j50042k6097
$$ -258083 -282033 -189968 -29335 47226 20609 48432 195172 297493 216577 66535 40438
36483D0438R0822N7477k6319m3048m2358r4242j37984r1654J3885R2727R7468
$$ 40438 131260 188737 162418 119370 77012 -17230 -155214 -246868 -232983 -140256 -42788
36472d2788K3217p2908o2798R8442K32637J41143p2834j22570J4355N5433j08380
$$ -42788 -19571 -92479 -155277 -56835 175802 316945 244111 121541 135896 191329 82949
36461H2949k07978l5534J93328J62088o6054j69672n2664P1913M4660m0341l5220
$$ 82949 -125029 -160563 32765 194853 128799 -40873 -93537 -21624 23036 -17305 -52525
36450e2525M1974O6523l987p3646l1448R7543J60713O7094q2239j30376q0426
$$ -52525 -10551 55972 51985 -21661 -53109 44434 205147 272241 190002 59626 -20800
36439b0800n4197p3680m5449M1794Q0317L1271j6855j0704J0541M4457J29201
$$ -20800 -74997 -148677 -194126 -152332 -72015 -40744 -57599 -68303 -57762 -13305 115896
36428A15896J90276R2476j07049j81343p6199P682l8037o0706M5391J27548N0279
$$ 115896 306172 398648 291599 110256 34057 41739 3702 -57004 -11613 115935 166214
36417A66214n8507m3936R716k6923o6735J8216J30622J07920L404l4157k2723
$$ 166214 107707 63771 73487 46564 -20171 -1955 128667 236587 239991 205834 183111
36406A83111m8684n1514L7092Q2544m4502j83105j09531O8301P5157o8097j06353
$$ 183111 134427 82913 120005 202549 158047 -25058 -134589 -66288 8869 -59228 -165581
36395a65581j3230j057p9555j7625J95574K59411N9050j24314p9171Q540p6113
$$ -165581 -178811 -179868 -259423 -277048 -81474 177937 236987 112673 33502 42042 -34071
36384c4071j90800j07231P0538Q1650n2343q4913L9742J29548Q3020J5159J7130
$$ -34071 -224871 -332102 -261564 -179914 -232257 -317170 -277428 -147880 -64860 -49701 -32571
36373c2571K2510k1136l8083K5038P8943K9189o4601p5851Q80N1627J0307o3561
$$ -32571 -10061 -31197 -69280 -44242 34701 63890 -711 -76562 -75682 -24055 -13748 -77309
$$ [...]
##END NTUPLES=NMR SPECTRUM
##END=
