##TITLE=31Pdec_69-2022
 CDCl3, 24 sc
 25.8.2022
##JCAMPDX= 6.0         $$ Bruker NMR JCAMP-DX V2.0
##DATA TYPE= NMR SPECTRUM
##DATA CLASS= NTUPLES
##ORIGIN= UXNMR, Bruker Analytische Messtechnik GmbH
##OWNER= root
$$ XWIN-NMR		Version 3.5
$$ Thu Aug 25 10:02:55 2022 Russian Standard Time (UT+4h)  she@DPX200
##.OBSERVE FREQUENCY= 81.013821
##.OBSERVE NUCLEUS= ^31P
##.ACQUISITION MODE= SIMULTANEOUS
##.ACQUISITION SCHEME= undefined
##.AVERAGES= 24
##.DIGITISER RES= 16
##SPECTROMETER/DATA SYSTEM= spect
##.PULSE SEQUENCE= zgpg30
##.SOLVENT NAME= DMSO
##.SHIFT REFERENCE= (INTERNAL, DMSO, 0, 248.564)
##AUDIT TRAIL= $$ (NUMBER, WHEN, WHO, WHERE, WHAT)
$$ ##TITLE= Audit trail, XWIN-NMR		Version 3.5
$$ ##JCAMPDX= 5.01
$$ ##ORIGIN= Bruker BioSpin GmbH
$$ ##OWNER= she
$$ F:/spectra/data/she/nmr/P31/1/pdata/1/auditp.txt
$$ ##AUDIT TRAIL=  $$ (NUMBER, WHEN, WHO, WHERE, WHAT)
(   1,<2022-08-25 10:01:11.35 +0400>,<she>,<DPX200>,
      <created by zg, POWCHK disabled, PULCHK disabled
       configuration hash MD5:
       00 E9 B6 7A A2 85 ED C7 34 08 36 98 17 FE 4E 26
       data hash MD5: 32K
       25 9B EF A0 93 AB F4 F6 AD 00 E5 6C B7 61 54 B3>)
(   2,<2022-08-25 10:01:20.54 +0400>,<she>,<DPX200>,
      <Start of raw data processing
       efp BC_mod = 2 LB = 1 FT_mod = 6 PKNL = 1 PHC0 = -10216.41 PHC1 = -23.74365 SI = 64K 
       data hash MD5: 64K
       E0 B2 15 26 E5 8E 2A 4B BA 83 B0 0A 43 67 54 64>)
(   3,<2022-08-25 10:01:46.48 +0400>,<she>,<DPX200>,
      <pk PHC0 = -49.62083 PHC1 = 112.6 
       data hash MD5: 64K
       61 AE 85 A2 EB DA 79 AF 8E D0 71 41 65 00 EC 23>)
(   4,<2022-08-25 10:01:49.62 +0400>,<she>,<DPX200>,
      <abs ABSG = 5 
       data hash MD5: 64K
       63 AD 59 18 7E D3 72 72 FB 2F 0B 26 98 7E 90 42>)
$$ ##END=
$$ 
$$ hash MD5
$$ 3A BD 28 31 16 E1 74 B7 E9 1E E4 C0 66 EB AC 42
##$RELAX= 
##$RELAX= 
##$RELAX= 
##$RELAX= 
##$RELAX= 
##$RELAX= 
##$RELAX= 
##$RELAX= 
$$ Bruker specific parameters
$$ --------------------------
##$DU= <F:/spectra>
##$EXPNO= 1
##$NAME= <P31>
##$PROCNO= 1
##$TYPE= <nmr>
##$USER= <she>
##$AMP= (0..31)
100 100 100 100 100 100 100 100 100 100 100 100 100 100 100 100 100 100 
100 100 100 100 100 100 100 100 100 100 100 100 100 100 
##$AQSEQ= 0
##$AQ_mod= 1
##$AUNM= <au_zg>
##$AUTOPOS= <>
##$BF1= 81.014009
##$BF2= 200.13
##$BF3= 200.13
##$BF4= 200.13
##$BF5= 200.13
##$BF6= 200.13
##$BF7= 200.13
##$BF8= 200.13
##$BYTORDA= 1
##$CFDGTYP= 0
##$CFRGTYP= 5
##$CHEMSTR= <none>
##$CNST= (0..31)
1 1 145 1 1 1 1 1 1 1 1 1 1 1 1 1 1 1 1 1 1 1 1 1 1 1 1 1 1 1 1 1 
##$CPDPRG= <waltz16>
##$CPDPRG1= <>
##$CPDPRG2= <waltz16>
##$CPDPRG3= <>
##$CPDPRG4= <mlev>
##$CPDPRG5= <mlev>
##$CPDPRG6= <mlev>
##$CPDPRG7= <mlev>
##$CPDPRG8= <mlev>
##$CPDPRGB= <>
##$CPDPRGT= <>
##$D= (0..31)
0 1 0 0 0 0 0 0 0 0 0 0.03 2e-05 3e-06 0 0 0 0 0 0 0 0 0 0 0 0 0 0 0 0 
0 0 
##$DATE= 1661407270
##$DBL= (0..7)
120 120 120 11 120 120 24 19 
##$DBP= (0..7)
150 150 150 150 150 150 150 150 
##$DBP07= 0
##$DBPNAM0= <>
##$DBPNAM1= <>
##$DBPNAM2= <>
$$ [...]
##$SUBNAM3= <"">
##$SUBNAM4= <"">
##$SUBNAM5= <"">
##$SUBNAM6= <"">
##$SUBNAM7= <"">
##$SUBNAM8= <"">
##$SUBNAM9= <"">
##$SW= 501.771253377433
##$SWIBOX= (0..15)
0 1 3 0 0 0 0 0 0 0 0 0 0 0 0 0 
##$SW_h= 40650.406504065
##$TD= 32768
##$TD0= 1
##$TE= 0
##$TE2= 300
##$TE3= 300
##$TEG= 300
##$TL= (0..7)
0 120 53 12 22 120 120 120 
##$TP= (0..7)
150 150 150 150 150 150 150 150 
##$TP07= 0
##$TPNAME0= <>
##$TPNAME1= <>
##$TPNAME2= <>
##$TPNAME3= <>
##$TPNAME4= <>
##$TPNAME5= <>
##$TPNAME6= <>
##$TPNAME7= <>
##$TPOAL= (0..7)
0.5 0.5 0.5 0.5 0.5 0.5 0.5 0.5 
##$TPOFFS= (0..7)
0 0 0 0 0 0 0 0 
##$TUNHIN= 0
##$TUNHOUT= 0
##$TUNXOUT= 0
##$USERA1= <user>
##$USERA2= <user>
##$USERA3= <user>
##$USERA4= <user>
##$USERA5= <user>
##$V9= 5
##$VALIST= <valist>
##$VCLIST= <CCCCCCCCCCCCCCC>
##$VD= 0
##$VDLIST= <DDDDDDDDDDDDDDD>
##$VPLIST= <PPPPPPPPPPPPPPP>
##$VTLIST= <TTTTTTTTTTTTTTT>
##$WBST= 1024
##$WBSW= 4
##$XGAIN= (0..3)
0 0 0 0 
##$XL= 0
##$YL= 0
##$YMAX_a= 3089
##$YMIN_a= -4277
##$ZGOPTNS= <>
##$ZL1= 120
##$ZL2= 120
##$ZL3= 120
##$ZL4= 120
##$ABSF1= 248.5645
##$ABSF2= -253.2056
##$ABSG= 5
##$ABSL= 3
##$ALPHA= 0
##$AQORDER= 0
##$ASSFAC= 0
##$ASSFACI= 0
##$ASSFACX= 0
##$ASSWID= 0
##$AUNMP= <proc_1d>
##$AZFE= 0.1
##$AZFW= 0.5
##$BCFW= 0
##$BC_mod= 2
##$BYTORDP= 0
##$COROFFS= 0
##$CY= -3
##$DATMOD= 1
##$DC= 0
##$DFILT= <>
##$DTYPP= 0
##$F1P= 0
##$F2P= 0
##$FCOR= 1
##$FTSIZE= 65536
##$FT_mod= 6
##$GAMMA= 0
##$GB= 0
##$INTBC= 1
##$INTSCL= 5.30512e-09
##$ISEN= 30
##$LB= 1
##$LEV0= 0
##$LPBIN= 0
##$MAXI= 10000
##$MC2= 0
##$MEAN= 0
##$ME_mod= 0
##$MI= 50
##$NCOEF= 0
##$NC_proc= -8
##$NLEV= 6
##$NOISF1= 182.463
##$NOISF2= 159.3651
##$NSP= 0
##$NTH_PI= 0
##$NZP= 0
##$OFFSET= 248.5645
##$PC= 4
##$PHC0= -10266.03
##$PHC1= 88.85635
##$PH_mod= 1
##$PKNL= yes
##$PPARMOD= 0
##$PSCAL= 0
##$PSIGN= 0
##$REVERSE= no
##$SF= 81.0140089999908
##$SI= 65536
##$SIGF1= 159.3651
##$SIGF2= -187.1042
##$SINO= 113.3802
##$SIOLD= 16384
##$SREGLST= <1H.CDCl3>
##$SSB= 0
##$STSI= 65536
##$STSR= 0
##$SW_p= 40650.406504065
##$SYMM= 0
##$S_DEV= 0
##$TDeff= 32768
##$TDoff= 0
##$TI= <>
##$TILT= no
##$TM1= 0
##$TM2= 0
##$TOPLEV= 0
##$USERP1= <user>
##$USERP2= <user>
##$USERP3= <user>
##$USERP4= <user>
##$USERP5= <user>
##$WDW= 1
##$XDIM= 65536
##$YMAX_p= 410447658
##$YMIN_p= -65627575
$$ End of Bruker specific parameters
$$ ---------------------------------
##NTUPLES= NMR SPECTRUM
##VAR_NAME=  FREQUENCY,     SPECTRUM/REAL,   SPECTRUM/IMAG
##SYMBOL=    X,             R,               I
##VAR_TYPE=  INDEPENDENT,   DEPENDENT,       DEPENDENT
##VAR_FORM=  AFFN,          ASDF,            ASDF
##VAR_DIM=   65536,         65536,           65536
##UNITS=     HZ,            ARBITRARY UNITS, ARBITRARY UNITS
##FACTOR=    0.620285442955139, 1,           1
##FIRST=     20137.2065510736, 0,            0
##LAST=      -20513.1999529914, 0,           0
##MIN=       -20513.1999529914, -65627575,   0
##MAX=       20137.2065510736, 410447658,    0
$$ Real data points
##PAGE= N=1
##DATA TABLE= (X++(R..R)), XYDATA
$$ [...]
42774h225721j26264N887584N825157P07298k974090k287517m31561l77195j139236
42765c141545j232492j152770j101155j44074J247030J360393P05121J632048
42757a827444L698235L294270p40891m643950m611532j426352J329284J448819
42749c479561o47405k832899k673094K55169L163798L112823J036701K71521J456459
42740c36488K024771P79196m79878m64808j68607j89011M94105J821547J740980
42731E221807m47880k376001j802857N72267K734265L701442L182804J116006
42723A1901853j243608j864607p29135o4757q24461j237022k7087J375516J379886
42714H666578O53977K07809p22078k687633l809006k138096Q33587J527290j108925
$$ y = [-8225721, -8351985, -2464401, 3360756, 4068054, 1093964, -1193553, -1625114, -2002309, -3141545, -4374037, -5526807, -6627962, -6772036, -5525006, -4164613, -3459492, -1827444, 1870791, 5165061, 4424170, -219780, -4831312, -6257664, -4928380, -3479561, -4126966, -6959865, -9632959, -9377790, -6213992, -3101169, -2064468, -1792947, -336488, 1688283, 2467479, 1987601, 1522793, 1354186, 1165175, 1659280, 3480827, 5221807, 4773927, 2397926, 595069, 1167336, 3901601, 7603043, 10785847, 11901853, 10658245, 8793638, 8064503, 7999746, 7175285, 5938263, 5911176, 7286692, 8666578, 9320555, 9528364, 8806286, 6118653, 2309647, 171551, 1005138, 2532428, 1423503]
42705A423503m140868l917816P5666M483794N028880J052444l017881k492129
42697a504407J303086K437579j057764l839009j210407L185491K512411k490921
42689f63941m171166K62317M196181J851151k674917k051126K438823K964727
42681B152049j982667m759664p19201M097461K315169l236777m102518Q70247
42673e365901M709225L436880M93773o94609j329928k198013p64840L148274M685795
42664F120656J274205k534364k256192n83926j758259l428544r32692L706011
42656c93105M519820J325110o22831M45094J357472P84793L49775o49155m163765
42647B953208p037528l865516K828478L969888k120700n954839j146338N779791
$$ y = [1423503, -2717365, -6635181, -6559515, -2075721, 2953159, 4005603, 987722, -1504407, -201321, 2236258, 1178494, -2660515, -3870922, -685431, 1826980, -663941, -4835107, -4572790, -376609, 1474542, -1200375, -3251501, -812678, 2152049, 169382, -4590282, -5309483, -1212022, 1103147, -2133630, -6236148, -5365901, -656676, 2780204, 3273977, 2579368, 1249440, -948573, -1713413, 1434861, 6120656, 7394861, 4860497, 2604305, 2020379, 262120, -3166424, -4099116, -393105, 4126715, 5451825, 4828994, 5274088, 6631560, 7416353, 7766128, 7116973, 2953208, -4084320, -7949836, -5121358, -1151470, -3272170, -9227009, -10373347, -4593556]
42639d593556N648518p9245l098182n07688L427702M595729K487430j192554l122599
42630C565555n59600L706948L046688k731476m997592L31132M273283j715931
42622D919007j0126009p259828M683936R352006Q60311p254648k780806P484781
42614a21250R327778J779139m283358l610858j828795l639569n258202j795749
42606i430864M156072O137593L001625l30420p50634j059648m167415o699000
42598i142691l034133N062170Q555157L207435l531904k409916M432190O510654
42590I648962j15308p848600q352281k333956L678639N439994L102340q30490
42582B389300k793451n34205L388425L560913p43661l767061j738017J181771
$$ y = [-4593556, 1054962, 975717, -2122465, -2630153, 797549, 5393278, 7880708, 6688154, 3565555, 3005955, 6712903, 9759591, 7028115, 2030523, 2361655, 6634938, 4919007, -5207002, -12466830, -7782894, 1569112, 2429423, -4825225, -7606031, -121250, 9206528, 10985667, 6702309, 3091451, 1262656, -2376913, -7635115, -9430864, -5274792, 862801, 3864426, 3534006, 2783372, 1723724, -2443691, -9142691, -12176824, -7114654, 1440503, 4647938, 1116034, -1293882, 3138308, 9648962, 9533654, 1685054, -6667227, -9001183, -5322544, 117450, 3219790, 2389300, -404151, -938356, 2450069, 6010982, 5267321, 1500260, -237757, 944014]
42574I44014k73390l519481k035305L747998O279928K096989k983483k403982
42566A853288K019423L311810q75909n706426n862932j590387K737163L907058
42558b06912K230322k39761j905578j971292m10734J334507Q80311k313610n408862
42549h011609n144412j847390J360041K855442L532136L606926J622049k200714
42541d227531m549047l064711K82687K053873J881388J830967K585805K851023
42533c55546J890910L40391j200513k431502k528078r34573J185033K010281J496578
42524e27019J213373J871971K465912J772553n25738l793672o145346m997627
42516h665593l8474M778067M790651M71177k899271k183075j78290o51065k260598
$$ y = [944014, 670624, -2848857, -4884162, -1136164, 5143764, 7240753, 4257270, 1853288, 3872711, 7184521, 6308612, 602186, -5260746, -6851133, -4113970, -206912, 2023410, 1783649, -121929, -2093221, -2503955, -1169448, -289137, -2602747, -8011609, -13156021, -15003411, -13643370, -10787928, -7255792, -3648866, -2026817, -4227531, -8776578, -11841289, -11558602, -9504729, -7623341, -5792374, -3206569, -355546, 1535364, 1875755, 675242, -1756260, -4284338, -5218911, -4033878, -2023597, -527019, 686354, 2558325, 5024237, 6796790, 6271052, 2477380, -3667966, -8665593, -8704067, -3926000, 864651, 1335828, -1563443, -3746518, -3924808, -4575873, -6836471]
42507f836471q30405L496548N511134K307598k118176k199736J546714L674456
42499D551662J687208j204972j721219q15172l80123N03667K575726K787461j480532
42490F503706o402256n521762O99726M855895K980813p01527j220009O84334K443650
42481D322570M296734N792719L021550m833670j0399305o566820K473443N909034
42473D016255R12166m590812l853058Q77739L788954K725148r07765m399249m228046
42464e658668R07748O152357M694973k521051o835312l701150J493680K456483
42456c010940O83735P29753K305797K545521J797248J550128K73527l047590m719215
42447h92036j696940K098986J391511j484065o56132K617168K025120j975854
$$ y = [-6836471, -7666876, -4170328, 1340806, 3648404, 1530228, -669508, 877206, 4551662, 6238870, 5033898, 3312679, 2497507, 2117384, 2621051, 5196777, 7984238, 6503706, 101450, -5420312, -4720586, 135309, 3116122, 2414595, 1194586, 1878920, 4322570, 8619304, 14412023, 17433573, 12599903, 2200598, -4366222, -1892779, 4016255, 4928421, 337609, -3515449, -2637710, 1151244, 3876392, 2968627, -1430622, -5658668, -4750920, 1401437, 6096410, 3575359, -3259953, -6961103, -5467423, -3010940, -2327205, -1597452, 708345, 3253866, 5051114, 6601242, 6874769, 3827179, -892036, -2588976, -489990, 901521, -582544, -1238676, 1378492, 3403612, 1427758]
42439A427758j936396L705450O799874J965205n120863o607857l116212k69466
42431c152507P0715m31090j361899k573184j721942J920225M039852R53915l691257
42422e947172l400184J652498N074355L388787l66888j865879J49676M356759
42414C041952P476915N147005l108941j0318812q769285l52997N365269L980878
42406B461984Q54435J155145K213899j16035l413938k974127k72459n59914l792889
42397d443899m364573R9104N184787O126501L489132P67023l41772l73751k17630
42388E924922n03214j257185j231998O68360K774684J915441j744217l938387
42380B608406k119416P36401P14723j171903j287261K76222K48524j345177m14828
$$ y = [1427758, -508638, 3196812, 9996686, 11961891, 6841028, 233171, -2883041, -3152507, -3081792, -3512882, -4874781, -7447965, -9169907, -7249682, -3209830, -2255915, -5947172, -9347356, -7694858, -2620503, 768284, 401396, -1464483, -1314807, 3041952, 10518867, 15665872, 12556931, 2238119, -6531166, -6884163, -1518894, 2461984, 3316419, 4471564, 6685463, 6569428, 3155490, 181363, -91096, -651010, -4443899, -8808472, -8709368, -3524581, 2601920, 6091052, 6858075, 6516303, 6142552, 5924922, 5421708, 4164523, 2932525, 3600885, 6375569, 8291010, 6546793, 2608406, 488990, 1225391, 1940114, 768211, -519050, -242828, 5696, -1339481, -1754309]
42371a754309L996306O463209K436450m505280o789491k580295K686107L887229
42363C839926J474798j076026j553944J43683K530129K918372l9958l400927k587096
42354B248957J910468M174928J226469k288181j244698J844868J043373l084594
42346E831590m134959j54792L188471J455437k161755k435919K54359J829622
42338C672054J048476m3246m13604q07534j080476l10712P71028N42798n56392
42329B822392p75467m74808j448029k705129r57470L298309M298399j200884p672903
42320d815590o877778R43184O762461M438625j736377l627685J02071L874509
42312i36580L840139J915297J020262P59213k26792r62772j0852J451939J272461
$$ y = [-1754309, 2241997, 8705206, 11141656, 6636376, -153115, -2733410, -47303, 3839926, 5314724, 4238698, 2684754, 2828437, 5358566, 8276938, 8236980, 4836053, 2248957, 4159425, 8334353, 9560822, 7272641, 6027943, 7872811, 8916184, 5831590, 1696631, 1541839, 4730310, 6185747, 4023992, 1588073, 1842432, 3672054, 4720530, 4677284, 4263680, 3456146, 2375670, 2064958, 2835986, 3378784, 2822392, 2046925, 1572117, 124088, -2581041, -3538511, -240202, 4058197, 2857313, -4815590, -11693368, -10750184, -3987723, 450902, -1285475, -4913160, -4811089, -936580, 2903559, 4818856, 5839118, 6598331, 6371539, 5408767, 5397915, 6849854, 8122315]
42303H122315k63736j250554j320706j377636j109226L84819K109347K275156
42295G569779J450171J457288J466514j028999n020690n987612k478382J326228
42287a245703J801942Q52052J668005K904544J292316j990932k303684J324213
42279D302753M119650J771782l949752p314963n112093J86883L456536K465019
42271g4185j73131q36351N18329J313806Q65578Q02538J046426n99803l585305
42262g22098l637869P13635M627144L603199J12088r40224k07838j589137l972191
42253b013291k193633L699320O877599L377658k251653l846066j646869J21567
42245B124632J77530M34363J273665Q51060j144653k514133k105285j764256l164584
$$ y = [8122315, 7858579, 6608025, 5287319, 3909683, 2800457, 3185276, 5294623, 7569779, 9019950, 10477238, 11943752, 10914753, 5894063, -93549, -2571931, -1245703, 556239, 1408291, 3076296, 5980840, 7273156, 5282224, 2978540, 4302753, 8422403, 10194185, 6244433, -1070530, -6182623, -5995740, -2539204, -74185, -247316, -1083667, -565338, 748468, 1614046, 2416584, 3463010, 2863207, -722098, -4359967, -3646332, 980812, 4584011, 4696099, 3755875, 3548037, 1958900, -2013291, -4206924, -507604, 6369995, 9747653, 7496000, 3649934, 2003065, 2124632, 2302162, 2736525, 4010190, 4861250, 3716597, 1202464, -902821, -2667077, -5831661]
42236e831661m384791k175789K520037M361212Q14498l072848j008262M881702
42228c895902O306906J215645k750172k49026L137752J96031n604605n338092
42220f981463J080543N078508L042247M64110J331105K212656n8200k450000j564288
42211B155218P52197J715738K121965K614635P69359l711175n903653k669799
42203b155515J665603J738714q47207j392401j56563l51872j111638P18973L519263
42194A627357K538173j766757l503879l13310L031566J775506k414541m486654
42186c512539k609082M08025R76947j197490k628387N2094N411668Q014683M867725
42177I783644r88356m710772m978946l289563r41801O88318j06891k253009j571331
$$ y = [-5831661, -10216452, -12392241, -9872204, -5510992, -4696494, -7769342, -8777604, -3895902, 2411004, 3626649, 876477, 627451, 3765203, 3961234, -1643371, -6981463, -5900920, -822412, 2219835, 2683945, 4015050, 6227706, 6169506, 3719506, 2155218, 2907415, 4623153, 6745118, 9359753, 10129112, 6417937, 514284, -2155515, -489912, 1248802, 401595, -990806, -1147369, -1499241, -2610879, -1891906, 1627357, 4165530, 2398773, -1105106, -1418416, 1613150, 3388656, 974115, -3512539, -6121621, -5713596, -4736649, -5934139, -8562526, -8510432, -3098764, 4915919, 9783644, 8795288, 4084516, -894430, -4183993, -5125794, -4437476, -4544367, -6797376, -8368707]
42168h368707L014660O371988M410744P08079N12800J767937q70257n612097n452432
42159c517285J08426L739269J793246q61952P0996J880802J196185K46308J953011
42150F609006L802920J915462k182785l845184k147310r1663M73863K71598j15468
42141D690439j000876j928427j689073L5916K342841L820602K947320o24965m205322
42132D388455l648470J367551N510517L633953k673724o854504n310152j176738
42124d763112L97194j187751j959654N11591L368573K560027r60138k488029p37410
42115e258709O36778j21443K42143L047459L209418k455728p139600k535083P111972
42106c262793R176093J080271n504244j913888N365090N497922j064419n180611
$$ y = [-8368707, -5354047, 1017941, 5428685, 6136764, 6649564, 8417501, 7547244, 1935147, -3517285, -3408859, 330410, 2123656, 1261704, 1332700, 3213502, 4409687, 4655995, 6609006, 10411926, 12327388, 10144603, 6299419, 4152109, 4060446, 4534309, 4805907, 4690439, 3689563, 1761136, 72063, 107979, 2450820, 6271422, 9218742, 8593777, 4388455, 739985, 2107536, 7618053, 11252006, 8578282, 1723778, -3586374, -4763112, -4365918, -5553669, -7513323, -7001732, -3633159, -1073132, -2033270, -4521299, -5258709, -4621931, -4743374, -4501231, -1453772, 1755646, -700082, -7839682, -10374765, -3262793, 5913300, 6993571, 1489327, -424561, 4940529, 10438451, 9374032, 4193421]
42098D193421k828586J265527K102605R8273j843591k387884j946431j289493
42090b636159o68796L99708J971859K435681M04425k219202k080494L68995J108720
42081i15263j111930k777871j371616J130695K376529K900832L115651J566377
42073D913404j234619j841935L32150R80722k066268m729583l480027j168630
42065h294786j355959j737157J100109M558007L956374M68941r71066P02455K685515
42056A112433L524412L112422K39683m389773n688711p42862N022271M665113
42048F854988j582j945440k34165N6978k197118k557355N68901L264636K591326
42039F401169k64070l419011n404428l817105J260777M190532P85885l838671
$$ y = [4193421, 1364835, 2630362, 4732967, 4831240, 2987649, 599765, -1346666, -2636159, -3304955, -2905247, -933388, 1502293, 1906718, -312484, -2392978, -2023983, -915263, -2027193, -4805064, -6176680, -5045985, -2669456, 231376, 3347027, 4913404, 3678785, 1836850, 2169000, 3149722, 1083454, -3646129, -7126156, -8294786, -9650745, -11387902, -10287793, -5729786, -1773412, -1304471, -2275537, -1573082, 1112433, 4636845, 7749267, 7988950, 3599177, -2089534, -2832396, 2189875, 6854988, 6853406, 4907966, 4673801, 4730779, 2533661, -23694, 545207, 3809843, 6401169, 6137099, 2718088, -2686340, -6503445, -5242668, -1052136, -266251, -4104922]
42031d104922k304713K646294K577295j636946j014588N129040O886194O67564
42023H845218m336224j667670K294399N45862k921983j884712R08712K29817j596110
42014D17309k95651J259171j176202l980480j609029K931966K990472k42224n98008
42005c02676J834226J862333o00317q45080J321412J421508j086785k217322j111448
41996B75851n59986l49542K066945M571612K274766l234302m776111q01445K307629
41987A775417P81690j594602j369656n88654j063198o62621J162870R41840j789459
41978b406373j645532L598001P302737L256491m225408o123804j307959L377255
41970A825408L673443K009615J418343J222071n1881j733028k602356k608494
$$ y = [-4104922, -6409635, -3763341, -1186046, -2822992, -3837580, 1291460, 8177654, 8845218, 4508994, 2841324, 5135723, 5681585, 2759602, 874890, 1783602, 2013419, 417309, 121658, 1380829, 204627, -3775853, -5384882, -2452916, 537556, 295332, -302676, 1531550, 3393883, 2793566, 1948486, 3269898, 4691406, 3604621, 1387299, 275851, -284135, -633677, 1433268, 6004880, 8279646, 5045344, 269233, -532212, 1775417, 2557107, 962505, -407151, -995805, -2059003, -2721624, -1558754, -616914, -2406373, -4051905, -453904, 6848833, 10105324, 5879916, -243888, -1551847, 1825408, 5498851, 7508466, 8926809, 10148880, 10096999, 8363971, 5761615, 3153121]
41962C153121j775181K97983K677447K883746M8342l059365l055518m72866P99178
41953A496887j001424k824678j331490J797391K193666m78879k200705j179695
41945c528927J3212K50889K267476O174117O328885q0597o312294m771870J375179
41936A716070L223918J1463j179659J523925K083624j914757m775712k789982
41928b101110k6628k2800J43475K595466L227177m18519k812317Q06352N128343
41919F519439K463912m370338n668017N73026O084742M520460q56317l280168
41911E986739j144779J668809J287754j999767m289511k778099L24908Q22206
41903a21740o85946N85016N054218O592171K042197k973543k627271J24487p82188
$$ y = [3153121, 1377940, 1675923, 4353370, 7237116, 7285458, 4226093, 1170575, 697709, 1496887, 495463, -2329215, -3660705, -1863314, 330352, -148527, -2349232, -3528927, -3515715, -3264826, -997350, 5176767, 11505652, 11425055, 5112761, 340891, 1716070, 4939988, 4951451, 3771792, 5295717, 7379341, 5464584, 688872, -2101110, -2127738, -2150538, -2007063, 588403, 3815580, 3397061, 584744, 1391096, 6519439, 8983351, 4613013, -1055004, -481978, 5602764, 10123224, 9266907, 5986739, 4841960, 6510769, 7798523, 5798756, 1509245, -1268854, -943946, -121740, -807686, -222670, 4831548, 11423719, 13465916, 10492373, 7865102, 7989589, 7207401]
41894G207401m463210n660262l729397j829751j62143K571802L738155P18652
41886a608753k162537P20069N678174M295632k344812m492120N48538M300689
41878D934880J280057l072564k876280q79767j466585k503258n05421K286895
41870b802043K218611O56955N52173R52009j6397r07654l90232o11587k538414
41861b886579k503092J615625N303110L963116L25287m72542Q13053L83478j110810
41852E430646p42913j0091k192020n141408m012715J05391J546860m87947j079966
41843f584163J437218K706546J50799k636317j795472J316432L133643K698373
41835D27059J209998l40572j183485o19894Q15684J735671J898860K052315J901205
$$ y = [7207401, 2744191, -2916071, -6645468, -8475219, -8637362, -6065560, -2327405, -1608753, -3771290, -3051221, 2626953, 6922585, 4577773, 85653, 634191, 4934880, 6214937, 3142373, 266093, -613674, -2080259, -4583517, -5088938, -2802043, -583432, 73523, 625696, 1577705, 1561308, 653654, 263422, -348165, -2886579, -5389671, -3774046, 1529064, 5492180, 5817467, 5344925, 6157978, 6541456, 5430646, 4687733, 4677642, 2485622, -2655786, -6668501, -6563110, -5016250, -5504197, -6584163, -5146945, -2440399, -2289600, -4925917, -6721389, -5404957, -2271314, 427059, 1637057, 1296485, 113000, -506894, 308790, 2044461, 3943321, 5995636, 7896841]
41826G896841M04412k009556l616969l596876k327714k96941J498274J454481
41818e94048k39055q76205Q04041K288804J600894P88371J492305P96791l326507
41809B735391o111633k396231L839596M424117o5061j355404K548796M188664
41801G808235m49246n283838m422582p96357O19714R41301K681412L113227o95510
41792C516356m730224l106571K492692N075605K401933j091096j606754j33244
41784B818697O49010l04949k261123l286591j545851K036727L809436J901618
41776C816974j351263l264704m141056m427948k227390K743386O081844M117715
41768A347558j83772j466678O9572J15982j996682k681854p92392N91102k01531
$$ y = [7896841, 8301253, 6291697, 2674728, -922148, -3249862, -3546803, -2048529, -594048, -833103, -1709308, -905267, 1383537, 2984431, 3772802, 5265107, 6061898, 2735391, -3376242, -5772473, -1932877, 2491240, 2426179, 1070775, 3619571, 7808235, 7358989, 2075151, -2347431, -3143788, -2524074, -1582773, 1098639, 4211866, 3516356, -1213868, -4320439, -1827747, 3247858, 5649791, 4558695, 2951941, 2818697, 3467707, 3162758, 901635, -2384956, -3930807, -1894080, 1915356, 3816974, 2465711, -798993, -4940049, -9367997, -11595387, -8852001, -2770157, 1347558, 1163786, -302892, -233320, -117338, -2114020, -4795874, -5588266, -4997164, -5198695]
41759e198695p59311R39532L074924K839888L15975k049342k443664j321225p09618
41750e311536j770419k772674r18586L156406N149895K913094k90920o85581P29518
41741A99197P76402p56925j993351k408929j869474Q80593M789622M900600q07901
41732C709834o253661m941326J83186J658140l48122M94568M314218M109729j626074
41723A300492n151572j620955L710884M779893L336119K984032J761184k730271
41715H369806o357018l842144K439628N539311L293897q55715l856665m584933
41707A46167j915027L247937N981633K735228k872919m598198k173582k84994
41699B66245p53005j376423j279667j539438j240371J209465L339611J360804
$$ y = [-5198695, -5958006, -5018474, -1943550, 896338, 1212313, -837029, -3280693, -4601918, -5311536, -7081955, -9854629, -10773215, -7616809, -2466914, 446180, 155260, -530321, 199197, 975599, 218674, -1774677, -4183606, -6053080, -5172487, -382865, 4517735, 3709834, -2543827, -7485153, -7301967, -5643827, -5991949, -5497381, -1183163, 2926566, 1300492, -3851080, -5472035, -1761151, 3018742, 6354861, 9338893, 11100077, 8369806, 2012788, -1829356, 610272, 6149583, 9443480, 8587765, 4731100, 146167, -1768860, 1479077, 7460710, 10195938, 7323019, 2724821, 551239, 266245, -486760, -1863183, -3142850, -4682288, -5922659, -4713194, -1373583, -12779]
41691a2779k532097k315184J868784L189722o01532l052804K05101L791287J354929
41682A895427l717648l541502J743724M291858M95690m198574l515106J741559
41674d804572N961346N501840J251722l399136n502082m546236k399086q88343
41666h824547J01031J301799K066132J525399P81394J583022L252378L325330
41658E111938J187837j169237k091370j828881j078037q5893N78457L46892r1858
41649H79848L14910J026836Q22415P2235l18563j212273l123922l001264J962267
41640b577511P650372O416360j524702o823608m067376P66471O18004j732595
41632a274585p1185L590502K836991j088239j024233L356317M473866n20466n303041
$$ y = [-12779, -2544876, -4860060, -2991276, 198446, -403086, -3455890, -3250789, 540498, 1895427, -1822221, -5363723, -3619999, 671859, 1167549, -3031025, -6546131, -4804572, 1156774, 6658614, 7910336, 4511200, -990882, -5537118, -7936204, -8824547, -8723516, -7421717, -5355585, -3830186, -3048792, -1465770, 1786608, 5111938, 6299775, 5130538, 3039168, 1210287, 132250, 46357, 624814, 971706, 879848, 1194758, 2221594, 3044009, 3116244, 2797681, 1585408, -1538514, -4539778, -2577511, 5072861, 11489221, 9964519, 3140911, -926465, -159994, 458010, -1274585, -1345770, 2244732, 5081723, 3993484, 2969251, 6325568, 10799434, 10278968, 4975927]
41623D975927m924581k323109j065927M16987L093979L167950j075370m436722
41615b170866k415676J635976K510731J250706J334641J526059q22050l302388
41607d52867k322285k29106j385187l788389k179359K379533L902134J518695
41599b556831K33069J703312K143041L57584J33252K497247K801395j197584m523973
41590A590512k361918K472888L756588L09330l643108m384123j792457K036115
41582b016173M714515M768944K369163j243778m731192o325239m223753M72687
41574f214826L153224J328304j086329N74189L729627K039547m035752o971101
41566g483117l210282K219775M018246L201387K518970J108993k252314m973547
$$ y = [4975927, 51346, -2271763, -3337690, -2920703, 173276, 3341226, 2265856, -2170866, -4586542, -2950566, -439835, 810871, 2145512, 3671571, 2849521, -452867, -2775152, -3004258, -4389445, -8177834, -10357193, -7977660, -4075526, -2556831, -2323762, -620450, 1522591, 1880175, 2013427, 4510674, 7312069, 6114485, 1590512, -771406, 1701482, 5458070, 5767400, 2124292, -2259831, -4052288, -2016173, 2698342, 7467286, 9836449, 8592671, 3861479, -2463760, -6687513, -6214826, -3061602, -1733298, -2819627, -2245438, 1484189, 3523736, -512016, -7483117, -10693399, -8473624, -4455378, -1253991, 1264979, 2373972, 121658, -4851889]
41558d851889l998501n45065J841303J860100P70449J58618R06908K372851K113774
41549F28548r86366l692542k198070J699616K908703Q89030n32635o22263j970064
41540c876043l252614j43515N286310N260043r80605m683410j603798J535801
41532b457831j68921j146487L073830N856196Q29061n488738l775626K351921
41524i26595K863426j770222k950980L99457J544481o47956o87973J690884R01576
41515D16098k770590k601656J951652L406711n84904l012980K82851M140970L655354
41506D883506J150758l66438k137172l970372k052931L084674M523212k25939
41498D889298m146197j784529K208147J707397q54160k21739J890546N33859l247977
$$ y = [-4851889, -8850390, -9395455, -7554152, -5694052, -4923603, -4764985, -3858077, -1485226, 628548, -357818, -4050360, -6248430, -4548814, -1640111, -751081, -1283716, -1905979, -3876043, -7128657, -7272172, -1985862, 3274181, 2293576, -2389834, -3993632, -2457831, -2626752, -3773239, -699409, 5156787, 5985848, 497110, -3278516, -926595, 1936831, 166609, -2784371, -2384914, -840433, -1488389, -2176362, -485478, 416098, -2354492, -4956148, -3004496, 402215, -182689, -3195669, -2912818, 1228152, 4883506, 6034264, 5667826, 3530654, -439718, -2492649, 592025, 5115237, 4889298, 743101, -1041428, 1166719, 2874116, 2019956, 1798217, 3688763, 4222622, 974645]
41489I74645m447329k404104m06973O42717K026173K623045M16421k611245k320492
41480e507142J381650M331857L655097L81689k671818l177961p07465K205766
41472a08327K196691l26359j447391P8689Q63926q55450j709988Q03623L448590
41463B944004K550410j521p11078n86912k126853l554501j702985J862820L102633
41454A776017J854270P69036l4206j907492l177058j397624J241757M44538l099291
41445c530053m574750k375017O70886K735226M153944L615230p41474n859603
41437e905611n385078J478756P679389P022812J246199l567846m234153k109808
41429c775340j26352l1142j130822j156142N06957J427083k9693j344744K35193
$$ y = [974645, -3472684, -5876788, -6283761, -5641044, -3614871, -991826, -575405, -3186650, -5507142, -4125492, 206365, 3861462, 4243151, 1571333, -1606628, -2314093, -108327, 2088364, 1762005, 314614, 393303, 1257229, 401779, -1308209, -504586, 2944004, 5494414, 5492893, 4781815, 4194903, 2068050, -1486451, -3189436, -1326616, 1776017, 3630287, 4399323, 4365117, 2457625, -719433, -2117057, -875300, -430762, -3530053, -8104803, -10479820, -9808934, -7073708, -2919764, 695466, -46008, -5905611, -11290689, -9811933, -2132544, 4890268, 6136467, 2568621, -1665532, -3775340, -3901692, -3932834, -5063656, -6219798, -5712841, -4285758, -4315451, -5660195, -5425002]
41420e425002K275875M28776l914367m823458q14976L057606L195262J973992
41412d046292K242016K448820K91163k786223l931514k841253q14816J564701
41404g873398L661912M164494L034979J737933M01627k203276m816825l840472
41396e733026O95247L450543R66335l116921l390244m9882K722551L068059K246890
41387H59552J176849J6135k18485R86802J872944Q85811n74498o49393l26198
41378D029519j097889j443445N54594K912054K316704l73993j628364j099449
41370D169731j234270j879087o18321J632620J124093j801072k118698J657584
41362I32580M326511K021315j747384j951743L58565Q47387j030662k494099k580764
$$ y = [-5425002, -3149127, -2720351, -6634718, -11458176, -12273152, -9215546, -6020284, -4046292, -1804276, 644544, 935707, -1850516, -5782030, -8623283, -9438099, -7873398, -4211486, -46992, 2987987, 4725920, 5127547, 2924271, -1892554, -5733026, -5037779, -1587236, -620901, -3737822, -7128066, -7177948, -4455397, -1387338, 859552, 2036401, 2052536, 1834051, 2820853, 4693797, 5579608, 5005110, 4355717, 4029519, 2931630, 1488185, 2042779, 4954833, 7271537, 6897544, 5269180, 4169731, 2935461, 1056374, 438053, 2070673, 3194766, 1393694, -725004, 932580, 5259091, 7280406, 5533022, 3581279, 3939844, 4787231, 3756569, 1262470, -1318294]
41353a318294k241969j201256Q09048J417027j094771l422796j350608K922697
41345e480922L391262j85904j752598J165137L739438K302562Q3535P32804J806605
41336E801919l14746l498099l455109r98891J0360m46953M91849K433601K393736
41327B417667N72408k20374j39937j440820k666736l39007L447825K545620k715931
41318A460715m389316N86430M585629J110521m663330m243915O91936J754911
41310c106419k215523l792407O55795N485865M712459Q0929k710066j397893K021976
41301b65284M618655M269138N65382l995610n591195l268150O2613J587075J527996
41292d89380J349186J281408R17356N32738N29354O37387L24027q73080l161491
$$ y = [-1318294, -3560263, -4761519, -3952471, -2535444, -3630215, -7053011, -8403619, -5480922, -2089660, -2275564, -4028162, -2863025, 876413, 3178975, 3262510, 3995314, 5801919, 5487173, 1989074, -1466035, -2464926, -2454566, -2901519, -2409670, 23931, 2417667, 2990075, 2769701, 2629764, 1188944, -1477792, -1816799, 1631026, 4176646, 1460715, -2928601, -2342171, 2243458, 3353979, -1309351, -5553266, -4861330, -3106419, -5321942, -9114349, -8458554, -2972689, 1739770, 1820699, -889367, -2287260, -265284, 4353371, 8622509, 9187891, 5192281, -398914, -3667064, -3604451, -2017376, -489380, 859806, 2141214, 3058570, 3591308, 4120662, 4758049, 5082076, 4208996, 1047505]
41283A047505n235350m071653J416701O952693O487195j91758o580227p127568
41275g302462k771400K158323N030862N104924K178310k016211l656722j236426
41267b510802J720485J292075j238047j673139N98230K166044J205347k43107
41259A317086j68888M33128k04765j671825k150901q54861J342266K857478K496332
41250C395050M79861j408095j615274o71555j05803N5062Q18397J437708k19233
41241B166118l657405m884940j554411L141257M264416J362201j878971l069659
41233d111394k876369j894148K66007K209316J228101j799719k080019J786504
41225g271721M189384M24957n184463m897726P12894L565521N07893k475595n54909
$$ y = [1047505, -4187845, -8259498, -6842797, 109896, 6597091, 6405333, -174894, -7302462, -10073862, -7915539, -2884677, 2220247, 4398557, 2382346, -1274376, -2510802, -790317, 501758, -736289, -2409428, -1811198, 354846, 1560193, 1317086, 1148198, 1581326, 1376561, -295264, -2446165, -3301026, -1958760, 898718, 3395050, 3874911, 2466816, 851542, 179987, 74184, 129246, 947643, 2385351, 2166118, -1491287, -6376227, -7930638, -4789381, -524965, 837236, -1041735, -4111394, -6987763, -8881911, -8615904, -6406588, -5178487, -6978206, -9058225, -7271721, -3082337, -2657380, -7841843, -12739569, -12026675, -8461154, -7953261, -10428856, -10983765]
41216a0983765K639342K234448N46404K308717N765787N426472J421551q02654
41208H556302M92776J069569j858833n515325o342798m340989j099744K424747
41200f614295M588635L387980r81j433354N34340K392247J075950j576089k186188
41191A68245q33942J31724J64540N41699J607999K411161K353608J588004M85358
41182H618396l32186l82553j43745j36373N30351K345932K683625j212456o290709
41173E680282n847368N62080M816865J346491m555151m602303N04186L370607
41165A275689J458960q32542p36008n29269j444030p14165K784909N123026K830756
41156I217326j763946l888183k495563k94020N16851J1256p59103q61575m2547
$$ y = [-10983765, -8344423, -6109975, -5563571, -3254854, 2510933, 7937405, 9358956, 8556302, 9049078, 10118647, 8259814, 2744489, -3598309, -7939298, -9039042, -6614295, -2025660, 1362320, 1361339, -72015, 462325, 2854572, 3930522, 2354433, 168245, -665697, -533973, -369433, 172266, 1780265, 4191426, 6545034, 8133038, 8618396, 8286210, 7903657, 7759912, 7623539, 8153890, 10499822, 13183447, 11970991, 5680282, -167086, 394994, 5211859, 6558350, 2003199, -2599104, -2094918, 1275689, 2734649, 1902107, 1166099, 636830, -807200, -1521365, 1263544, 6386570, 9217326, 7453380, 3565197, 1069634, 775614, 1292465, 1303721, 544618, -316957, -359504]
41147c59504P16265K12323q88069p28607L02640p23215m506892o800273l206227
41138a5981559M417161R201518P033626R75158k699216j424292J696044K199992
41130E418432o37526l516220l396038r49385P54537P8319j724120k379127q24332
41121g175460K127999M359962M067530J808271L09697J060581K055783O84609
41113I298972k170676l452873k679779k140568k242530m05447L993175P001398
41105G201672M987200j49174l395847k775674m86895J012752J352125J025115
41097H771274K64239m91834o17264j92487R6860L2804N4168M48228R78676J191776
41087A0536440P94632J07117J14338J190426J931630Q11582j005073p57015J532204
$$ y = [-359504, 356761, 569084, -318985, -1047592, -744952, -1468167, -5975059, -12775332, -15981559, -11564398, -2362880, 4670746, 5645904, 2946688, 1522396, 3218440, 5418432, 4780906, 1264686, -2131352, -3080737, -2326200, -2247881, -3972001, -6351128, -7175460, -5047461, -687499, 3380031, 5188302, 5497999, 6558580, 8614363, 9298972, 7128296, 3675423, 995644, -1144924, -3387454, -3792901, 200274, 7201672, 12188872, 12039698, 8643851, 5868177, 5381282, 6394034, 7746159, 8771274, 9035513, 8543679, 7926415, 7733928, 7830788, 7863592, 7917760, 8365988, 9344664, 10536440, 11331072, 11438189, 11552527, 12742953, 14674583, 15486165, 14481092, 13724077, 15256281]
41078A5256281K608849J138176M8203J568271L373837K980846K599272M959021
41070C4532756P248476N425995K704310N950534J3498653J5373849Q597366L484780
41062I6816719Q630693J6996898J5803988N598288j123283R27210L025063k722363
41054A43953213j1472815j4290836j1669519j1041073j4661817j7482319j5905016
41047D7429818j2100051r014684o359920l188701n82767K44638j6652k46165n02013
41038A5663503j037714j486477j895391k743909l206718j571782J595238L115153
41030H431903J618755o1277Q24596K432684J283297j651578j819532J786739M336873
41021A7182460J792192l196503m910605k384207j23695j145823k864057j636686
$$ y = [15256281, 17865130, 19003306, 19051509, 20619780, 23993617, 26974463, 29573735, 34532756, 41781232, 47207227, 49911537, 55862071, 69360724, 84734573, 93331939, 96816719, 105447412, 122444310, 138248298, 143846586, 142723303, 143650513, 146675576, 143953213, 132480398, 118189562, 106520043, 95478970, 80817153, 63334834, 47429818, 35329767, 26315083, 19955163, 16766462, 16183695, 16428333, 16411681, 16165516, 15663503, 14625789, 13139312, 11243921, 8500012, 5293294, 3721512, 5316750, 8431903, 10050658, 9989381, 10813977, 13246661, 14529958, 12878380, 11058848, 12845587, 17182460, 18974652, 15778149, 10867544, 8483337, 8359642, 7213819, 4349762, 2713076]
41013B713076J309405J749643q24743k303231n26026J166056m91248k881113j524870
41004a613051K151478K593105o67408j856280J251504K899901j129421n349655
40996a719827k461726M519124O131359Q82928k968722q66730J638253p50547m347133
40987E6979l667686q51867q22707j790289J216583O125004N950487N19730k682234
40978D054000n95627R50990k105323m894617k193134K430717K740621L22241J226675
40969A936543M852848M456609j503242o260597m729298j67095J961838J479103
40961B026709J226767J462309P33655l67005m13580l69932j839675l295634j795898
40952b632284J974850L842905J633447k211881l969441k391858J158093M200749
$$ y = [2713076, 4022481, 5772124, 4947381, 2644150, 2118124, 3284180, 2792932, -88181, -1613051, 538427, 3131532, 2464124, 607844, 1859348, 4759249, 3629828, -1719827, -4181553, 337571, 6468930, 7351858, 4383136, 3516406, 5154659, 4404112, 56979, -3610707, -4462574, -5285281, -7075570, -5858987, 266017, 6216504, 6736234, 4054000, 3458373, 4409363, 2304040, -2590577, -4783711, -2352994, 387627, 709868, 1936543, 6789391, 11246000, 9742758, 3482161, -1247137, -1414232, 547606, 2026709, 3253476, 4715785, 5449440, 5082435, 4668855, 4298923, 2459248, -836386, -2632284, -657434, 3185471, 4818918, 2607037, -1362404, -3754262, -2596169, 1604580]
40944A604580M374896J198494k796037m265455k709834m20357J041225K096404
40936A23916K789283K011122J26521l40664J518338K763362N24134l397805m531574
40927A586633j639438J946096K862423J341636k05157l85148L84463J148728J337751
40918H377987P38233o10384k183547k851859j540497J456149M044761M059998
40910A1490841J530610j562820l737641m973600n119018l230652M23222L339466
40902a839592L403916J467564k73658j367519k600478l283547j628673K009347
40894d112640M527227L562744J83891k609628l024623j578877M6812O96550O73460
40885a635084J089175K094997K414692J302338K3887J56355J251008J749896J484614
$$ y = [1604580, 5979476, 7177970, 4381933, 116478, -2593356, -3013713, -1972488, 123916, 2913199, 4924321, 5050842, 4710178, 6228516, 8991878, 9516012, 6118207, 1586633, -52805, 1893291, 4755714, 6097350, 5892193, 5507045, 5891508, 7040236, 8377987, 9116220, 8505836, 6322289, 3470430, 1929933, 3386082, 7430843, 11490841, 13021451, 11458631, 7720990, 2747390, -2371628, -5602280, -5179058, -1839592, 1564324, 3031888, 2758230, 1390711, -1209767, -4493314, -6121987, -4112640, 414587, 3977331, 4161222, 1551594, -1473029, -3051906, -3005094, -2308544, -1635084, -545909, 1549088, 3963780, 5266118, 5290005, 5446360, 6697368, 8447264, 9931878]
40876I931878J380228J241552M2140j767214k496275j858466j217178j055644
40868D201021m75318M80121L73215j140914k497740k457663j253141N64908K169351
40859c6160J692958j458080l825807j569763K900541L164884j158208k826238
40851c115873J611041N429799K041625m151396m473725O73579L657567K361488
40843D034105J806286L415746K215530l230045o774564m340430l04923L45809
40835b832486j20548K345566N496581M553776N14357j663668j017789p73962j867669
40826D634158j985649p96119q91392k793892l355974n14470L447068M739534K220404
40817D703668j967388m413782l048509Q63762L634452L223197J424659O92367
$$ y = [9931878, 11312106, 12553658, 12595798, 10828584, 8332309, 6473843, 5256665, 4201021, 3725703, 4205824, 4579039, 3438125, 940385, -1517278, -2770419, -2205511, -36160, 1656798, 198718, -3627089, -5196852, -2296311, 868573, -289635, -3115873, -1504832, 3924967, 5966592, 1815196, -2658529, -1984950, 1672617, 4034105, 5840391, 9256137, 11471667, 8241622, 1467058, -2873372, -3178295, -2832486, -2953034, -607468, 4889113, 9442889, 9957246, 8293578, 7275789, 6501827, 4634158, 2648509, 1852390, 960998, -1832894, -5188868, -5703338, -2256270, 2483264, 4703668, 2736280, -1677502, -4726011, -3862249, -227797, 2995400, 4420059, 5112426]
40809E112426N63828n30407j686478q57654J270215J885600J10168k177383l077783
40800F12532j978793Q42035L518799L007726r04787l750053k029372J184215O63596
40791A165898k686564l390050l36803J927373J059047j14847L47332M59549p93006
40782b362071j164560p2729l57808k474708k418592J296356L947493J833509j704471
40773c477581j807536Q36246K905729M038474M739090L058969j322525l853074
40765E117792j695614N51812j860110n005168k500195K943110L335767j173698
40757b86304k575157J477896M364497K243127m44768j55646L4433j911112j850624
40748H96342K515677N526254J901894m258298n461461j618968J611887J937061
$$ y = [5112426, 5676254, 5145847, 3459369, 2601715, 3871930, 5757530, 5867698, 3690315, 612532, -1366261, -524226, 2994573, 6002299, 5097512, 1347459, -681913, 502302, 1165898, -1520666, -4910716, -5247519, -3320146, -2261099, -2375946, -2028614, -1569065, -2362071, -3526631, -3599360, -3957168, -6431876, -8850468, -7554112, -3606619, -1773110, -3477581, -5285117, -4448871, -1543142, 2495332, 7234422, 10293391, 8970866, 5117792, 3422178, 3973990, 2113880, -2891288, -5391483, -2448373, 887394, -286304, -2861461, -1383565, 2980932, 5224059, 4779291, 4623645, 4658078, 2746966, 896342, 3412019, 8938273, 10840167, 6581869, 1120408, -498560, 1113327, 3050388]
40740C050388J402588P17924j000300k239937p17371J822778J721177l09398j59953
40731D287896K635563L903035J413314j979315k822723j198877N64215O23135
40723G426243j303664l334019k477809J157851K693076j280257o344035n303810
40715h766424J071692M554539J569714j772126M64749N162214N684327J817343
40707I786028j264477j270196n30145o06617k36544J083811J446795m73726l242787
40698D692142m272679k290109J550315L902398J912080k645116l974340K24099
40690i01210M212552J565874m670220n213169J941350P971385N619481j117721
40682I408322m023421k196014o17716p25702N51977L549691M491964K042400n12705
$$ y = [3050388, 4452976, 5170900, 4170600, 1930663, 1213292, 3036070, 4757247, 4447849, 4287896, 6923459, 10826494, 12239808, 10260493, 7437770, 6238893, 6803108, 7426243, 6122579, 2788560, 310751, 1468602, 4161678, 2881421, -3462614, -8766424, -7694732, -3140193, -1570479, -3342605, -2877856, 2284358, 7968685, 9786028, 8521551, 7251355, 6721210, 6114593, 5878049, 6961860, 8408655, 7934929, 4692142, 419463, -1870646, -320331, 3582067, 5494147, 2849031, -1125309, -901210, 3311342, 4877216, 206996, -5006173, -3064823, 4906562, 10526043, 9408322, 5384901, 3188887, 2571171, 1845469, 2397446, 5947137, 10439101, 12481501, 11968796]
40673A1968796r77105j057546j816404j342324O72073Q89784j908234l516008
40665B913032q41080K281271R09663k594291k133914J987993L345976j87170l092659
40656B588821j195920J962174J222920k246969l502651j493327L92977K53878
40648b018097m3852J314438L201420L455434J694416p25060k352380k555644j629025
40639C41650n23937N8252N22280J661535K861919K072424j382705m613634l624550
40630b626766J539704N949930N540176K015234l67120j344844l953164p577153
40622h24003p022038o78510N274089M772299K31077j737970M9707J627106J621457
40613C313214K168638K804568L63592m154360n167896r84100L162277L065241
$$ y = [11968796, 10991691, 9934145, 8117741, 6775417, 7447490, 8337274, 6429040, 2913032, 2071952, 4353223, 5262886, 2668595, 534681, 2522674, 5868650, 5681480, 2588821, 1392901, 3355075, 4577995, 2331026, -1171625, -2664952, -2271975, -2018097, -2061949, -747511, 2453909, 5909343, 7603759, 6878699, 4526319, 1970675, 341650, -182287, -124035, 398245, 2059780, 4921699, 6994123, 5611418, 997784, -2626766, -1087062, 4862868, 10403044, 12418278, 12051158, 10706314, 6753150, -824003, -7846041, -8524551, -3250462, 1521837, 1752914, 14944, 64651, 1691757, 3313214, 5481852, 8286420, 8650012, 4495652, -672244, -1656344, 1505933, 4571174]
40605D571174J039677M43189R6214j921300l665178k967078j625186j451616j12391
40596e592495L994003O518985L031434k722150l353654R04929K753109m79089
40588E055072l079972o55317L049631K460633j617477m195849l273942q08330
40580c065551J465577L272875L665310J311779k377479l090804J514879P754241
40572A0450827Q894891K893199m505533o193993k152692J307274M17712j842658
40564I269027j656042j49378p5453l43406J458047L394694J538242k794431l810053
40555F831247R897L163985J156933l133257m103428j216684J369354J119476m42075
40546D755448j140511j043423j242117j580361r17162Q08070J940974J166871
$$ y = [4571174, 5610851, 6054040, 6150254, 4228954, 563776, -2403302, -4028488, -5480104, -5592495, -1598492, 4920493, 7951927, 5229777, 1876123, 2781052, 5534161, 5055072, 1975100, 1319783, 4369414, 6830047, 5212570, 1016721, -2257221, -3065551, -1599974, 1672901, 5338211, 6649990, 4272511, 1181707, 2696586, 10450827, 19345718, 22238917, 17733384, 11539391, 9386699, 10693973, 11111685, 9269027, 7612985, 7463607, 7388154, 7044748, 8502795, 11897489, 13435731, 10641300, 6831247, 6841144, 10005129, 11162062, 8028805, 3925377, 2708693, 4078047, 5197523, 4755448, 3614937, 2571514, 1329397, -250964, -1168126, -360056, 1580918, 2747789]
40538B747789l50144j04753K286284M086238K627733j595878n727823p210401
40530c240955n026451q4239M452703N110815K022715p78254n01282J089599J338740
40521D383391R24711J503592J733330m04509l146665l158253j072830m20519j716703
40512a374455k134544q06069J56299J27470Q99984K572061K927748J712662J181091
40503E262247J561184O08029j250184m39951L233202M805751J659438k116614
40495A3323102k313368r07262j492490k531506m73434L219401L806947O63387
40487A3294777k150113k079800l47477J554409L201677L082430l94452m961760
40479A1199691n787960k186743P94386l66982k307679O8202N463977P369949K943363
$$ y = [2747789, 2397645, 2292892, 4579176, 8665414, 11293147, 9697269, 3969446, -3240955, -8267406, -8351645, -3898942, 1211873, 3234588, 2456334, 1955052, 3044651, 4383391, 5308102, 6811694, 8545024, 8140515, 4993850, 1835597, 762767, 342248, -1374455, -3508999, -4315068, -4158769, -4031299, -3131315, -559254, 2368494, 4081156, 5262247, 6823431, 7431460, 6181276, 5741325, 8974527, 13780278, 15439716, 13323102, 11009734, 10102472, 8609982, 6078476, 5605042, 8824443, 12631390, 13294777, 11144664, 9064864, 8717387, 10271796, 13473473, 16555903, 16161451, 11199691, 5411731, 3224988, 4019374, 3652392, 1344713, 1412915, 6876892, 14246841, 17190204]
40470A7190204l111936m736818j797478R72345O96483p13650k80636J829324L031003
40461A3078841J966683j6889p96587L9950R12170L88601o17253K86790L325499
40452A8567805N249316L514213M70805M43413L392644N322668M889746M788883
40444D6639493N590996L896065o61060k392929J894788O487797M854999k6240
40436F6283909n03113L583960N499683K972068P43246J462577J727672j089713
40428H0680289m513423n552476m447202k384912k79847m81225m444102q417705
40420E0159397p440767l798648m340424q620728q166626p9997P188554N914859
40412C0815620o21344m869970n172889l861331j555466Q42964J36491l410490
$$ y = [17190204, 14078268, 9341450, 7543972, 8516317, 9212800, 8499150, 8218514, 10047838, 13078841, 15045524, 15028635, 14232048, 14271998, 15184168, 15572769, 14955516, 15242306, 18567805, 23817121, 27331334, 27802139, 28245552, 31638196, 36960864, 41850610, 46639493, 52230489, 56126554, 55465494, 53072565, 54967353, 61455150, 66310149, 66283909, 65780796, 69364756, 74864439, 77836507, 78579753, 80042330, 81770002, 80680289, 76166866, 70614390, 66167188, 63782276, 63502429, 63021204, 58577102, 50159397, 42718630, 38919982, 34579558, 25958830, 17792204, 17712207, 24900761, 30815620, 30194276, 25324306, 20151417, 16290086, 14734620, 15577584, 15714075, 12303585]
40404A2303585l748586J697965O109288L110520k995020m192699r40949P19076
40396A2063180p2382N2763K30190k883073o825922n849409p48449K380610K525691
40387H73199M139065P188660O088946R3412m010218k397581L86062k2547j038350
40378A1300648O10113K089287l98375m066875l278254J372308L408920k68888
40370A0768884n059607n008228m93202L001715K720983J878273L635970N109537
40362A6554325J663411m447653n945110j705267R45949k014776m599759j125021
40354f73901L628448K201653k913541l567705N50873K507677N21842k28946J857308
40345C883708K283412j84437r71664J068494Q49001k952297l657656K471589Q343665
$$ y = [12303585, 8554999, 10252964, 16362252, 19472772, 16477752, 12285053, 11344104, 12063180, 11990798, 12043561, 12273751, 9390678, 2564756, -3284653, -4033102, -1652492, 873199, 5012264, 12200924, 18289870, 18383282, 14373064, 11975483, 12361545, 12338998, 11300648, 11910761, 14000048, 13601673, 9534798, 6256544, 7628852, 11037772, 10768884, 5709277, 701049, 207847, 3209562, 5930545, 7808818, 11444788, 16554325, 18217736, 13770083, 7824973, 6119706, 7065655, 5050879, 451120, -673901, 2954547, 5156200, 2242659, -1325046, -774173, 1733504, 2255346, 2026400, 3883708, 6167120, 5982683, 5011019, 6079513, 6928514, 3976217, 318561, 2790150, 11133815]
40336A1133815N533838l486071r132228p335657k325715J158012K756920L879509
40328B182423M505100L643945J083576j937284l412918k283850N56716L433383
40320G771091N105354M083978p68990o706773p329516n40296O401497N261828
40312A3278173j652730m768570r52911L322143K775441k57403j920946k358014
40304G465183k375123o42970K601626M060344K437084O03594N25703N33589m83033
40295A4725997r34364m05597p93785j937370j247963Q83217J015150o22067J82342
40286A0865560L471002L911650J94186k169290p37680m99520l848966m856579
40278F330363K69335N185186L547264q9561J629597N890106M813277o10841k080678
$$ y = [11133815, 16667653, 13181582, 4049354, -3286303, -5612018, -4454006, -1697086, 2182423, 6687523, 10331468, 11415044, 9477760, 6064842, 3780992, 4337708, 7771091, 12876445, 16960423, 16191433, 9484660, 2155144, 1614848, 8016345, 13278173, 11625443, 6856873, 5903962, 9226105, 12001546, 11744143, 9823197, 7465183, 5090060, 4447090, 7048716, 11109060, 13546144, 14149738, 14675441, 15209030, 14725997, 13791633, 13386036, 12592251, 10654881, 9406918, 10290135, 11305285, 10683218, 10865560, 14336562, 18248212, 18442398, 16273108, 15535428, 15035908, 11186942, 6330363, 6599698, 11784884, 15332148, 15242587, 16872184, 22762290, 27575567, 26964726, 24884048]
40269B4884048K406859O080135M285524k49046l417464m163019k462893J130040
40261B8494184L495612J736851j777228j854666K004566M932960L598740q6811
40253D0544208k232663r34421K645385N086598M003827J866905L304258P111178
40245F1395275O450821K22680k747866L170743R976904P293272j406065m164497
40237H0191267J436317O910598P860840Q483461J0549678R661563N444774M851464
40229A35389962J0628281J5481201J3327559Q855307R595345J4418587J6709175
40222B24405417J4986422J3708838J5421486J7706745J7677225J5712982J4311297
40215C33930412J5029304J6666774J6202398J2352047P621727M978299L475692
$$ y = [24884048, 27290907, 33371042, 37656566, 37407520, 33990056, 29827037, 27364144, 28494184, 31989796, 33726647, 31949419, 30094753, 32099319, 37032279, 40631019, 40544208, 38311545, 37377124, 40022509, 45109107, 49112934, 50979839, 54284097, 61395275, 67846096, 68068776, 65320910, 68491653, 78468557, 85761829, 84355764, 80191267, 81627584, 88538182, 96399022, 104882483, 115432161, 125093724, 130538498, 135389962, 146018243, 161499444, 174827003, 183682310, 193277655, 207696242, 224405417, 239391839, 253100677, 268522163, 286228908, 303906133, 319619115, 333930412, 348959716, 365626490, 381828888, 394180935, 401802662, 406780961, 410256653]
40208D10256653J91005m331218o598925o091283o294827r033129j1926862j2870371
40200C53301043j3310839j5355220j8578516k1141695k1657992j9317155j4857991
40193B29081635j1659709j2667894j5904306j6432770j3157643j0026073r935984
40186A39297256j1284406j1474195j0147015p814789m740028k361645k677864
40179H8797314n110051o722141o142038m582040l033631j597656j292589k941008
40171E7376160m587347l789734j870188j755004k609075j578842J98579p35907
40163D0648642l175643k630299M23803R56748j516593k146735j43982l19268l111858
40154B8984815k387316L091470N378055k5825n957802m786691q6778N70454k221706
$$ y = [410256653, 410447658, 406116440, 399517515, 393426232, 387131405, 378098276, 366171414, 353301043, 339990204, 324634984, 306056468, 284914773, 263256781, 243939626, 229081635, 217421926, 204754032, 188849726, 172416956, 159259313, 149233240, 139297256, 128012850, 116538655, 106391640, 98576851, 93836823, 91475178, 88797314, 83687263, 76965122, 70823084, 66241044, 63207413, 61609757, 60317168, 57376160, 52788813, 48999079, 47128891, 45373887, 42764812, 41185970, 41384549, 40648642, 37472999, 34842700, 35266503, 36223251, 34706658, 32559923, 32415941, 32096673, 28984815, 26597499, 29688969, 35067024, 35041199, 29083397, 24296706, 24209928, 24780382, 22558676]
40145B2558676l150146k177144k283546j795200J977994N055105K001982l763793
40137A8423928m170959O53483K972036J47782k465832j786905j215844k817445
40129I740244l356123r35613J158658M10663p09280L82697J932893J332273n80369
40120I376043j342211l01642J486632K534561J481951j175630k299027j54235
40112I606442J835858l78564m435147m596575j073837M01318j453198j582426
40104a676129J661935L091625M96573k37353M650297Q722205M846418k890852
40096A8664719n297011k206219j189711m068668m565636p2728L520148J722053
40088F506947j613689j564735k5520r45661k513638m26992L795209M266397j47726
$$ y = [22558676, 19408530, 17231386, 14947840, 13152640, 15130634, 20185739, 22187721, 18423928, 14252969, 14906452, 17878488, 18026270, 15560438, 13773533, 12557689, 9740244, 6384121, 5448508, 6607166, 7017829, 6308549, 6691246, 8624139, 9956412, 9376043, 8033832, 7732190, 9218822, 11753383, 13235334, 12059704, 9760677, 9606442, 11442300, 11063736, 6628589, 2032014, 958177, 1359495, -93703, -1676129, -14194, 3077431, 3574004, 3336651, 7986948, 16709153, 21555571, 18664719, 13367708, 11161489, 9971778, 5903110, 1337474, 1264746, 4784894, 6506947, 4893258, 3328523, 3303003, 2357342, -156296, -583288, 3211921, 7478318, 7330592]
40079G330592l882051k685640J008899K454896R13340o03387J98844K706030M595261
40070A2036784L940616Q90074k150158k904159j923572j548099k253915k136979
40062C950592l95485J174593J160643N11036J16133j013792l151607l889403j430052
40053b967342K052380L143501J725943L8076j140444k208226k186448j15647K025271
40044C67064J581996l32091m99029J024961J466466P43389J407230L071548K264749
40035A1096283j126554k718353q36900M76217j532926l355664j067666K965165
40027C899602L571874N0107m020635n826405m618347m76089M433414N618585J346909
40018C979015l690304l677478O97437L647353K216757r11118j974485k47723K181431
$$ y = [7330592, 3448541, 762901, 1771800, 4226696, 5140036, 4536649, 4735493, 7441523, 12036784, 15977400, 16867474, 14717316, 11813157, 9889585, 8341486, 6087571, 3950592, 3555107, 4729700, 5890343, 6401379, 6517512, 5503720, 2352113, -1537290, -2967342, -914962, 2228539, 3954482, 3992558, 2852114, 643888, -1542560, -1658207, 367064, 1949060, 1616969, 1117940, 2142901, 3609367, 4352756, 5759986, 8831534, 11096283, 9969729, 7251376, 6414476, 6890693, 5357767, 2002103, 934437, 3899602, 7471476, 7521583, 3500948, -2325457, -6943804, -7419893, -2986479, 2632106, 3979015, 288711, -3388767, -2691330, 956023, 3172780, 2261662, 287177, 39454, 2220885]
40009B220885K407810q26296m873069n030286o17028L280059K746593N95722J185051
40000A089441K921505J358962k402410k818487J069525L896127K058595j816561
39992E356697l738430k965213m70990K705822M181759J700756k522487l279789
39984I68125P9054K152881k52792l258340k534020r6921l8193j339421m12200
39975d731827J774516J126854k015068k673718R53768M766392N214405L741441
39967H156763K644485R03213k544977m850175k853772J369046K969014J331786
39959G125383K06939J075968J132779j188948l316363l171895k491155k848739
39951c476031k432901j75578R75346o64694r81307L326501P141955L596859l847994
$$ y = [2220885, 4628695, 3802399, -1070670, -6100956, -6717984, -3437925, -691332, -95610, 1089441, 4010946, 5369908, 2967498, 149011, 1218536, 5114663, 7173258, 5356697, 1618267, -1346946, -1817936, 887886, 5069645, 6770401, 4247914, 968125, 1047179, 3200060, 2947268, -311072, -2845092, -2942013, -2980206, -4319627, -4731827, -2957311, -1830457, -3845525, -6519243, -5565475, -799083, 4415322, 8156763, 10801248, 11704461, 9159484, 4309309, 1455537, 2824583, 5793597, 7125383, 7332322, 8408290, 9541069, 8352121, 5035758, 1863863, -627292, -3476031, -5908932, -6084510, -5109164, -5773858, -6755165, -3428664, 3713291, 7310150, 3462156]
39942C462156n128358P96461M077561m5881l730870o4352N338895L980510j662034
39933G024088l201624k99306L52400k587642l547974n44028J635306J82568j168929
39924b155141J103345M522066M448125K40639m422560n301617j269941L925608
39916A090524M566936j72181m345195l071764Q47148K212972J550741K117707
39908D796888K384408r06319m750112l698906j86898j328500n683533m122470
39900a3495442M286916Q688204L178596l583620k235406L160296L413974p22038
39892B691480j697438J337229K292803o68593k859556j778924m02017r30202j502206
39883c517424m84869Q23043J090374P74664J12726j486194l295674l255295p66716
$$ y = [3462156, -1666202, -869741, 3207820, 3161939, -568931, -633283, 4705612, 8686122, 7024088, 3822464, 3523158, 3875558, 1287916, -2260058, -2804086, -1168780, -986212, -2155141, -1051796, 3470270, 7918395, 8159034, 3736474, -1565143, -2835084, 1090524, 5657460, 5485279, 1140084, -1931680, -1084532, 1128440, 2679181, 4796888, 7181296, 6274977, 1524865, -2174041, -2360939, -3689439, -9372972, -13495442, -9208526, -520322, 2658274, -925346, -3160752, -456, 3413518, 2691480, 994042, 2331271, 4624074, 3955481, 1095925, -682999, -1085016, -2015218, -3517424, -4002293, -3179250, -2088876, -1314212, -1201486, -2687680, -5983354, -9238649, -10005365]
39874a0005365K462900M440191M143621J495151j985797l419005j600123J054891
39866c413536J590715L77977k42280K18390N06772L78316M88821M53728k93750
39857F5153n82104P54043J992731N07485k663893l463815n25960K570477J953689
39848F07806j531968l441820j140109L040676M451208J758747j174915k83401
39840B286224K905832L168625q49748m493755l738619n56481N61858j324566l533106
39831e573736l591823r31487L148136N356855K906267j957662l280136L06144
39823c617442K760837k69550m156612k619209J708855J537343k575969k741759
39815i973506L023243O863164L197673k757487l201674J160774L700766J799356
$$ y = [-10005365, -7542465, -3102274, 1041347, 2536498, 550701, -2868304, -4468427, -3413536, -1822821, -1444844, -1687124, -1468734, -961962, -583646, -94825, 358903, 65153, -516951, 237092, 2229823, 2737308, 73415, -3390400, -3916360, -1345883, 607806, -924162, -4365982, -5506091, -2465415, 1985793, 3744540, 2569625, 2286224, 5192056, 8360681, 7510933, 3017178, -721441, -1277922, -716064, -2040630, -5573736, -9165559, -10097046, -6948910, -1592055, 1314212, -643450, -3923586, -3617442, -856605, -1126155, -5282767, -7901976, -6193121, -4655778, -7231747, -9973506, -6950263, -87099, 3110574, 353087, -2848587, -1687813, 2012953, 3812309]
39807C812309j363979k876227k746501j281415J594153M139391L678234N42102
39799E498067j746092j170096M33635Q67672Q65629J916637K851699J487252j280643
39790I723760k282222j073420p13671k421393l043043l86583K206368O37286k939444
39781b92362l024452L56521J566294j374895l563547j374999J938742K333036
39773c435662J555762K944685M691093K880526j337617l319554k273955j612244
39765I3034k490792k193622N71568L217882L230835J214865r93943k526016k976341
39756b852530j973537J1848J905371L092514L140297J486687j055833k037122
39748A717695o08237Q05344L46525j65155R96649J389702j571473m844218l334615
$$ y = [3812309, 2448330, -427897, -3174398, -4455813, -2861660, 1277731, 4955965, 5498067, 3751975, 2581879, 3015514, 3883186, 4748815, 6665452, 9517151, 11004403, 9723760, 7441538, 6368118, 5654447, 3233054, 190011, -196572, 2009796, 2647082, -292362, -3316814, -2960293, -1393999, -2768894, -6332441, -7707440, -5768698, -3435662, -1879900, 1064785, 5755878, 8636404, 7298787, 3979233, 1705278, 93034, -2397758, -4591380, -4019812, -801930, 2428905, 3643770, 2649827, 123811, -2852530, -4826067, -4814219, -2908848, 183666, 3323963, 4810650, 3754817, 1717695, 1109458, 1914802, 2261327, 2096172, 3092821, 4482523, 2911050, -1933168, -5267783]
39739e267783K025055N226498L631311J73236k403392l847314l103278J034479
39731b531188N241266L996768j825089m870632j889715J860061J620354J18566
39723A720391J322520K966093Q67157l374617m699978k018119J582479L851791
39715B217717M166518J546980l426914o488929m203780O09302K447209R94674
39707b137223O49806K791977L730638J093302k417124l400000k288701j401841
39699c379166j142958m16793Q60480J744145J865916J499718O07423q58271j993137
39690a212643j552570K36977J462328P86770p68491j366188j115474j464269j950360
39681f943920m32610K400733K435554j134719k370119L025869Q991781O209465
$$ y = [-5267783, -3242728, 1983770, 5615081, 5788317, 3384925, -462389, -3565667, -2531188, 2710078, 6706846, 4881757, 11125, -1878590, -18529, 1601825, 1720391, 3042911, 6009004, 6876161, 3501544, -1198434, -3216553, -1634074, 2217717, 6384235, 7931215, 4504301, -1984628, -6188408, -5579106, -3131897, -2137223, -1487417, 1304560, 5035198, 6128500, 3711376, 311376, -1977325, -3379166, -4522124, -4938917, -4078437, -2334292, -468376, 1031342, 1638765, 780494, -1212643, -2765213, -2528236, -1065908, -279138, -1047629, -2413817, -3529291, -4993560, -6943920, -7376530, -4975797, -2540243, -3674962, -6045081, -3019212, 5972569, 12182034]
39673A2182034l160533o843962l58970N803249J840753o885337q654228k393570
39665h470564L305309M248117L754878L302324K08794m370325m430327R84790
39657a467004M630478J637763l249403l346588N64837L264711K983165J256872
39649F274831j398846m484203n078586j672297J743172O52086k662019k364365
39641h990227J419264K581001r68750l447686J83168O514803Q146575L064270
39633H502418l690541o269826l503512R97206K590437R9956k799858j893737J872808
39624d094649L500695J263369o61361J111178L566666K137770j590256k026387
39616C207025J573633L625136L52255n012831o942124m198123K46447L213139
$$ y = [12182034, 9021501, 2177539, 1818569, 7621818, 9462571, 2577234, -6076994, -8470564, -5165255, -917138, 2837740, 6140064, 6348858, 1978533, -2451794, -1467004, 3163474, 4801237, 1551834, -1794754, -1229917, 2034794, 5017959, 6274831, 4875985, 391782, -4686804, -6359101, -4615929, -3963843, -6625862, -8990227, -7570963, -4989962, -5958712, -9406398, -9223230, -2708427, 5438148, 8502418, 4811877, -1457949, -4961461, -3964255, -1373818, -1273862, -4073720, -5967457, -4094649, -593954, 669415, 8054, 1119232, 4685898, 6823668, 5233412, 3207025, 4780658, 8405794, 8758049, 3745218, -3196906, -7395029, -7148582, -3935443]
39608c935443L225606N84082k393474k756325k14329K312095K530188J249569
39600F01969j40031k019224m222681l972413N28350N891656O536008J667867l618847
39591A252654m387640p14167L592525M976801K579620j456059l709252k738733
39583f04251n34789L45846K24307J022960K360620J668429j512750l914379k462887
39574c406894J722174M586821L762471R18142n95448M1155J82366k250572m942854
39565A7361l785803R02001M056885K760269j38590j216963j406284k568561k956416
39556d336101o23215J700113N60214j638189q8553L810476M065432M7046k248717
39547A248506M6702K616606J853910K01957L62983K62239j961839l210386o76568
$$ y = [-3935443, -709837, -125755, -2519229, -5275554, -5489883, -3177788, -647600, 601969, 461938, -1557286, -5779967, -9752380, -9224030, -3332374, 3203634, 4871501, 1252654, -3134986, -3849153, -256628, 4720173, 7299793, 5843734, 2134482, -604251, -1139040, -793194, -568887, 454073, 2814693, 4483122, 2970372, -944007, -3406894, -1684720, 2902101, 6664572, 7582714, 6987266, 7028421, 7210787, 4960215, 17361, -3768442, -2866441, 1190444, 3950713, 3812123, 2595160, 1188876, -1379685, -4336101, -4959316, -3259203, -2698989, -4337178, -4425731, -615255, 3450177, 3497223, 1248506, 1295208, 3911814, 5765724, 5967681, 6330664, 6592903, 4631064, 1420678, 744110]
39538G44110K397246J653867r31022l09123L023384L613875l08283m197142l998469
39529A688443j335286k42401j550192k535546j058726J489365J799838r39438
39521b683943l288026j648203K586958M486226K216351p85803j065779N48605
39513C66386J341556N25340j089170k711459l241396j793200J17643k38986k178345
39504h901631j681160K200907N049439L674176Q81864L81941Q80334o60464l188075
39495a362669l457732j264122J309911L468102M702819L071981j278665l831979
39487A357646j682997J173388j35995l104738k029160K041189K989437o5396k090651
39478a547277j543490k103449l898598j683151N123527Q656592L837870l192023
$$ y = [744110, 3141356, 4795223, 3864201, 3555078, 6578462, 10192337, 9884054, 5686912, 1688443, 353157, 110756, -1439436, -3974982, -5033708, -3544343, -1744505, -2683943, -5971969, -7620172, -5033214, -546988, 1669363, 883560, -182219, 366386, 1707942, 2233282, 1144112, -1567347, -4808743, -6601943, -6484300, -6723286, -8901631, -10582791, -8381884, -3332445, 341731, 1223595, 1605536, 2485870, 1825406, -1362669, -4820401, -6084523, -4774612, -1306510, 3396309, 6468290, 5189625, 1357646, -325351, 848037, 712042, -2392696, -4421856, -2380667, 608770, 543374, -1547277, -3090767, -5194216, -9092814, -10775965, -5652438, 3004154, 6842024, 3650001]
39470C650001l931796K37689J550094j685563l581629p45045L083264L691814
39462B268829K117227J156982L50564k003082m376019l696983p17514M36799j237366
39453e700563j652623J568483M181939J538026k976515j848110M747075P950856
39445G808568K892124m264848n693499k499283o41451r14768M09465L610004M815040
39436E521352K413271j194235l730541m584236l281895n89104M12250j401566
39428f434704k068264J440615M903487K795747k088853k616028Q94871J663422
39420a509707j303538j661605K302689M054305L78266k738771o10547K039012
39412I50104m47040m873729m683541k16384L051539K841140R53254r95195j759546
$$ y = [3650001, -281795, -44106, 1505988, -179575, -3761204, -4506249, -1422985, 2268829, 4386056, 5543038, 5893602, 3890520, -485499, -4182482, -4899996, -4463197, -5700563, -7353186, -5784703, -1602764, -64738, -3041253, -4889363, -142288, 7808568, 10700692, 6435844, 742345, -1756938, -2398389, -3313157, -2903692, 706312, 5521352, 7934623, 6740388, 3009847, -1574389, -4856284, -5445388, -5033138, -6434704, -8502968, -7062353, -2158866, 636881, -1451972, -4068000, -3173129, -1509707, -2813245, -4474850, -2172161, 1882144, 2260410, -478361, -1088908, 950104, 503064, -4370665, -9054206, -9270590, -6219051, -3377911, -2424657, -3419852, -5179398]
39403e179398M09113M309243M982605Q28321k517336m25581K957174J326735l325565
39394C365311m165791p17216J184763o31745k358450j747030q43952n32651J001398
39385e445363L113858K337933r82042j753267J596910L708282P47689k964275
39377C59725j705634K290652K343833j832870l444270P28934N045439L221678
39369G007487k603850n327602k860470L54067J004401O98583J075537M77614j707163
39360a881396k134846R79246L552297J895771n38293R51726L158487O0114n141087
39351I02019l440890M302286O638551l62982n893942j497770N422724M247310
39343A0317306j802826k731378O57169n55662o379966p219637m14608N108927
$$ y = [-5179398, -4770285, -461042, 4521563, 5349884, 2832548, 2406967, 5364141, 6690876, 3365311, -800480, -1517696, -332933, -964678, -3323128, -5070158, -5914110, -6446761, -5445363, -2331505, 6428, -975614, -2728881, -1131971, 2576311, 3324000, 359725, -1345909, 944743, 3288576, 1455706, -1988564, -1259630, 3785809, 7007487, 4403637, -923965, -3784435, -3430368, -2425967, -1727384, -651847, -174233, -1881396, -4016242, -3036996, 515301, 2411072, 1872779, 2824505, 5982992, 6043106, 902019, -2538871, 1763415, 8401966, 8038984, 2145042, 647272, 6069996, 10317306, 8514480, 5783102, 6440271, 5884609, -495357, -7714994, -8129602, -3020675]
39335c020675L512701L95448J888846M616242K608350k556853n001615l459488
39327a017044j115543M37241J922212K902413J929931n86073k600485k947994
39319a075342j890446j72908J189332J404205J011992J088853J165280R9396r92508
39310A827854J64592K446357J680224k851511n995036l456446J997975M194333
39302H342J392390k633174m110764k909781r98006L96605J594322L317544M933332
39293I90810M285760N60069l103988k429907J973628M376032J400475l058857
39285D994022l149736P85819L022596P25884k469982k205377M21021R56151j602358
39276A478040l300406j126945K255902J990250k061983m977727l548109k41701
$$ y = [-3020675, 492026, 887474, 2776320, 7392562, 10000912, 7444059, 2442444, -1017044, -2132587, -1695346, 226866, 3129279, 5059210, 4473137, 1872652, -1075342, -2965788, -3138696, -1949364, -545159, 466833, 1555686, 2720966, 2820362, 1827854, 1992446, 4438803, 6119027, 3267516, -2727520, -6183966, -4185991, 8342, 1400732, -1232442, -5343206, -8252987, -9250993, -8854388, -7260066, -3942522, 990810, 5276570, 5836639, 2732651, 302744, 2276372, 6652404, 8052879, 4994022, 1844286, 2630105, 5652701, 6378585, 3908603, 1703226, 2124247, 3080398, 1478040, -1822366, -2949311, -693409, 1296841, -765142, -5742869, -9290978, -9532679]
39268i532679J040568L38287K96038J561037K541477K531448K093891J098680
39260A968747p30003j868942n53073J966483K572450O26799j529198k294224k220953
39251b061914j782205p10561K47841j27755r58521j78070J718984K025238L99112
39242a427851k79227J449021L353214L073488R88634j601104m165285n609130
39234d218240m304162r24629J518809J745813J455856J546696O47461j151530
39226c683926j131081J239410K307156O0166j818630M84112M469211M846483J230593
39217H003494k206170l278923l513537m073113m140244l286115j997198O1011
39209a4430795L220546N625368N107849K922189K178281K766172J684665j313480
$$ y = [-9532679, -8492111, -8153824, -7857786, -6296749, -3755272, -1223824, 870067, 1968747, 1238744, -630198, -1183271, 783212, 3355662, 3982461, 2453263, 159039, -2061914, -3844119, -4554680, -4306839, -4434594, -5393115, -5571185, -3852201, -1826963, -1427851, -1707078, -258057, 3095157, 6168645, 7157279, 5556175, 1390890, -4218240, -8522402, -9447031, -7928222, -6182409, -4726553, -3179857, -2532396, -3683926, -4815007, -3575597, -1268441, -1208275, -3026905, -2542793, 1926418, 6772901, 8003494, 5797324, 2518401, -995136, -5068249, -9208493, -12494608, -14491806, -14430795, -11210249, -5584881, -477032, 2445157, 4623438, 7389610, 9074275, 7760795]
39201G760795k665221q19319J014510J10022j485047q99708M75772k23841j702536
39192A565427m25508K645555K486746j855549m639153j699909K932879L004813
39184D015301n22006j702873K66776Q7342l689420n073712n58453L900290J732052
39175a544703l308199k636012L501839O382725K413592k175197j946124M57297
39167A145218J095959J556682L812801M171986j029951p461422p450018q78942
39159e037687M802547M844587J778464n11670j871698l324512l623469j112253
39151d055691K965876N185016L488206o61366l385598k014824J768154L320653
39143F610426N43353l339520l985712j405517R36502J223232P26592O70790N02581
$$ y = [7760795, 5095574, 4276255, 5290765, 5400787, 3915740, 3016032, 3491804, 3267963, 1565427, 1139919, 3785474, 6272220, 4416671, -222482, -1922391, 1010488, 4015301, 3493295, 1790422, 2057198, 2144540, -1544880, -6618592, -7177045, -3276755, -1544703, -4852902, -7488914, -3987075, 2395650, 4809242, 2634045, 687921, 1145218, 2241177, 3797859, 7610660, 11782646, 10752695, 3291273, -4158745, -5037687, -235140, 4609447, 6387911, 5876241, 4004543, 680031, -2943438, -4055691, -1089815, 4095201, 7583407, 6922041, 3536443, 1521619, 3289773, 6610426, 7153779, 3814259, -171453, -1576970, -640468, 582764, 1309356, 1980146, 2482727]
39134B482727l26937j059092q74745j10939L35077J17736j83261M09539J852088
39125B642193K261913J2238l133514l299611Q5702K772035J374571j939195k760234
39116a983902j41166L495117N772575M963577m9134o847246r250763m493002J690437
39107f843507K246100j064133r94546L124137M455152M98230k343609O89969M766026
39098D533819L216239k099683m303428k016809j02760j340383l065458k284680
39090g463143K61606K068477J975242N76265n25722K33266K445813L328008J078038
39081C977850k089499k499452l0836J935329J324914n81571k104238l284760m038733
39072g390996k801484J009693M702583M642457N56696l943773n178151k824686
$$ y = [2482727, 2155790, 1096698, 221953, 111014, 446091, 563827, 380566, 790105, 2642193, 4904106, 4916344, 1782830, -1516781, -1431079, 1340956, 2715527, 776332, -1983902, -2125068, 1370049, 7142624, 12106201, 12057067, 5209821, -4040942, -8533944, -6843507, -4597407, -5661540, -6656086, -3531949, 923203, 1421433, -922176, -232207, 4533819, 7750058, 5650375, 1346947, -669862, -772622, -2113005, -5178463, -7463143, -7201537, -5133060, -3157818, -2581553, -3107275, -2874009, -428196, 2899812, 3977850, 1888351, -611101, -641937, 1293392, 2618306, 2036735, -67503, -3352263, -7390996, -10192480, -9182787, -4480204, 162253, 718949, -3224824, -8402975, -11227661]
39064a1227661M74772K123090J799633J023637J036298J568446J741297J499746
39056C9258J420987J451134Q81107l26900j243487j367972j241472j041890J75219
39047a254016K554078L831749J710821k433550m506180k833533j16922P60196
39039b287357M82417R32828J274954m91953l196179l312289k60448K386818J881700
39030b589509l26293j425571r46183r8477M47790M56965m28461j634163j733426
39021h277328q23173p50524j641328q88261K340200M504927K694705l65148k82850
39012c488780J921799J448215k337787m592192k231012J961493L849344K833948
39004f34972N65804j854370l307912k195533R92536K859386J369617p94589K35815
$$ y = [-11227661, -10752889, -8629799, -6830166, -5806529, -4770231, -3201785, -1460488, 39258, 1460245, 2911379, 3792486, 3465586, 2222099, 854127, -387345, -1429235, -1254016, 1300062, 5131811, 6842632, 4409082, -97098, -2930631, -3047553, -2287357, -1804940, -872112, 402842, -89111, -3285290, -6597579, -6858027, -4471209, -2589509, -2915802, -4341373, -5287556, -5386033, -4938243, -4481278, -4909739, -6543902, -8277328, -9100501, -9851025, -11492353, -12380614, -10040414, -5535487, -2840782, -3205930, -3488780, -1566981, -118766, -2456553, -7048745, -9279757, -7318264, -3468920, -634972, -69168, -1923538, -5231450, -7426983, -6434447, -3575061, -2205444, -3000033, -2764218]
38995b764218L846027N615903L335260k98906j635547p20357n14417k294157l682110
38986H87478k013996J559106L173380J326079j370650k263626j962054j780020
38978b444303n67075K605481M578955J514198m297706n951542j281564L880302
38970a963254L898668O50324n43237J007135J582183l00703j820939o08543J675682
38961C577316J653204j483737m860135m649502r3665M890253N150161J81559m709556
38952c44102m460711j55595L042175K735898J329231J344976J807943P64476q37921
38943E226370l83771J906036K398780r72138n038214m880201m01754L149640J940754
38934B945502j664126k992692j664983j100372k301345k148904J071662M079557
$$ y = [-2764218, 1081809, 6697712, 10032972, 9734066, 8098519, 7378162, 6863745, 4569588, 887478, -1126518, 432588, 3605968, 4932047, 3561397, 1297771, -664283, -2444303, -3011378, -405897, 4173058, 5687256, 1389550, -4561992, -5843556, -1963254, 1935414, 2585738, 2042501, 3049636, 4631819, 4331116, 2510177, 1901634, 3577316, 5230520, 3746783, -1113352, -5762854, -5856519, -966266, 4183895, 4365454, -344102, -4804813, -4960408, -1918233, 817665, 2146896, 3491872, 5299815, 6064291, 5226370, 4842599, 6748635, 9147415, 8175277, 3137063, -1743138, -2144892, 1004748, 2945502, 1281376, -1711316, -3376299, -4476671, -6778016, -8926920, -7855258, -3775701]
38926c775701L182601Q8907l98061K301713L373704j89669m553982m090216M07783
38917c652921K620713o0711k743084q70063K398603J480924j880549j090157L730545
38908f6700M804959n47324m622068j690021K214064n29799n677834l999906K530391
38899g584238L345935k870483n357060J375108Q840949Q101567K208616j179688
38891F880706j451649k056602k440591p16698N37550j392169l271979j274186
38883e185618J416206k08353l622325k706519J513972K670679J87429k30555K799450
38874c365634L961444Q84840j855481r30915O08964k83363j227334O00269K829658
38865A222448J637082k006674l765061j892400J076407J688210p92278l333222
$$ y = [-3775701, -593100, -504193, -902254, 1399459, 4773163, 4583494, 29512, -4060704, -3652921, -1032208, -1092919, -3836003, -4706066, -2307463, -826539, -2707088, -3797245, -66700, 4738259, 4190935, -431133, -2121154, 92910, -436889, -6114723, -10114629, -7584238, -4238303, -7108786, -12465846, -11090738, -2249789, 5851778, 8060394, 6880706, 5429057, 3372455, 931864, 215166, 752716, -639453, -3911432, -5185618, -3769412, -3977765, -7600090, -10306609, -8792637, -6121958, -5934529, -6165084, -3365634, 595810, 1480650, -374831, -1305746, -696782, -980145, -2207479, -1607210, 1222448, 2859530, 852856, -2912205, -4804605, -3728198, -2039988, -2832266, -6165488]
38857f165488j816972L699718P486417M677094j936982n443834l947675j328029
38849d775751K33278K275907M241532K541085k407347m607914j158638L138301
38841e19547L363989J255490L37288l58016k615130l779412j145443J940167O37741
38832h82873l177690l517045M21338L588995L072677J144321L23321L59449M98212
38823A830705N34796m91452k722638l043354J287136O877321P206224J740894
38815A3219632l307135m226248l885625m586653l289071J802396N403669K090631
38807C221596m279271m984779Q80308N007363K027548l277666l846142l58278
38799e609321J235492p63880k187724l79226J827342J015083j569604k165363
$$ y = [-6165488, -7982460, -4282742, 3203675, 7880769, 5943787, 499953, -3447722, -4775751, -4542473, -2266566, 1974966, 4516051, 2108704, -2499210, -3657848, -519547, 2844442, 4099932, 4437220, 4079204, 1464074, -2315338, -3460781, -1520614, -882873, -4060563, -7577608, -7156270, -3567275, -494598, 649723, 973044, 1332493, 1830705, 2365501, 1874049, -848589, -3891943, -2604807, 4272514, 11478738, 13219632, 9912497, 5686249, 1800624, -2786029, -6075100, -4272704, 1130965, 3221596, -1057675, -6042454, -5162146, -154783, 1872765, -1404901, -5251043, -5609321, -4373829, -5137709, -7325433, -7704659, -5877317, -4862234, -6431838, -8597201]
38791h597201K25976L150563M115045K676097M2171j632344n33452K381879L307410
38782E136144Q5905m251239m984503j876057J118481J717628J456356J919467
38774C22182K374776J866230N90674j376987l693083m000821m51989L773997L271574
38765B676553j324775l379121l93571K117600J58978j902708P77387M712965L955389
38756G398697J31438j030174K56230n44941l009512k710733j85637j59047k175013
38747b028692j031859K904753L259618p69833k079985J937984M341970P62334
38739G296290k695316j70038L640205J863578k749877l413374j274122k041551
38731D55795m421496k246785L546005N199087O21829l568342k906912o97442m32041
$$ y = [-8597201, -8371225, -5220662, -1105617, 1570480, 1612651, -19693, -553145, 1828734, 5136144, 5222049, 970810, -4013693, -5889750, -4771269, -3053641, -1597285, 322182, 2696958, 4563188, 5153862, 3776875, 83792, -3917029, -4369018, -595021, 2676553, 1351778, -2027343, -2420914, -303314, -144336, -2047044, -1269657, 3443308, 7398697, 7530135, 6499961, 6756191, 6211250, 3201738, 491005, 305368, 146321, -2028692, -3060551, -155798, 3103820, 2333987, 254002, 2191986, 6533956, 7296290, 4600974, 4430936, 8071141, 9934719, 7184842, 3771468, 2497346, 455795, -3965701, -6212486, -2666481, 2532606, 3154435, -413907, -3320819, -4018261, -4450302]
38722d450302j48783K136248L572162J290988k327484l179761j154479R25570
38714c335841J692339J819845J894959J757796J018034n46990k181295k273847
38706a55000q44980l68086j614043j118490L113989O133812K431150m178497m918374
38697a518519K85683K668937o41686j975650K990388O904473K944943l466544
38689H192025l698547L80048J339078o46852j47412J757632o02107n427391m771037
38680c624563J575454M494643J72022l890927j468884K922169K678241l16487
38672B541668m22120J892571J863476j157624l326406k645298p58924N51975R50034
38663e10648N46835K7642M75084J120967n00824m087380n229878j419968L559569
$$ y = [-4450302, -4599085, -2462837, 1109325, 2400313, 72829, -3106932, -4261411, -3335841, -1643502, 176343, 2071302, 3829098, 4847132, 4300142, 2118847, -155000, -999980, -1368066, -2982109, -4100599, -986610, 5147202, 7578352, 3399855, -1518519, -1232836, 1436101, 794415, -1181235, 1809153, 8713626, 11658569, 8192025, 4493478, 4873526, 6212604, 5565752, 5418340, 7175972, 6573865, 1146474, -3624563, -2049109, 2445534, 2617556, -1273371, -2742255, 179914, 2858155, 2541668, 2119548, 4012119, 5875595, 4717971, 1391565, -1253733, -2012657, -1460682, -510648, 36187, 63829, 538913, 1659880, 1159056, -2928324, -8158202, -9578170, -6018601]
38654f018601M757156K878921J946137K412939J352962j695746l788466l300454
38646a455152j601114N5714J670897K330846N30045k524513l086315L32596M581950
38637H34954N523727K559906j295607k755319j214389R40285J088974k86145l48580
38628E047806J318705J232409k442065n510040k941059L004389M760340j90294
38620D280191n687126n247779j20520L520518K580669o45873k545702j896654
38612e762276o6216P11375m85120j895559o64696L282864O046514L984648j357131
38603C794403m340802j751513L134934M381654Q40822k332236p30447K898321
38595E895136K407039k532885n501822k716830J507785J815153j08795M46602
$$ y = [-6018601, -1261445, 1617476, 3563613, 5976552, 7329514, 5633768, 1845302, -1455152, -3056266, -3000552, -1329655, 1001191, 1531236, -993277, -4079592, -3746996, 834954, 6358681, 8918587, 7622980, 4867661, 3653272, 4593557, 5682531, 5396386, 5047806, 6366511, 7598920, 5156855, -353185, -3294244, -289855, 4470485, 4280191, -1406935, -6654714, -6775234, -3254716, -674047, -1319920, -3865622, -5762276, -5828492, -5117117, -5602237, -7497796, -8162492, -4879628, 1166886, 5151534, 3794403, -546399, -2297912, 837022, 5218676, 6059498, 3727262, 2996815, 5895136, 8302175, 5769290, 267468, -2449362, -941577, 873576, 764781, 1211383]
38587A211383K375282N93779m451756o261232k221108K475825L096071J560094
38579a621662J072608J73831k994079m901601j261765M937372O376275J893232
38571C674211j836409j40914L283572K434916k274033n008003k677864J354756
38563a189768K084231r51040l649821k651983Q10621K757402J320256j221753
38555b691855j379233J267844L428395J980391j905759l617635p97975L055692
38547f60135K812214j060548k838368O7541L042975J276045k814261l494231m95165
38538d163933J509501R63869J022307K853017L276758P42138j583674j165388
38530C454595j13171j059392k798479k926751j607842j1336J949598L721106L011051
$$ y = [1211383, 3586665, 4180444, -271312, -6532544, -8753652, -6277827, -3181756, -1621662, -549054, -375223, -3369302, -8270903, -9532668, -4595296, 1780979, 3674211, 1837802, 1696888, 4980460, 7415376, 5141343, 133340, -2544524, -1189768, 894463, -56577, -3706398, -6358381, -5547760, -2790358, -1470102, -2691855, -4071088, -2803244, 625151, 2605542, 699783, -2917852, -3715827, -660135, 2152079, 1091531, -1746837, -1679296, 1363679, 2639724, -174537, -3668768, -4163933, -2654432, -1690563, -668256, 2184761, 5461519, 6203657, 4619983, 3454595, 3341424, 2282032, -516447, -3443198, -5051040, -5062376, -3112778, 608328, 3619379]
38521C619379o37208l890350l782768j273769J245643K786479K376808r19364
38513d75150m301501k543444L793232O937519K946337j770451p02558K075221
38505E959205o40273o179030o301018j352575P01485j620739j357330L576997
38497g213278O023727J969992k391868r96860K767544K810530j75178j980338
38489H14271k281644k774895k264769M83698K474430O85369k302510k178020R1889
38480g252181L70220j509007j880626O26580L569604M464131K573013j624899
38472f63165n414521m474767J482655N994564L483540k429696l723003M29241
38464e315152L246151J283032j133114j13008J499748m15822m149463m821486
$$ y = [3619379, 2982171, -908179, -4690947, -5964716, -4719073, -1932594, 444214, -475150, -4776651, -7320095, -3526863, 3410656, 6356993, 4586542, 3883984, 5959205, 5318932, -860098, -7161116, -8513691, -7812206, -9432945, -10790275, -7213278, -1189551, 780441, -1611427, -2608287, 159257, 2969787, 2794609, 814271, -1467373, -4242268, -6507037, -6023339, -3548909, -2863540, -5166050, -7344070, -7252181, -6881961, -8390968, -10271594, -9645014, -6075410, -1611279, 961734, -663165, -6077686, -10552453, -9069798, -3075234, 408306, -2021390, -5744393, -5315152, -2069001, -785969, -1919083, -2032091, -532343, -948165, -5097628, -9919114]
38456i919114j456041K530236M368788M054745K288227m80605k859017k998964
38448d471745j120231K41286l94071j167186L97247L117598L063898n73581l198259
38439d105044q49367L441981L311816j461383m015764l12581M820823M676504
38431E506985k24471m161640m392909k500780L48647M017722O061350L412571
38423H067475j969650m161230j368693J513151L14422k647438k934314o14152
38415c800429R41468N98498J69124N77478N41385p94120k152062j707534O74675
38406d951517L194111L779690K044112l63804j550667j131280K71216K220706
38398C512567L788533K878267j251409n327026n050669j036382J545027J70176
$$ y = [-9919114, -11375155, -8844919, -4476131, -421386, 1866841, 1386236, -1472781, -4471745, -5591976, -5350690, -5744761, -6911947, -6514700, -3397102, -333204, -906785, -4105044, -4954411, -1512430, 1799386, 338003, -3677761, -3990342, 830481, 5506985, 5282514, 1120874, -3272035, -5772815, -5424168, -1406446, 4654904, 8067475, 6097825, 1936595, 567902, 2081053, 2395475, -251963, -3186277, -3800429, -2858961, -2260463, -2091339, -1513861, -972476, -1766596, -3918658, -5626192, -4951517, -1757406, 2022284, 4066396, 3702592, 2151925, 1020645, 1291861, 3512567, 7301100, 10179367, 8927958, 3600932, -1449737, -2486119, -941092, -770916]
38390g70916j750277o16839J909801K250892P73634L17213P21120o15372l247537
38381a028281l360547K34423L737204L653644J207419o12298j492876k465103
38373a26415k460441N3970L051413K623605r93255k915217n60105K422348J709273
38364B805176j207772j872403k40914l36952k778337k962632J409519N636454
38356D52139M381964m91482k793836q60815J144852K90919j426042j362721k19626
38347h84648J55040m0266J66705K33143n05827o85455J290538M050085M322320
38338H101635J271477k244328l296080k212763j360223j703304k012228j252441
38330d708255k43418j97191o68153l35116N83035L66585j458992k996521k357258
$$ y = [-770916, -2521193, -3138032, -1228231, 1022661, 1796295, 2113508, 2834628, 2219256, -1028281, -4388828, -4154405, -417201, 3236443, 4443862, 3831564, 2338688, -126415, -2586856, -2532886, 518527, 3142132, 2148877, -766340, -1326445, 1095903, 2805176, 1597404, -274999, -515913, -852865, -3631202, -6593834, -5184315, 452139, 4834103, 4342621, 1548785, 687970, 1832822, 2123741, 697699, -665022, -884648, -729608, -769874, -603169, -370026, -875853, -1561308, -270770, 3779315, 8101635, 9373112, 7128784, 3832704, 1619941, 259718, -1443586, -3455814, -4708255, -4951673, -5148864, -5817017, -6152133, -5569098, -5202513, -6661505, -9658026, -12015284]
38321a2015284J14891K747079M260294L750729Q19269k679126k822635J926295
38313c898488P395034P515805J442745n266815o794156k749111K387021M079693
38305D111728J793165r55976p58649J377678J394666j709100l987700k588036
38297a322224l87597j159936l017070j525932K490324L935078J627144l57669
38289B82118L3933J41691j344301j432694J366318L324037J080053k897350l919428
38280c365623j229373K329852M085176K636805j732593n470410m043701J668647
38272e121220N064779K741867o19151n8152J683197m60284m280524l144757L082868
38263a111377O975579L943178j997436m358793j864887J688442K306724q42680
$$ y = [-12015284, -11900393, -9153314, -4893020, -1142291, -323022, -3002148, -5824783, -3898488, 3496546, 11012351, 12455096, 7188281, 394125, -2354986, 32035, 4111728, 5904893, 4948917, 4190268, 5567946, 6962612, 5253512, 1265812, -1322224, -1709821, -2869757, -5886827, -7412759, -4922435, -987357, 639787, 282118, 316051, 457742, -886559, -2319253, -952935, 2371102, 3451155, 553805, -3365623, -4594996, -2265144, 1820032, 4456837, 2724244, -2746166, -6789867, -5121220, -56441, 2685426, 2066275, 2008123, 3691320, 3231036, -1049488, -4194245, -1111377, 5864202, 9807380, 7809944, 3451151, 1586264, 3274706, 5581430, 4738750]
38255D738750n039015o337064l519801O53819L142114L877638L738067J956219
38247C210727j427032l080346m68026L333034L292816k96493k649373j711920
38239B03387Q040L55219k26872j140456k010830r61756K980907O159084L963527
38230I330250j823876m740600k981609j131626j626677j070283K418697M548005
38222B922281J772102k099901j296812L137188M972344J514199l626031n901500
38214A393870m669366k525024j809948k200452j421432J327932L540617K784667
38206c579136Q15531J135408L135386K933720K05451q17767J481323L028015O88518
38197I026449k599647k672512l42454Q84035K56399o88890j581217k650643k611271
$$ y = [4738750, -300265, -6637329, -10157130, -9503311, -6361197, -2483559, 1254508, 3210727, 1783695, -1296651, -1764677, 1568357, 4861173, 4564680, 1915307, 203387, 211427, 566646, 339774, -800682, -2811512, -3773268, -792361, 5366723, 9330250, 7506374, 2765774, -215835, -1347461, -2974138, -4044421, -1625724, 2922281, 4694383, 2594482, 1297670, 4434858, 9407202, 10921401, 7295370, 1393870, -3275496, -5800520, -7610468, -9810920, -11232352, -9904420, -6363803, -3579136, -2763605, -1628197, 1507189, 4440909, 4646360, 3828593, 5309916, 8337931, 9026449, 6426802, 3754290, 3411836, 4295871, 4552270, 3863380, 2282163, -368480, -2979751]
38188b979751m03702K244942K614295L11015k816921m581303l313779P91400M276390
38179c857414L412540l93556j846297M75100K134519L18008j924308j532187j09175
38170c322770N65815K047075M257862L093711j940861l972996R21590N706594
38162G356020K565836m368340n727467j795803l7033r26454J704872P047599O546297
38153A2365527j407345p448574n351336n7667K366301L067950L763441J167881
38145H466178n353392q591494l509992L830528M907655J003462q29313N18385
38137D42017Q50301k00740O79539K630276J087958l750086o127099l581373m81825
38128h451032p44052k053892k06086M112113O000412K707435k759176m841753
$$ y = [-2979751, -3383453, -1138511, 1475784, 1786799, -1030122, -5611425, -8925204, -8133804, -3857414, -444874, -838430, -2684727, -2209627, -75108, 242900, -1681408, -3213595, -3322770, -2756955, -709880, 3547982, 6641693, 4700832, 727836, 1649426, 7356020, 9921856, 5553516, -173951, -1969754, -2006787, -2933241, -1228369, 5819230, 12365527, 10958182, 3509608, -1841728, -1899395, 466906, 3534856, 7298297, 8466178, 3112786, -5478708, -8988700, -5158172, -250517, 752945, -76368, 442017, 1292318, 1091578, 1771117, 4401393, 5489351, 1739265, -4387834, -7969207, -8451032, -9195084, -11248976, -11455062, -7342949, -1342537, 1364898, -1394278, -6236031]
38120f236031j903541J644129J185420j377950m66626L814195M803878r5965m178402
38111b810893j499465L370239K463253k771606m043376L51638L473101J347842
38103a19267j754769j664839m48771q92002j086848J360624M479247N323622M428996
38094I625993L293259J046114k626476m585739k392583J243260K107897L38413
38086H050138j096871j451953j679427j020349J303783K650223J71624l551759
38078C375409l337450M79234K244834k10387k670919j960517n39097q70112n77013
38069d066018K547631N117411L052824j170915k009794L09723P07475j659103
38061B829234k012962J164007K560363j377057n840193m518132P33938K734578
$$ y = [-6236031, -8139572, -6495443, -5310023, -6687973, -7154599, -3340404, 1463474, 1367509, -2810893, -4310358, -940119, 1523134, -1248472, -5291848, -4940210, -1467109, -119267, -1874036, -3538875, -3987646, -4879648, -5966496, -4605872, -126625, 5196997, 9625993, 12919252, 13965366, 11338890, 6753151, 4360568, 5603828, 7711725, 8050138, 6953267, 5501314, 3821887, 2801538, 4105321, 6755544, 6927168, 3375409, 37959, 517193, 2762027, 2551640, -119279, -2079796, -2618893, -3489005, -4066018, -1518387, 3599024, 6651848, 5480933, 3471139, 3780862, 4488337, 2829234, 816272, 1980279, 4540642, 3163585, -2676608, -7194740, -6460802, -3726224]
38053c726224m14917l266348j470266K725495M622318K883931m29447k732514
38045a807972k174777J552812N886085O712811K769420k562086n079366l997086
38037A299841j311320J235812K843613K803680J145775m76074l06045J387748
38029H623030K924659L368630K799184J104246j854506n005341o411921n139140
38021D08841k082954R79142K652515K626352J703607Q45977O7093r61594j390806
38012D848173o3025J772123J112411k182572m188243k494139j24464n88685j718854
38003c627275P68276N275852N868347J714696j411529n44448J33376k453889m156811
37994A566595j107340K073845j054159p293775p581120j136945L192895J098714
$$ y = [-3726224, -4141141, -7407489, -8877755, -6152260, -1529942, 1353989, 924542, -1807972, -3982749, -2429937, 3456148, 10168959, 12938379, 10376293, 5296927, 1299841, -11479, 1224333, 4067946, 6871626, 8017401, 7541327, 7235282, 8623030, 11547689, 14916319, 17715503, 18819749, 16965243, 11959902, 5547981, 408841, -1674113, -694971, 1957544, 4583896, 6287503, 7133480, 7200573, 6238979, 4848173, 4785148, 6557271, 7669682, 5487110, 1298867, -1195272, -1319736, -1908421, -3627275, -2858999, 2416853, 8285200, 9999896, 8588367, 8043919, 8177295, 5723406, 1566595, 459255, 2533100, 1478941, -5814834, -13395954, -14532899, -11340004, -10241290]
37986a0241290p08946L645004Q757970O290095j491948m768017o04825L718419
37978D596462K181515k254870l700217j658959J31295k79643j677076k509754
37970e171247k340192j318512N6323J206300K189331L171664L193451J364896
37962B352014o67606j98221K027061K091976r25345k684954M7755M085545M257990
37953A0386215N81818k772017l653420l035127j493477J038050K853683K152134
37945F057859O92575J499643L285686J916550k464811n064639m106089l227088
37937a410314m220993l304537J655473N525453K941791k723458l635326J155283
37929d016628M867915L168062p37981k335017j889088j709526j218218J594993
$$ y = [-10241290, -10950236, -7305232, 1452738, 7742833, 6250885, 1482868, 878043, 4596462, 6777977, 4523107, 822890, -836069, -704774, -984417, -2661493, -5171247, -7511439, -8829951, -8773628, -7567328, -5377997, -2206333, 987118, 2352014, 1684408, 1486187, 3513248, 5605224, 4679879, 1994925, 2042680, 6128225, 10386215, 10968033, 8196016, 4542596, 1507469, 13992, 1052042, 3905725, 6057859, 6750434, 8250077, 11535763, 13452313, 10987502, 5922863, 1816774, -1410314, -5631307, -8935844, -7280371, -1754918, 1186873, -1536585, -5171911, -4016628, 851287, 4019349, 3281368, 946351, -942737, -2652263, -3870481, -2275488]
37921b275488N570823O672654L003185k502844n142331l398863j44665J017670
37913B800141j79256j162173o44816l18974j625594k913249j861960O34689J656217
37904c614975P63038M77817K036254L451886K856913J348400P86002N70552j076045
37895G599842l427908l356909L19656M369025M493791O02328k883595k495875
37887E220355k3388K70509k130303l260368p29860K429236K149668o51601j635798
37878A638450N03764K751760K787098J528720r6226l007230o520492o552900p84502
37869g751558O402144Q009171K897920l082397m376041j140649K836531M510489
37861H305610K873983j245959m934544m872482j210596J821210R65826j960352
$$ y = [-2275488, 3295335, 9967989, 12971174, 10468330, 5325999, 1927136, 1782471, 2800141, 2620885, 1458712, 813896, 494922, -1130672, -4043921, -5905881, -5271192, -3614975, -2851937, -2374120, -337866, 3114020, 5970933, 7319333, 8105335, 8675887, 7599842, 4171934, 815025, 1134681, 5503706, 9997497, 10599825, 7716230, 5220355, 5196967, 5467476, 3337173, 76805, -653055, 1776181, 3925849, 3274248, 1638450, 2142214, 4893974, 7681072, 9209792, 9113566, 6106336, -414156, -6967056, -7751558, -1349414, 6659757, 9557677, 6475280, 2099239, 958590, 3795121, 8305610, 11179593, 9933634, 4999090, 126608, -1083988, 737222, 1703048, -257304]
37853b57304k981261j335715O52149J753812K592121K718916N94035k912894m343673
37844c519814k277633O81223J947945K115750K295848J446001q44002j735767
37836A09551Q30579L480416J395290l878063n674122j842486J916534M94650l272192
37827f439843l321515O55860L574854L056534K316585M119131N937595L770855
37819A3670056j554046n150029m496405j984762n10113M42020K334749L614760
37811F366230J562410k741537m891514l002191J10163J411950J129663N48579
37803D93753k34663n61556J181012L755906K746838k549046n852062k224412L847925
37794F03695M553012J27893k785307k271489k525751m349725l046096K201604
$$ y = [-257304, -3238565, -4574280, -3922131, -2168319, 423802, 3142718, 3736753, 823859, -3519814, -5797447, -5116224, -3168279, -1052529, 1243319, 2689320, 1845318, 109551, 940130, 4420546, 5815836, 1937773, -3736349, -5578835, -3662301, -3167651, -6439843, -9761358, -9105498, -5530644, -2474110, -157525, 3961606, 9899201, 13670056, 12116010, 6965981, 2469576, 484814, -25299, 416721, 2751470, 6366230, 7928640, 5187103, 295589, -2706602, -2596439, -1184489, -54826, 493753, 259090, -302466, 878546, 4634452, 7381290, 4832244, -1019818, -3244230, 603695, 5156707, 5284600, 2499293, 227804, -2297947, -6647672, -9693768, -7492164]
37786g492164N076427J934932k158682j613276J610220K933133K570831K569052
37778E430473J397146k380239n025375k673612J508279J572493k063808l960672
37770f195315k319475M7763K076505N045474P167012M426066k120003n954086
37762B173941l896249j45127O39224m37463j01622J200268Q27007q92927q88562
37753a521510J680611L694643K277406r64691j755657Q95418K787805K99244l886501
37744C506768m308469j006090O36522j144575j496459K535777O230295M371531
37736I325300m35591k045395P2007J552873M25551j744232l763925m671983k066421
37727c351816L967244P699139M450736j843149m014093k170481j747020l280260
$$ y = [-7492164, -2415737, -480805, -2639487, -4252763, -2642543, 290590, 2861421, 5430473, 6827619, 4447380, -577995, -3251607, -1743328, -170835, -2234643, -6195315, -8514790, -8467027, -6390522, -1345048, 5821964, 10248030, 8128027, 2173941, -1722308, -1867435, -1228211, -1665674, -1767296, -567028, 259979, -632948, -1521510, 159101, 3853744, 6131150, 5166459, 3410802, 4306220, 7094025, 7393269, 3506768, -801701, -1807791, -1171269, -2315844, -3812303, -1276526, 4953769, 9325300, 8889709, 6844314, 6916321, 8469194, 8894745, 7150513, 3386588, -1285395, -3351816, 615428, 8314567, 12765303, 10922154, 6908061, 4737580, 2990560, -289700]
37719b89700k402709J018686K346216P47599m3194K20940j869673m883755l143378
37710h298968K662505M968800J780485j39707K304095L240987m19629k423451
37702C675117J154896L600590q07270n666475k795890L433201L035092l378288
37694B250973o560366l731973o90261j38707J494695N038468N856591K201751
37686E721171j321178j117143N46454K51961j888696m053189n129505m138514
37678a1128639r06739K085345K060818J79811l02446M04792m94812k155192k32785
37669a0489847N503708Q899666N374936j635057n183767l299986r8388L43517
37661e85218j378425j790888M32140K704362K329683N26044L19810J401214Q59659
$$ y = [-289700, -2692409, -1673723, 672493, 1420092, 1376898, 1597838, -271835, -5155590, -8298968, -5636463, -667663, 1112822, 973115, 3277210, 6518197, 6098568, 3675117, 4830013, 8430603, 7623333, 1956858, -839032, 2594169, 5629261, 2250973, -4309393, -8041366, -8731627, -8870334, -7375639, -2337171, 3519420, 5721171, 4399993, 3282850, 3829304, 4081265, 2192569, -1860620, -6990125, -11128639, -12035378, -9950033, -7889215, -7709404, -8011850, -7607058, -8101870, -10257062, -10489847, -4986139, 3913527, 9288463, 7653406, 2469639, -830347, -928735, -585218, -1963643, -3754531, -3322391, -618029, 1711654, 2237698, 2557508, 3958722, 4818381]
37652D818381j041512q36846J284655N92819l548594m807114k06223L452873J75505
$$ y = [4818381, 3776869, 2940023, 4224678, 4817497, 1268903, -3538211, -3744434, -291561, -116056]
$$ [...]
##END NTUPLES=NMR SPECTRUM
##END=
