##TITLE=31Pdec_69-2024
 CDCl3, 64 sc
 3.9.2024
##JCAMPDX= 6.0         $$ Bruker NMR JCAMP-DX V2.0
##DATA TYPE= NMR SPECTRUM
##DATA CLASS= NTUPLES
##ORIGIN= UXNMR, Bruker Analytische Messtechnik GmbH
##OWNER= root
$$ XWIN-NMR		Version 3.5
$$ Tue Sep  3 14:22:27 2024 Russian Standard Time (UT+4h)  she@DPX200
##.OBSERVE FREQUENCY= 81.013821
##.OBSERVE NUCLEUS= ^31P
##.ACQUISITION MODE= SIMULTANEOUS
##.ACQUISITION SCHEME= undefined
##.AVERAGES= 64
##.DIGITISER RES= 17
##SPECTROMETER/DATA SYSTEM= spect
##.PULSE SEQUENCE= zgpg30
##.SOLVENT NAME= CDCl3
##.SHIFT REFERENCE= (INTERNAL, CDCl3, 0, 198.062)
##AUDIT TRAIL= $$ (NUMBER, WHEN, WHO, WHERE, WHAT)
$$ ##TITLE= Audit trail, XWIN-NMR		Version 3.5
$$ ##JCAMPDX= 5.01
$$ ##ORIGIN= Bruker BioSpin GmbH
$$ ##OWNER= she
$$ F:/spectra/data/she/nmr/P31/2/pdata/1/auditp.txt
$$ ##AUDIT TRAIL=  $$ (NUMBER, WHEN, WHO, WHERE, WHAT)
(   1,<2024-09-03 14:21:29.12 +0400>,<she>,<DPX200>,
      <continue with go, POWCHK disabled, PULCHK disabled
       configuration hash MD5:
       00 E9 B6 7A A2 85 ED C7 34 08 36 98 17 FE 4E 26
       data hash MD5: 32K
       42 57 55 93 E4 52 21 CC D8 CF 11 3C B4 03 29 63>)
(   2,<2024-09-03 14:21:31.17 +0400>,<she>,<DPX200>,
      <Start of raw data processing
       efp BC_mod = 2 LB = 1.5 FT_mod = 6 PKNL = 1 PHC0 = 2750.073 PHC1 = -26.71252 SI = 64K 
       data hash MD5: 64K
       11 1E AC 58 A0 3E C8 45 FE 8D 40 84 F3 8C D7 B2>)
(   3,<2024-09-03 14:21:56.98 +0400>,<she>,<DPX200>,
      <pk PHC0 = 0 PHC1 = 0 
       data hash MD5: 64K
       11 1E AC 58 A0 3E C8 45 FE 8D 40 84 F3 8C D7 B2>)
$$ ##END=
$$ 
$$ hash MD5
$$ DF 85 31 0B 62 58 52 07 06 5C 09 00 34 90 7E 95
##$RELAX= 
##$RELAX= 
##$RELAX= 
##$RELAX= 
##$RELAX= 
##$RELAX= 
##$RELAX= 
##$RELAX= 
$$ Bruker specific parameters
$$ --------------------------
##$DU= <F:/spectra>
##$EXPNO= 2
##$NAME= <P31>
##$PROCNO= 1
##$TYPE= <nmr>
##$USER= <she>
##$AMP= (0..31)
100 100 100 100 100 100 100 100 100 100 100 100 100 100 100 100 100 100 
100 100 100 100 100 100 100 100 100 100 100 100 100 100 
##$AQSEQ= 0
##$AQ_mod= 1
##$AUNM= <au_zg>
##$AUTOPOS= <>
##$BF1= 81.014009
##$BF2= 200.13
##$BF3= 200.13
##$BF4= 200.13
##$BF5= 200.13
##$BF6= 200.13
##$BF7= 200.13
##$BF8= 200.13
##$BYTORDA= 1
##$CFDGTYP= 0
##$CFRGTYP= 5
##$CHEMSTR= <none>
##$CNST= (0..31)
1 1 145 1 1 1 1 1 1 1 1 1 1 1 1 1 1 1 1 1 1 1 1 1 1 1 1 1 1 1 1 1 
##$CPDPRG= <waltz16>
##$CPDPRG1= <>
##$CPDPRG2= <waltz16>
##$CPDPRG3= <>
##$CPDPRG4= <mlev>
##$CPDPRG5= <mlev>
##$CPDPRG6= <mlev>
##$CPDPRG7= <mlev>
##$CPDPRG8= <mlev>
##$CPDPRGB= <>
##$CPDPRGT= <>
##$D= (0..31)
0 1 0 0 0 0 0 0 0 0.06 0 0.03 2e-05 3e-06 0 0 0.0002 0 0 0 0 0 0 0 0 0 
0 0 0 0 0 0 
##$DATE= 1725358754
##$DBL= (0..7)
120 120 120 11 120 120 24 19 
##$DBP= (0..7)
150 150 150 150 150 150 150 150 
##$DBP07= 0
##$DBPNAM0= <>
##$DBPNAM1= <>
##$DBPNAM2= <>
##$DBPNAM3= <>
##$DBPNAM4= <>
##$DBPNAM5= <>
##$DBPNAM6= <>
##$DBPNAM7= <>
##$DBPOAL= (0..7)
0.5 0.5 0.5 0.5 0.5 0.5 0.5 0.5 
##$DBPOFFS= (0..7)
$$ [...]
##$SUBNAM3= <"">
##$SUBNAM4= <"">
##$SUBNAM5= <"">
##$SUBNAM6= <"">
##$SUBNAM7= <"">
##$SUBNAM8= <"">
##$SUBNAM9= <"">
##$SW= 400.765351723535
##$SWIBOX= (0..15)
0 1 3 0 0 0 0 0 0 0 0 0 0 0 0 0 
##$SW_h= 32467.5324675325
##$TD= 32768
##$TD0= 1
##$TE= 0
##$TE2= 300
##$TE3= 300
##$TEG= 300
##$TL= (0..7)
0 120 53 12 22 120 120 120 
##$TP= (0..7)
150 150 150 150 150 150 150 150 
##$TP07= 0
##$TPNAME0= <>
##$TPNAME1= <>
##$TPNAME2= <>
##$TPNAME3= <>
##$TPNAME4= <>
##$TPNAME5= <>
##$TPNAME6= <>
##$TPNAME7= <>
##$TPOAL= (0..7)
0.5 0.5 0.5 0.5 0.5 0.5 0.5 0.5 
##$TPOFFS= (0..7)
0 0 0 0 0 0 0 0 
##$TUNHIN= 0
##$TUNHOUT= 0
##$TUNXOUT= 0
##$USERA1= <user>
##$USERA2= <user>
##$USERA3= <user>
##$USERA4= <user>
##$USERA5= <user>
##$V9= 5
##$VALIST= <valist>
##$VCLIST= <CCCCCCCCCCCCCCC>
##$VD= 0
##$VDLIST= <DDDDDDDDDDDDDDD>
##$VPLIST= <PPPPPPPPPPPPPPP>
##$VTLIST= <TTTTTTTTTTTTTTT>
##$WBST= 1024
##$WBSW= 4
##$XGAIN= (0..3)
0 0 0 0 
##$XL= 0
##$YL= 0
##$YMAX_a= 2517
##$YMIN_a= -3045
##$ZGOPTNS= <>
##$ZL1= 120
##$ZL2= 120
##$ZL3= 120
##$ZL4= 120
##$ABSF1= 0
##$ABSF2= 0
##$ABSG= 0
##$ABSL= 0
##$ALPHA= 0
##$AQORDER= 0
##$ASSFAC= 0
##$ASSFACI= 0
##$ASSFACX= 0
##$ASSWID= 0
##$AUNMP= <proc_1d>
##$AZFE= 0.1
##$AZFW= 0.5
##$BCFW= 0
##$BC_mod= 2
##$BYTORDP= 0
##$COROFFS= 0
##$CY= -3
##$DATMOD= 1
##$DC= 0
##$DFILT= <>
##$DTYPP= 0
##$F1P= 0
##$F2P= 0
##$FCOR= 1
##$FTSIZE= 65536
##$FT_mod= 6
##$GAMMA= 0
##$GB= 0
##$INTBC= 1
##$INTSCL= 9.790993e-09
##$ISEN= 30
##$LB= 1.5
##$LEV0= 0
##$LPBIN= 0
##$MAXI= 10000
##$MC2= 0
##$MEAN= 0
##$ME_mod= 0
##$MI= 50
##$NCOEF= 0
##$NC_proc= -9
##$NLEV= 6
##$NOISF1= 182.463
##$NOISF2= 159.3651
##$NSP= 0
##$NTH_PI= 0
##$NZP= 0
##$OFFSET= 198.0616
##$PC= 4
##$PHC0= 2750.073
##$PHC1= -26.71252
##$PH_mod= 1
##$PKNL= yes
##$PPARMOD= 0
##$PSCAL= 0
##$PSIGN= 0
##$REVERSE= no
##$SF= 81.0140089999434
##$SI= 65536
##$SIGF1= 159.3651
##$SIGF2= -187.1042
##$SINO= 113.3802
##$SIOLD= 16384
##$SREGLST= <1H.CDCl3>
##$SSB= 0
##$STSI= 65536
##$STSR= 0
##$SW_p= 32467.5324675325
##$SYMM= 0
##$S_DEV= 0
##$TDeff= 32768
##$TDoff= 0
##$TI= <>
##$TILT= no
##$TM1= 0
##$TM2= 0
##$TOPLEV= 0
##$USERP1= <user>
##$USERP2= <user>
##$USERP3= <user>
##$USERP4= <user>
##$USERP5= <user>
##$WDW= 1
##$XDIM= 65536
##$YMAX_p= 170741191
##$YMIN_p= -192110767
$$ End of Bruker specific parameters
$$ ---------------------------------
##NTUPLES= NMR SPECTRUM
##VAR_NAME=  FREQUENCY,     SPECTRUM/REAL,   SPECTRUM/IMAG
##SYMBOL=    X,             R,               I
##VAR_TYPE=  INDEPENDENT,   DEPENDENT,       DEPENDENT
##VAR_FORM=  AFFN,          ASDF,            ASDF
##VAR_DIM=   65536,         65536,           65536
##UNITS=     HZ,            ARBITRARY UNITS, ARBITRARY UNITS
##FACTOR=    0.49542278885378, 1,            1
##FIRST=     16045.7642231865, 0,            0
##LAST=      -16421.768244346, 0,            0
##MIN=       -16421.768244346, -192110767,   0
##MAX=       16045.7642231865, 170741191,    0
$$ Real data points
##PAGE= N=1
##DATA TABLE= (X++(R..R)), XYDATA
$$ [...]
7384a60596m496345o072503n237900n00013N999293R533375P674529K630274j553717
$$ -160596 -4656941 -10729444 -15967344 -16467357 -10468064 -934689 6739840 9370114 7816397
7375G816397k866846k148756j334690j582794k325430j610349J842933O391785
$$ 7816397 4949551 2800795 1466105 -116689 -2442119 -4052468 -2209535 4182250
7367D182250Q310046N896049J784118l48200n28248j627044m053177m649880k188459
$$ 4182250 12492296 18388345 20172463 19824263 19296015 17668971 13615794 8965914 6777455
7358F777455n10869l068530o853284o192174j468375J114879r53116k518194J223366
$$ 6777455 6266586 3198056 -3655228 -9847402 -11315777 -10200898 -11154014 -13672208 -12448842
7349a2448842P145853Q464946L804916j932309m114498k334734Q92870K191474
$$ -12448842 -5302989 3161957 6966873 5034564 920066 -1414668 -521798 1669676
7341A669676p27455o018592p827879k812295M597247P027841L207894j683153
$$ 1669676 942221 -5076371 -12904250 -15716545 -11119298 -4091457 -883563 -2566716
7333b566716l586114k798766k62833L835003P040812N668760O32390k543215j508583
$$ -2566716 -6152830 -8951596 -9214429 -5379426 1661386 7330146 7962536 5419321 3910738
7324C910738j91475j847839l965962l312608j449051j234507j795544j301420
$$ 3910738 3719263 1871424 -2094538 -5407146 -6856197 -8090704 -9886248 -11187668
7316a1187668j195829k937596l665979l40646M277256N265292L282302K981082
$$ -11187668 -12383497 -15321093 -18987072 -19327718 -15050462 -9785170 -6502868 -3521786
7308c521786M952971N221429K437605k07292o82734m55637m78554R9411M30216
$$ -3521786 1431185 6652614 9090219 8882927 8200193 7744556 7266002 7365413 7795629
7299G795629j676365m742815m175468N20748M161051L459317R45587j090553m743644
$$ 7795629 6119264 1376449 -2799019 -2278271 1882780 5342097 6287684 5197131 453487
7290D53487j0610877j3155872p649954J765995O860117O037387M664395N940737
$$ 453487 -10157390 -23313262 -30963216 -29197221 -22337104 -16299717 -11635322 -5694585
7282e694585P170350N361068J667051j043550j802665j687706k474167n168579
$$ -5694585 1475765 6836833 8503884 7460334 5657669 3969963 1495796 -3672783
7274c672783p918100o420101O80683P970776Q768754L853496O1254L4161r50204
$$ -3672783 -11590883 -18010984 -17330301 -9359525 -590771 3262725 3323979 3358140 2407936
7265B407936n827749r225677n002796L315690N979196K97991n413833l060402
$$ 2407936 -3419813 -12645490 -17648286 -14332596 -8353400 -8055409 -13469242 -16529644
7257a6529644M549366P860708L031630m173370o823407m794199k160185j18862
$$ -16529644 -11980278 -4119570 -1087940 -5261310 -12084717 -16878916 -19039101 -19157963
7249a9157963L066840O269904N116848p95950m881685j632274N128066O829222
$$ -19157963 -16091123 -9821219 -4704371 -5500321 -10382006 -12014280 -6886214 -56992
7241e6992J791119k929611j903493J515869R67458l701386o797658m728908L2561
$$ -56992 1734127 -1195484 -3098977 -1583108 -615650 -4317036 -11114694 -15843602 -15811041
7232a5811041K924450K576343J241126J408145L137897M604994M591494L624629
$$ -15811041 -12886591 -10310248 -9069122 -7660977 -4523080 81914 4673408 8298037
7224H298037K359470J19520l302115n284599k733815K731375N116771J450916
$$ 8298037 10657507 10777027 7474912 2190313 -543502 2187873 7304644 8755560
7216H755560l801110m506398r93760J338581N44574N62098M010895O956198M244967
$$ 8755560 4954450 448052 -545708 792873 1337447 1899545 5910440 12866638 17111605
7207A7111605k402851n908041l117882J418583K231225j5614j111217m29770r40730
$$ 17111605 14708754 8800713 5682831 7101414 9332639 9317025 8205808 7776038 6835308
7198F835308k472960l05042O866232J1736025O176918p216030j6520750j4113554
$$ 6835308 4362348 4057306 10923538 22659563 28836481 21620451 5099701 -9013853
7190i013853m681181J913079J992359k52426M09483M903298R847959J0352806
$$ -9013853 -13695034 -11781955 -9789596 -10042022 -9632539 -4729241 5118718 15471524
7182A5471524M038425n533696j0828372q053068j540321J878760R62089o21869
$$ 15471524 19509949 13976253 3147881 -4905187 -6445508 -4566748 -3604659 -4226528
7174d226528r71549j237078j121776J342253M706957M218198p85000m399152k194128
$$ -4226528 -5198077 -6435155 -7556931 -6214678 -1507721 2710477 1925477 -2473675 -4667803
7165d667803K524835M304368L448831L377433L311963K0468m599259m767011l01138
$$ -4667803 -2142968 2161400 5610231 8987664 12299627 12320095 7720836 2953825 2652687
7156B652687J983693j198037l992015o84120M497288L053052m983372j0587779
$$ 2652687 4636380 3438343 -553672 -1237792 3259496 6312548 1329176 -9258603
7148i258603p859576o61316M141862M921131M149198L146643J809381J310738
$$ -9258603 -17118179 -17779495 -13637633 -8716502 -4567304 -1420661 388720 1699458
7140A699458L091820N732565N978050L018574o42435k814929l885633m864456
$$ 1699458 4791278 10523843 16501893 19520467 18878032 16063103 12177470 7313014
7132G313014n237721m071600j996310n95318j63774P72291L368981O345444O603812
$$ 7313014 2075293 -1996307 -3992617 -4587935 -4751709 -3979418 -610437 5735007 12338819
7123A2338819K561259l259408o073307l933048o1917Q39500k287338o520737q522858
$$ 12338819 14900078 11640670 5567363 1634315 1572398 2411898 124560 -6396177 -14919035
7114a4919035o727368j256944N631597R583017P741487K530016j061811k023382
$$ -14919035 -21646403 -22903347 -17271750 -7688733 52754 2582770 1520959 -502423
7106e02423l469151n780161m645998J504028O945744N933939R83935j269046J45836
$$ -502423 -3971574 -9751735 -14397733 -12893705 -5947961 -14022 969913 -299133 -153297
7097a53297Q08368n96280p23305J372156K204969M55189m15405J358698K298504
$$ -153297 655071 58791 -664514 707642 2912611 3367800 2952395 4311093 6609597
7088F609597M2600j697810J014982N360004N497204P32793m563648p117435o532788
$$ 6609597 6652197 4954387 5969369 11329373 16826577 17559370 12995722 5878287 -654501
7079f54501l011827J944006M126644R98482l421707l155130Q37240J985879j426020
$$ -654501 -3666328 -1722322 2404322 3402804 -18903 -3174033 -2336793 -350914 -1776934
7070a776934l366867L95203N544582N558444O26628l732138m120483j534825J729336
$$ -1776934 -5143801 -4748598 795984 6354428 6981056 3248918 -871565 -2406390 -677054
7061f77054L685923K440705k011440o047165n414112l38203M280239M082994n20561
$$ -677054 3008869 5449574 3438134 -2609031 -8023143 -8361346 -4081107 1887 -518674
7052e18674n285580o375675l828274j190842j216794k192608k13747M883737Q584759
$$ -518674 -5804254 -12179929 -16008203 -17199045 -18415839 -20608447 -20822194 -15938457 -7353698
7043g353698P744173M603920K705584J706323n13020k831623k190362R14557K372115
$$ -7353698 390475 4994395 7699979 9406302 8893282 6061659 3871297 4785854 7157969
7034G157969K04244l054729m344673l347624r73799K262719M908092M506215J099615
$$ 7157969 7362213 4307484 -37189 -3384813 -4358612 -2095893 2812199 7318414 8418029
7025H418029j334693M04780L857696L587163j498436o341991o202251k564231
$$ 8418029 7083336 7488116 11345812 14932975 13434539 7092548 890297 -1673934
7017a673934m15736r63550m07494L395739O579902M483897j127924m353392l770511
$$ -1673934 -2089670 -3053220 -3460714 -64975 6514927 10998824 9870900 5517508 1746997
7008A746997l597704n555312n453528q97975L053294J053315l660954l778512
$$ 1746997 -1850707 -7406019 -12859547 -13757522 -10704228 -9650913 -13311867 -17090379
7000a7090379J041796M210787K246980j814700m880994o896418o761927k230558
$$ -17090379 -16048583 -11837796 -9590816 -11405516 -16286510 -23182928 -29944855 -32175413
6992c2175413M126186N767964K068502O06812N423748R707226O181595r71440
$$ -32175413 -28049227 -22281263 -20212761 -19605949 -14182201 -4474975 1706620 735180
6984G35180k321912K390449M486704m23694p438983j0798532j0108816o842341
$$ 735180 -1586732 803717 5290421 4866727 -2572256 -13370788 -23479604 -30321945
6976c0321945j198483M942924P181830M018729l06867j016638J839487N054782
$$ -30321945 -31520428 -26577504 -19395674 -15376945 -15683812 -16700450 -14860963 -9806181
6968i806181O462031N501817K198975k211487n311358n622907l373080R68027
$$ -9806181 -3344150 2157667 4356642 2145155 -3166203 -8789110 -12162190 -11194163
6960a1194163O263769Q706302M388672m302772q810223m038714M933081R018352
$$ -11194163 -4930394 3775908 8164580 3861808 -4948415 -8987129 -4054048 4964304
6952D964304N729525J86196k582913k258859q49878K72365K66292j299765l328118
$$ 4964304 10693829 10880025 8297112 6038253 5188375 5460740 5727032 4427267 1099149
6943A099149l814918k417664r57978p75466r86344j64092J408581K279616K042413
$$ 1099149 -2715769 -5133433 -6091411 -6866877 -7853221 -8017313 -6608732 -4329116 -2286703
6934b286703J761444J983286J475621q28633l093894j879841K883400O269256
$$ -2286703 -525259 1458027 2933648 2105015 -988879 -2868720 14680 6283936
6926F283936L915320k109730n782745m705123j937209m89622P0435N85792j16898
$$ 6283936 10199256 8089526 2306781 -2398342 -4335551 -4825173 -4754738 -4168946 -4285844
6917d285844k442135l979862k810677l90178J293076K995018N846866P802632
$$ -4285844 -6727979 -10707841 -13518518 -13908696 -12615620 -9620602 -3773736 4028896
6909D028896N676748k94837o313035q522463n378102J304003O122320M149501
$$ 4028896 9705644 9410807 3097772 -5424691 -10802793 -9498790 -3376470 773031
6901G73031k268584m462498J271173P426019N447915j824958n031293k838409
$$ 773031 -1495553 -5958051 -4686878 2739141 8187056 6362098 1330805 -1507604
6893a507604k604491o762382q267683k470749N057584P403673O087660O079694
$$ -1507604 -4112095 -10874477 -19142160 -21612909 -16555325 -9151652 -3063992 3015702
6885C015702O541525L463328j852273l889373j168027K281717L004215R42461
$$ 3015702 9557227 13020555 11168282 7278909 6110882 8392599 11396814 12339275
6877A2339275l025357p634848r692868o655310j060976J697274M44495q02012
$$ 12339275 9313918 1679070 -8013798 -14669108 -15730084 -14032810 -13588315 -14390327
6869a4390327O38278K762766L177322K643306K326265J008013k215590m969560
$$ -14390327 -13752049 -10989283 -7811961 -5168655 -2842390 -1834377 -4049967 -9019527
6861i019527m333107j122904J229152J345229J132937K520228M787610N434652
$$ -9019527 -13352634 -14475538 -13246386 -11901157 -10768220 -8247992 -3460382 1974270
6853A974270K713597k658508p521497q303915m101276K138561O197194O464240
$$ 1974270 4687867 2029359 -5492138 -13796053 -17897329 -15758768 -9561574 -3097334
6845c097334M756409L429298K662402J165303j185343k714668k211245o92837
$$ -3097334 1659075 5088373 7750775 8916078 7730735 5016067 2804822 2111985
6837B111985J6830k66234l86672j69890o10594j474168p32496K420146N530678
$$ 2111985 2128815 1862581 1475909 1306019 695425 -778743 -1511239 908907 6439585
6828F439585N479535K190053j726181m203313m966545m175759j806820J356368
$$ 6439585 11919120 14109173 12382992 8179679 3213134 -962625 -2769445 -1413077
6820a413077L416130K556394j587459p011208r435856n216848L926955J0516543
$$ -1413077 2003053 4559447 2971988 -4039220 -13475076 -18691924 -14764969 -4248426
6812d248426Q458699K09135n882442n262461j217649J115925J169540J460826
$$ -4248426 4210273 4419408 -1463034 -6725495 -7943144 -6827219 -5657679 -4196853
6804d196853K646447L146499K373300J409676P47942l06971j792256k514781j798494
$$ -4196853 -1550406 1596093 3969393 5379069 6127011 5820040 4027784 1513003 -285491
6795b85491m33259N76012J035226Q79773k77435k005782k448510k69318L033910
$$ -285491 -718750 -142738 892488 1772261 1494826 -510956 -2959466 -3228784 -194874
6786a94874M207937K107917o46948q07012J471276K988620J634404j285059l163485
$$ -194874 4013063 6120980 5474032 4667020 6138296 9126916 10761320 9476261 6312776
6777F312776l197983k477879j811154o76330J534352L798310L604485m31223n902817
$$ 6312776 3114793 636914 -1174240 -1850570 -316218 3482092 7086577 6655354 752537
6768G52537p953958m677719J2738J092941j063285k087722q24801m43765j598026
$$ 752537 -7201421 -11879140 -11866402 -10773461 -11836746 -13924468 -14749269 -15193034 -16791060
6759a6791060j36472N299017Q726082N005622j445772k508970J596679L261852
$$ -16791060 -16927532 -11628515 -2902433 2103189 657417 -1851553 -254874 3006978
6751C006978m34018m079059l329248r75761j107220k932722l524692k221839M45265
$$ 3006978 2572960 -1506099 -4835347 -5811108 -6918328 -9851050 -13375742 -15597581 -15152316
6742a5152316M033741N979661K749581l853721o275024q17817O667778Q773441
$$ -15152316 -11118575 -5138914 -2389333 -6243054 -12518078 -13335895 -6668117 2105324
6734B105324N921306L058621J227647j514834l890954k931520k53596l83769l263843
$$ 2105324 8026630 11085251 12312898 10798064 6907110 3975590 3721994 3338225 74382
6725G4382m285554j883788L72481j11344j617095j722850p4480K978866O548070
$$ 74382 -4211172 -6094960 -5722479 -5833823 -7450918 -9173768 -9248248 -6269382 278688
6716B78688P827194M687169l40213k960939l513271n222114o609762k658902N356790
$$ 278688 8105882 12793051 12452838 9491899 5978628 756514 -5853248 -8512150 -3155360
6707c155360Q902333M196731j947259k735352j038728k402276m532817j950675
$$ -3155360 5746973 9943704 7996445 5261093 4222365 1820089 -2712728 -4663403
6699d663403K793784J911333m627633p847998k888782M406398O904941N511593
$$ -4663403 -1869619 41714 -4585919 -12433917 -15322699 -10916301 -4011360 1500233
6691A500233M755551M419926J487995k578087l039535k31O25277l986002q590875
$$ 1500233 6255784 10675710 12163705 9585618 6546083 6545852 7171129 3185127 -5405748
6682e405748p282430k316483m96745k412129j620607M315015Q485421M519597
$$ -5405748 -12688178 -15004661 -15501406 -17913535 -19534142 -15219127 -6733706 -2214109
6674b214109l260467n847186k566637n42499k323940k619417J166666L643056
$$ -2214109 -5474576 -11321762 -13888399 -14430898 -16754838 -19374255 -18207589 -14564533
6666a4564533O96486l176505k328344J094387J947586Q89076J257886J210388
$$ -14564533 -13868047 -17044552 -19372896 -18278509 -16330923 -15441847 -14183961 -12973573
6658a2973573k844957p557335o114428O21722N077564M881876M855911O377592
$$ -12973573 -15818530 -23375865 -29490293 -28868571 -23791007 -18909131 -14053220 -7675628
6650g675628M670706n54252j942634K867871N087913j206728p448763l142317
$$ -7675628 -3004922 -3559174 -5501808 -2633937 2453976 1247248 -6201515 -9343832
6642i343832O270441O550799l113548q432160j938658O081114L976531m149850
$$ -9343832 -3073391 3477408 363860 -8068300 -10006958 -3925844 50687 -4099163
6634d099163o032864M51020N863167L561984k851201o623336n804077k445798
$$ -4099163 -10132027 -9681007 -3817840 -255856 -3107057 -9730393 -15534470 -17980268
6626a7980268J334408M030530M368791K504360K86876o75942j07112J804068M427629
$$ -17980268 -16645860 -12615330 -8246539 -5742179 -5455303 -6131245 -6238357 -4434289 -6660
6617f660N648880L215952j895244n516032m891632j561504J349996K690077K765703
$$ -6660 5642220 8858172 6962928 1446896 -3444736 -5006240 -3656244 -966167 1799536
6608A799536J550604l43821o68879J741618M319317L611413R2740k722438l470209
$$ 1799536 3350140 3006319 2337440 4079058 8398375 12009788 12102528 9380090 5909881
6599E909881l950463m909265m514374k142987k12605k82466k82278J884028M397660
$$ 5909881 1959418 -2949847 -7464221 -9607208 -9819813 -10102279 -10384557 -8500529 -4102869
6590d102869M121790J386685r61637k186898m031821o663636p269568l545837
$$ -4102869 18921 1405606 443969 -1742929 -5774750 -12438386 -19707954 -23253791
6582b3253791K987458P614539N941868j912568r485006q659170R93490R603356
$$ -23253791 -20266333 -12651794 -6709926 -8622494 -18107500 -26766670 -25773180 -16169824
6574a6169824P756687j473602o273128j535697N429867O096096J396917k358058
$$ -16169824 -8413137 -9886739 -16159867 -17695564 -12265697 -6169601 -4772684 -7130742
6566g130742k889162k046072l43693K490098L704288O11434l320637j756341M780628
$$ -7130742 -10019904 -12065976 -12409669 -9919571 -6215283 -5603849 -8924486 -10680827 -5900199
6557e900199Q653912O007532J770221J045186J450805j397083n541835n798490
$$ -5900199 2753713 8761245 10531466 11576652 13027457 11630374 6088539 290049
6549B90049k374505j33297n05355k51020J740727K350119J10904k096654k126128
$$ 290049 -2084456 -2217753 -2723108 -2974128 -1233401 1116718 1227622 -869032 -2995160
6540b995160j595301j662349n32032K037636K653393M96029O43542N931641J0061367
$$ -2995160 -4590461 -6252810 -6784842 -4747206 -2093813 -1597784 -954242 4977399 15038766
6531A5038766N901034k656974n735201k748469k594506p593596q277513P99796
$$ 15038766 20939800 18282826 12547625 9799156 7204650 -388946 -8666459 -7866663
6523g866663R869828P120699l553417q112223k380667L956626L157884p15849
$$ -7866663 2003165 9123864 5570447 -2541776 -4922443 -965817 2192067 1476218
6515A476218o16033K821297M405127L042725J775760J674756N67032k537785n129128
$$ 1476218 860185 3681482 8086609 11129334 12905094 14579850 15146882 12609097 7479969
6506G479969m127289J88466L844948K941029k033476o373723o433215l463629
$$ 7479969 3352680 3541146 7386094 10327123 8293647 1919924 -4513291 -7976920
6498g976920p73106J030544L158340M687346L583275J124761R16417L166295M237008
$$ -7976920 -8750026 -7719482 -4561142 126204 3709479 4834240 5750657 8916952 13153960
6489A3153960K602052Q00375L32565o19255k521436k456163M31894K088678k37123
$$ 13153960 15756012 16556387 16888952 16269697 13748261 11292098 11723992 13812670 13575547
6480A3575547l094094k389558k02218j089434m362146n391262k950334j15715
$$ 13575547 10481453 8091895 7889677 6800243 2438097 -2953165 -5903499 -6019214
6472f019214J212212J887881K161875J306221M27025J383866K911369J973135
$$ -6019214 -4807002 -2919121 -757246 548975 976000 2359866 5271235 7244370
6464G244370q81066j753733M84378K522592K045169P77026N48801L5738k371891
$$ 7244370 6363304 4609571 5093949 7616541 9661710 10438736 10987537 11023275 8651384
6455H651384n261182o061278m398974j958775n15014j087887l279405m599744
$$ 8651384 3390202 -2671076 -7070050 -9028825 -9543839 -10631726 -13911131 -18510875
6447a8510875k386413K708728O954642P851297O157636L278550m73580l885589
$$ -18510875 -20897288 -18188560 -11233918 -3382621 2775015 6053565 5579985 1694396
6439A694396m212641q34940K578949K052496j784665m823794m557620k134350
$$ 1694396 -2518245 -3353185 -774236 1278260 -506405 -5330199 -9887819 -12022169
6431a2022169O470P28830M88540K88924O55309J279679J611254J531281J042682
$$ -12022169 -12015699 -11286869 -10798329 -10509405 -9854096 -8574417 -6963163 -5431882 -4389200
6422d389200p4439j375680j365779M53676J894630M92392k812290m604326l320257
$$ -4389200 -4463639 -5839319 -7205098 -6751422 -4856792 -4364400 -7176690 -11781016 -15101273
6413a5101273l51475K711265N106504N497691K969105l51940j257617m93314j829039
$$ -15101273 -15452748 -12741483 -7634979 -2137288 831817 479877 -777740 -1271054 -3100093
6404c100093n318527o223829k501794J582950K273377J900599L538558M598424
$$ -3100093 -8418620 -14642449 -17144243 -15561293 -13287916 -11387317 -7848759 -3250335
6396c250335J381703l215746l089877J513387M373024L018468J651014L178152
$$ -3250335 -1868632 -5084378 -8174255 -6660868 -2287844 730624 2381638 5559790
6388E559790M361345J687722k587953l839613j431877J723634L797676M849325
$$ 5559790 9921135 11608857 9020904 5181291 3749414 5473048 9270724 14120049
6380A4120049M327901J209975l333071n962230m625462o90755K716661L474089
$$ 14120049 18447950 19657925 16324854 10362624 5737162 5046407 7763068 11237157
6372A1237157J411836k173921n089090n142052j879266K335012L997527J928773
$$ 11237157 12648993 10475072 5385982 243930 -1635336 699676 4697203 6625976
6364F625976j539805l474620l598479l545967l772008l122178j256469N84675
$$ 6625976 5086171 1611551 -1986928 -5532895 -9304903 -12427081 -13683550 -13098875
6356a3098875J555938K116051K664091L124797L980318N413107N404257J821436
$$ -13098875 -11542937 -9426886 -6762795 -3637998 342320 5755427 11159684 12981120
6348A2981120l107633m278891j028218J322000m43158k433119m65268K605795
$$ 12981120 9873487 5594596 4566378 5888378 5445220 3012101 2546833 5152628
6340E152628J653661k127870l638499k434823k000978j956103J309728O240111
$$ 5152628 6806289 4678419 1039920 -1394903 -3395881 -5351984 -4042256 2197855
6332B197855O476500J364689j764225R14634L376561k16429n690749n638840j211098
$$ 2197855 8674355 10039044 8274819 9189453 12566014 12349585 6658836 1019996 -191102
6323a91102L96083k469726m445126k462786N31089J861852K914071M819750N503911
$$ -191102 204981 -2264745 -6709871 -9172657 -8641568 -6779716 -3865645 954105 6458016
6314F458016L544943J015032o1997o71035j584148n13984L902801P700315N565935
$$ 6458016 10002959 11017991 10955994 10284959 8700811 8186827 12089628 19789943 25355878
6305B5355878j562663p052027p043771m499948l503223l265050p32727L349960
$$ 25355878 23793215 16741188 9697417 5197469 1694246 -1570804 -2303531 1046429
6297A046429M969186K837549J84209n3811J277016K061460K109666J978138R43442
$$ 1046429 6015615 8853164 9037373 8983562 10260578 12322038 14431704 16409842 17353284
6288A7353284j467757l602886l769674k882789k664626k586414j338165q7874
$$ 17353284 15885527 12282641 8512967 5630178 2965552 379138 -959027 -1046901
6280a046901r99943l221285l749451j968632P0621J583345L472641M874939L548419
$$ -1046901 -2046844 -5268129 -9017580 -10986212 -10915591 -9332246 -5859605 -984666 2563753
6271B563753K56604j604150j524353k180883l166281m67880N183287O052946j560879
$$ 2563753 2820357 1216207 -308146 -2489029 -5655310 -6123190 -939903 5113043 3552164
6262C552164r695161q715647p71259M167658K751660L52451R7518r56016l584317
$$ 3552164 -6142997 -14858644 -15629903 -11462245 -8710585 -8358134 -8260616 -9216632 -12800949
6253a2800949l242854J386221M144478N32667m757478m949083j278187P0891k005993
$$ -12800949 -16043803 -14657582 -10513104 -9980437 -14737915 -19686998 -20965185 -20894294 -22900287
6244b2900287k983768p65286J776796K362565K260057K786785L022417K262361
$$ -22900287 -25884055 -26649341 -24872545 -22509980 -20249923 -17463138 -14440721 -12178360
6236a2178360J453108J012441Q3842j010598m39973J750767K722969J039134o75254
$$ -12178360 -10725252 -9712811 -9628969 -10639567 -11079540 -9328773 -6605804 -5566670 -6241924
6227f241924N73240L606918M524338J587944l233738o667305o398898k053029
$$ -6241924 -5668684 -2061766 2462572 4050516 816778 -5850527 -12249425 -14302454
6219a4302454L978750P273234N090858m61574m312254l499413M09115L320462
$$ -14302454 -10323704 -3050470 2040388 1578814 -2733440 -6232853 -5823738 -2503276
6211b503276K093288k909372p365477o321566K29113O367278O952982L709921
$$ -2503276 -409988 -3319360 -10684837 -17006403 -16777290 -10410012 -3457030 252891
6203B52891J725528J734736L81943k734051l924033k030707l59073j4336K675678
$$ 252891 1978419 3713155 4095098 1361047 -2562986 -4593693 -4952766 -4967102 -2291424
6194b291424Q584301J1489376O703944o60143k476655P63068K145775k19558j803626
$$ -2291424 6292877 17782253 24486197 23826054 21349399 22112467 24258242 24038684 22235058
6185B2235058r33391j432511m957045p813417p202260m372534n4246O461697J1620694
$$ 22235058 21301667 19869156 14912111 7098694 -103566 -4476100 -4530346 1931351 13552045
6176A3552045Q530913k537735j1358480j0228427l322150J278060K613939L752020
$$ 13552045 22082958 19545223 8186743 -2041684 -5363834 -4085774 -1471835 2280185
6168B280185L600585k68789m740777n157453l192820k948485k279053L071868
$$ 2280185 5880770 5611981 871204 -4286249 -7479069 -10427554 -12706607 -9634739
6160i634739Q977423O882135k001620o993637m038477j074053l877820o645213
$$ -9634739 -657316 6224819 4223199 -2770438 -6808915 -7882968 -11760788 -18406001
6152a8406001k503050M996477Q105381O272303L897415J730721j721403l851017
$$ -18406001 -20909051 -15912574 -7807193 -1534890 2362525 4093246 2371843 -1479174
6144a479174j005304M056629N056500J484669j649655k488986l811685n793443
$$ -1479174 -2484478 1572151 6628651 8113320 6463665 3974679 162994 -5630449
6136e630449m391001J358718O475837O862251M025032P67339k789525n951619
$$ -5630449 -10021450 -8662732 -2186895 4675356 8700388 9467727 6678202 726583
6128G26583n209113L17578M817850K365274m340768o834169j931885M634191O156769
$$ 726583 -4482530 -4164952 652898 3018172 -1322596 -8156765 -10088650 -5454459 702310
6119G02310K621373r95571j193470J177776K820550J280042k586177m728202k030287
$$ 702310 3323683 2328112 1134642 2312418 5132968 6413010 3826833 -901369 -2931656
6110b931656L068354M417299J09221m109290k382065K470313K375659m150707
$$ -2931656 136698 4553997 4663218 553928 -1828137 642176 3017835 -1132872
6102a132872r010740n396945L082379P955602P023664M844692M091979K523880
$$ -1132872 -10143612 -15540557 -12458178 -4502576 2521088 7365780 11457759 13981639
6094A3981639j109148l928039l948717l643206n231404n953710k155515M003758
$$ 13981639 12872491 8944452 4995735 1352529 -3878875 -9832585 -11988100 -7984342
6086g984342O357127K856228j831299k473537P46709L498843K709171n86293l038839
$$ -7984342 -1627215 1229013 -602286 -3075823 -2329114 1169729 3878900 3292607 253768
6077B53768k704762o97491R96785K542100N209140P364535M925615k048045o578752
$$ 253768 -2450994 -3148485 -2151700 390400 5599540 12964075 17889690 15841645 9262893
6068I262893k882456M626657N840839j637193r281428r360951m202537m07106
$$ 9262893 6380437 11007094 16847933 15210740 5929312 -3431639 -7634176 -8041282
6060h041282J037851L435024O561694O884804M653630M205983O240368N714858
$$ -8041282 -7003431 -3568407 2993287 9878091 14531721 18737704 24978072 30692930
6052C0692930j82080p022621r426194q185935p131119o408387l851567o64687
$$ 30692930 30510850 23488229 14062035 5876100 -1255019 -7663406 -11514973 -12179660
6044a2179660j10075j402271m44153L156477N187470L979361L023266M252495
$$ -12179660 -12289735 -13692006 -14136159 -10979682 -5792212 -1812851 1210415 5462910
6036E462910L995590n76355n252794m146654J164890L218121j155119o819927
$$ 5462910 9458500 8882145 3629351 -517303 647587 3865708 2710589 -4109338
6028d109338p256854k203872K825090K819857j717010n286003l215582K647962
$$ -4109338 -11366192 -13570064 -10744974 -7925117 -9642127 -14928130 -18143712 -15495750
6020a5495750N760693L306038o4335P60597L835868L799073O23790p11211J483768
$$ -15495750 -9735057 -6429019 -6493354 -5732757 -1896889 1902184 2525974 1814763 3298531
6011C298531L309628J950767m68824j227858p97154m32390J23741N68047o83399
$$ 3298531 6608159 8558926 8090102 6862244 6065090 5632700 5756441 6324488 5641089
6002E641089k992111k734621J492746N957229O603166M019288J135251j180238
$$ 5641089 2648978 -85643 1407103 7364332 13967498 17986786 19122037 17941799
5994A7941799l249476l781724j432498K117393L549571J766338j377385l164704
$$ 17941799 14692323 10910599 9478101 11595494 15145065 16911403 15534018 12369314
5986A2369314j706031K627262O228031N085539J48002k875375j086077J225777
$$ 12369314 10663283 13290545 19518576 24604115 24752117 21876742 20790665 22016442
5978B2016442j380501p686791j1466786r265490l455753J231025J797970r73835
$$ 22016442 20635941 12949150 1482364 -7783126 -11238879 -10007854 -8209884 -9183719
5970i183719k640508P67832P069679R399237N370906O08451j11510j97170m269021
$$ -9183719 -11824227 -11056395 -3986716 5412521 10783427 11391878 11280368 11083198 6814177
5961F814177q526680o039851Q85264K837530k027404m562586J329946R120173
$$ 6814177 -1712503 -7752354 -6867090 -4029560 -6056964 -10619550 -9289604 -169431
5953a69431R002226J223682n602620o184231l019660n67964J76034P97048K375064
$$ -169431 8832795 10056477 4453857 -1730374 -4750034 -5317998 -5141964 -4344916 -1969852
5944a969852M572094O302664O175499K845097l677838j0294713j1702444n547721
$$ -1969852 2602242 8904906 15080405 17925502 14247664 3952951 -7749493 -13297214
5936a3297214L296132O832595L391491o34075j95236K008639J923407J552670
$$ -13297214 -10001082 -3168487 223004 -411071 -606307 1402332 3325739 4878409
5928D878409M022553N825907K111129l209031k151330L566658L929358l030804
$$ 4878409 8900962 14726869 16837998 13628967 11477637 15044295 18973653 15942849
5920A5942849p303007l151285J407422j900702p825804o462675O93291L986546
$$ 15942849 8639842 5488557 6895979 4995277 -2830527 -9293202 -8599911 -4613365
5912d613365J208849o72823J524004K603044q42858m115962k113361K531386L452069
$$ -4613365 -3404516 -4077339 -2553335 49709 -793149 -4909111 -7022472 -4491086 -1039017
5903a039017p69969n823360p581959n619028j894740J379528K760884K385732
$$ -1039017 -1808986 -7632346 -15214305 -20833333 -22728073 -21348545 -18587661 -16201929
5895a6201929K012767K993328L983866K140531k475690n267987k341682L275039
$$ -16201929 -14189162 -11195834 -7211968 -5071437 -7547127 -12815114 -15156796 -11881757
5887a1881757M460282J17739k164878K974344R571554Q235080K52973m134046
$$ -11881757 -7421475 -7303736 -9468614 -6494270 3077284 11312364 11565337 7431291
5879G431291j033519K229287m16780m810248m415527k60819K576336L163382L487324
$$ 7431291 6397772 8627059 8210279 3400031 -1015496 -1276315 1300021 4463403 7950727
5870G950727K999961K06388l099635m217001l703708l102704j734875J92106n38053
$$ 7950727 10950688 11157076 8057441 3840440 136732 -2965972 -4700847 -4508741 -5046794
5861e046794m202166m722263J455811P533006N283575j731771l064678K525966
$$ -5046794 -9248960 -13971223 -12515412 -4982406 301169 -1430602 -4495280 -1969314
5853a969314N934827K705314r92490K74174K985122J941473j549002l610842m376995
$$ -1969314 3965513 6670827 5678337 5952511 8937633 10879106 9330104 5719262 1342267
5844A342267n671327o045063k778810L274821P980151P790716K430271m067802
$$ 1342267 -4329060 -10374123 -13152933 -9878112 -1897961 5892755 8323026 4255224
5836D255224n279108Q01815P089871M693819m733726j0101087n792223J387046
$$ 4255224 -1023884 -222069 6867802 11561621 6827895 -3273192 -9065415 -7678369
5828g678369L143727N61645p81985k86665m15096P0479L577512P026024N121431
$$ -7678369 -4534642 -3972997 -4754982 -5041647 -5456743 -5386264 -1808752 5217272 10338703
5819A0338703n26989k397739K066665O389990L936568l387409q031537n981852
$$ 10338703 9811714 7413975 9480640 15870630 19807198 16419789 8388252 2406400
5811B406400m95844K482651P94619k417084k983287m62846K136610K518394J157817
$$ 2406400 1910556 4393207 5187826 2770742 -212545 -675391 1461219 3979613 5137430
5802E137430n10846j625052j314068Q89384L304671L218168O31683j527236j692205
$$ 5137430 4626584 3001532 1687464 2576848 5881519 9099687 9731370 8204134 6511929
5793F511929j347278j579217j248054P7409Q24373O47218J208367J935768m41844
$$ 6511929 5164651 3585434 2337380 2414789 3239162 3886380 5094747 7030515 6588671
5784F588671n272225n913620J056631Q770304Q122758J51475n870817n077549
$$ 6588671 1316446 -4597174 -3540543 5229761 13352519 13503994 7633177 2555628
5776B555628j310557P00832Q72720L41786j651893m843543n930323k332375M134072
$$ 2555628 1245071 1945903 2818623 3160409 1508516 -3335027 -9265350 -11597725 -7463653
5767g463653Q922509Q544493K542908n866111j0968635r228428l260133J431282
$$ -7463653 1458856 10003349 12546257 6680146 -4288489 -13516917 -16777050 -15345768
5759a5345768L433807N557975Q054433O874276P85586m640106m109809k75672
$$ -15345768 -11911961 -6353986 1700447 8574723 9360309 4720203 610394 334722
5751C34722M68906k144546k142114K830876O951179M146485l034096o379018k461676
$$ 334722 803628 -1340918 -3483032 -652156 6299023 10445508 7411412 1032394 -1429282
5742a429282L763372O080960M128710J555203p4992k178063n044250o478110n135829
$$ -1429282 2334090 8415050 12543760 14098963 14023971 11845908 6801658 323548 -4812281
5733d812281k458023k34257J523514L165805L996874L665121L133780K929230
$$ -4812281 -7270304 -7504561 -5981047 -2815242 1181632 4846753 7980533 10909763
5725A0909763K233638R89660P04995J423084K75957m333117q909386q280554j976501
$$ 10909763 13143401 14133061 14838056 16261140 16537097 12203980 3294594 -4985960 -6962461
5716f962461N367544R238757Q475992M141866j858430o826955q259750n681679
$$ -6962461 -1594917 7643840 16119832 20261698 18403268 11576313 3316563 -2365116
5708b365116r02490L199085L891279L88254m294860n223837j126013L702971M918744
$$ -2365116 -3267606 -68521 3822758 4211012 -83848 -5307685 -6433698 -2730727 2188017
5699B188017L247231J632968n920l321192o672643o223531j517083L648979N665897
$$ 2188017 5435248 7068216 7062296 3741104 -2931539 -9155070 -10672153 -7023174 -1357277
5690a357277L567157j775655p380712q403522l045333L465078M313394Q6666k470107
$$ -1357277 2209880 434225 -6946487 -15350009 -18395342 -14930264 -10616870 -10530204 -13000311
5681a3000311l60103K620900L274695L166636L293553O86953n674107j0135815
$$ -13000311 -13360414 -10739514 -7464819 -4298183 -1004630 -317677 -5991784 -16127599
5673a6127599o504722L389707J1393375J2121777P272569J737405j795883m092041
$$ -16127599 -22632321 -19242614 -7849239 4272538 11545107 13282512 11486629 7394588
5665G394588o512618p659145m194010L713860R838121Q328923J545335l007489
$$ 7394588 881970 -6777175 -10971185 -7257325 2580796 10909719 12455054 9447565
5657I447565k920235k444058l585016k661956J700761M042932K58853n066079
$$ 9447565 6527330 4083272 498256 -2163700 -462939 3579993 3838846 -1227233
5649a227233n061308l11411L407123L823384K767503P54208k698567m907873k518555
$$ -1227233 -6288541 -6599952 -3192829 630555 3398058 4152266 1453699 -3454174 -5972729
5640e972729K334914M226100K768557K847324N749369O146290M84490o525095
$$ -5972729 -3637815 588285 3356842 6204166 11953535 18099825 18584315 12059220
5632A2059220p627688k458338K397201J665290l158373o614423n608490k009016
$$ 12059220 4431532 1973194 4370395 6035685 2877312 -3737111 -9345601 -11354617
5624a1354617N40075J095572J462986K297736J595034j855701n640835o206481
$$ -11354617 -10814542 -9718970 -8255984 -5958248 -4363214 -6218915 -11859750 -18066231
5616a8066231k804084K506310P118820Q630816N573769k35210l922046k678489
$$ -18066231 -20870315 -18364005 -11245185 -2614369 2959400 2724190 -1197856 -3876345
5608c876345Q79312K600696J812510r6619l116368o665517o803360o55536P552066
$$ -3876345 -2997033 -396337 1416173 1319554 -1796814 -8462331 -15265691 -15921227 -8369161
5599h369161J0188575N743583k01813l451138n387835p882202r216605p241367
$$ -8369161 1819414 7562997 7361184 3910046 -1477789 -9359991 -18576596 -25817963
5591b5817963k813409J857220N304808O070737L170413j356999l450030j846823
$$ -25817963 -28631372 -26774152 -21469344 -15398607 -12228194 -13585193 -17035223 -18882046
5583a8882046Q48468K457584L151355K624760k62297l710354l483755N92235L055331
$$ -18882046 -18033578 -15575994 -12424639 -9799879 -10062176 -13772530 -17256285 -16664050 -13608719
5574a3608719O33692k453586o82096M676893P787249O219466K615218j36503j660630
$$ -13608719 -12975027 -15428613 -16110709 -11433816 -3646567 2572899 5188117 5051614 3390984
5565C390984k652879l453462l766575k408521J386555N365919N366613P37833
$$ 3390984 738105 -2715357 -6481932 -8890453 -7503898 -2137979 3228634 3966467
5557C966467l936762m585886k413456p47825l05069l26459j010163j380194J692197
$$ 3966467 29705 -4556181 -6969637 -7717462 -8022531 -8348990 -9359153 -10739347 -9047150
5548i047150P984020J0900730N482360l270870o402233l523317k296084n977212
$$ -9047150 -1063130 9837600 15319960 12049090 5646857 2123540 -172544 -6149756
5540f149756r055099o613420j078221K947413M600800M435655J648072k564878
$$ -6149756 -15204855 -21818275 -22896496 -19949083 -15348283 -10912628 -9264556 -11829434
5532a1829434l577399L41953M028002K314674k117913k618832J988061O806392
$$ -11829434 -15406833 -15064880 -11036878 -8722204 -10840117 -13458949 -11470888 -4664496
5524d664496Q202436O667708L123463k244455o850897o439026r67939L956666
$$ -4664496 3537940 10205648 13329111 11084656 4233759 -2205267 -3173206 783460
5516G83460L915237J067013J65318J612313J810010p40565l259233l010555r68291
$$ 783460 4698697 5765710 5931028 7543341 9353351 8612786 5353553 2342998 1374707
5507A374707K40813J75583M12792J388387J539516j45639k459752l742526m004078
$$ 1374707 1615520 1791103 2203895 3592282 5131798 4986159 2526407 -1216119 -5220197
5498e220197m008068l271060q84920J956274K511179M29925o79835K635001Q760223
$$ -5220197 -9228265 -12499325 -13384245 -11427971 -8916792 -8486867 -9166702 -6531701 2228522
5489B228522J2060848R080334K389652k432331k834532j289761j457521l596530
$$ 2228522 14289370 23369704 25759356 23327025 20492493 19202732 17745211 14148681
5481A4148681m698265k682376Q73187K658367J378036j217437k548284j678951
$$ 14148681 9450416 6768040 7641227 10299594 11677630 10460193 7911909 6232958
5473F232958J35835P28416r18699l395553m044559j888509J229091L008520L328407
$$ 6232958 6368793 7097209 6178510 2782957 -1261602 -3150111 -1921020 1087500 4415907
5464D415907L536963L909591L175295L60477l749219o647469n422287L81722O428422
$$ 4415907 7952870 11862461 15037756 15398233 11649014 5001545 -420742 -39020 6389402
5455F389402O583288L42683n190513l901135J150056K521771o59423k647136j346756
$$ 6389402 12972690 13315373 8124860 4223725 5373781 7895552 7236129 4588993 3242237
5446C242237j224426m211292n197730o87915M510555M749386K275738J973833
$$ 3242237 2017811 -2193481 -7391211 -8079126 -3568571 1180815 3456553 5430386
5438E430386K011101k196455p681219o815749M8310L906713M85563m082846l759521
$$ 5430386 7441487 5245032 -2436187 -9251936 -9203626 -5296913 -4811350 -8894196 -12653717
5429a2653717r53337r0648K57915L023860N672789M193517O91528M57316L341956
$$ -12653717 -13607054 -13697702 -13439787 -10415927 -4743138 -549621 141907 599223 3941179
5420C941179M223314J311583j717354k107687j495829j963749k739582k310743
$$ 3941179 8164493 9476076 7758722 5651035 4155206 2191457 -548125 -2858868
5412b858868p98051J008010K565422K786243P52231k087664k866138j216535J44624
$$ -2858868 -3656919 -2648909 -83487 2702756 3454987 1367323 -1498815 -2715350 -2570726
5403b570726l81360r89311L09071K512426L526353L446157L766556M355886L462269
$$ -2570726 -2952086 -3941397 -3632326 -1119900 2406453 5852610 9619166 13975052 17437321
5394A7437321N74971k550356m109331m128992l409421j724454J387135M303842
$$ 17437321 18012292 15461936 11352605 7223613 3814192 2089738 3476873 7780715
5386G780715L946131j0862l345384k201900J251081J499265k097065m084494j326711
$$ 7780715 11726846 11715984 8370600 6168700 7419781 8919046 6821981 2737487 1410776
5377A410776K017248J172423j704118j490998J294281J752444q67270k156906
$$ 1410776 3428024 4600447 2896329 1405331 2699612 4452056 3584786 1427880
5369A427880l82178O27978j837626m804358m283039p69612K440056L592565L085230
$$ 1427880 1045702 1673680 -163946 -4968304 -9251343 -10020955 -7580899 -3988334 -903104
5360i03104K121548K197460L683521M391156K421302K22745J398978L461504N6476
$$ -903104 1218444 3415904 7099425 11490581 13911883 14134628 15533606 18995110 19051586
5351A9051586p907590j0712781l608620M795399M299693k343800m604004P565
$$ 19051586 11143996 431215 -3177405 1617994 5917687 3573887 -1030117 -1022552
5343a022552M292683L853639K021034J732614R51098j461482k383674k47341J409817
$$ -1022552 3270131 7123770 9144804 10877418 11828516 10367034 7983360 7736019 9145836
5334I145836l22505l029977l380658k192061j636696r71633J176387L147596K798859
$$ 9145836 8823331 5793354 2412696 220635 -1416061 -2387694 -1211307 1936289 4735148
5325D735148J628051K441872M179359K898703k182053o692334n950692k55047
$$ 4735148 6363199 8805071 12984430 15883133 13701080 7008746 1058054 803007
5317H03007N250369N558053P78054l949031m282814j775842j150527l037254k995769
$$ 803007 6053376 11611429 12389483 8440452 4157638 2381796 1231269 -1805985 -4801754
5308d801754J204039N276861M297791l8755j944862K03361K350789J422685n07473
$$ -4801754 -3597715 1679146 5976937 5938182 3993320 4196681 6547470 7970155 7462682
5299G462682j50541J910932K619679J461647J085208K557815K693237j651762
$$ 7462682 7312141 9223073 11842752 13304399 14389607 16947422 19640659 17988897
5291A7988897p862402r425777m237566J996883K790785j101217l730743k362688
$$ 17988897 10126495 700718 -3536848 -1539965 1250820 149603 -3581140 -5943828
5283e943828m1796j90608k301675l518134j766245K862254P390950P274330J692279
$$ -5943828 -5985624 -6176232 -8477907 -11996041 -13762286 -10900032 -3509082 3765248 5457527
5274E457527l337598j504084M582103O069386J85274o222199p039465m196009
$$ 5457527 2119929 615845 5197948 11267334 11452608 5230409 -1809056 -6005065
5266f005065j612448J374273N602074P069865K845893k336426k337002O97493
$$ -6005065 -7617513 -6243240 -641166 6428699 9274592 6938166 4601164 5298657
5258E298657J29812l876985m647966m7505M227923L416207n63607l719204m986242
$$ 5298657 5428469 1551484 -3096482 -3143987 1083936 4500143 3936536 217332 -4768910
5249d768910m814969l300355j544334j184135j333690M47827L407111L795526
$$ -4768910 -9583879 -12884234 -14428568 -15612703 -16946393 -16498566 -13091455 -9295929
5241i295929P45560k069828j795857L84897K367189L543567L207554P35120j574054
$$ -9295929 -8550369 -10620197 -12416054 -12031157 -9663968 -6120401 -2912847 -2177727 -3751781
5232c751781j84911M017982O335974N496948M868520N075490K052596m564552
$$ -3751781 -3936692 81290 6417264 11914212 16782732 21858222 23910818 19346266
5224A9346266q027194m267647J032937J086631j754967j431099P97867p83153
$$ 19346266 11319072 7051425 8084362 9170993 7416026 5984927 6782794 5999641
5216E999641n260663n926572j506996J953917J123033n14987j33188J63354j013341
$$ 5999641 738978 -5187594 -6694590 -4740673 -3617640 -4132627 -4265815 -4102461 -5115802
5207e115802r95300J616709M128516N253140P488118J0466279Q301411j187910
$$ -5115802 -6111102 -4494393 -365877 4887263 12375381 22841660 31143071 29955161
5199B9955161j0113106r871479k818476K193787K565006K527931L212930R71813
$$ 29955161 19842055 9970576 7152100 9345887 11910893 14438824 17651754 18623567
5191A8623567m212601p090495n771039m364945m389520j302725O039760R843876
$$ 18623567 14410966 7320471 1549432 -2815513 -7205033 -8507758 -2467998 7375878
5183G375878L888793n911172r050910m760229o84492J97025K036254N626492N039006
$$ 7375878 11264671 5353499 -3697411 -8457640 -9142132 -8945107 -6908853 -1282361 3756645
5174C756645k204592r321707r189968l491123J555888L825711M806531M559145
$$ 3756645 1552053 -7769654 -16959622 -20450745 -18894857 -15069146 -10262615 -5703470
5166e703470K674846J552070L308764N171569K976913k017083m727850l757283
$$ -5703470 -3028624 -1476554 1832210 7003779 9980692 7963609 3235759 -521524
5158e21524k330304k072409r26580K095928M619966M593419K681987Q4450k590284
$$ -521524 -2851828 -4924237 -5850817 -3754889 865077 5458496 8140483 8224933 5634649
5149E634649l546081p06209M299261O548062L850021n77172k749375k187523l06941
$$ 5634649 2088568 1382359 5681620 12229682 16079703 15502531 12753156 10565633 10258692
5140A0258692K007951L362217J689744k455785n132600l820765n00531K121528
$$ 10258692 12266643 15628860 17318604 14862819 9730219 5909454 5408923 7530451
5132G530451M415478P074627P625813L673959k245566n209863m419842l301442
$$ 7530451 11945929 19020556 26646369 30320328 28074762 22864899 18445057 15143615
5124A5143615l502855k849626k3566K362853J342107k028097m110250l475780
$$ 15143615 11640760 8791134 8767568 11130421 12472528 10444431 6334181 2858401
5116B858401k172022k271292l011279k497781j213925j733753m473550n867900
$$ 2858401 686379 -1584913 -4596192 -7093973 -8307898 -10041651 -14515201 -20383101
5108b0383101k685691L108517O257776M526324P05896j549876j381719J3058J306976
$$ -20383101 -23068792 -19960275 -13702499 -9176175 -8470279 -10020155 -11401874 -11388816 -10081840
5099a0081840J658212J367847K001246L809859L800182l08466m772665l154794
$$ -10081840 -8423628 -7055781 -5054535 -1244676 2555506 2247040 -2525625 -5680419
5091e680419M283995R541615P246463J322917j581558q28046o0882n04068o71931
$$ -5680419 -1396424 8145191 15391654 16714571 15133013 14304967 14244085 13740017 13068086
5082A3068086m82306j314657l205485n094720o330482n624925j282525M666678
$$ 13068086 12585780 11271123 8065638 2970918 -3359564 -8984489 -10267014 -5600336
5074e600336O073982N19195n679826n241832P3988K883702J353272L47385K260234
$$ -5600336 473646 992841 -4686985 -9928817 -9854829 -6971127 -5617855 -5270470 -3010236
5065c010236L580315J564173j525135k717036k344517j849638j063832P21586
$$ -3010236 570079 2134252 609117 -2107919 -4452436 -6302074 -7365906 -6644320
5057f644320L473712O758055R052589P449230J347733m493962m793840j028006
$$ -6644320 -3170608 3587447 12640036 20089266 21436999 16943037 12149197 11121191
5049A1121191O86412j565965m055278m576916m783426m420937n3019P728361J1948329
$$ 11121191 11807603 10241638 6186360 1609444 -3173982 -7594919 -7647938 80423 12028752
5040A2028752Q124502P86427k994891k589322j965103k276319j370626R82982
$$ 12028752 20153254 20939681 17944790 15355468 13390365 11114046 9743420 10726402
5032A0726402J976412j81811l868960n752874l685061J267895N106163M869852
$$ 10726402 12702814 12521003 8652043 2899169 -785892 482003 5588166 10458018
5024A0458018K554044K446614M423642L848839q26183n136712n638190m978105
$$ 10458018 13012062 15458676 19882318 23731157 22904974 17768262 12130072 7151967
5016G151967o208068o558097k145463M320149O649380M510931L566416O195567
$$ 7151967 943899 -5614198 -7759661 -3439512 3209868 7720799 11287215 17482782
5008A7482782P781325M038566k324352n194755k947631J28367l39857l721297
$$ 17482782 25264107 29302673 26978321 21783566 18835935 18964302 18624445 14903148
5000A4903148n786000m194976j139434j4375r12627j235971O8527J517505K242937
$$ 14903148 9117148 4922172 3782738 3768363 2855736 1619765 1688292 3205797 5448734
4991E448734L056701L610602J699970k865597o382750n492814j454950J752717
$$ 5448734 8505435 12116037 13816007 10950410 4567660 -925154 -2380104 -627387
4983f27387J976517j40277k946041m604134l546603m4776L436663M623195L426053
$$ -627387 1349130 1208853 -1737188 -6341322 -9887925 -9932701 -6496038 -1872843 1553210
4974A553210J255789k57414J49932K112968L145200J815267O68534K333300L592549
$$ 1553210 2808999 2551585 2701517 4814485 7959685 9774952 10443486 12776786 16369335
4965A6369335r80457q915407j0429857k230395O070112M723724k473803m385390
$$ 16369335 15388878 6473471 -3956386 -6186781 -116669 4607055 2133252 -2252138
4957b252138J019202M551431k20732q181705j0206033m744049J593356L253098
$$ -2252138 -1232936 3318495 3097763 -5083942 -15289975 -20034024 -18440668 -15187570
4949a5187570K292913M323503R115345R056770k64302j1357795j2717455m078696
$$ -15187570 -12894657 -8571154 544191 9600961 9336659 -2021136 -14738591 -18817287
4941a8817287L708499M473583L531041N937792P543277L695775j460523k181943
$$ -18817287 -15108788 -10635205 -7104164 -1166372 6376905 10072680 8612157 6430214
4933F430214q95472k300967l556394K36810N507716N341047J592355J314297L655645
$$ 6430214 5534742 3233775 -322619 -85809 5421907 10762954 12355309 13669606 17325251
4924A7325251J618306m230874n575993o80181K522381J32987j642306J850982
$$ 17325251 18943557 14712683 9136690 8456509 10978890 11111877 9469571 11320553
4916A1320553N623204M025369l3819q82212R32862J389780J84332l85515m39226
$$ 11320553 16943757 20969126 20935307 20053095 20985957 22375737 22560069 22174554 21735328
4907B1735328j391394k070010m83050J733312O70383l810311o482556l151072
$$ 21735328 20343934 18273924 17790874 19524186 20194569 16384258 9901702 6750630
4899F750630K677603L124269k514253m278074M599390J4491178J0587216l898229
$$ 6750630 9428233 12552502 10038249 5760175 10359565 24850743 35437959 31539730
4891C1539730r890008p97426P703908L804279k301114Q40801N076948P61016j411452
$$ 31539730 21649722 20852296 28556204 32360483 30059369 30900170 35977118 36738134 35326682
4882C5326682R598820J8749621P871382p785327j372165J6728307J4926515J109476
$$ 35326682 44925502 63675123 71546505 63761178 62389013 79117320 94043835 95153311
4874I5153311J3549715M2024701K0013464p1520086j47946660j21640584k1744628
$$ 95153311 108703026 150727727 170741191 99221105 -48725555 -170366139 -192110767
4867a92110767M6658876M0618728J2070898J0258198J9967308J2260289j717426
$$ -192110767 -145451891 -104833163 -92762265 -82504067 -62536759 -50276470 -51993896
4860e1993896P85723J1309199R503588k7221j81041O745350O042684k396712o622818
$$ -51993896 -51208173 -39898974 -30395386 -30422607 -30603648 -23858298 -17815614 -20212326 -26835144
4851b6835144l882013p47579J129910L792199L966672j035756m767349j212511
$$ -26835144 -30717157 -31464736 -30334826 -26542627 -22575955 -23611711 -28379060 -29591571
4843b9591571L837594K645115m54858K859821R387419R711691L896939l29466
$$ -29591571 -25753977 -23108862 -23563720 -20703899 -11316480 -1604789 2292150 1962684
4835A962684r58029j778754k656377p72325J258605j107774n070222m375781l44557
$$ 1962684 1004655 -774099 -3430476 -4202801 -2944196 -4051970 -9122192 -13497973 -13842530
4826a3842530K60416l364863n560768l819355r59883J171151L107971M189872
$$ -13842530 -13582114 -16946977 -22507745 -26327100 -27286983 -26115832 -23007861 -18817989
4818a8817989L746144L811174N026743L220874l563521q679014n218172K675990
$$ -18817989 -15071845 -11260671 -6233928 -3013054 -6576575 -15255589 -20473761 -17797771
4810a7797771N129883N93884l691162l318017p06814J176647J619577j16805l167538
$$ -17797771 -12667888 -12074004 -15765166 -19083183 -19789997 -18613350 -16993773 -17110578 -20278116
4801b0278116k999634K412615O960155M176809k285632m068525j197262o55097
$$ -20278116 -23277750 -20865135 -13904980 -9728171 -12013803 -16082328 -17279590 -17934687
4793a7934687l848522n170075k363294Q97223K596982L954510L897038O69973
$$ -17934687 -21783209 -26953284 -29316578 -28419355 -25822373 -21867863 -17970825 -17300852
4785a7300852j800897J495910O431631M465098k539258l754442L020805P440989
$$ -17300852 -19101749 -17605839 -11174208 -6709110 -9248368 -13002810 -9982005 -2541016
4777b541016L660101p79401J291471M950129K720749k974514n184236l715278
$$ -2541016 1119085 339684 1631155 6581284 9302033 6327519 1143283 -2571995
4769b571995k996810l348177j725667J885203M684191N297659L725773L2249l585132
$$ -2571995 -5568805 -8916982 -10642649 -8757446 -4073255 1224404 4950177 4982426 1397294
4760A397294l108463J616798N342029M476097J346356j281591m491798q381942
$$ 1397294 -1711169 -94371 5247658 9723755 11070111 9788520 5296722 -3085220
4752c085220q685985l185922L288802N348294M259020L805803L472459J334889
$$ -3085220 -11771205 -14957127 -11668325 -6320031 -2061011 1744792 5217251 6552140
4744F552140m05852Q65610K097055j228648o846567q005218l057896K794472M968048
$$ 6552140 6146288 7011898 9108953 7880305 1033738 -6971480 -10029376 -7234904 -2266856
4735b266856L941167K299762J359791J047356M26735j440812l406159k479430
$$ -2266856 1674311 3974073 5333864 6381220 6807955 5367143 1960984 -518446
4727e18446J778384N129478L526288j610763n366670m878124r39103L772061O036500
$$ -518446 1259938 6389416 9915704 8304941 2938271 -1939853 -2878956 893105 6929605
4718F929605L942937o62622l743713m186226m313107m703856l177326k68696P0815
$$ 6929605 10872542 10209920 6466207 2279981 -2033126 -6736982 -9914308 -10183004 -10112189
4709a0112189k226164j628596L692399P323148M332159p42002j670300l46754
$$ -10112189 -12338353 -13966949 -10274550 -2951402 1380757 638755 -1031545 -1378299
4701a378299j669477l950548k683773L11537K89208r84225J798918P058008P777508
$$ -1378299 -3047776 -6998324 -9682097 -9370560 -9081352 -10065577 -8266659 -1208651 6568857
4692F568857K513093l177298n608843n564147k991148K656198P177049N076036
$$ 6568857 9081950 5904652 295809 -5268338 -8259486 -5603288 1573761 6649797
4684F649797j415493m606090k841182j737123l662332m564480k374632j00929
$$ 6649797 5234304 628214 -2212968 -3950091 -7612423 -12176903 -14551535 -14652464
4676a4652464J024200L218266N407082L453221r60609q56887L967552N046507
$$ -14652464 -13628264 -10409998 -5002916 -1549695 -2510304 -3367191 600361 5646868
4668E646868p92993n441672k759031J691380Q59060k531956k813317j820905l631651
$$ 5646868 4853875 -587797 -3346828 -1655448 -796388 -3328344 -6141661 -7962566 -11594217
4659a1594217n138785j463853L870031L866438m5419n13406L362647N443007L556329
$$ -11594217 -16733002 -18196855 -14326824 -10460386 -10505805 -11019211 -7656564 -2213557 1342772
4650A342772K158392L349734L338283j75795l674027l380909k19752K878588M557739
$$ 1342772 3501164 6850898 10189181 10013386 6339359 2958450 2738698 5617286 10175025
4641A0175025M282059J746648j269254j665384O52129J772014j275735o485358
$$ 10175025 14457084 16203732 14934478 13269094 13921223 15693237 14417502 7932144
4633G932144r222945p386477l106221J16375J091438J303380J677475O56771k617351
$$ 7932144 -1290801 -8677278 -11783499 -11667124 -10575686 -9272306 -7594831 -6938060 -9555411
4624i555411m949730k846995J122761J088781k413554k007499M678007R622495
$$ -9555411 -14505141 -17352136 -16229375 -15140594 -17554148 -19561647 -14883640 -5261145
4616e261145N831873j819152l853331L7025K057198j295920n418783n472892j653386
$$ -5261145 570728 -1248424 -5101755 -5064730 -3007532 -4303452 -9722235 -15195127 -16848513
4607a6848513L395451P132104P171275L387010l73328o17948R25630O90597p01907
$$ -16848513 -13453062 -6320958 850317 4237327 3863999 3246051 4171681 4862278 4160371
4598D160371o15450j2574r96436j233950K120244M909500O75023p753147j0188273
$$ 4160371 3544921 3532347 2535911 1301961 3422205 8331705 9006728 1253581 -8934692
4589h934692l599985L787710M965544K584566J850767K545316K376720K064989
$$ -8934692 -12534677 -8746967 -3781423 -1196857 653910 3199226 5575946 7640935
4581G640935K493390J614626j696391m659251m737711l120532j690227n09931
$$ 7640935 10134325 11748951 10052560 5393309 655598 -2464934 -4155161 -4665092
4573d665092j19963j633800k873975R3312N622575O867263J943145l029146m026189
$$ -4665092 -4785055 -6418855 -9292830 -9199518 -3576943 3290320 5233465 2204319 -1821870
4564a821870m586004o852374n506234K618444J0140226Q699658J488793k307046
$$ -1821870 -6407874 -13260248 -18766482 -16148038 -6007812 2691846 4180639 1873593
4556A873593j115389j85217q76357k11221J165049j973j829082K93609M221327
$$ 1873593 758204 572987 -303370 -514591 650458 648485 -1180597 -886988 3334339
4547C334339L376025j322721j786486L308463N013825j616730q920036q062579
$$ 3334339 6710364 5387643 3601157 6909620 11923445 10306715 1386679 -6675900
4539f675900j678358J867285J346822J982720M922823N358120J158083k975199
$$ -6675900 -8354258 -6486973 -5140151 -3157431 1765392 7123512 8281595 5306396
4531E306396k064808K235012L895992J85581n086003o271405k661356R59931P17918
$$ 5306396 3241588 5476600 9372592 9558173 4472170 -1799235 -4460591 -3500660 -2782742
4522b782742j521656j508649J067751K667785J373833j225559l397514m811430
$$ -2782742 -4304398 -5813047 -4745296 -2077511 -703678 -1929237 -5326751 -10138181
4514a0138181m416046q01183M067431N298389J318936l495451m657134l068558
$$ -10138181 -14554227 -15355410 -11287979 -5989590 -4670654 -8166105 -12823239 -15891797
4506a5891797k093256j965132o44332J574300K206539Q08630l85840k92199m41735
$$ -15891797 -17985053 -19950185 -20594517 -19020217 -16813678 -16005048 -16390888 -16683087 -17124822
4497a7124822j827098k934829k438627j760138k682923l604283j048927M861925
$$ -17124822 -18951920 -21886749 -24325376 -26085514 -28768437 -32372720 -33421647 -28559722
4489b8559722R272191Q453372M586672K314464K269652J440503q96811j951671
$$ -28559722 -19287531 -10834159 -6247487 -3933023 -1663371 -222868 -1119679 -3071350
4481c071350p67810l84033k614442m547648l140061j8127J681789K389371M102131
$$ -3071350 -3839160 -4223193 -6837635 -11385283 -14525344 -14543471 -12861682 -10472311 -6370180
4472f370180N666740M469158J335938n96213q94835j530060k442650j803631j96281
$$ -6370180 -703440 3765718 5101656 4505443 3610608 2080548 -362102 -2165733 -2362014
4463b362014k0086p65521N46430L694627M504263J005571l505514n151151m107002
$$ -2362014 -2382100 -3147621 -2601191 1093436 5597699 6603270 3097756 -2053395 -6160397
4454f160397k942911k700888k150492K25772L952977N842650L064448k022550
$$ -6160397 -9103308 -11804196 -13954688 -13728916 -9775939 -3933289 -868841 -2891391
4446b891391l215005R34184L963469J114395k618822n64904L896898K764118k267316
$$ -2891391 -6106396 -5172212 -1208743 -94348 -2713170 -3278074 618824 3382942 1115626
4437A115626k004671M044667N753093p77907o295494l529361J454054K85404m285786
$$ 1115626 -889045 3155622 8908715 8130808 1835314 -1694047 -239993 45411 -4240375
4428d240375m582760p28423J797781K309922L844223N423073L603290l83327k004813
$$ -4240375 -8823135 -9551558 -7753777 -5443855 -1599632 3823441 7426731 7043404 5038591
4419E038591k72728K398465M845961O408590M487304j507269o654255o592552
$$ 5038591 4765863 7164328 12010289 18418879 22906183 21398914 14744659 8152107
4411H152107m109790m074242n231976l312297R50221L533383L938136L809942
$$ 8152107 4042317 -31925 -5263901 -8576198 -7625977 -4092594 -154458 3655484
4403C655484K078175j648361k633983K079896O071826K035771n350163n565964
$$ 3655484 5733659 4085298 1451315 3531211 9603037 11638808 6288645 722681
4395G22681Q33954L089837k222648o521986l959989M73506J012766p74080k054680
$$ 722681 1556635 4646472 2423824 -4098162 -8058151 -7584645 -6571879 -7345959 -9400639
4386i400639l897724n943078m085017J974504O230845N529166L900830M032499
$$ -9400639 -13298363 -19241441 -23326458 -21351954 -15121109 -9591943 -5691113 -1658614
4378a658614K550127j639625k839371J640605N127350J998759k689556j700618
$$ -1658614 891513 -748112 -3587483 -1946878 3180472 5179231 2489675 789057
4370G89057K569826L257353Q60262Q57961L113406K706236p08536k781988k659729
$$ 789057 3358883 6616236 7476498 8334459 11447865 14154101 13445565 10663577 8003848
4361H003848l582823n623604m944076q68811K382505K030314n0316j174699p61830
$$ 8003848 4421025 -1202579 -6146655 -7015466 -4632961 -2602647 -2652963 -3827662 -4589492
4352d589492R78345L508362M948702L962020K360645K485423K721135l72745n738750
$$ -4589492 -3611147 -102785 4845917 8807937 11168582 13654005 16375140 16002395 10263645
4343A0263645p962009m550503N19072J892367j107271m824604n796254l586175
$$ 10263645 2301636 -2248867 -1729795 162572 -944699 -5769303 -11565557 -15151732
4335a5151732r7771K685087M010495L889686K566805J252287J770501L564245
$$ -15151732 -15249503 -12564416 -8553921 -4664235 -2097430 -845143 925358 4489603
4327D489603K927294j670872n576221l914697K83057K75506l163006k842621K041881
$$ 4489603 7416897 5746025 169804 -3744893 -3461836 -3186330 -6349336 -9191957 -7150076
4318g150076L691868r99609m775157k441520P00914m99167j317076L284587P776756
$$ -7150076 -3458208 -4457817 -9232974 -11674494 -10973580 -11472747 -12789823 -9505236 -1728480
4309a728480N166276M0767R46823N242841M080071j528769k985469q2707p14447
$$ -1728480 3437796 3478563 4425386 9668227 13748298 12219529 9234060 9151353 8436906
4300H436906n097137m690574J325722K784469l950615q446662k767242N769346
$$ 8436906 3339769 -1350805 -25083 2759386 -1191229 -9637891 -12405133 -6635787
4292f635787O461937P61704k770993k118271j572798k505211k477135r28795N38523
$$ -6635787 -173850 587854 -2183139 -4301410 -5874208 -8379419 -10856554 -11785349 -11246826
4283a1246826J492271J675389n78609m733983o011350j386031N214038P933451
$$ -11246826 -9754555 -8079166 -8657775 -13391758 -19403108 -20789139 -15575101 -7641650
4275g641650O483947M541316L509238K465157K117379L957190O364222N635817
$$ -7641650 -1157703 3383613 6892851 9358008 11475387 15432577 21796799 27432616
4267B7432616Q97402m673524p435255o470422l669578j633846r49111L25165L216178
$$ 27432616 28330018 23656494 16221239 9750817 6081239 4447393 3498282 3823447 7039625
4258G039625N086528L083967q81479k540610j709229j570826k314622j362205
$$ 7039625 12126153 15210120 14328641 11788031 10078802 8507976 6193354 4831149
4250D831149K80570j182297m410206l375060K281678N165846J556204k794275
$$ 4831149 5111719 3929422 -480784 -3855844 -1574166 3591680 5147884 2353609
4242B353609k346942K92811J031118J412088L162849K679892k060506n317184
$$ 2353609 6667 299478 1330596 2742684 5905533 8585425 6524919 1207735
4234A207735j929121L432286L102029k159026o279832p755298q180708n472849
$$ 1207735 -721386 2710900 5812929 3653903 -2625929 -10381227 -18561935 -24034784
4226b4034784K084887Q555771P011388J045733l08395K829575K466014k280420
$$ -24034784 -21949897 -13394126 -6382738 -5337005 -5645400 -2815825 -349811 -2630231
4218b630231l263367K075414N545422J507633m399549m902067j489958L70485
$$ -2630231 -5893598 -3818184 1727238 3234871 -1164678 -6066745 -7556703 -7186218
4210g186218R631j44995j34429r57186j080996R53681L263514L606028K937919
$$ -7186218 -7176587 -7321582 -7456011 -8413197 -9494193 -8540512 -5276998 -1670970 1266949
4201A266949K907408K621811R52685o17805m93523K9974q62694k157962j756434
$$ 1266949 4174357 6796168 7748853 7131048 6637525 6667499 5804805 3646843 1890409
4192A890409P2680J363129J258730K94411q20924j264974m03099P76624J62555
$$ 1890409 1963089 3326218 4584948 4879359 4058435 2793461 2390362 3166986 3329541
4183C329541k472487m758786n015211m136295l008696n37219L643456O486995
$$ 3329541 857054 -3901732 -8916943 -13053238 -16061934 -16599153 -12955697 -6468702
4175f468702M498799j118865m777710k536402L613937Q203124P993321M155512
$$ -6468702 -1969903 -3088768 -7866478 -10402880 -6788943 1414181 9407502 13563014
4167A3563014m69401m075195n378422l281157O14600J710904j658891m256767
$$ 13563014 13093613 9018418 3639996 358839 973439 2684343 1025452 -3231315
4159c231315j052489L673634J750278m895842n164562M100948J2170533J0551521
$$ -3231315 -4283804 -610170 1140108 -3755734 -8920296 -4819348 7351185 17902706
4151A7902706M888780L316447K696159l286744j0496322j1037212p441353p149084
$$ 17902706 22791486 26107933 28804092 25517348 15021026 3983814 -3457539 -10606623
4143a0606623p678477j498448P572800Q120178J70805m742084k702373j174872
$$ -10606623 -18285100 -19783548 -12210748 -4090570 -3919765 -8661849 -11364222 -12539094
4135a2539094k590755m80018N299404O135623J393201L19473K675258k642169
$$ -12539094 -15129849 -15609867 -10310463 -4174840 -2781639 -2462166 213092 -2429077
4127b429077j2294275n037984K2232434L7792504J6511945j9721590k9844579
$$ -2429077 -14723352 -19761336 2471098 40263602 56775547 37053957 7209378
4120G209378j0351918N451437N641q312187j813881Q824061O486430m297623p765454
$$ 7209378 -3142540 2308897 2314538 -5997649 -7811530 1012531 7498961 3201338 -4564116
4111d564116k056891J766252j621815o984919q378571m496771K897338R169419
$$ -4564116 -6621007 -4854755 -6476570 -13461489 -21840060 -26336831 -23439493 -14270074
4103a4270074Q540477R66788n862893n562697m32376L582701M656861L984738
$$ -14270074 -5729597 -4762809 -10625702 -16188399 -16620775 -13038074 -8381213 -4396475
4095d396475J823841q18034q03331K307180L909516J115795k092017j008178K329038
$$ -4396475 -2572634 -3390668 -4193999 -1886819 2022697 3138492 1046475 38297 2367335
4086B367335K870422M75371j335408k043129l802570n710695l966031J872753
$$ 2367335 5237757 5713128 4377720 2334591 -1467979 -7178674 -11144705 -9271952
4078i271952O920626O378457P41572m856538n464847j011070L288082K654329
$$ -9271952 -2351326 4027131 4768703 -87835 -5552682 -6563752 -3275670 -621341
4070f21341j018643j600216K053170L848923j05885m616033k645821L960222O905182
$$ -621341 -1639984 -3240200 -1187030 2661893 2556008 -2060025 -4705846 -745624 6159558
4061F159558L129194j871796k672635n21974L75232r70864k464940k659586j772662
$$ 6159558 9288752 7416956 4744321 4222347 4597579 3626715 1161775 -1497811 -3270473
4052c270473k74876J424807K401286J871351L19000j076043k030363l134481m117989
$$ -3270473 -3545349 -2120542 280744 2152095 2471095 1395052 -635311 -3769792 -7887781
4043g887781l479209q88945J096647k36215l432127l775420M92945N328067O086482
$$ -7887781 -11366990 -12255935 -11159288 -11395503 -14827630 -18603050 -18110105 -12782038 -6695556
4034f695556L320565Q51897J64046J00737N09447J955237K558725j81879m124330
$$ -6695556 -3374991 -2523094 -2359048 -2258311 -1748864 206373 2765098 2583219 -1541111
4025a541111l790808J727789O513037N503333P03622k616347k580091r00608O94861
$$ -1541111 -5331919 -3604130 2908907 8412240 9115862 6499515 3919424 3018816 3713677
4016C713677J275886O0218k328041l537309k487276q98827j12136J105705L237153
$$ 3713677 4989563 5049781 2721740 -815569 -3302845 -4201672 -4313808 -3208103 29050
4007B9050L221875j553475q179294j0751241p299143j267500L320610N364851
$$ 29050 3250925 1697450 -6481844 -17233085 -24532228 -25799728 -22479118 -17114267
3999a7114267N671449N145450M325074K960007J58895l520850m825703r56633
$$ -17114267 -11442818 -6297368 -1972294 987713 1146608 -2374242 -7199945 -8156578
3991h156578N949287R682176O310409j386772o684798n743192j068328J989956
$$ -8156578 -2207291 7474885 13785294 12398522 5713724 -29468 -1097796 892160
3983H92160J523905L34691N76342o7965l987911p667860n290869J760252N018890
$$ 892160 2416065 2750756 3327098 3259133 -728778 -8396638 -13687507 -11927255 -6908365
3974f908365Q34032l561330l00174P324360R433882L527455k820036l097762M83857
$$ -6908365 -6074333 -9635663 -9935837 -2611477 6822405 10349860 7529824 4432062 4915919
3965D915919K276372J246740N51639J832988L248816K456412n91944l920431n546951
$$ 4915919 7192291 8439031 8990670 10823658 14072474 16528886 15936942 12016511 6469560
3956F469560m934390k734022L14183L354476M518642K040695k627039m762693
$$ 6469560 1535170 -1198852 -884669 2469807 6988449 9029144 6402105 1639412
3948A639412j651658L270924M156142J53294l643739k953628O61618K834141K420915
$$ 1639412 -12246 3258678 7414820 7568114 3924375 970747 1632365 4466506 6887421
3939F887421K104189L287261K941556k338616r790392j1306527l161072P234671
$$ 6887421 8991610 12278871 15220427 12881811 3091419 -8215108 -11376180 -4141509
3931d141509Q491743r19623j0497962j0814391m161533J027236K076610L005991
$$ -4141509 4350234 3430611 -7067351 -17881742 -22043275 -21016039 -18939429 -15933438
3923a5933438N865325P552921N839166L174427K260031J665213j166314m847398
$$ -15933438 -10068113 -2515192 3323974 6498401 8758432 10423645 9257331 4409933
3915D409933n246287j329646K598566J435249m585163r210541o483308K126103
$$ 4409933 -836354 -2166000 432566 1867815 -2717348 -11927889 -18411197 -16285094
3907a6285094Q199668N271962l565913q757792m842559L888348Q731212N923520
$$ -16285094 -8085426 -2813464 -6379377 -15137169 -19979728 -16091380 -7360168 -1436648
3899a436648m62131l955368k329286J476859L670396L236477J384177o10393j728209
$$ -1436648 -1898779 -5854147 -8183433 -6706574 -3036178 200299 1584476 974083 -754126
3890g54126r69034J127970J826554l79170k521606o52682L665743M398309n37615
$$ -754126 -1723160 -595190 1231364 852194 -1669412 -2322094 1343649 5741958 5204343
3881E204343n989965o680759l860558k112095k686831l404808k925989j635082
$$ 5204343 -785622 -7466381 -11326939 -13439034 -16125865 -19530673 -22456662 -24091744
3873b4091744L81074L178671N463548N417091K523796k216776o344586o070088
$$ -24091744 -23710670 -20531999 -15068451 -9651360 -7127564 -9344340 -15688926 -21759014
3865b1759014L19601Q248659J0262477N475771R27545J124574K029119n64759
$$ -21759014 -21439413 -13190754 -2928277 2547494 3475039 4599613 6628732 6063973
3857F063973l040702o56974L238307K589497q80306j265264N43100r08407m245042
$$ 6063973 3023271 2366297 5604604 8194101 7313795 6048531 6591631 5683224 1438182
3848A438182k586219L696767O035482J168345m365051n820058o373497p856597
$$ 1438182 -1148037 2548730 8584212 9752557 5387506 -432552 -6806049 -14662646
3840a4662646n453717K456464Q150512N629112M54328N67014L668120K712698
$$ -14662646 -20116363 -17659899 -9509387 -3880275 -3425947 -2858933 809187 3521885
3832C521885j022321m27869M465054N955789R62985m722792n568665k507323J495753
$$ 3521885 2499564 2071695 6536749 12492538 13455523 8732731 3164066 656743 2152496
3823B152496N557962Q211711O240476m39451o477613o853275k691672Q78579P84547
$$ 2152496 7710458 15922169 22162645 21723194 15245581 8392306 5700634 6579213 7363760
3814G363760j855677m006251l398788K84L792025M874576K181160k425059n957173
$$ 7363760 5508083 1501832 -1896956 -1896672 1895353 6769929 8951089 6526030 568857
3805E68857o542660m178579k24800L512397N495322M724498J292467k517376k961878
$$ 568857 -5973803 -10152382 -10377182 -6864785 -1369463 3355035 4647502 2130126 -831752
3796h31752J057850N212686M144952j167739m108061j588041J573373k8733m407790
$$ -831752 226098 5438784 9583736 8415997 4307936 2719895 4293268 4264535 -143255
3787a43255n363745j191606L926166N957665M654353J715120j328907l308969
$$ -143255 -5507000 -6698606 -2772440 3185225 7839578 9554698 8225791 4916822
3779D916822l819226l351897j770524J882421O306303P052807J923477m516884
$$ 4916822 1097596 -2254301 -4024825 -2142404 4163899 11216706 13140183 8623299
3771H623299n683684j317833K732943K552565p1280k079394l208856m272032m598946
$$ 8623299 2939615 1621782 4354725 6907290 6836010 4756616 1547760 -2724272 -7323218
3762g323218l188509o67556J296019J610527M51982o47430K31004K882751M162838
$$ -7323218 -10511727 -11179283 -9883264 -8272737 -7820755 -8468185 -8237181 -5354430 -1191592
3753a191592J737651k041703k686398K80277K777790K178968O72958J215970K802882
$$ -1191592 546059 -1495644 -4182042 -3901765 -1123975 1054993 1727951 2943921 5746803
3744E746803K115744j418442m497957l862740N4937L930355N377826N012854M329794
$$ 5746803 7862547 6444105 1946148 -1916592 -1861655 2068700 7446526 12459380 16789174
3735A6789174K794169r46957n283259o098502k378514J303336L14920l862270
$$ 16789174 19583343 18636386 13353127 7254625 4876111 6179447 6494367 2632097
3727B632097n681892k575374K656793N723804M767235J041040k222127k232318
$$ 2632097 -3049795 -5625169 -2968376 2755428 7522663 8563703 6341576 4109258
3719D109258L59028J915485Q11568J9110K335932N277078M292092l97735m122682
$$ 4109258 4468286 6383771 7195339 7214449 9550381 14827459 19119551 18721816 14599134
3710A4599134m225091k449097j250962j321192k595131m273385l971640k28012
$$ 14599134 10374043 7924946 6673984 5352792 2757661 -1515724 -5487364 -5715376
3702e715376M306100N492118L136665L76470j513707l425849m205300j361438
$$ -5715376 -1409276 4082842 7219507 7595977 6082270 2656421 -1548879 -2910317
3694b910317L623368N914365M290956K501955K490428J590854j761892n004174
$$ -2910317 713051 6627416 10918372 13420327 15910755 17501609 15739717 10735543
3686A0735543o499972q054635r348647n789517L567807J1326342J0754677N276624
$$ 10735543 4235571 -3819064 -13167711 -18957228 -15389421 -4063079 6691598 11968222
3678A1968222K592378K802201k3867o213559q872445m922351k73002p96350l807563
$$ 11968222 14560600 17362801 17338934 11125375 2252930 -2669421 -2942423 -3738773 -7546336
3669g546336k935069K119017N523981L604224j120226m354627n025258m465061
$$ -7546336 -10481405 -8362388 -2838407 765817 -354409 -4709036 -9734294 -14199355
3661a4199355l109778n08610K357612L598226L556026M613750O585866N394197
$$ -14199355 -17309133 -17817743 -15460131 -11861905 -8305879 -3692129 2893737 8287934
3653H287934p78757o678734n878686k05115K217265j378242m683521k401805J752960
$$ 8287934 7509177 830443 -5048243 -5253358 -3036093 -4414335 -9097856 -11499661 -9746701
3644i746701J357804k832701m755309k326347O95423J369645J175414K439290
$$ -9746701 -8388897 -11221598 -15976907 -18303254 -17607831 -16238186 -15062772 -12623482
3636a2623482M804797O166563M870124Q23289l721187n125371k377094O59153
$$ -12623482 -7818685 -1652122 3218002 4041291 320104 -4805267 -7182361 -6523208
3628f523208l33854m177400n765211l200936J34819J036723M26322M15268L98839
$$ -6523208 -6857062 -11034462 -16799673 -20000609 -19865790 -18829067 -18402745 -17987477 -17588638
3619a7588638j465848m309601m503647J47625P167891J1139789R138682M076481
$$ -17588638 -19054486 -23364087 -27867734 -27720109 -20552218 -9412429 -273747 3802734
3611C802734J297801J853501J630333j748701m533521k539795J573284J738641
$$ 3802734 5100535 6954036 8584369 6835668 2302147 -237648 1335636 3074277
3603C074277j919324k813313J767133N745568K784383m596356q620584o316502
$$ 3074277 1154953 -1658360 108773 5854341 8638724 4042368 -4578216 -10894718
3595a0894718j598016J295466K036112K016144J888285K219234L541244M599906
$$ -10894718 -12492734 -11197268 -9161156 -7145012 -5256727 -3037493 503751 5103657
3587E103657L214380J74394n69121K265960M025988J75620o159157p357628k024019
$$ 5103657 8318037 8492431 7923310 10189270 14215258 14390878 8231721 874093 -1149926
3578a149926K442680J3219n626079o579767j454989M144085O110810N580812M433829
$$ -1149926 1292754 1305973 -4320106 -10899873 -12354862 -8210777 -2099967 3480845 7914674
3569G914674K420956J22413R827K094175K327121j676028o284546o378135j978906
$$ 7914674 10335630 10458043 10467870 12562045 14889166 13213138 6928592 550457 -1428449
3560a428449K647857M566724L815063J253432j868995l323138k025066m5201R9645
$$ -1428449 1219408 5786132 9601195 10854627 8985632 5662494 3637428 3592227 3691872
3551C691872r36790j161611j247124l151448n695795n582686k740903o53509q01119
$$ 3691872 2755082 1593471 346347 -2805101 -8500896 -14083582 -16824485 -17477994 -18279113
3542a8279113o34066J708199M169304M090896J955500j45393j490670k165134
$$ -18279113 -18913179 -17204980 -13035676 -8944780 -6989280 -7134673 -8625343 -10790477
3534a0790477j483181P22830K526992J942010O17k36703K085972L989034K244810
$$ -10790477 -12273658 -11550828 -9023836 -7081826 -7081209 -7317912 -5231940 -1242906 1001904
3525A001904j939717l203583J909165R700701J2168096N943075l493465q070603
$$ 1001904 -937813 -4141396 -2232231 7468470 19636566 25579641 22086176 14015573
3517A4015573n822551j206017J432582J434266j54630k258872l086144j105851
$$ 14015573 8193022 6987005 8419587 9853853 9699223 7440351 4354207 3248356
3509C248356K328053L951263K889994J395179P34622n95669l472434n960411o064641
$$ 3248356 5576409 9527672 12417666 13812845 14547467 13951798 10479364 4518953 -1545688
3500a545688m074885q15751L550132P374780P501990L872199J062450K103106
$$ -1545688 -5620573 -6436324 -2886192 4488588 11990578 15862777 16925227 19028333
3492A9028333L585134Q35716m343195n927966k571207P95363L40014k507922n108064
$$ 19028333 22613467 23449183 19105988 13178022 10606815 11402178 11742192 9234270 4126206
3483D126206o919367o868938k361115N426581R207402L702963n901989r076714
$$ 4126206 -2793161 -9662099 -12023214 -6596633 2610769 6313732 411743 -8664971
3475h664971l107413M224465N906706L975990L762352M988237L677327n6179k029752
$$ -8664971 -11772384 -7547919 -1641213 2334777 6097129 11085366 14762693 14706514 12676762
3466A2676762j005039k22839j514457k875135l015182l437087m141528k189527
$$ 12676762 11671723 11448884 9934427 7059292 4044110 607023 -3534505 -5724032
3458e724032K653291N590954L835816J416129K236781K861868j308473o313358
$$ -5724032 -3070741 2520213 6356029 7772158 10008939 12870807 11562334 5248976
3450E248976m457071K693957N431909Q31599k934252m07613K243777j845127q091583
$$ 5248976 791905 3485862 8917771 9749370 6815118 6407505 8651282 6806155 -1285428
3441a285428p698142k035833j46579l864290n228197J88342O129596N424007J93346
$$ -1285428 -8983570 -11019403 -11165982 -15030272 -20258469 -20070127 -13940531 -8516524 -8323178
3432h323178k629226j354350M29720J123791K535096M618798M201581L53285k935251
$$ -8323178 -10952404 -12306754 -11877034 -10753243 -8218147 -3599349 602232 955517 -1979734
3423a979734j794133K334215N043922M745318L209209J288386k339607p384165
$$ -1979734 -3773867 -1439652 3604270 8349588 11558797 12847183 10507576 3123411
3415C123411j0070257p410319j642285K299590L134073M251849P883872J0878971
$$ 3123411 -6946846 -14357165 -15999450 -13699860 -10565787 -6313938 1569934 12448905
3407A2448905Q339991M05420o909403q187589m443881j203160j517479k983293
$$ 12448905 20788896 21194316 14284913 6097324 1653443 450283 -1067196 -4050489
3399d050489k246944p5887L89414j074044j654788m10903N38366M74738J563514
$$ -4050489 -6297433 -6373320 -5983906 -7057950 -8712738 -9123641 -8585275 -8110537 -6547023
3390f547023L944168L626738j308826o103112n372563r68630J230836J89488l30554
$$ -6547023 -2602855 1023883 -284943 -6388055 -11760618 -12729248 -11498412 -11308924 -11639478
3381a1639478P06390N05141j227057j207111J213103K758315K529458L479165
$$ -11639478 -10933088 -10427947 -11655004 -12862115 -11649012 -8890697 -6361239 -2882074
3373b882074N627291M381105j001335l661828J126223P655147P186471N8007n651741
$$ -2882074 2745217 7126322 6124987 2463159 3589382 11244529 18431000 18489007 12837266
3364A2837266n155525q56297L176848M957863L483827q58573m559327l926719
$$ 12837266 7681741 6825444 10002292 14960155 18443982 17585409 13026082 9099363
3356I099363j39324K124988J110855m08720j3923J287842J352332n83578m088230
$$ 9099363 8960039 11085027 12195882 11787162 11773239 13061081 14413413 13829835 9741605
3347I741605p752057q971349n919072k35210L971914M045139P01077l197860m629658
$$ 9741605 1989548 -6981801 -12900873 -13136083 -9164169 -5119030 -4417953 -7615813 -12245471
3338a2245471k502758Q66677K027674J254005K260936N432569N695030P18933
$$ -12245471 -14748229 -13881552 -11853878 -10599873 -8338937 -2906368 2788662 3507595
3330C507595l436414o54960N056224N135551k22597l001600r53911o82387n290814
$$ 3507595 71181 -583779 4472445 9607996 9385399 6383799 5429888 4747501 -543313
3321e43313q357966m713737O17507L66442l830480m869985r50968L519318N442289
$$ -543313 -8901279 -13615016 -12997509 -12631067 -16461547 -21331532 -22282500 -18763182 -13320893
3312a3320893N596224M921528L243318J191386l99340k235718m571009m962038
$$ -13320893 -7724669 -2803141 440177 1631563 1232223 -1003495 -5574504 -10536542
3304a0536542j511474L229525N388057N209926N175605M352129L5161n514578
$$ -10536542 -12048016 -8818491 -3430434 1779492 6955097 11307226 11342387 5827809
3296E827809o057800m53312M598735L403811j443819l695348j887909N19846J149891
$$ 5827809 -229991 -683303 3915432 7319243 5875424 2180076 292167 812013 1961904
3287A961904R33804J146306J406651P63110j142197l801790n411417l690033J039630
$$ 1961904 2895708 4042014 5448665 6211775 5069578 1267788 -4143629 -7833662 -6794032
3278f794032M663995L634459j60565j733605N0622J338196j93100j575651K96136
$$ -6794032 -2130037 1504422 1343857 -389748 -339126 999070 805970 -769681 -473545
3269d73545K980848J736019l215413o724818n684521k234991L33115J293540J064888
$$ -473545 2507303 4243322 1027909 -5696909 -11381430 -13616421 -13283306 -11989766 -10924878
3260a0924878n17701k646656k956446n82476K322428L923112N159822O772796
$$ -10924878 -11442579 -14089235 -17045681 -17628157 -15305729 -11382617 -6222795 550001
3252E50001O560789K703772k218569l983644k147455M51839K064104K418615N52558
$$ 550001 7110790 9814562 7595993 3612349 1464894 1916733 3980837 6399452 6952010
3243F952010l260857m825931p89037M436967K948653m595314q249197k841831
$$ 6952010 3691153 -1134778 -1923815 2513152 5461805 866491 -7382706 -10224537
3235a0224537M290692M510202M75562L29859L754504K967138l505240p291077
$$ -10224537 -5933845 -1423643 -948081 -618222 3136282 6103420 2598180 -4692897
3227d692897k576259N363369P861512L682454k082324n628608o162191l233336
$$ -4692897 -7269156 -1905787 5955725 9638179 7555855 1927247 -4234944 -7468280
3219g468280K199638N639697L245698k240129m380395j640700J767619L686925
$$ -7468280 -5268642 371055 3616753 1376624 -3003771 -4644471 -2876852 810073
3211H10073O509980R997376Q347149o67069q912690p217688J448829N834559K504095
$$ 810073 7320053 17317429 25664578 24997509 16084819 8867131 10315960 16150519 18654614
3202A8654614l24152L288167P479912L864826n641444j1687421j0000940m782808
$$ 18654614 18330462 21618629 29098541 32963367 27321923 15634502 5633562 850754
3194H50754q99216J414817L388757L860118Q29594m971394r608350r119261l654019
$$ 850754 -48462 1366355 4755112 8615230 9444824 4473430 -5134920 -14254181 -17908200
3185a7908200J694684K053895j000479j299962L043040O711651N209746J151184
$$ -17908200 -16213516 -14159621 -15160100 -16460062 -13417022 -6705371 -1495625 -344441
3177c44441j047473k068247m167302m926646j072602M388569N835516L663143
$$ -344441 -1391914 -3460161 -7627463 -12554109 -13626711 -9238142 -3402626 260517
3169B60517K064335M69611m100139p554739k204794R102775J3201817M773017
$$ 260517 2324852 2794463 -1305676 -8860415 -11065209 -1962434 11239383 16012400
3161A6012400n584308o829205j954238n977j713300k060694j419614m044022q148070
$$ 16012400 10428092 3598887 1644649 1638672 -74628 -2135322 -3554936 -7598958 -15747028
3152a5747028o846807J169971R092384J0598787N759414j413192o556053o649946
$$ -15747028 -22593835 -21423864 -12331480 -1732693 4026721 2613529 -3942524 -10592470
3144a0592470k613896M26261o29366j896732J818720Q402658J0970549P562283
$$ -10592470 -13206366 -12780105 -13409471 -15306203 -13487483 -5084825 5885724 13448007
3136A3448007K322457j980084n949024q310769o111874j595555j532510o574303
$$ 13448007 15770464 13790380 7841356 -469413 -6581287 -8176842 -9709352 -16283655
3128a6283655p951382M32401J1877403J4890583Q141141J025552L76949K911610
$$ -16283655 -24235037 -23802636 -11925233 2965350 11106491 12132043 12508992 15420602
3120A5420602K236892j860375m699951m406878l784544m701976m862106k183380
$$ 15420602 17657494 15797119 11097168 6690290 2905746 -1796230 -6658336 -8841716
3112h841716P79361L63640j938364j084438L846144Q008294P652587M264721L72835
$$ -8841716 -8062355 -7698715 -9637079 -10721517 -6875373 1132921 8785508 13050229 13423064
3103A3423064m050031q323276q813665m010295J592472K905220P88110p03544
$$ 13423064 9373033 1049757 -7763908 -11774203 -10181731 -7276511 -6488401 -7191945
3095g191945n87393j28881J144123L488254L721314l66118m573895l336683J496843
$$ -7191945 -7779338 -7908219 -6764096 -3275842 445472 79354 -4494541 -7831224 -6334381
3086f334381L296647P56364j427297j170029r65006j233292N86835L287597K036151
$$ -6334381 -3037734 -2281370 -3708667 -4878696 -5843702 -7076994 -6490159 -3202562 -1166411
3077a166411k658434l834241Q89318M586628J769900k836947j966105L016915
$$ -1166411 -3824845 -7659086 -6769768 -2183140 -413240 -3250187 -5216292 -2199377
3069b199377N006874J855357j902911k220061N18069L583505M161191P49827m558680
$$ -2199377 2807497 4662854 2759943 539882 1057951 4641456 8802647 9552474 4993794
3060D993794o715948l505125J020942J628081j551773m478393n100010m300181
$$ 4993794 -1722154 -5227279 -4206337 -2578256 -4130029 -8608422 -13708432 -18008613
3052a8008613k475523J060446N544616Q455698P972039M454467J31442j922835
$$ -18008613 -20484136 -19423690 -13879074 -5423376 2548663 7003130 7134572 5211737
3044E211737j08446L403459M608625K716593O47024l46013k684957p008776q871355
$$ 5211737 5103291 8506750 13115375 15831968 16478992 16132979 13448022 6439246 -2432109
3035b432109m621829K495367O286433N531570L944357L865209M021404K616249
$$ -2432109 -7053938 -4558571 1727862 7259432 11203789 15068998 19090402 21706651
3027B1706651q30615n853145j0175612r760074l239320M561449P054928L443052
$$ 21706651 20876036 15022891 4847279 -4912795 -8152115 -3590666 3464262 6907314
3019F907314j217752k902535k286421j726762j807579j494493L11173L510768
$$ 6907314 5689562 2787027 500606 -1226156 -3033735 -4528228 -4217055 -706287
3011g06287N797045M008244j626004o145378n369040j282332J131870R77251J438470
$$ -706287 5090758 9099002 7472998 1327620 -4041420 -5323752 -4191882 -3214631 -1776161
3002a776161L410548L642337J21711m268756n024213p57516O087529J1142948
$$ -1776161 1634387 5276724 5398435 1129679 -3894534 -4652050 1435479 12578427
2994A2578427J0395725L274422n387336q682939m523896K015010M331605J215601
$$ 12578427 22974152 26248574 20861238 12178299 7654403 9669413 14001018 15216619
2986A5216619k929677l913992k208026j110963j681960j582454L88624J204654
$$ 15216619 12286942 8372950 6164924 5053961 3372001 1789547 2178171 3382825
2978C382825k000516o157398n484160l18297K821030J491391J416962O491836
$$ 3382825 1382309 -4775089 -10259249 -10577546 -7756516 -6265125 -4848163 1643673
2970A643673J0570445N694308n122998j0728575o269837J876879N654665L777009
$$ 1643673 12214118 17908426 12785428 2056853 -4212984 -2336105 3318560 7095569
2962G095569k88877l450216m254640k825187j061357l75479O98734L575847N372794
$$ 7095569 6806692 3356476 -898164 -3723351 -4784708 -5160187 -4461453 -885606 4487188
2953D487188K305526l064553l701570J753233O356649M566845o07451l231743
$$ 4487188 6792714 3728161 26591 1779824 8136473 12703318 12095867 8864124
2945H864124k712764k470994l544763l788557j985020N36413J777994O94452k143459
$$ 8864124 6151360 3680366 135603 -3652954 -5637974 -5101561 -3323567 -2629115 -4772574
2936d772574m367915l727319j002058Q96459J326479K635864N338274N878717
$$ -4772574 -9140489 -12867808 -13869866 -12973407 -11646928 -9011064 -3672790 2205927
2928B205927J630998m382621o586461l229033K486322O276055N891886J830771
$$ 2205927 3836925 -545696 -7132157 -10361190 -7874868 -1598813 4293073 6123844
2920F123844k970050n069778l804826j920165k001300l504759m147675k600803
$$ 6123844 3153794 -1915984 -5720810 -7640975 -9642275 -13147034 -17294709 -19895512
2912a9895512J128786O014178R426594Q300359K676568l378664n862268m502745
$$ -19895512 -18766726 -12752548 -3325954 4974405 7650973 4272309 -1589959 -6092704
2904f092704j498374J197731J979397m21330m702382o723157m020404Q58120L861495
$$ -6092704 -7591078 -6393347 -4413950 -4835280 -9537662 -16260819 -20281223 -19423103 -15561608
2895a5561608M652219N484146O256553M445302N4846k932168j683749J161599
$$ -15561608 -10909389 -5425243 831310 5276612 5331458 2399290 715541 1877140
2887A877140O31863l790760o879299m231285J425328L123339r10997m001767K30054
$$ 1877140 2509003 -1281757 -8161056 -12392341 -10967013 -7843674 -8754671 -12756438 -12526384
2878a2526384Q344552J0651917L676760n683483r426899p370834m498255l193345
$$ -12526384 -4181832 6470085 10146845 4463362 -4963537 -12334371 -16832626 -20025971
2870b0025971j714504J556161N618680P960409O280931J65792p333205j1006655
$$ -20025971 -21740475 -20184314 -14565634 -6605225 -324294 -158502 -7491707 -18498362
2862a8498362q118329j081472N237099P618152N587410Q51076l165405l571490
$$ -18498362 -26616691 -27698163 -22461064 -14842912 -9255502 -8404426 -11569831 -15141321
2854a5141321j348860l55646j783863k288696P39742N114730P443622P787753
$$ -15141321 -16490181 -16845827 -18629690 -20918386 -20178644 -15063914 -7620292 167461
2846A67461P660305O111849J818729k639670k981286N42002K783368K35754m623622
$$ 167461 7827766 13939615 15758344 13118674 10137388 10679390 13462758 13698512 9074890
2837I074890o467214l222185J746148L424289J053432q08111J389889M353195
$$ 9074890 2607676 -614509 1131639 4555928 5609360 4801249 6191138 10544333
2829A0544333K071919m872028r268437p392422l344081j096489J342091N721961
$$ 10544333 12616252 7744224 -1524213 -8916635 -12260716 -13357205 -12015114 -6293153
2821f293153P849320M287345k69959L62662L520125J872851m510629q542808p317049
$$ -6293153 1556167 5843512 5573553 5936215 9456340 11329191 6818562 -1724246 -9041295
2812i041295m622163k517329J117081N544754N939711J639644j622595p22287
$$ -9041295 -13663458 -16180787 -15063706 -9518952 -3579241 -1939597 -3562192 -4284479
2804d284479K89084j899244l714273j036386L492115M643374K464539J050939
$$ -4284479 -3995395 -5894639 -9608912 -10645298 -7153183 -2509809 -45270 1005669
2796A005669J872132K709424J922084L06194p74554j016164j250107k405538l548057
$$ 1005669 2877801 5587225 7509309 7815503 7040949 6024785 4774678 2369140 -1178917
2787a178917j967491K473800M925951J723912k820975k000131K001613O74619
$$ -1178917 -3146408 -672608 4253343 5977255 3156280 1156149 3157762 3832381
2779C832381o184197q221393o71422O970104M978037k335697m918834k679719
$$ 3832381 -2351816 -10573209 -11244631 -4274527 703510 -1632187 -6551021 -9230740
2771i230740k625373m839321k646519M528035Q921881O108041N35259k169640
$$ -9230740 -11856113 -16695434 -19341953 -14813918 -5892037 216004 751263 -1418377
2763a418377j470615R72024M185226O309707N515403L480077L011496K422260
$$ -1418377 -2888992 -1916968 2268258 8577965 14093368 17573445 20584941 23007201
2755B3007201j677902o444707n389610L57042K068392k845210o162435k360490
$$ 23007201 21329299 14884592 9494982 9852024 11920416 9075206 2912771 552281
2747E52281J976862r30078p024727o889350l29267M666639M773405M039912M651047
$$ 552281 2529143 1599065 -5425662 -12315012 -12644279 -7977640 -3204235 835677 5486724
2738E486724L779893P75181k57300K283267L841272P55769l756542m498621j857247
$$ 5486724 9266617 10041798 9784498 12067765 15909037 16664806 12908264 8409643 6552396
2729F552396n22026k467049m771888l985476r6841M111935O149999N661410L722126
$$ 6552396 6030370 3563321 -1208567 -5194043 -5290884 -1178949 4971050 10632460 14354586
2720A4354586J100506j893652l956920l202651l79404L86275l276042p590266
$$ 14354586 15455092 13561440 9604520 6401869 6022465 6408740 3132698 -4457568
2712d457568o898212j608369K236213J589728J20357J784240M952016N684484
$$ -4457568 -11355780 -12964149 -10727936 -9138208 -9017851 -7233611 -2281595 3402889
2704C402889L513362P37275j499709l145055l353357j976268j052125j404304
$$ 3402889 6916251 7653526 6153817 3008762 -344595 -2320863 -3372988 -4777292
2696d777292J39325N771508J0657942P551167k520697j0019144r055244m510217
$$ -4777292 -4637967 1133541 11791483 19342650 16821953 6802809 -2252435 -6762652
2688f762652l980304p060843p098322j094699O701663J0391647Q159068K580149
$$ -6762652 -10742956 -17803799 -24902121 -25996820 -19295157 -8903510 -744442 1835707
2680A835707k098054k832383J46012L856033N826707N937622M576838J477158
$$ 1835707 -262347 -3094730 -2948718 907315 6734022 12671644 17248482 18725640
2672A8725640j851483j581655L019807O020485J470740p442517j1277371o737967
$$ 18725640 16874157 15292502 18312309 24332794 25803534 18361017 7083646 345679
2664C45679p47596l48052l656567m238260n56736L236575L723893J338808j834105
$$ 345679 -401917 -749969 -4406536 -8644796 -9201532 -5964957 -2241064 -902256 -2736361
2655b736361l809337k749255J532255N958037O572000K951978j403042l061223
$$ -2736361 -6545698 -9294953 -7762698 -1804661 4767339 7719317 6316275 3255052
2647C255052j558678J319130L425901L486335J854341L3195j318282l030795n072937
$$ 3255052 1696374 3015504 6441405 9927740 11782081 11815276 10496994 7466199 2393262
2638B393262n160306j787444K580537L897128J420392k210975m891926o035545
$$ 2393262 -2767044 -4554488 -1973951 1923177 3343569 1132594 -3759332 -9794877
2630i794877m349790J384020Q591092J1591451P748200N60290m567958n348193
$$ -9794877 -14144667 -12760647 -4169555 7421896 15170096 15730386 11162428 5814235
2622E814235k658653J345979L710448K334199q36549j098291K384787M434002
$$ 5814235 3155582 4501561 8212009 10546208 9709659 8611368 10996155 15430157
2614A5430157J299843l047207k490091J730919K637890j943993o122237m448403
$$ 15430157 16730000 13682793 11192702 12923621 15561511 13617518 7495281 3046878
2606C046878J045626M613571M008016J194123j586837l498119m139629l351796
$$ 3046878 4092504 8706075 12714091 13908214 12321377 8823258 4683629 1331833
2598A331833j652021L05310K072037K761308J514674p79875k070873k182441k969937
$$ 1331833 -320188 -14878 2057159 4818467 6333141 5553266 3482393 1299952 -1669985
2589a669985m406977l564935L35895K998635P31082l324322l197505Q66033K495717
$$ -1669985 -6076962 -9641897 -9306002 -6307367 -5576285 -8900607 -12098112 -11232079 -8736362
2580h736362j302700n635093m494251J779660P993859J0002520P009739R29806
$$ -8736362 -10039062 -15674155 -20168406 -18388746 -10394887 -392367 6617372 7547178
2572G547178m078054m055390P3550K566880J96840l260673l160600j372818k404700
$$ 7547178 3469124 -586266 -512716 2054164 2251004 -1009669 -4170269 -5543087 -7947787
2563g947787m535619j786663N329187Q480100L439800l231722l719246J99557
$$ -7947787 -12483406 -14270069 -8940882 -460782 2979018 -252704 -3971950 -3772393
2555c772393J514020o85684j076559K351603N512500N386725L980561L514534
$$ -3772393 -2258373 -2944057 -4020616 -1669013 3843487 9230212 13210773 16725307
2547A6725307K625291k92769l744551n421968m878037k421061J241620K915154
$$ 16725307 19350598 19057829 15313278 9891310 5013273 2592212 3833832 6748986
2539F748986r94546p837369r148677j773756O090584N451469r26858l547392q06857
$$ 6748986 5754440 -2082929 -11231606 -13005362 -6914778 -1463309 -2390167 -5937559 -6744416
2530f744416K06860l054680m255486L80368N042023L668725o63675j782590l89746
$$ -6744416 -6537556 -9592236 -13847722 -13467354 -8425331 -4756606 -5420281 -7202871 -7592617
2521g592617j010439k825880j229975L183364M547856P60636l486230l554586
$$ -7592617 -8603056 -11428936 -12658911 -9475547 -4927691 -4167055 -7653285 -11207871
2513a1207871J27116M556271P160563N751216P4108n569096n524196Q7612N139800
$$ -11207871 -11080755 -6524484 636079 6387295 6461403 892307 -4631889 -4544277 595523
2504E95523N284929K140165q97430k434997j616851J980395M986996K070739n750423
$$ 595523 5880452 8020617 7123187 4688190 3071339 5051734 10038730 12109469 6359046
2495F359046r608238l860716N395973P844397K019528m375915n391939k677595
$$ 6359046 -3249192 -7109908 -1713935 6130462 8149990 3774075 -1617864 -4295459
2487d295459o58768n22169k96264J610428M206153M771766K204484q02274r13347
$$ -4295459 -4954227 -5476396 -5772660 -4162232 43921 4815687 7020171 6217897 5304550
2478E304550P38766J39496k478644k094681K537983N404712K036350l476669n095031
$$ 5304550 6043316 6182812 3704168 1609487 4147470 9552182 11588532 8111863 3016832
2469C016832l457391k148092k72372M044851O941550M022608p48113m06992K943232
$$ 3016832 -440559 -2588651 -2861023 1183828 8125378 12147986 11399873 10992881 13936113
2460A3936113J281343n293489q438079n739835l567272l855884k24208Q303352
$$ 13936113 15217456 9923967 1485888 -4253947 -7821219 -11677103 -11901311 -3597959
2452c597959J1684341M198421m921448n122728j73258M3377l606626k654125L047133
$$ -3597959 8086382 12284803 7363355 2240627 2067369 2110746 -1495880 -4150005 -1102872
2443a102872M768416l86601m922892k714491K931710N279119K251428l209032
$$ -1102872 3665544 3278943 -1643949 -4358440 -1426730 3852389 6103817 2894785
2435B894785o256307k963640N606377J2094741R918634J346040n606685p109475
$$ 2894785 -3361522 -6325162 -718785 11375956 21294590 22640630 17033945 9924470
2427I924470n496212l066392l06569N31351k798086o759012m996319J815912N898936
$$ 9924470 4428258 1361866 1055297 1586648 -1211438 -7970450 -12966769 -11150857 -5251921
2418e251921L586482n14686k606993n036227q832549q857330k391628L921013
$$ -5251921 -1665439 -2180125 -4787118 -9823345 -18655894 -27513224 -29904852 -25983839
2410b5983839L102044r13282P38294P466136R709474L604673l193911k793039
$$ -25983839 -22881795 -23795077 -23056783 -15590647 -5881173 -2276500 -5470411 -8263450
2402h263450K315960L911461p17341o468636p546810l367626K134616M570826
$$ -8263450 -5947490 -2036029 -2753370 -9222006 -16768816 -20136442 -18001826 -13431000
2394a3431000K466679j567435k831552P51456N579732N688962J4348n435241m595494
$$ -13431000 -10964321 -12531756 -15363308 -14611852 -9032120 -3343158 -3328810 -8764051 -13359545
2385a3359545Q49074L769924J283437j977988j548855L71808m99995l034015k751756
$$ -13359545 -12510471 -8740547 -7457110 -9435098 -10983953 -10612145 -11112140 -14146155 -16897911
2376a6897911N36195K671318K278769K472520M668053N856489L839547O99573
$$ -16897911 -16361716 -13690398 -11411629 -8939109 -4271056 1585433 5424980 6124553
2368F124553j190511k534828l843395k708489K033510O326814N156999o87107
$$ 6124553 4934042 2399214 -1444181 -4152670 -2119160 4207654 9364653 8677546
2360H677546n529004n587703k071869J656605L342904K678897J115641P41796
$$ 8677546 3148542 -2439161 -4511030 -2854425 488479 3167376 4283017 5024813
2352E024813J921394K545748Q02524k223099m010513l681393k232895o12862R82747
$$ 5024813 6946207 9491955 10294479 8071380 4060867 379474 -1853421 -2466283 -1483536
2343a483536K428275L327631L064557J184850j223085j137292K926078P205698
$$ -1483536 944739 4272370 7336927 8521777 7298692 6161400 9087478 16293176
$$ [...]
##END NTUPLES=NMR SPECTRUM
##END=
