##TITLE=31Pdec_68-2024
 CDCl3, 24 sc
 3.9.2024
##JCAMPDX= 6.0         $$ Bruker NMR JCAMP-DX V2.0
##DATA TYPE= NMR SPECTRUM
##DATA CLASS= NTUPLES
##ORIGIN= UXNMR, Bruker Analytische Messtechnik GmbH
##OWNER= root
$$ XWIN-NMR		Version 3.5
$$ Tue Sep  3 14:12:54 2024 Russian Standard Time (UT+4h)  she@DPX200
##.OBSERVE FREQUENCY= 81.013821
##.OBSERVE NUCLEUS= ^31P
##.ACQUISITION MODE= SIMULTANEOUS
##.ACQUISITION SCHEME= undefined
##.AVERAGES= 24
##.DIGITISER RES= 17
##SPECTROMETER/DATA SYSTEM= spect
##.PULSE SEQUENCE= zgpg30
##.SOLVENT NAME= CDCl3
##.SHIFT REFERENCE= (INTERNAL, CDCl3, 0, 198.062)
##AUDIT TRAIL= $$ (NUMBER, WHEN, WHO, WHERE, WHAT)
$$ ##TITLE= Audit trail, XWIN-NMR		Version 3.5
$$ ##JCAMPDX= 5.01
$$ ##ORIGIN= Bruker BioSpin GmbH
$$ ##OWNER= she
$$ F:/spectra/data/she/nmr/P31/2/pdata/1/auditp.txt
$$ ##AUDIT TRAIL=  $$ (NUMBER, WHEN, WHO, WHERE, WHAT)
(   1,<2024-09-03 14:11:56.25 +0400>,<she>,<DPX200>,
      <created by zg, POWCHK disabled, PULCHK disabled
       configuration hash MD5:
       00 E9 B6 7A A2 85 ED C7 34 08 36 98 17 FE 4E 26
       data hash MD5: 32K
       D8 64 38 71 37 42 8B 31 A4 43 6B 83 23 79 C0 95>)
(   2,<2024-09-03 14:12:03.85 +0400>,<she>,<DPX200>,
      <Start of raw data processing
       efp BC_mod = 2 LB = 1.5 FT_mod = 6 PKNL = 1 PHC0 = 2720.917 PHC1 = -26.71252 SI = 64K 
       data hash MD5: 64K
       3D D3 82 64 82 86 02 55 5E DD 75 D6 2A 21 B0 B8>)
(   3,<2024-09-03 14:12:18.40 +0400>,<she>,<DPX200>,
      <pk PHC0 = 29.1555 PHC1 = 0 
       data hash MD5: 64K
       DC 5B 56 9D E4 37 06 B4 27 9A EA 4F CE A0 B7 93>)
(   4,<2024-09-03 14:12:22.59 +0400>,<she>,<DPX200>,
      <abs ABSG = 5 
       data hash MD5: 64K
       B7 55 9C E3 E9 ED B4 5D 9A D2 6A 7F 4F 91 72 2C>)
$$ ##END=
$$ 
$$ hash MD5
$$ 2B BF BD 30 76 9F 25 A7 2C 11 B7 03 81 44 FE 6B
##$RELAX= 
##$RELAX= 
##$RELAX= 
##$RELAX= 
##$RELAX= 
##$RELAX= 
##$RELAX= 
##$RELAX= 
$$ Bruker specific parameters
$$ --------------------------
##$DU= <F:/spectra>
##$EXPNO= 2
##$NAME= <P31>
##$PROCNO= 1
##$TYPE= <nmr>
##$USER= <she>
##$AMP= (0..31)
100 100 100 100 100 100 100 100 100 100 100 100 100 100 100 100 100 100 
100 100 100 100 100 100 100 100 100 100 100 100 100 100 
##$AQSEQ= 0
##$AQ_mod= 1
##$AUNM= <au_zg>
##$AUTOPOS= <>
##$BF1= 81.014009
##$BF2= 200.13
##$BF3= 200.13
##$BF4= 200.13
##$BF5= 200.13
##$BF6= 200.13
##$BF7= 200.13
##$BF8= 200.13
##$BYTORDA= 1
##$CFDGTYP= 0
##$CFRGTYP= 5
##$CHEMSTR= <none>
##$CNST= (0..31)
1 1 145 1 1 1 1 1 1 1 1 1 1 1 1 1 1 1 1 1 1 1 1 1 1 1 1 1 1 1 1 1 
##$CPDPRG= <waltz16>
##$CPDPRG1= <>
##$CPDPRG2= <waltz16>
##$CPDPRG3= <>
##$CPDPRG4= <mlev>
##$CPDPRG5= <mlev>
##$CPDPRG6= <mlev>
##$CPDPRG7= <mlev>
##$CPDPRG8= <mlev>
##$CPDPRGB= <>
##$CPDPRGT= <>
##$D= (0..31)
0 1 0 0 0 0 0 0 0 0.06 0 0.03 2e-05 3e-06 0 0 0.0002 0 0 0 0 0 0 0 0 0 
0 0 0 0 0 0 
##$DATE= 1725358315
##$DBL= (0..7)
120 120 120 11 120 120 24 19 
##$DBP= (0..7)
150 150 150 150 150 150 150 150 
##$DBP07= 0
##$DBPNAM0= <>
##$DBPNAM1= <>
##$DBPNAM2= <>
$$ [...]
##$SUBNAM3= <"">
##$SUBNAM4= <"">
##$SUBNAM5= <"">
##$SUBNAM6= <"">
##$SUBNAM7= <"">
##$SUBNAM8= <"">
##$SUBNAM9= <"">
##$SW= 400.765351723535
##$SWIBOX= (0..15)
0 1 3 0 0 0 0 0 0 0 0 0 0 0 0 0 
##$SW_h= 32467.5324675325
##$TD= 32768
##$TD0= 1
##$TE= 0
##$TE2= 300
##$TE3= 300
##$TEG= 300
##$TL= (0..7)
0 120 53 12 22 120 120 120 
##$TP= (0..7)
150 150 150 150 150 150 150 150 
##$TP07= 0
##$TPNAME0= <>
##$TPNAME1= <>
##$TPNAME2= <>
##$TPNAME3= <>
##$TPNAME4= <>
##$TPNAME5= <>
##$TPNAME6= <>
##$TPNAME7= <>
##$TPOAL= (0..7)
0.5 0.5 0.5 0.5 0.5 0.5 0.5 0.5 
##$TPOFFS= (0..7)
0 0 0 0 0 0 0 0 
##$TUNHIN= 0
##$TUNHOUT= 0
##$TUNXOUT= 0
##$USERA1= <user>
##$USERA2= <user>
##$USERA3= <user>
##$USERA4= <user>
##$USERA5= <user>
##$V9= 5
##$VALIST= <valist>
##$VCLIST= <CCCCCCCCCCCCCCC>
##$VD= 0
##$VDLIST= <DDDDDDDDDDDDDDD>
##$VPLIST= <PPPPPPPPPPPPPPP>
##$VTLIST= <TTTTTTTTTTTTTTT>
##$WBST= 1024
##$WBSW= 4
##$XGAIN= (0..3)
0 0 0 0 
##$XL= 0
##$YL= 0
##$YMAX_a= 10375
##$YMIN_a= -3113
##$ZGOPTNS= <>
##$ZL1= 120
##$ZL2= 120
##$ZL3= 120
##$ZL4= 120
##$ABSF1= 198.0616
##$ABSF2= -202.7028
##$ABSG= 5
##$ABSL= 3
##$ALPHA= 0
##$AQORDER= 0
##$ASSFAC= 0
##$ASSFACI= 0
##$ASSFACX= 0
##$ASSWID= 0
##$AUNMP= <proc_1d>
##$AZFE= 0.1
##$AZFW= 0.5
##$BCFW= 0
##$BC_mod= 2
##$BYTORDP= 0
##$COROFFS= 0
##$CY= -3
##$DATMOD= 1
##$DC= 0
##$DFILT= <>
##$DTYPP= 0
##$F1P= 0
##$F2P= 0
##$FCOR= 1
##$FTSIZE= 65536
##$FT_mod= 6
##$GAMMA= 0
##$GB= 0
##$INTBC= 1
##$INTSCL= 9.790993e-09
##$ISEN= 30
##$LB= 1.5
##$LEV0= 0
##$LPBIN= 0
##$MAXI= 10000
##$MC2= 0
##$MEAN= 0
##$ME_mod= 0
##$MI= 50
##$NCOEF= 0
##$NC_proc= -8
##$NLEV= 6
##$NOISF1= 182.463
##$NOISF2= 159.3651
##$NSP= 0
##$NTH_PI= 0
##$NZP= 0
##$OFFSET= 198.0616
##$PC= 4
##$PHC0= 2750.073
##$PHC1= -26.71252
##$PH_mod= 1
##$PKNL= yes
##$PPARMOD= 0
##$PSCAL= 0
##$PSIGN= 0
##$REVERSE= no
##$SF= 81.0140089999434
##$SI= 65536
##$SIGF1= 159.3651
##$SIGF2= -187.1042
##$SINO= 113.3802
##$SIOLD= 16384
##$SREGLST= <1H.CDCl3>
##$SSB= 0
##$STSI= 65536
##$STSR= 0
##$SW_p= 32467.5324675325
##$SYMM= 0
##$S_DEV= 0
##$TDeff= 32768
##$TDoff= 0
##$TI= <>
##$TILT= no
##$TM1= 0
##$TM2= 0
##$TOPLEV= 0
##$USERP1= <user>
##$USERP2= <user>
##$USERP3= <user>
##$USERP4= <user>
##$USERP5= <user>
##$WDW= 1
##$XDIM= 65536
##$YMAX_p= 339995496
##$YMIN_p= -24585516
$$ End of Bruker specific parameters
$$ ---------------------------------
##NTUPLES= NMR SPECTRUM
##VAR_NAME=  FREQUENCY,     SPECTRUM/REAL,   SPECTRUM/IMAG
##SYMBOL=    X,             R,               I
##VAR_TYPE=  INDEPENDENT,   DEPENDENT,       DEPENDENT
##VAR_FORM=  AFFN,          ASDF,            ASDF
##VAR_DIM=   65536,         65536,           65536
##UNITS=     HZ,            ARBITRARY UNITS, ARBITRARY UNITS
##FACTOR=    0.49542278885378, 1,            1
##FIRST=     16045.7642231865, 0,            0
##LAST=      -16421.768244346, 0,            0
##MIN=       -16421.768244346, -24585516,    0
##MAX=       16045.7642231865, 339995496,    0
$$ Real data points
##PAGE= N=1
##DATA TABLE= (X++(R..R)), XYDATA
$$ [...]
$$ plain form
42452 1525043 1392603 32952 -1106311 -282045 2102469 4017148 4375248 3733686 2722275
42443 2722275 1304957 -270772 -1174026 -1098411 -702058 -566180 -526956 -343679 -255241 -534828
42433 -534828 -1107255 -1819147 -2534943 -2977397 -3182308 -3948485 -5767376 -7348837 -6628778
42424 -6628778 -3606714 -713947 314904 424910 1081960 1719558 1016415 -489064 -1218696
42415 -1218696 -1380161 -2605821 -4722484 -5258710 -2950070 250068 1815498 1692800 1346233
42406 1346233 1143458 436015 -590440 -967134 -549390 -25970 513037 1518827 2537984
42397 2537984 2433069 1364629 1041144 2349079 3988846 4247015 3074025 1585462 489758
42388 489758 -23413 280288 1168446 1477638 403188 -1088622 -1307109 -75820 1222703
$$ packed form
42452A525043j32440j359651j139263Q24266K384514J914679L58100o41562j011411
42443B722275j417318j575729r03254P5615L96353J35878L9224J83277Q8438k79587
42433e34828n72427p11892p15796m42454k04911p66177j818891j581461P20059
42424f628778L022064K892767J028851J10006O57050O37598p03143j505479p29632
42415a218696j61465j225660k116663n36226K308640L200138J565430j22698l46567
42406A346233k02775p07443j026455l76694M17744N23420N39007J005790J019157
42397B537984j04915j068440l23485J307935J639767K58169j172990j488563j095704
42388D89758n13171L03701Q88158L09192j074450j491810k18487J231289J298523
$$ plain form
42379 1222703 1667779 1563616 1129744 -103837 -2014233 -3232709 -2758622 -1525391 -1382016
42370 -1382016 -2813803 -4439514 -4638631 -3093059 -794946 980734 1678105 1714381 1727119
42361 1727119 1558675 429885 -1577765 -2792443 -1543087 1583227 3893946 3350991
42353 3350991 676656 -1706859 -2431540 -2221489 -2280406 -2516612 -1981826 -627000 348728
42344 348728 129874 -502511 -179636 1287870 2844286 3628833 3679903 3224278 2131531
42335 2131531 423874 -1302073 -2442299 -3000976 -3245972 -3083429 -2226882 -807828 589713
42326 589713 1455120 1663821 1375192 888052 552221 595618 992308 1541929 1998934 2103336
42316 2103336 1687654 921403 360256 594679 1797338 3569278 5180240 6049938 6117803
$$ packed form
42379A222703M45076j04163m33872j233581j910396j218476M74087J233231J43375
42370a382016j431787j625711j99117J545572K298113J775680O97371L6276J2738
42361A727119j68444j128790k007650j214678J249356L126314K310719n42955
42353C350991k674335k383515p24681K10051n8917k36206N34786J354826R75728
42344C48728k18854o32385L22875J467506J556416P84547N1070m55625j092747
42335B131531j707657j725947j140226n58677k44996J62543Q56547J419054J397541
42326E89713Q65407K08701k88629m87140l35831M3397L96690N49621M57005J04402
42316B103336m15682p66251n61147K34423J202659J771940J610962Q69698O7865
$$ plain form
42307 6117803 5695103 4940323 3733502 2205742 1025376 790028 1362539 2131132 2645039
42298 2645039 2687095 2196923 1614688 1719828 2401316 2226067 280791 -2109225 -2843635
42289 -2843635 -1852513 -887976 -778729 -818432 -945079 -2195480 -4230681 -4741452 -2767469
42280 -2767469 -635905 -773072 -2246955 -2622627 -1913503 -2156360 -3787769 -5051687 -4907298
42271 -4907298 -4165638 -3471021 -2248782 -211818 1786089 2980088 3437584 3279395 2547608
42262 2547608 2032066 2653581 3728835 3510355 1878826 744666 1149842 1823560 1598381
42253 1598381 1454685 2705020 4547269 5116950 4115209 2813397 1952980 1058594 -325658
42244 -325658 -1765701 -2289132 -1125369 1483701 3812248 3798566 1371782 -1136742 -1704943
$$ packed form
42307F117803m22700p54780j206821j527760j180366k35348N72511P68593N13907
42298B645039M2056m90172n82235J05140O81488j75249j945276k390016p34410
42289b843635R91122R64537J09247l9703j26647j250401k035201n10771J973983
42280b767469K131564j37167j473883l75672P09124k42857j631409j263918J44389
42271d907298P41660O94617J222239K036964J997907J193999M57496j58189p31787
42262B547608n15542O21515J075254k18480j631529j134160M05176O73718k25179
42253A598381j43696J250335J842249N69681j001741j301812q60417q94386j384252
42244c25658j440043n23431J163763K609070K328547j3682k426784k508524n68201
$$ plain form
42235 -1704943 -965487 -920948 -2092723 -3148153 -2931324 -1693204 -399103 335182 634824
42226 634824 1149921 2191241 2874851 1876555 -574460 -2510827 -2764817 -2544743 -3392089
42217 -3392089 -4677723 -4640609 -3151757 -1781687 -1501467 -1860029 -2216740 -2309614 -1689461
42208 -1689461 11287 2176951 3684234 4172049 3855559 2612179 666609 -386778
42200 -386778 787574 2718051 2307231 -1078280 -4665236 -5985265 -5555171 -4999709 -4530173
42191 -4530173 -3744064 -3294847 -3896247 -4628344 -4065564 -2629254 -2175339 -3337211 -4661986
42182 -4661986 -4553942 -3021434 -1231803 -127418 178148 127052 169256 324063 193215
42173 193215 -547713 -1773301 -3035289 -3821444 -3695016 -2609433 -1224715 -469276 -550482
$$ packed form
42235a704943P39456M4539j171775j055430K16829J238120J294101P34285K99642
42226F34824N15097J041320O83610r98296k451015j936367k53990K20074q47346
42217c392089j285634L7114J488852J370070K80220l58562l56711r2874O20153
42208a689461J700748K165664J507283M87815l16490j243380j945570j053387
42200c86778J174352J930477m10820l385511l586956j320029M30094N55462M69536
42191d530173P86109M49217o01400p32097N62780J436310M53915j161872j324775
42182d661986J08044J532508J789631J104385L05566n1096M2204J54807j30848
42173A93215p40928j225588j261988p86155J26428J085583J384718P55439q1206
$$ plain form
42164 -550482 -747078 -356200 517472 1254144 1401369 928840 190638 -270299 -250216 -194737
42154 -194737 -554388 -1022587 -1080129 -1072358 -1771843 -2913665 -3306445 -2587113 -1700889 -1328234
42144 -1328234 -1085102 -748302 -879894 -1441884 -1184465 407556 1757909 1289939 39656
42135 39656 504233 3232697 6124259 7107452 6177484 4616649 3388827 2716047 2405170
42126 2405170 2117325 1683466 1285076 1078364 889576 720776 1135579 2380142 3409732
42117 3409732 2739655 283794 -2462946 -4139396 -4620668 -4282477 -3096152 -1045801 1123886
42108 1123886 2401885 2776456 3365225 4826902 5984924 4903861 1581238 -1435232
42100 -1435232 -2022020 -1244198 -1716425 -3783681 -5376674 -5656210 -6276889 -8099047 -9134780
$$ packed form
42164e50482j96596L90878Q73672P36672J47225m72529p38202m60937K0083N5479
42154a94737l59651m68199n7542P771o99485j141822l92780P19332Q86224L72655
42144a328234K43132L36800j31592n61990K57419J592021J350353m67970j250283
42135C9656M64577K728464K891562R83193r29968j560835j227822o72780l10877
42126B405170k87845m33859l98390k06712j88788j68800M14803J244563J029590
42117C409732o70077k455861k746740j676450m81272L38191J186325K050351K169687
42108A123886J277999L74571N88769J461677J158022j081063l322623l016470
42100a435232n86788P77822m72227k067256j592993k79536o20679j822158j035733
$$ plain form
42091 -9134780 -7577127 -4849738 -3338119 -2693387 -1136710 703076 519295 -1369201
42083 -1369201 -1783593 559151 2968648 2734784 760554 -408764 -313699 -377663 -1131243
42074 -1131243 -1624972 -1291461 -909200 -1554536 -3311337 -5061629 -5313270 -3507309 -615663
42065 -615663 1938095 3761349 5154467 5641905 4226684 1226720 -1643005 -3469684
42057 -3469684 -4968067 -6540896 -7167353 -6270369 -5190452 -5345184 -6007413 -5475419 -3718142
42048 -3718142 -2292460 -2024677 -2216270 -2054432 -1642963 -1593743 -2402849 -4112600 -5930576
42039 -5930576 -6519668 -5408783 -3734877 -2808139 -2399798 -1372251 424761 1983662 2634440
42030 2634440 2613980 2201054 1347264 328721 -118479 380844 1409896 2253824 2406368
$$ packed form
42091i134780J557653K727389J511619O44732J556677J839786j83781j888496
42083a369201m14392K342744K409497k33864j974230j169318R5065o3964p53580
42074a131243m93729L33511L82261o45336j756801j750292k51641J805961K891646
42065f15663K553758J823254J393118M87438j415221k999964k869725j826679
42057c469684j498383j572829o26457Q96984J079917j54732o62229N31994J757277
42048c718142J425682K67783j91593J61838M11469M9220q09106j709751j817976
42039e930576n89092J110885J673906R26738M08341J027547J797012J558901O50778
42030B634440k0460m12926q53790j018543m47200M99323J029052Q43928J52544
$$ plain form
42021 2406368 1697645 444513 -632775 -1138638 -1457423 -1969683 -2151676 -1226897 445612
42012 445612 1463225 940374 -643074 -2209229 -3143003 -3495641 -3556878 -3338506 -2367693
42003 -2367693 -237884 2496145 4546864 5413403 5972219 6887734 7206571 5629651 2701938
41994 2701938 465518 39031 651899 1028124 600758 -686895 -2573159 -4146051 -4358802
41985 -4358802 -3331342 -2344552 -2191124 -2315676 -1935122 -1182342 -630958 -357491 -18386
41976 -18386 622560 1657079 3065416 4441979 5136340 4952961 4259473 3248653 1786261
41967 1786261 289326 -115163 972435 2243249 2036269 417102 -919634 -756849 384546
41958 384546 1158902 822384 -572903 -2737103 -5158124 -6753523 -6348980 -3931490 -1022768
$$ packed form
42021B406368p08723j253132j077288n05863l18785n12260j81993R24779J672509
42012D45612J017613n22851j583448j566155r33774l52638o1237K18372R70813
42003b367693K129809K734029K050719Q66539N58816R15515L18837j576920k927713
41994B701938k236420m26487O12868L76225m27366j287653j886264j572892k12751
41985d358802J027460R86790J53428j24552L80554P52780N51384K73467L39105
41976a8386O40946J034519J408337J376563O94361j83379o93488j010820j462392
41967A786261j496935m04489J087598J270814k06980j619167j336736J62785J141395
41958C84546P74356l36518j395287k164200k421021j595399M04543K417490K908722
$$ plain form
41949 -1022768 725027 1192791 1610427 2803134 4206326 4758950 4217158 3252517 2623801
41940 2623801 2566463 2731526 2516336 1725228 987616 1131135 2108808 3079023 3525441 3521283
41930 3521283 2891788 1303922 -449612 -638284 1055944 2577855 2036562 189279 -904627
41921 -904627 -781369 -577203 -831203 -1004999 -860879 -672073 -181623 1133409 2784599
41912 2784599 3602043 3221316 1969311 -303687 -3587153 -6234910 -6234704 -4145328 -2744712
41903 -2744712 -3299057 -4126759 -3509882 -2088492 -1371649 -1540572 -1889460 -2129531 -2153429
41894 -2153429 -1553571 -283469 1076328 2228295 3276617 3688461 2658670 924355
41886 924355 426574 1474130 2099340 1073570 -444711 -1308402 -2178332 -3413477 -3423052
$$ packed form
41949a022768J747795M67764M17636J192707J403192N52624n41792r64641o28716
41940B623801n7338J65063k15190p91108p37612J43519R77673R70215M46418m158
41930C521283o29495j587866j753534j88672J694228J521911n41293j847283j093906
41921i04627J23258K04166k54000j73796J44120J88806M90450J315032J651190
41912B784599Q17444l80727j252005k272998l283466k647757K06K089376J400616
41903b744712n54345q27702O16877J421390P16843j68923l48888k40071k3898
41894b153429N99858J270102J359797J151967J048322M11844j029791j734315
41886I24355m97781J047556O25210j025770j518281q63691q69930j235145r575
$$ plain form
41877 -3423052 -1199846 1396486 2179166 1803033 1953605 1966088 194388 -2338972 -2864658
41868 -2864658 -1042497 770209 1364121 1906067 3029233 3468490 2405086 914490 157362
41859 157362 -72456 -250049 -225920 -106783 -489505 -1179125 -1092806 7887 1048516 1345310
41849 1345310 1387183 1533729 1415691 1063422 1091030 1241403 339218 -1615914 -2811591
41840 -2811591 -1880650 507352 2983966 5005990 6262790 6001914 4049498 1508538
41832 1508538 -450081 -1672888 -2394500 -2626050 -2718403 -3338363 -4281210 -4493932 -3771581
41823 -3771581 -3054198 -2576890 -1470266 60788 184767 -1630831 -3036261 -1886909 631440
41814 631440 1898423 1617359 1577226 2564737 3672225 4188294 4181229 3468230 1852088 301398
$$ packed form
41877c423052K223206K596332P82680l76133J50572J2483j771700k533360n25686
41868b864658J822161J812706N93912N41946J123166M39257j063404j490596p57128
41859A57362k29818j77593K4129J19137l82722o89620Q6319J100693J040629K96794
41849A345310M1873J46546j18038l52269K7608J50373r02185j955132j195677
41840b811591R30941K388002K476614K022024J256800k60876j952416k540960
41832A508538j958619j222807p21612k31550r2353o19960r42847k12722P22351
41823c771581P17383M77308J106624J531054J23979j815598j405430J149352K518349
41814F31440J266983k81064m0133R87511J107488N16069p065p12999j616142j550690
$$ plain form
41804 301398 240164 1609354 2957849 3308991 2649655 947031 -1689385 -3987550 -4333589
41795 -4333589 -2824044 -1149028 -337828 42043 417936 466034 108229 -135822 -166838
41786 -166838 -452750 -872440 -683931 28131 211317 -365620 -481771 720791 2421023
41777 2421023 3311997 3104624 2167491 665935 -1131437 -2508434 -3088197 -3363376 -3813074
41768 -3813074 -4128177 -3891843 -3350448 -2919032 -2604214 -2478010 -2922028 -3701703 -3625469 -2040771
41758 -2040771 -19036 898659 599042 123087 84811 455165 1404631 2984615 4121169
41749 4121169 3363200 935958 -1108192 -1249111 -89445 871782 1148791 1259750 1504468
41740 1504468 1663026 1706707 2084144 3192090 4862091 6373822 6893325 6150300 4842191
$$ packed form
41804C01398o1234J369190J348495L51142o59336j702624k636416k298165l46039
41795d333589J509545J675016Q11200L79871L75893M8098l57805k44051l1016
41786a66838k85912m19690J88509P12062J83186n76937j16151J202562J700232
41777B421023Q90974k07373r37133j501556j797372j376997n79763k75179m49698
41768c813074l15103K36334N41395M31416L14818J26204m44018p79675P6234J584698
41758b040771K021735R17695k99617m75955l8276L70354R49466J579984J136554
41749D121169p57969k427242k044150j40919J159666R61227K77009J10959K44718
41740A504468J58558M3681L77437J107946J670001J511731N19503p43025j308109
$$ plain form
41731 4842191 4036814 3958040 3764877 2808558 1554393 745040 258083 -326235 -475709
41722 -475709 711091 2665721 3461372 2284086 617543 145385 469678 5828 -1597060
41713 -1597060 -3207081 -3936510 -3797622 -2862369 -1161828 526682 1149392 907201 1087374
41704 1087374 2042121 2604263 1994396 1033865 800377 1277818 2057490 3099258 3905306
41695 3905306 3326174 1449788 404392 1699029 3807119 4150984 2604435 1059810
41687 1059810 288344 -364691 -495827 1364501 4744547 6728886 5587621 2937216 1070373
41678 1070373 -54136 -1636744 -3362528 -3766379 -2475872 -483532 1342989 2703413
41670 2703413 3238983 2713808 1622630 670167 -129405 -1131067 -2279706 -3314429 -4119851
$$ packed form
41731D842191q05377p8774j93163r56319j254165q09353m86957n84318j49474
41722d75709J186800J954630P95651j177286j666543m72158L24293m63850j602888
41713a597060j610021p29429J38888R35253J700541J688510O22710k42191J80173
41704A087374R54747N62142o09867r60531k33488M77441P79672J041768Q06048
41695C905306n79132j876386j045396J294637K108090L43865j546549j544625
41687A059810p71466o53035j31136J860328L380046J984339j141265k650405j866843
41678A070373j124509j582608j725784m03851J290507J992340J826521J360424
41670B703413N35570n25175j091178r52463p99572j001662j148639j034723q05422
$$ plain form
41661 -4119851 -4189983 -2656294 183531 2381189 2671552 2295208 2910995 3739358 2961738
41652 2961738 1211380 858815 1821650 1217672 -1795256 -3809818 -1828840 2120166 3654723
41643 3654723 1943111 96438 212109 935010 387199 -989250 -1730805 -1744655 -1862605
41634 -1862605 -1968529 -1110305 755533 2299772 2262699 692710 -1370959 -2905860 -3366637
41625 -3366637 -2563897 -620414 1797814 3511651 3605347 2399533 1330506 1496275 2503895
41616 2503895 3108602 2749817 1936882 1312188 1049840 1180053 1688946 2024197 1267967
41607 1267967 -669085 -2551694 -3091286 -2409112 -1781771 -2184899 -3431513 -4447005 -4111276
41598 -4111276 -2276285 -319013 -141471 -2083277 -4342973 -5086937 -4548456 -4222035 -4604997
$$ packed form
41661d119851p0132J533689K839825K197658K90363l76344O15787Q28363p77620
41652B961738j750358l52565R62835o03978l012928k014562J980978L949006J534557
41643C654723j711612j846673J15671P22901n47811j376449p41555j3850j17950
41634a862605j05924Q58224J865838J544239l7073j569989k063669j534901m60777
41625c366637Q02740J943483K418228J713837R3696j205814j069027J65769J007620
41616B503895O04707l58785q12935o24694k62348J30213N08893L35251p56230
41607A267967j937052j882609n39592O82174O27341m03128j246614j015492L35729
41598d111276J834991J957272J77542j941806k259696p43964N38481L26421l82962
$$ plain form
41589 -4604997 -4955215 -4949829 -5115239 -5463916 -5095152 -3673913 -2185480 -1561905 -1472310 -1185069
41579 -1185069 -835657 -1006243 -1584992 -1835124 -1302844 -130195 1169536 1824356 1208450
41570 1208450 -328237 -1491205 -1408914 -515475 336254 959137 1443348 1456858 808915
41561 808915 86790 -275718 -1068562 -3305959 -6423369 -8603662 -8846446 -7746274 -6305765
41552 -6305765 -4998511 -4016413 -3409076 -2800547 -1830514 -974029 -1030215 -1713395 -1776451 -801477
41542 -801477 137492 48901 -609599 -704361 100371 1206618 1932299 1996563 1494919 786113
41532 786113 239381 -32968 -53424 188078 428364 124493 -541531 -248961 1624797 3167722
41522 3167722 1717869 -2341848 -5497836 -5543523 -4198164 -3987794 -4289617 -2645673 900475
$$ packed form
41589d604997l50218N386j65410l48677L68764J421239J488433O23575Q9595K87241
41579a185069L49412j70586n78749k50132N32280J172649J299731O54820o15906
41570A208450j536687j162968Q2291Q93439Q51729O22883M84211J3510o47943
41561H08915p22125l62508p92844k237397l117410k180293k42784J100172J440509
41552f305765J307254R82098O07337O08529R70033Q56485n6186o83180o3056R74974
41542h01477R38969q8591o58500r4762Q04732J106247P25681O4264n01644p08806
41532G86113n46732k72349k0456K41502K40286l03871o66024K92570J873758J542925
41522C167722j449853m059717l155988m5687J345359K10370l01823J643944L546148
$$ plain form
41513 900475 3257600 2301756 -470815 -2067183 -1530435 -447575 -623189 -2152560 -3713520
41504 -3713520 -4189919 -3708274 -3117809 -2799664 -2478426 -2162523 -2501043 -3770845 -5131194
41495 -5131194 -5557419 -5118244 -4598469 -4098821 -2834171 -430948 2164566 3368415 2409096
41486 2409096 72166 -1940532 -2531859 -2153333 -2075815 -2860947 -3989006 -4809958 -5054511
41477 -5054511 -4409226 -2684480 -754666 -149709 -1003792 -1502174 -299868 1543017 2216583
41468 2216583 1815131 1850589 2741764 3406847 3060932 1849240 -163357 -3009280 -5757547
41459 -5757547 -7069715 -7120588 -7410301 -8251646 -8113194 -6207448 -4052139 -3216312 -2923774
41450 -2923774 -1567071 337891 702437 -843918 -2152568 -1547059 -64954 255307 -775764
$$ packed form
41513I00475K357125r55844k772571j596368N36748J082860j75614j529371j560960
41504c713520m76399M81645N90465L18145L21238L15903l38520j269802j360349
41495e131194m26225M39175N19775M99648J264650K403223K595514J203849r59319
41486B409096k336930k012698n91327L78526P7518p85132j128059q20952k44553
41477e054511O45285J724746J929814O04957q54083m98382J202306J842885O73566
41468B216583m01452L5458Q91175O65083l45915j211692k012597k845923k748267
41459e757547j312168n0873k89713q41345J38452J905746K155309Q35827K92538
41450b923774J356703J904962L64546j546355j308650O05509J482105L20261j031071
$$ plain form
41441 -775764 -1707455 -1991563 -2711694 -4453841 -5895994 -5613441 -4374329 -4074390 -4666397
41432 -4666397 -4005473 -1302443 1020513 281675 -2804825 -5093116 -5012452 -3856606 -3280443
41423 -3280443 -3394927 -3754987 -4543688 -5811323 -6657564 -6226572 -4899722 -3693687 -2976543
41414 -2976543 -2488782 -2174272 -2214293 -2465920 -2527705 -2289553 -1941186 -1496473 -726619 378285
41404 378285 1337404 1521755 828687 11006 90020 1219188 2405029 2726976 2507749
41395 2507749 2677685 3252888 3281994 2257897 685206 -902518 -2592085 -4414494 -5817382
41386 -5817382 -6305277 -6027324 -5315084 -4196240 -2793889 -1663083 -1205534 -1118510 -860800
41377 -860800 -347998 190348 735967 1449778 2230162 2542026 1713612 -408489 -2845730
$$ packed form
41441g75764r31691k84108p20131j742147j442153K82553J239112K99939n92007
41432d666397O60924K703030K322956p38838l086500k288291Q0664J155846N76163
41423c280443j14484l60060p88701j267635q46241M30992J326850J206035P17144
41414b976543M87761L14510m0021k51627o1785K38152L48367M44713P69854J104904
41404C78285R59119J84351o93068q17681P9014J129168J185841L21947k19227
41395B507749J69936N75203K9106j024097j572691j587724j689567j822409j402888
41386e817382m87895K77953P12240J118844J402351J130806M57549Q7024K57710
41377h60800N12802N38346N45619P13811P80384L11864q28414k122101k437241
$$ plain form
41368 -2845730 -3885540 -2742464 -646216 461747 174013 -291393 -90233 284415 117194
41359 117194 -663011 -1997984 -3809039 -5133295 -4496103 -1947839 407869 835359 -32392
41350 -32392 -464961 88823 957605 1508213 1356078 202494 -1378723 -1848779 -658962
41341 -658962 538046 34861 -1408791 -1874789 -1403252 -1719641 -3094278 -3713964 -2553212
41332 -2553212 -873382 -161082 -325254 -833285 -1985555 -3780725 -4804227 -3782212 -1488771
41323 -1488771 312326 1273948 2301110 3234252 2458807 -564851 -3675995 -4073325 -1553991
41314 -1553991 1322033 2276986 1589478 968534 1043481 986476 336429 -92889 371022 899261
41304 899261 167458 -1704159 -3189466 -3308160 -2739031 -2778953 -3726910 -4554533 -3906971
$$ packed form
41368b845730j039810J143076K096248J107963k87734m65406K01160L74648j67221
41359A17194p80205j334973j811055j324256O37192K548264K355708M27490q67751
41350c2392m32569N53784Q68782N50608j52135j153584j581217m70056J189817
41341f58962J197008n03185j443652m65998M71537l16389j374637o19686J160752
41332b553212J679830P12300j64172n08031j152270j795170j023502J022015K293441
41323a488771J801097R61622J027162R33142p75445l023658l111144l97330K519334
41314a553991K876024R54953o87508o20944P4947n7005o50047m29318M63911N28239
41304H99261p31803j871617j485307j18694N69129l9922r47957q27623O47562
$$ plain form
41295 -3906971 -1342631 2185954 5065547 6401648 6562461 6247953 5467529 3932644 2094459
41286 2094459 998479 1103671 1925655 2955362 4229285 5652413 6367340 5467404 3195510
41277 3195510 838140 -734548 -1938756 -3441317 -4612452 -3953122 -1313222 1351496
41269 1351496 2301693 2244161 2905409 4003643 3581931 1390032 -247474 288075 1781344
41260 1781344 2562668 3086280 4331834 5233239 4011273 1127957 -1393724 -3001536 -4658911
41251 -4658911 -6245943 -6400512 -5046190 -3739272 -3157045 -2455919 -1544189 -1620914 -2687358
41242 -2687358 -2923793 -1739108 -1129876 -2319729 -3109184 -817640 3552934 6523316 6725646
41233 6725646 5913134 5651720 5351099 4077130 2463242 1802184 2244649 2799230 2632087
$$ packed form
41295c906971K564340L528585K879593J336101J60813l14508p80424j534885j838185
41286B094459j095980J05192Q21984J029707J273923J423128P14927q99936k271894
41277C195510k357370j572688j204208j502561j171135O59330K639900K664718
41269A351496R50197n7532O61248J098234m21712k191899j637506N35549J493269
41260A781344P81324N23612J245554R01405j221966k883316k521681j607812j657375
41251d658911j587032j54569J354322J306918N82227P01126R11730p6725j066444
41242b687358k36435J184685O09232j189853p89455K291544M370574K970382K02330
41233F725646q12512k61414l00621j273969j613888o61058M42465N54581j67143
$$ plain form
41224 2632087 1731768 555032 -453153 -972068 -788847 55357 1131558 1939500 2471018
41215 2471018 3047180 3379648 2531061 488798 -1035343 -606502 724101 819743 -268858
41206 -268858 -437908 946677 1937743 1178059 -22437 -72133 397050 65515 -708248
41197 -708248 -977798 -1280646 -2498400 -3729161 -3577247 -2797545 -3249551 -4645626 -4846600
41188 -4846600 -3369543 -2065143 -1865963 -1327850 611094 2601747 3081702 2816438 3437973
41179 3437973 4490922 3916486 1273998 -1245431 -1518580 -71236 871676 348126 -390796
41170 -390796 13494 1086007 1566731 1599176 2294354 3248349 2460712 -535565 -3300968
41161 -3300968 -3606145 -2399434 -1936249 -2257663 -1737951 -303560 388154 -229889 -1042250
$$ packed form
41224B632087r00319j176736j008185n18915J83221Q44204J076201Q07942N31518
41215B471018N76162L32468q48587k042263j524141M28841J330603R5642j088601
41206b68858j69050J384585R91066p59684j200496m9696M69183l31535p73763
41197g08248k69550l02848j217754j230761J51914P79702m52006j396075k00974
41188d846600J477057J304400J99180N38113J938944J990653M79955k65264O21535
41179C437973J052949n74436k642488k519429k73149J447344R42912n23550p38922
41170c90796M04290J072513M80724L2445O95178R53995p87637k996277k765403
41161c300968l05177J206711M63185l21414N19712J434391O91714o18043q12361
$$ plain form
41152 -1042250 -1661053 -3105813 -5461174 -6888515 -5890585 -3074204 -26910 2100627
41144 2100627 2452448 690509 -1841237 -2785145 -1527452 33886 108756 -1130179 -2882211
41135 -2882211 -4948039 -6611963 -6305195 -3868951 -1453039 -626489 -285148 881133 1689101
41126 1689101 488112 -1644363 -2349114 -1541755 -804502 -100469 1803275 3982743 3820212
41117 3820212 1320008 -235588 888155 2241467 1086736 -1470876 -2476522 -1552399
41109 -1552399 -869748 -1608633 -2808732 -3475105 -3718325 -3583784 -2536798 -745663 435061
41100 435061 77357 -1054214 -1583460 -1250607 -795086 -555829 -132621 579777 934540
41091 934540 522528 -36578 37775 388241 -103228 -1679364 -3232242 -3641940 -2906959
$$ packed form
41152a042250o18803j444760k355361j427341R97930K816381L047294K127537
41144B100627L51821j761939k531746r43908J257693J561338P4870j238935j752032
41135b882211k065828j663924L06768K436244K415912Q26550L41341J166281Q07968
41126A689101j200989k132475p04751Q07359P37253P04033J903744K179468j62531
41117C820212k500204j555596J123743J353312j154731k557612j005646R24123
41109a552399O82651p38885j200099o66373k43220J34541J046986J791135J180724
41100D35061l57704j131571n29246L32853M55521K39257M23208P12398L54763
41091I34540m12012n59106P4353L50466m91469j576136j552878m09698P34981
$$ plain form
41082 -2906959 -1719475 -646720 -55607 -38542 86693 1367945 3624832 5088909 4515576
41073 4515576 2883616 1948894 1875169 1623468 1037644 879537 1086307 769048 18704
41064 18704 25775 1133687 2364853 3181542 4019938 4662192 4022424 2373942 1813462 3235009
41054 3235009 4660242 4205680 3049042 3373898 4672970 4580499 2718903 1168622 1159695
41045 1159695 1639084 1477466 984361 582715 -121003 -1002757 -751633 1296495 3795481
41036 3795481 4980498 4793663 4448450 4599551 4924476 4996675 4648408 3766489 2451274
41027 2451274 1162404 193321 -733490 -1935423 -3128126 -3637997 -2977718 -1131148 1206859
41018 1206859 2658462 2285184 886249 202651 550821 501688 -543733 -1024962 333236
$$ packed form
41082b906959J187484J072755N91113J7065J25235J281252K256887J464077n73333
41073D515576j631960r34722p3725k51701n85824j58107K06770l17259p50344
41064A8704P071J107912J231166Q16689Q38396O42254o39768j648482n60480J421547
41054C235009J425233m54562j156638L24856J299072r2471j861596j550281q927
41045A159695M79389j61618m93105m01646p03718q81754K51124K048128K498986
41036C795481J185017j86835l45213J51101L24925P2199l48267q81919j315215
41027B451274j288870r69083r26811j201933j192703n09871O60279J846570K338007
41018A206859J451603l73278j398935o83598L48170m9133j045421m81229J358198
$$ plain form
41009 333236 2149878 2233242 896869 436566 1716699 3326198 4134579 4640277 5301377
41000 5301377 5372971 4275085 2690762 1394275 196162 -1030524 -1435543 -448248 907245
40991 907245 1138433 189916 -791257 -1146288 -1200464 -1384182 -1697023 -1843440 -1362830 -82348
40981 -82348 1063147 510190 -1738364 -3302335 -2188357 264683 900575 -1019751 -2961515
40972 -2961515 -2740858 -1108420 93327 625424 1297312 1901031 1434136 -42334 -1303693
40963 -1303693 -1708552 -1798027 -2046576 -2235756 -2427467 -3358286 -5057293 -5957511 -4545130
40954 -4545130 -1582831 449450 262754 -864794 -1039207 -229749 3772 -1227325 -3163626
40945 -3163626 -4662286 -5477895 -5919793 -6007461 -5641882 -5228110 -5426495 -6334445 -7394302
$$ packed form
41009C33236J816642Q3364j336373m60303J280133J609499Q08381N05698O61100
41000E301377P1594j097886j584323j296487j198113j226686m05019R87295J355493
40991I07245K31188r48517r81173l55031n4176j83718l12841j46417M80610J280482
40981h2348J145495n52957k248554j563971J113978K453040O35892j920326j941764
40972b961515K20657J632438J201747N32097O71888O03719m66895j476470j261359
40963a303693m04859q9475k48549j89180j91711r30819j699007r00218J412381
40954d545130K962299K032281j86696j127548j74413Q09458K33521j231097j936301
40945c163626j498660q15609m41898q7668L65579M13772j98385r07950j059857
$$ plain form
40936 -7394302 -8116184 -8524860 -8863577 -9127181 -8928708 -7740489 -5454711 -2859948 -1211378
40927 -1211378 -953366 -1172992 -793338 29909 418840 458720 1325020 3390213 5079499
40918 5079499 4385589 1228140 -2284684 -3856346 -2891160 -561486 1498746 2472387 2702573
40909 2702573 3049795 3902712 4756458 4760975 3648046 2012210 611534 -494941 -1840009
40900 -1840009 -3465427 -4305946 -3188324 -419330 2222830 3318411 3116019 2720728 2593859
40891 2593859 2448005 2126633 1747264 1167728 135435 -1027695 -1610342 -1463368 -1135881
40882 -1135881 -980318 -747855 -202935 463687 1029488 1553396 2153643 2884934 3781118
40873 3781118 4466163 3914026 1539789 -1380252 -2452395 -798561 1906890 3536120
$$ packed form
40936g394302p21882m08676l38717k63604J98473J188219K285778K594763J648570
40927a211378K58012k19626L79654Q23247L88931L9880Q66300K065193J689286
40918E079499o93910l157449l512824j571662R65186K329674K060232R73641K30186
40909B702573L47222Q52917Q53746M517j112929j635836j400676j106475j345068
40900a840009j625418q40519J117622K768994K642160J095581k02392l95291j26869
40891B593859j45854l21372l79369n79536j032293j163130n82647J46974L27487
40882a135881J55563K32463N44920O66622N65801N23908O00247P31291Q96184
40873C781118O85045n52137k374237k920041j072143J653834K705451J629230
$$ plain form
40865 3536120 3799250 3791625 4072381 4160865 3547306 2334050 1005621 151916 234015 1104734
40855 1104734 1940600 2087503 1783704 1716751 2165866 2891054 3444403 3221473 1743321
40846 1743321 -549212 -2231103 -2256192 -1076960 110159 827988 1433092 2180870 2888705
40837 2888705 3289204 3145406 2331407 1353595 1331083 2693824 4229090 4202485 2217535
40828 2217535 -635722 -3046177 -4169757 -3644494 -2004199 -728473 -749978 -1129395 -323279
40819 -323279 1484495 2591394 2146223 869967 -570178 -2244847 -3698444 -3756472 -2420995
40810 -2420995 -1467815 -2066874 -2999245 -2428913 -478571 1217065 1760865 1510375 959677
40801 959677 466241 680128 1796480 2495792 1084367 -2035426 -4256731 -3638838 -1001066
$$ packed form
40865C536120K63130p625K80756Q8484o13559j213256j328429q53705Q2099Q70719
40855A104734Q35866J46903l03799o6953M49115P25188N53349k22930j478152
40846A743321k292533j681891k5089J179232J187119P17829O05104P47778P07835
40837B888705M00499j43798q13999r77812k2512J362741J535266k6605j984950
40828B217535k853257k410455j123580N25263J640295J275726k1505l79417Q06116
40819c23279J807774J106899m45171j276256j440145j674669j453597n8028J335477
40810b420995R53180n99059r32371N70332J950342J695636N43800k50490n50698
40801I59677m93436K13887J116352O99312j411425l119793k221305O17893K637772
$$ plain form
40792 -1001066 1320754 1987698 1333397 280920 -451596 -285733 1106360 3214507 4656210
40783 4656210 4309629 2595521 1289211 1705733 3161402 3663883 2244248 164384 -515000
40774 -515000 778127 2717433 3716660 3405344 2501190 1831300 1782319 2359119 3341817
40765 3341817 4317445 4704129 3914189 1738807 -1245395 -3813224 -4962733 -4667818 -3553872
40756 -3553872 -1998708 -91121 1518999 1607503 -127503 -2139856 -2627562 -1882808 -1872670
40747 -1872670 -3265120 -4261085 -3270408 -1482948 -1161160 -2079545 -1718909 946071 3970354
40738 3970354 5435891 5876872 6380210 6125055 3938787 1153012 410920 1927470 3271284
40729 3271284 3013769 2326480 2374383 2352403 1316613 149838 114674 731895 796783 652331
$$ packed form
40792a001066K321820O66944o54301j052477p32516J65863J392093K108147J441703
40783D656210l46581j714108j306310M16522J455669N02481j419635k079864o79384
40774e15000J293127J939306R99227l11316r04154o69890m8981N76800R82698
40765C341817R75628L86684p89940k175382k984202k567829j149509K94915J113946
40756c553872J555164J907587J610120Q8504j735006k012353m87706P44754J0138
40747a872670j392450r95965R90677J787460L21788r18385L60636K664980L024283
40738C970354J465537M40981N03338k55155k186268k785775p42092J516550J343814
40729C271284k57515o87289M7903k1980j035790j166775l5164O17221O4888j44452
$$ plain form
40719 652331 1688620 3944428 5828028 6259973 5787837 5392725 5293831 5238322 5042379
40710 5042379 4397169 2842670 516580 -1398522 -1491287 547157 3519162 5662314 6010619
40701 6010619 4862793 3018146 907479 -1249686 -2885460 -3467249 -3331954 -3265603 -3200615
40692 -3200615 -2314584 -616134 727404 1101941 1249124 1620438 1241277 -562815 -2355781
40683 -2355781 -2047385 393806 3062541 4498127 4621643 3812896 2619311 2095018 2788361
40674 2788361 3469861 2488178 363317 -770620 -469594 -668531 -2404952 -3914821 -3286193
40665 -3286193 -1357093 -327625 -621485 -841822 -125990 1154460 2660927 4375899 5576027
40656 5576027 4986701 2425162 -623274 -2423883 -2349960 -754323 1646500 3909732 5097581
$$ packed form
40719F52331J036289K255808J883600M31945m72136l95112r8894n5509j95943
40710E042379o45210j554499k326090j915102r2765K038444K972005K143152L48305
40701F010619j147826j844647k110667k157165j635774n81789J35295O6351O4988
40692c200615Q86031J698450J343538L74537J47183L71314l79161j804092j792966
40683b355781L08396K441191K668735J435586J23516q08747j193585n24293O93343
40674B788361O81500r81683k124861j133937L01026j98937j736421j509869O28628
40665c286193J929100J029468k93860k20337P15832J280450J506467J714972J200128
40656E576027n89326k561539l048436j800609P3923J595637K400823K263232J187849
$$ plain form
40647 5097581 4937850 4009369 3029451 2260978 1814310 2103314 3494079 5545358 7018312
40638 7018312 6920530 5478250 3832421 2715412 1755716 375262 -999093 -1295520 -282816
40629 -282816 1113090 2141277 2967331 3632030 3276218 1415320 -653885 -1004214 511599
40620 511599 2199024 2930709 3334372 4137574 4615095 3732241 2031680 1059047 1114873
40611 1114873 845439 -655526 -2402860 -2838888 -1911138 -1017403 -1223543 -2378073 -3870443
40602 -3870443 -5289939 -6049336 -5278727 -2846552 16188 1920533 2883139 3877486 5038832
40593 5038832 5417286 4707900 4027379 4201375 4181811 2332009 -1096360 -3980239 -4845775
40584 -4845775 -4247050 -3306904 -2001316 246993 2951820 4645955 4498076 3011848 1084035
$$ packed form
40647E097581j59731r28481r79918p68473m46668K89004J390765K051279J472954
40638G018312r7782j442280j645829j117009r59696j380454j374355k96427J012704
40629b82816J395906J028187Q26054O64699l55812j860898k069205l50329J515813
40620E11599J687425P31685M03663Q03202M77521q82854j700561r72633N5826
40611A114873k69434j500965j747334m36028R27750Q93735k06140j154530j492370
40602c870443j419496p59397P70609K432175K862740J904345R62606R94347J161346
40593E038832L78454p09386o80521J73996j9564j849802l428369k883879q65536
40584d845775N98725R40146J305588K248309K704827J694135j47879j486228j927813
$$ plain form
40575 1084035 -786187 -2102724 -2103748 -670832 931567 1113876 -219194 -1556809 -1601114
40566 -1601114 -609379 295768 558885 458318 326239 131422 -178395 -394278 -280538
40557 -280538 138502 688909 1353131 2304625 3547574 4601900 4840674 4309560 3848373
40548 3848373 3931176 3701246 1988258 -735192 -2443128 -1987326 -443660 640839 1327342
40539 1327342 2466865 3580769 3215910 1405356 249781 1471611 4352374 6638743
40531 6638743 6772960 4806524 1879377 -569944 -1562492 -1159836 -167017 836306 1752636
40522 1752636 2310825 2047190 1291161 1246792 2382197 3462109 3088887 1707083 1015029
40513 1015029 1563979 2074501 1417370 328453 437634 2019663 3528425 3493351 2276453
$$ packed form
40575A084035j870222j316537j024J432916J602399J82309j333070j337615m4305
40566a601114R91735R05147K63117j00567j32079j94817l09817k15883J13740
40557b80538M19040N50407O64222R51494J242949J054326K38774n31114m61187
40548C848373Q2803k29930j712988k723450j707936M55802J543666J084499O86503
40539A327342J139523J113904l64859j810554j155575J221830K880763K286369
40531F638743J34217j966436k927147k449321r92548M02656R92819J003323R16330
40522A752636N58189k63635p56029m4369J135405J079912l73222j381804o92054
40513A015029N48950N10522o57131j088917J09181J582029J508762l5074j216898
$$ plain form
40504 2276453 1450976 1703218 2047496 1247444 -673457 -2727453 -4092687 -4328677 -3178448
40495 -3178448 -1202344 -135831 -1266426 -3512027 -4445443 -3355058 -1894778 -1412795
40487 -1412795 -1236184 -317222 981198 1848480 2406802 2773722 1960822 -586843 -3212856
40478 -3212856 -3730228 -2474865 -1776677 -2477790 -2941460 -1886624 -327904 207259 -83068
40469 -83068 -59294 259512 -280481 -2138148 -4361427 -5798650 -6250894 -6059869 -5033994
40460 -5033994 -2532978 1107470 3842049 3604018 882814 -1352839 -898391 1305030
40452 1305030 2754391 2487272 1470978 564879 -384331 -1532389 -2530545 -3217777 -3698304
40443 -3698304 -3612040 -2479451 -945171 -461216 -1363316 -2350934 -2286963 -1512814 -1005695
$$ packed form
40504B276453q25477K52242L44278q00052j920901k053996j365234k35990J150229
40495c178448J976104J066513j130595k245601r33416J090385J460280M81983
40487a412795J76611R18962J298420Q67282N58322L66920q12900k547665k626013
40478c212856n17372J255363O98188p01113m63670J054836J558720N35163k90327
40469h3068K3774L18806n39993j857667k223279j437223m52244J91025J025875
40460e033994K501016L640448K734579k38031k721204k235653M54448K203421
40452A305030J449361k67119j016294r06099r49210j148058r98156o87232m80527
40443c698304Q6264J132589J534280M83955r02100r87618O3971P74149N07119
$$ plain form
40434 -1005695 -1226053 -2106700 -3078565 -2840254 -528371 2323663 2599714 -542065 -3986231
40425 -3986231 -4192154 -1324776 1629372 2920432 3349838 3956313 4390009 4023567 3334459
40416 3334459 3508481 5225003 7986448 10177579 10045578 7447610 4500898 3603467 4781284
40407 4781284 5782174 4780976 2149747 -494179 -2080820 -2651714 -2845409 -3170350 -3435139
40398 -3435139 -2916195 -1517071 -440725 -837442 -1912184 -1482704 1310417 4802070 6720680
40389 6720680 6518737 5378665 4676615 4975967 5873168 6213626 4952431 2392659 202875
40380 202875 -264924 714037 1997306 3076416 4190377 5406928 6397780 6961334 7091349
40371 7091349 6629527 5488185 4184355 3549695 3856007 4705459 5728485 6768026 7336573
$$ packed form
40434a005695k20358q80647r71865K38311K311883K852034K76051l141779l444166
40425c986231k05923K867378K954148J291060M29406O06475M33696l66442o89108
40416C334459J74022J716522K761445K191131j32001k597968k946712q97431J177817
40407D781284J000890j001198k631229k643926j586641n70894j93695l24941k64789
40398c435139N18944J399124J076346l96717j074742M29480K793121L491653J918610
40389F720680k01943j140072p02050K99352Q97201L40458j261195k559772k189784
40380B02875m67799R78961J283269J079110J113961J216551R90852N63554J30015
40371G091349m61822j141342j303830o34660L06312Q49452J023026J039541N68547
$$ plain form
40362 7336573 6673566 4757121 2710981 1655850 1444258 1046010 12759 -992464 -1141186
40353 -1141186 -419905 507825 1036719 958713 364407 -446059 -1131422 -1749882 -2852973
40344 -2852973 -4599796 -5837737 -4902879 -1812245 1013244 1092382 -1268617 -3328310 -3079532
40335 -3079532 -1146865 642976 1478858 1670680 1445713 752774 -98888 -649507 -1041642
40326 -1041642 -1685203 -2291099 -2217732 -1734283 -1780027 -2300871 -2130849 -993961 -214843 -565456
40316 -565456 -819079 165133 1146704 237408 -1801097 -2293082 -615677 914099 614639
40307 614639 -404909 -728063 -1086102 -2565387 -4027548 -3550274 -1540113 -198486 -259939
40298 -259939 -333287 513731 1440336 1453922 744720 -71784 -727741 -902145 -257754 735071
$$ packed form
40362G336573o63007j916445k046140j055131k11592l98248j033251j005223j48722
40353a141186P21281R27730N28894p8006n94306q10466o85363o18460j103091
40344b852973j746823j237941R34858L090634K825489P9138k360999k059693K48778
40335c079532J932667J789841Q35882J91822k24967o92939q51662n50619l92135
40326a041642o43561o05896P3367M83449m5744n20844J70022J136888P79118l50613
40316e65456k53623R84212R81571r09296k038505m91985J677405J529776k99460
40307F14639j019548l23154l58039j479285j462161M77274K010161J341627o1453
40298b59939p3348Q47018R26605J3586p09202q16504o55957j74404O44391R92825
$$ plain form
40288 735071 1125306 868787 674568 357138 -1038480 -3054719 -3606414 -1886887 168152
40279 168152 539973 -244438 -588831 -541205 -1157158 -2075894 -1779362 50524 2216328
40270 2216328 3952351 5573271 7087647 7647750 6767700 5057963 3465808 2512657 2235542
40261 2235542 2116831 1311237 -181388 -973864 -43658 1398309 1214589 -732268 -2568912
40252 -2568912 -3275020 -3752529 -4738379 -5528308 -5526402 -5353991 -5331110 -4323140 -1507423 1720161
40242 1720161 3083627 2171558 647546 54878 444794 998249 1129323 964683 1211633
40233 1211633 2385313 3867517 4178894 2613041 156363 -1613876 -2034183 -1396972 -208748
40224 -208748 974217 1555965 1416728 1014257 565157 -214365 -1104862 -1072183 220785
$$ packed form
40288G35071L90235k56519j94219l17430j395618k016239n51695J719527K055039
40279A68152L71821p84411l44393M7626o15953r18736K96532J829886K165804
40270B216328J736023J620920J514376N60103q80050j709737j592155r53151k77115
40261B235542j18711q05594j492625p92476R30206J441967j83720j946857j836644
40252b568912p06108m77509r85850p89929J906J72411K2881J007970K815717L227584
40242A720161J363466r12069j524012n92668L89916N53455J31074j64640K46950
40233A211633J173680J482204L11377j565853k456678j770239m20307O37211J188224
40224b08748J182965N81748j39237m02471m49100p79522q90497L2679J292968
$$ plain form
40215 220785 1476111 1389403 441161 -180941 -738565 -2376140 -4643062 -5375970 -3515463
40206 -3515463 -711774 568146 -299061 -1844260 -2219986 -706419 1877560 3770481
40198 3770481 3691212 2074208 643820 605714 1598970 2488110 2626963 2063636 1016802
40189 1016802 -314413 -1570282 -2319670 -2499130 -2617126 -3273841 -4355888 -4957131 -4479138
40180 -4479138 -3607052 -3511251 -4111648 -4113186 -3096530 -2454431 -3424976 -5112553 -5552731 -4083270
40170 -4083270 -1547457 1174763 3425424 4034661 2027509 -1818512 -5426139 -7494645
40162 -7494645 -7989808 -6912856 -4364369 -1896057 -1722096 -3832799 -5640934 -5407650 -4326713
40153 -4326713 -4048235 -3854377 -2057912 995991 3325236 4109612 4230980 4263695 3723955
$$ packed form
40215B20785J255326q6708r48242o22102n57624j637575k266922p32908J860507
40206c515463K803689J279920q67207j545199l75726J513567K583979J892921
40198C770481p9269j617004j430388l8106R93256Q89140J38853n63327j046834
40189A016802j331215j255869p49388j79460j17996o56715j082047o01243M77993
40180d479138Q72086R5801o00397j538J016656O42099r70545j687577m40178J469461
40170d083270K535813K722220K250661O09237k007152l846021l607627k068506
40162g494645m95163J076952K548487K468312J73961k110703j808135K33284J080937
40153d326713K78478J93858J796465L053903K329245P84376J21368L2715n39740
$$ plain form
40144 3723955 2542917 1807279 2455483 4089842 5468414 5619067 4373939 2383111 664370
40135 664370 -295903 -876000 -1410372 -1465560 -733064 -98927 -733988 -2344241 -3430289
40126 -3430289 -3234961 -2356587 -1402912 -219120 1216605 2155466 1885678 567756 -1030414
40117 -1030414 -2064454 -1824850 -258734 1509947 2055217 1361380 790038 962449 690355
40108 690355 -1227761 -3937820 -5266345 -4225360 -1966436 -311308 47775 -210218 -223029
40099 -223029 -114107 -751467 -2202202 -2939764 -1430371 1618183 3646288 3127645 1088067
40090 1088067 -570019 -1090234 -598345 869591 2841162 3809156 2665340 404454 -887234
40081 -887234 -572372 163294 296300 54123 -3459 293042 1179963 2945398 4980432
$$ packed form
40144C723955j181038p35638O48204J634359J378572J50653j245128j990828j718741
40135F64370r60273n80097n34372n5188P32496O34137o35061j610253j086048
40126c430289J95328Q78374R53675J183792J435725R38861k69788j317922j598170
40117a030414j034040K39604J566116J768681N45270o93837n71342J72411k72094
40108F90355j918116k710059j328525J040985K258924J655128L59083k57993j2811
40099b23029J08922o37360j450735p37562J509393L048554K028105n18643k039578
40090A088067j658086n20215M91889J467936J971571R67994j143816k260886j291688
40081h87234L14862P35666J33006k42177n7582K96501Q86921J765435K035034
$$ plain form
40072 4980432 5839351 4829111 2817748 1047173 -103081 -791900 -1055306 -1068561 -1299880
40063 -1299880 -1739894 -1638172 -632001 583623 1431297 2490460 4344632 6052143 6068405
40054 6068405 4418521 2672255 1811594 1417621 1153163 1682175 3413488 5283262 5655891
40045 5655891 4011150 1241833 -1214726 -2087423 -771853 2105184 4911181 6415994
40037 6415994 6810944 6989541 7308670 7648702 8152462 8915389 9122747 7581165 4392387
40028 4392387 1310111 -877 400002 1103597 909950 -254421 -1547403 -1997125 -1330808
40019 -1330808 -219083 532048 1014036 1954421 3392666 4365685 4252890 3673940 3436090
40010 3436090 3265012 2462603 1359124 1022406 1651789 2369982 2748996 3403595 4557640
$$ packed form
40072D980432Q58919j010240k011363j770575j150254o88819k63406j3255k31319
40063a299880m40014J01722J006171J215624Q47674J059163J854172J707511J6262
40054F068405j649884j746266q60661l93973k64458N29012J731313J869774L72629
40045E655891j644741k769317k456559q72697J315570K877037K805997J504813
40037F415994L94950J78597L19129L40032N03760P62927K07358j541582l188778
40028D392387l082276j310988M00879P03595j93647j164371j292982m49722O66317
40019a330808J111725P51131M81988R40385J438245R73019j12795n78950k37850
40010C436090j71078q02409j103479l36718O29383P18193L79014O54599J154045
$$ plain form
40001 4557640 5052155 3760182 1463158 235348 955396 2260866 2216374 449336 -1648725
39992 -1648725 -2374343 -1018514 1824713 4637254 5823827 4924536 3259976 2830267 4115742
39983 4115742 5374397 4749289 2786967 1945360 3505331 5970774 7061787 6406811 5329251
39974 5329251 4573143 3538206 1793709 169953 -188771 811923 2298523 3453625
39966 3453625 4035344 4135946 3795074 2892140 1490615 364419 711696 2712220 4674372
39957 4674372 4559596 2386585 210800 -383106 248772 1012317 1459337 1416647 555864
39948 555864 -685822 -870235 527143 1851227 1282487 -601590 -1804375 -1879471 -2118943
39939 -2118943 -2978094 -3306812 -2534299 -1799228 -2080530 -2690727 -2695768 -2661597 -3689945 -5391242
$$ packed form
40001D557640M94515j291973k297024j227810P20048J305470m4492j767038k098061
39992a648725p25618J355829K843227K812541J186573q99291j664560m29709J285475
39983D115742J258655o25108j962322q41607J559971K465443J091013o54976j077560
39974E329251p56108j034937j744497j623756l58724J000694J486600J155102
39966C453625N81719J00602l40872r02934j401525j126196L47277K000524J962152
39957D674372j14776k173011k175785n93906O31878P63545M47020m2690q60783
39948E55864j241686j84413J397378J324084n68740j884077j202785p5096k39472
39939b118943q59151l28718P72513P35071k81302o10197n041L4171j028348j701297
$$ plain form
39929 -5391242 -6099830 -4969762 -2972697 -1761250 -2013640 -2890472 -2931752 -1644378 -176208
39920 -176208 -1375 -1057366 -1938243 -1901085 -1607931 -1641200 -1559155 -1070916 -898292 -1440784
39910 -1440784 -1620403 -320396 1789728 3218563 3883068 4933600 6652987 7998544
39902 7998544 8258860 7886063 7525307 7300806 7191716 7111405 6562615 5268093 4147418
39893 4147418 4424662 5636231 5947236 4867460 4166981 5257129 6963455 7091470 5320676
39884 5320676 3279647 2265974 2100980 2054952 1882770 1872814 2501215 4003657 5853504
39875 5853504 6914896 6626827 5786143 5671122 6674753 8217415 9505150 9786813 8489473
39866 8489473 6032062 4055650 3758245 4276837 3906757 2764650 2810353 4992509 7797116
$$ packed form
39929e391242p08588J130068J997065J211447k52390q76832m1280J287374J468170
39920a76208J74833j055991q80877L7158K93154l3269Q2045M88239J72624n42492
39910a440784j79619J300007K110124J428835O64505J050532J719387J345557
39902G998544K60316l72797l60756k24501j09090q0311n48790j294522j120675
39893D147418K77244J211569L11005j079776p00479J090148J706326J28015j770794
39884E320676k041029j013673j64994m6028j72182r956O28401J502442J849847
39875E853504J061392k88069q40684j15021J003631J542662J287735K81663j297340
39866H489473k457411j976412k97405N18592l70080j142107M5703K182156K804607
$$ plain form
39857 7797116 9222696 8932814 7680291 5892883 4075585 3613713 5499940 8566342
39849 8566342 10477818 10489502 9914360 9843166 9940175 9907555 10511726 12099965 13353186 12950191
39839 12950191 11729386 11674055 13115729 14529035 15105748 15879670 17749031 19816258 20715306
39830 20715306 20682159 21201890 23054324 25634500 27936245 29416351 30057738 30244910 30447130
39821 30447130 30536967 29764411 28024977 26722904 27451378 29983154 32510300 33879795 34685131
39812 34685131 36038947 38206669 40803918 43593449 46656926 50284338 54937209 60779811
39804 60779811 67099479 72919528 78498083 85474016 95014372 106393258 117965191 129149982
39796 129149982 140987002 155042515 172108379 191638280 212209076 232903069 254300039
$$ packed form
39857G797116J425580k89882j252523j787408j817298m61872J886227L066402
39849H566342J911476J1684n75142p1194R7009l2620O04171J588239J253221m02995
39839A2950191j220805n5331J441674J413306N76713P73922J869361K067227Q99048
39830B0715306l3147N19731J852434K580176K301745J480106O41387J87172K02220
39821C0447130Q9837p72556j739434j302073P28474K531776K527146J369495Q05336
39812C4685131J353816K167722K597249K789531L063477L627412M652871N842602
39804F0779811O319668N820049N578555O975933R540356J1378886J1571933J1184791
39796A29149982J1837020J4055513J7065864J9529901K0570796K0693993K1396970
$$ plain form
39789 254300039 277382624 301131357 321902164 335615603 339995496 334612984 320206928
39782 320206928 299081402 275125244 251747301 229797052 208421487 187537134 168233578
39775 168233578 151044425 135412844 121217257 109476081 100761492 93794639 86570044
39768 86570044 78602910 71356735 66366547 63301190 60145003 55335419 49454417 44401355
39760 44401355 41081992 38733705 36590601 34921620 33686343 31523695 27605677 23644996
39752 23644996 22180319 23130053 23880581 22806152 20811292 19092402 17417071 15478716
39744 15478716 14097166 13735665 13226217 11461809 9350799 8589440 9180966 9597798 8959725
39735 8959725 7780310 6902930 6857657 7932657 9718299 10840658 10263436 8618646 7198248
$$ packed form
39789B54300039K3082585K3748733K0770807J3713439M379893n382512j4406056
39782C20206928k1125526k3956158k3377943k1950249k1375565k0884353j9303556
39775A68233578j7189153j5631581j4195587j1741176q714589o966853p224595
39768H6570044p967134p246175m990188l065357l156187m809584n881002n053062
39760D4401355l319363k348287k143104j668981j235277k162648l918018l960681
39752B3644996j464677R49734P50528j074429j994860j718890j675331j938355
39744A5478716j381550l61501n09448j764408k111010p61359N91526M16832o38073
39735H959725j179415q77380m5273J075000J785642J122359n77222j644790j420398
$$ plain form
39726 7198248 6046677 4398869 2664424 2210459 2991931 3215262 2119226 1528194 3384416
39717 3384416 6757764 8796756 8328350 7201190 7820397 10217416 12107024 11576694 9220894
39708 9220894 7360484 7335893 8165941 8183419 7296265 6710586 6801708 6609352 5665448 4963280
39698 4963280 5341580 5989263 5668028 4708014 4498508 5299885 5870536 5351782 4342399
39689 4342399 3742772 3583821 3643950 4368953 6202190 8385816 9435174 8874875 7750575
39680 7750575 7209919 7221558 7051897 6422321 5577019 4557066 3218338 2012343 1981626
39671 1981626 3539544 5640078 6585914 5532301 3046967 522750 -724846 -228249
39663 -228249 1250447 2324339 2371866 2051580 2047926 1849645 617441 -1085231 -1594372
$$ packed form
39726G198248j151571j647808j734445m53965P81472K23331j096036n91032J856222
39717C384416L373348K038992m68406j127160O19207K397019J889608n30330k355800
39708I220894j860410k4591Q30048J7478q87154n85679R1122j92356r43904p02168
39698D963280L78300O47683l21235r60014k09506Q01377N70651n18754j009383
39689D342399n99627j58951O0129P25003J833237K183626J049358n60299j124300
39680G750575n40656J1639j69661o29576q45302j019953j338728j205995l0717
39671A981626J557918K100534R45836j053613k485334k524217j247596M96597
39663b28249J478696J073892M7527l20286l654j98281j232204j702672n09141
$$ plain form
39654 -1594372 -286310 1656346 2905311 3315392 3098738 1898086 -258925 -1961048
39646 -1961048 -1750125 -121193 1097306 1274305 1599761 2972506 4542887 5037982 4618861
39637 4618861 4492462 5089780 5469393 4508031 2170700 -446639 -2046201 -2093946 -1053397
39628 -1053397 282678 1613569 3118872 4786613 6213792 7092194 7347867 6691997 4757608
39619 4757608 2078225 200994 92119 903951 1135280 654487 602384 1448097 2273011
39610 2273011 2214548 1590268 1085574 696001 204386 74233 979457 2709678 4301369
39601 4301369 5141479 5303305 4908001 3874286 2372581 886990 -348125 -1429945 -2133423
39592 -2133423 -1788184 -206901 1708948 2778726 2728845 2200099 1835148 1811118 2067553
$$ packed form
39654a594372J308062J942656J248965M10081k16654j200652k157011j702123
39646a961048K10923J628932J218499J76999L25456J372745J570381M95095m19121
39637D618861j26399N97318L79613r61362k337331k617339j599562m7745J040549
39628a053397J336075J330891J505303J667741J427179Q78402K55673o55870j934389
39619D757608k679383j877231j08875Q11832K31329m80793n2103Q45713Q24914
39610B273011n8463o24280n04694l89573m91615j30153R05224J730221J591691
39601D301369Q40110J61826l95304j033715j501705j485591j235115j081820p03478
39592b133423L45239J581283J915849J069778m9881n28746l64951k4030K56435
$$ plain form
39583 2067553 2399973 2302210 1282890 -422707 -1845972 -2269868 -1958014 -1668465 -1733776
39574 -1733776 -1942208 -2044640 -1888906 -1196866 172676 1634051 2157269 1509722 787570
39565 787570 1226399 2724998 4031826 4242136 3590888 2808516 2254767 1847037 1415522
39556 1415522 893776 390503 160133 270390 366542 183200 231425 1336433 3332283
39547 3332283 4886461 4964325 3860029 2374867 665875 -1425133 -3453973 -4634967
39539 -4634967 -4787628 -4379621 -3895617 -3715479 -4111862 -4569965 -3671387 -809173 2333413
39530 2333413 3356324 2054641 303491 -912222 -2456352 -4521897 -5269105 -3449309
39522 -3449309 -830511 -66394 -1021653 -1240200 285998 1872744 1899965 984740 666034
$$ packed form
39583B067553L32420r7763j019320j705597j423265m23896L11854K89549o5311
39574a733776k08432j02432J55734O92040J369542J461375N23218o47547p22152
39565G87570M38829J498599J306828K10310o51248p82372n53749m07730m31515
39556A415522n21746n03273k30370J10257R6152j83342M8225J105008J995850
39547C332283J554178P7864j104296j485162j708992k091008k028840j180994
39539d634967j52661M08007M84004J80138l96383m58103Q98578K862214L142586
39530B333413J022911j301683j751150j215713j544130k065545p47208J819796
39522c449309K618798P64117r55259k18547J526198J586746K7221r15225l18706
$$ plain form
39513 666034 1265215 1970822 2167063 1839215 1284182 1128920 2078268 3906348 5115167
39504 5115167 4348572 1940146 -535010 -2008334 -2570098 -2567319 -1913293 -568379 907937
39495 907937 1831393 2268044 3006933 4537827 6269718 7004454 6196985 4517844 3007393
39486 3007393 1909402 753848 -463286 -812547 444688 2639707 4213353 4397085
39478 4397085 3799412 3190447 2340271 578710 -1861789 -3752297 -4091028 -2853024 -534666
39469 -534666 2277627 4612362 5278035 4141544 2726369 2557900 3138628 2621623 504564
39460 504564 -1523490 -1843438 -977401 -653221 -1504735 -2540657 -2530533 -1225383 580045
39451 580045 1734539 1784053 1676004 2874564 5356807 7247541 7126516 5831020 4905069
$$ packed form
39513F66034N99181P05607J96241l27848n55033j55262R49348J828080J208819
39504E115167p66595k408426k475156j473324n61764K779O54026J344914J476316
39495I07937R23456M36651P38889J530894J731891P34736q07469j679141j510451
39486C007393j097991j155554j217134l49261J257235K195019J573646J83732
39478D397085n97673o08965q50176j761561k440499j890508l38731J238004K318358
39469e34666K812293K334735O65673j136491j415175j68469N80728n17005k117059
39460E04564k028054l19948Q66037L24180q51514j035922J0124J305150J805428
39451E80045J154494M9514j08049J198560K482243J890734j21025j295496r25951
$$ plain form
39442 4905069 4095247 2002336 -1135933 -3203383 -3088179 -2162649 -2150967 -2878599 -3142125
39433 -3142125 -2755151 -2476300 -2472106 -2088581 -1067334 -64504 179499 -363631 -1113812
39424 -1113812 -1376027 -687500 966748 3061793 4664585 4818105 3227971 921124 -193462
39415 -193462 801777 2528594 2787424 1364432 270875 899155 2224668 2594960 2089443
39406 2089443 1858211 2012295 1773784 1345094 1891465 3397114 4032305 2415210 -444516
39397 -444516 -2267349 -1996961 -480517 893941 1442028 1181641 364805 -603598 -1057330
39388 -1057330 -342594 1555797 3761682 5189568 5578202 5551253 5501693 4892215 3163242
39379 3163242 967794 -311152 -284644 3894 -358310 -881641 -509443 794453 1995437
$$ packed form
39442D905069q09822k092911l138269k067450J15204R25530J1682p27632k63526
39433c142125L86974K78851M194L83525J021247J002830K44003n43130p50181
39424a113812k62215O88527J654248K095045J602792J53520j590134k306847j114586
39415a93462R95239J726817K58830j422992j093557O28280J325513L70292n05517
39406B089443k31232J54084k38511m28690N46371J505649O35191j617095k859726
39397d44516j822833K70388J516444J374458N48087k60387q16836r68403m53732
39388a057330P14736J898391K205885J427886L88634k6949m9560o09478j728973
39379C163242k195448j278946K6508K88538l62204n23331L72198J303896J200984
$$ plain form
39370 1995437 2287305 1763637 881137 -37295 -655804 -671092 -320970 -284120 -697960 -868568
39360 -868568 -499974 -542027 -1832039 -3297717 -2839850 -138156 2681369 3610584 2814066
39351 2814066 1555602 435363 -231899 449237 2795916 5260397 6036781 5537960 5547702
39342 5547702 6267659 6230358 5058323 3981646 3247653 1567385 -858041 -1343916 1439372
39333 1439372 4764620 5260084 3391905 2017407 1776543 932389 -793271 -1448329 -241204
39324 -241204 1133915 1381659 1371017 1953318 2246566 1494779 717966 856466 882543 -338020
39314 -338020 -1554021 -662893 1938226 3693250 3429062 2566029 2541378 2855544 2417319
39305 2417319 1412634 799342 806246 931068 945778 1033309 1153266 976331 368275 -566673
$$ packed form
39370A995437K91868n23668q82500r18432o18509j5288L50122L6850m13840j70608
39360h68568L68594m2053j290012j465678M57867K701694K819525R29215p96518
39351B814066j258464j120239o67262O81136K346679K464481P76384m98821R742
39342E547702P19957l7301j172035j076677p33993j680268k425426m85875K783288
39333A439372L325248M95464j868179j374498k40864q44154j725660o55058J207125
39324b41204J375119K47744j0642N82301K93248p51787p76813J38500K6077j220563
39314c38020j216001Q91128K601119J755024k64188q63033k4651L14166m38225
39305B417319j004685o13292O904J24822J4710Q7531J19957j76935o08056r34948
$$ plain form
39295 -566673 -1771794 -3014669 -3526399 -2630900 -901043 73567 -421871 -1131574 -341791
39286 -341791 1843127 3608038 3750081 2925192 2302828 1975770 1462730 1096054 1822315
39277 1822315 3714947 5555175 6077956 5094970 3273748 1339242 -241709 -1133149 -1076622
39268 -1076622 -86061 1287382 2061683 1591954 290343 -874582 -1655129 -2578563 -3500645
39259 -3500645 -3181699 -1116908 1156473 1787127 975712 241599 -108845 -1004351 -2235562
39250 -2235562 -2109464 -109926 1810179 1651107 -121219 -1520879 -1515780 -488934 945898
39241 945898 2373597 3251327 3216716 2591109 1919044 1280349 595510 162020 240868 525429
39231 525429 660256 837507 1180719 1026213 -260687 -1993737 -2613384 -1474369 464953
$$ packed form
39295e66673j205121j242875n11730Q95499J729857R74610m95438p09703P89783
39286c41791K184918J764911J42043q24889o22364l27058n13040l66676P26261
39277A822315J892632J840228N22781r82986j821222j934506j580951q91440N6527
39268a076622R90561J373443P74301m69729j301611j164925p80547r23434r22082
39259c500645L18946K064791K273381O30654q11415p34113l50444q95506j231211
39250b235562J26098J999538J920105j59072j772326j399660N099J026846J434832
39241I45898J427699Q77730l4611o25607o72065o38695o84839m33490P8848K84561
39231E25429J34827J77251L43212j54506j286900j733050o19647J139015J939322
$$ plain form
39222 464953 1780949 1894603 1220556 463606 -78330 -619697 -1281614 -1567371 -944048
39213 -944048 111444 462239 -85196 -456016 -708 520879 341608 33935 470610
39204 470610 1340333 1845399 2070447 2343133 1969581 208796 -1937583 -2630652 -1765840
39195 -1765840 -980993 -1084589 -1226773 -906854 -970238 -1836327 -2263221 -920586 1845426
39186 1845426 4671141 6674161 7571481 7305306 6403138 5826452 5621202 4593962 2201221
39177 2201221 -188339 -1001892 -563733 -199965 29368 1114662 2892236 3671076 2336991
39168 2336991 -309963 -2591704 -3427189 -2659345 -908170 612250 966252 476885 154610
39159 154610 108272 -500196 -1735631 -2325982 -1429167 61737 789577 654277 346536
$$ packed form
39222D64953J315996J13654o74047p56950n41936n41367o61917k85757O23323
39213i44048J055492L50795n47435l70820M55308N21587j79271l07673M36675
39204D70610Q69723N05066K25048K72686l73552j760785k146379o93069Q64812
39195a765840P84847j03596j42184L19919o3384q66089m26894J342635K766012
39186A845426K825715K003020Q97320k66175r02168n76686k05250j027240k392741
39177B201221k389560q13553M38159L63768K29333J085294J777574P78840j334085
39168B336991k646954k281741q35485P67844J751175J520420L54002m89367l22275
39159A54610m6338o08468j235435n90351Q96815J490904P27840j35300l07741
$$ plain form
39150 346536 -53470 -850945 -1664423 -1905921 -2072974 -3154731 -4714346 -5040228 -3646668
39141 -3646668 -2245277 -2420194 -3497202 -3812198 -3191233 -2814739 -3139753 -3450047 -3403359
39132 -3403359 -3585068 -4178076 -4311997 -3389625 -2184727 -1905768 -2760523 -4039374 -5032771
39123 -5032771 -5223354 -4182254 -2211306 -803599 -1476985 -4037635 -6709764 -8132786
39115 -8132786 -8569956 -8853350 -8759360 -7119034 -3499958 743773 3475087 3814615 2906423
39106 2906423 2461455 2780051 2676961 1328692 -441461 -1056649 100631 2311586 4462386
39097 4462386 5736394 5567760 3722698 787084 -1805333 -2686990 -1623043 363567
39089 363567 1960905 2693920 3058763 3552211 3871718 3408857 2267330 1161597 360799
$$ packed form
39150C46536m00006p97475q13478k41498j67053j081757j559615l25882J393560
39141c646668J401391j74917j077008l14996O20965L76494l25014l10294M6688
39132c403359j81709n93008j33921R22372J204898K78959q54755j278851r93397
39123e032771j90583J041100J970948J407707o73386k560650k672129j423022
39115h132786m37170k83394R3990J640326L619076M243731K731314L39528r08192
39106B906423m44968L18596j03090j348269j770153o15188J157280K210955K150800
39097D462386J274008j68634j845062k935614k592417q81657J063947J986610
39089C63567J597338P33015L64843M93448L19507m62861j141527j105733q00798
$$ plain form
39080 360799 -513795 -1532423 -2180641 -2364602 -2718994 -3313151 -3091713 -1634663 -585394
39071 -585394 -1830492 -4621267 -6086789 -4749574 -2170575 -770305 -1291858 -2963819
39063 -2963819 -4918942 -6450266 -6693151 -5267921 -3054716 -1489104 -1129599 -1490467 -2115883
39054 -2115883 -3090319 -4398218 -5438060 -5567922 -4836983 -3802552 -2720781 -1283474 724430
39045 724430 2779455 3930976 3691710 2348262 448515 -1612243 -3422077 -4478069
39037 -4478069 -4644677 -4411867 -4370888 -4602029 -4752077 -4433248 -3403872 -1798813 -410807
39028 -410807 -178647 -998161 -1611640 -1181397 -375931 -274459 -860747 -1481906 -2208526 -3558341
39018 -3558341 -5117321 -5651770 -4700918 -3098408 -1734353 -568722 970537 3210493
$$ packed form
39080C60799q74594j018628o48218j83961l54392n94157K21438J457050J049269
39071e85394j245098k790775j465522J337215K578999J400270n21553j671961
39063b963819j955123j531324k42885J425230K213205J565612L59505l60868o25416
39054b115883r74436j307899j039842j29862P30939J034431J081771J437307K007904
39045G24430K055025J151521k39266j343448j899747k060758j809834j055992
39037d478069j66608K32810M0979k31141j50048L18829J029376J605059J388006
39028d10807K32160q19514o13479M30243Q05466J01472n86288o21159p26620j349815
39018c558341j558980n34449R50852J602510J364055J165631J539259K239956
$$ plain form
39010 3210493 5889304 8111352 8857824 8065414 6780010 5659602 4131316 2021185
39002 2021185 929784 2152628 3924102 3143009 -81631 -2061117 -405232 2960342
38994 2960342 4751487 4265532 2862659 1240535 -811323 -2909473 -4170388 -4449353
38986 -4449353 -4267058 -3936038 -3668277 -3825133 -4088492 -3257747 -1033374 855321 645379
38977 645379 -1039215 -2111086 -1666283 -228989 1950959 4961969 7796443 8746163 7567464
38968 7567464 5819372 4716910 3942757 2962033 2229077 2389659 3155705 3668960 3515712
38959 3515712 2961273 2505536 2405430 2425009 2190731 2068718 3161854 5690058 7857479
38950 7857479 7502062 4836344 2443422 2351062 4056693 5688444 6131843 5481939 4161898
$$ packed form
39010C210493K678811K222048P46472p92410j285404j120408j528286k110131
39002B021185j091401J222844J771474p81093l224640j979486J655885L365574
38994B960342J791145m85955j402873j622124k051858k098150j260915k78965
38986d449353J82295L31020K67761j56856k63359Q30745K224373J888695k09942
38977F45379j684594j071871M44803J437294K179948L011010K834474R49720j178699
38968G567464j748092j102462p74153r80724p32956J60582P66046N13255j53248
38959C515712n54439m55737j00106J9579k34278j22013J093136K528204K167421
38950G857479l55417k665718k392922r2360J705631J631751M43399o49904j320041
$$ plain form
38941 4161898 2387748 358604 -1471396 -2459512 -2232796 -1175181 -180009 315355 663966
38932 663966 1058676 831049 -648614 -2827266 -4479533 -5012905 -4559761 -3256782 -1367438
38923 -1367438 272260 985279 1161427 1401980 1140952 -529921 -2843567 -3770228 -2742565
38914 -2742565 -1514297 -1735489 -2930675 -3624463 -3403559 -2925800 -2589843 -2131203 -1254406
38905 -1254406 -79620 851827 794932 -547309 -2374547 -3327051 -2966564 -2225516 -2118337
38896 -2118337 -2556375 -2798074 -2576415 -2314639 -2484781 -3082100 -3591869 -3364637 -2247661
38887 -2247661 -913842 -341410 -908317 -2073363 -2789480 -2195388 -384370 1282821 1297238
38878 1297238 -114879 -991811 -155681 1186021 1314752 482923 94508 196973 -381549
$$ packed form
38941D161898j774150k029144j830000r88116K26716J057615R95172M95364L48611
38932F63966L94710k27627j479663k178652j652267n33372M53144J302979J889344
38923a367438J639698P13019J76148K40553k61028j670873k313646r26661J027663
38914b742565J228268k21192j195186o93788K20904M77759L35957M58640Q76797
38905a254406J174786R31447n6895j342241j827238r52504L60487P41048J07179
38896b118337m38038k41699K21659K61776j70142n97319n09769K27232J116976
38887b247661J333819N72432n66907j165046p16117N94092J811018J667191J4417
38878A297238j412117q76932Q36130J341702J28731q31829l88415J02465n78522
$$ plain form
38869 -381549 -1702418 -2389449 -1749212 -658055 -197011 -772583 -2481011 -4751974 -5756069
38860 -5756069 -4037008 -816753 1233917 1587084 2042974 3197010 3459977 2405684 2239011
38851 2239011 4320994 6641862 6718394 5047226 3625619 2745342 1461166 -117163 -1212983
38842 -1212983 -2010355 -2889198 -3082521 -2095050 -1386097 -2469761 -4270919 -4622071 -3557858
38833 -3557858 -2755491 -2464076 -1640584 -666387 -1048919 -2396753 -2542186 -1149516 -520960
38824 -520960 -1953339 -3689110 -3612954 -1927031 60387 1907406 3359560 3319065 1251508
38815 1251508 -1284653 -2043069 -621949 1374444 2264456 1674130 535878 344557 1911720
38806 1911720 4345297 5737717 5166513 3428002 1692548 388428 -321466 -141560 605170
$$ packed form
38869c81549j320869o87031O40237J091157M61044n75572j708428k270963j004095
38860e756069J719061L220255K050670L53167M55890J154036K62967j054293j66673
38851B239011K081983K320868P6532j671168j421607q80277j284176j578329j095820
38842a212983p97372q78843j93323R87471P08953j083664j801158l51152J064213
38833c557858Q02367K91415Q23492R74197l82532j347834j45433J392670O28556
38824e20960j432379j735771P6156J685923J987418J847019J452154m0495k067557
38815A251508k536161p58416J421120J996393Q90012n90326j138252j91321J567163
38806A911720K433577J392420n71204j738511j735454j304120p09894J79906P46730
$$ plain form
38797 605170 791904 -157750 -1427908 -1945346 -1629363 -908174 202666 1752123 3209642
38788 3209642 3944616 3905324 3273175 2052369 626232 39216 880403 2366060 3373087
38779 3373087 3993355 5138850 6786258 7583391 6454705 4033514 2155737 2067689 3257366
38770 3257366 4062906 3412566 1750537 77124 -1457530 -3317237 -5230952 -6139618 -5672561
38761 -5672561 -4700962 -4025798 -3411800 -2462294 -1597917 -1391935 -1518765 -1131428 82149
38752 82149 1780527 3442733 4384528 3847674 1865440 -301340 -1384957 -1579390 -2057621
38743 -2057621 -3138436 -3715131 -2682013 -386315 1633398 2153673 1378005 634735 1027259
38734 1027259 2441237 3928261 4785363 4871672 4143387 2637960 931241 -234417 -999400
$$ packed form
38797F05170J86734r49654j270158n17438L15983P21189J110840J549457J457519
38788C209642P34974l9292o32149j220806j426137n87016Q41187J485657J007027
38779C373087O20268J145495J647408P97133j128686k421191j877777q8048J189677
38770C257366Q05540o50340j662029j673413j534654j859707j913715r08666M67057
38761e672561R71599O75164O13998R49506Q64377K05982j26830L87337J213577
38752H2149J698378J662206R41795n36854j982234k166780j083617j94433m78231
38743b057621j080815n76695J033118K295698K019713N20275p75668p43270L92524
38734A027259J413978J487024Q57102Q6309p28285j505427j706719j165658p64983
$$ plain form
38725 -999400 -2215873 -3898113 -4807917 -4193138 -3001717 -2461671 -2219162 -1021973 1227466
38716 1227466 3321541 4451585 4871071 4837749 4099395 2812562 1983011 2343223 3361398
38707 3361398 3925808 3630409 2911385 2252485 1821967 1762060 2240329 3011828 3307714 2566760
38697 2566760 1264174 672844 1558416 3207796 3956279 2675363 -298848 -3452935 -5057256
38688 -5057256 -4200378 -1548116 858347 1157574 -650809 -2810820 -3650890 -3001010 -1854814
38679 -1854814 -1226077 -1483332 -2220961 -2524893 -1879085 -1031578 -1376614 -3213774 -5289365
38670 -5289365 -6417046 -6770609 -7003470 -6911815 -5897494 -4192630 -2545390 -955579 1193837
38661 1193837 3757486 5594023 5940189 5212427 4160174 2961920 1583217 410918
$$ packed form
38725i99400j216473j682240r09804O14779J191421N40046K42509J197189K249439
38716A227466K094075J130044M19486l3322p38354j286833q29551L60212J018175
38707C361398N64410k95399p19024o58900m30518n9907M78269P71499K95886p40954
38697B566760j302586n91330Q85572J649380P48483j280916k974211l154087j604321
38688e057256Q56878K652262K406463K99227j808383k160011q40070O49880J146196
38679a854814O28737k57255p37629l03932O45808Q47507l45036j837160k075591
38670e289365j127681l53563k32861R1655J014321J704864J647240J589811K149416
38661A193837K563649J836537L46166p27762j052253j198254j378703j172299
$$ plain form
38653 410918 -92208 -93985 -203199 -595684 -705540 106914 1760634 3436388 4298947 4171314
38643 4171314 3523615 2919816 2560751 2266280 1724984 786277 -312367 -1010940 -893852
38634 -893852 -90956 910961 1725685 2122816 1869811 985878 47353 -305122 -166032
38625 -166032 -115133 -163099 324755 1421647 2092519 1361065 -432661 -1992645 -2345532
38616 -2345532 -1434334 125480 1424692 1712507 969059 -39226 -493494 -175421 666436
38607 666436 1762430 2971490 4246397 5512741 6353394 6034713 4401112 2550047 1815043
38598 1815043 2101218 2077120 1009276 -576782 -2066582 -3348880 -4047861 -3593339 -2558380
38589 -2558380 -2477541 -3586225 -4172546 -3124320 -1666795 -1333304 -1580033 -937022 643333
$$ packed form
38653D10918n03126j777j09214l92485j09856Q12454J653720J675754Q62559j27633
38643D171314o47699o03799l59065k94471n41296r38707j098644o98573J17088
38634h93852Q02896J001917Q14724L97131k53005q83933r38525l52475J39090
38625a66032N0899m7966M87854J096892O70872p31454j793726j559984l52887
38616b345532R11198J559814J299212K87815p43448j008285m54268L18073Q41857
38607F66436J095994J209060J274907J266344Q40653l18681j633601j851065p35004
38598A815043K86175k4098j067844j586058j489800j282298o98981M54522J034959
38589b558380Q0839j108684n86321J048226J457525L33491k46729O43011J580355
$$ plain form
38580 643333 2261331 3838893 5508884 6066239 4194119 902954 -1286477 -1510752 -1058374
38571 -1058374 -789790 -95212 1289988 2352336 2315396 1572428 544734 -982561 -2792184
38562 -2792184 -3815946 -3486399 -2488508 -1656423 -1118847 -938538 -1496768 -2705932 -3774714
38553 -3774714 -4207507 -4194069 -3761411 -2553555 -744332 890550 2135932 3504830 4927153
38544 4927153 5406249 4416375 2622310 855863 -612674 -1584559 -1923412 -2261097 -3351870
38535 -3351870 -4421771 -3686207 -1004249 1529578 2235362 1502430 178377 -1823377 -4256813
38526 -4256813 -5681077 -5288042 -4189507 -3596378 -3170097 -2523284 -2707996 -4423942 -6171134
38517 -6171134 -6215172 -5253223 -5010595 -5147225 -3874873 -1083250 1419967 2551098 2821479
$$ packed form
38580F43333J617998J577562J669991N57355j872120l291165k189431k24275M52378
38571a058374K68584O94578J385200J062348l6940p42968j027694j527295j809623
38562b792184j023762L29547R97891Q32085N37576J80309n58230j209164j068782
38553c774714m32793J3438M32658J207856J809223J634882J245382J368898J422323
38544D927153M79096r89874j794065j766447j468537r71885l38853l37685j090773
38535c351870j069901P35564K681958K533827P05784p32932j324053k001754k433436
38526d256813j424264L93035J098535N93129M26281O46813j84712j715946j747192
38517f171134m4038R61949K42628j36630J272352K791623K503217J131131K70381
$$ plain form
38508 2821479 2789859 2574905 2686607 3413812 3646402 2352967 913993 1563546 3585439
38499 3585439 3861581 1685191 65485 1027950 2423122 1402549 -1175291 -2331249
38491 -2331249 -1512160 -872222 -1634060 -2696805 -2948409 -2786943 -2703437 -2002964 49013
38482 49013 2734996 4484566 4537349 3312423 1414514 -907725 -3111248 -3867255 -2101423
38473 -2101423 1362403 4009845 4155566 2807706 2222927 2961973 3508387 2779763 1642491
38464 1642491 1363059 1719721 1617034 814602 -24990 -590786 -1178875 -1811064 -1994076
38455 -1994076 -1447599 -431984 698461 1683703 2046132 1217395 -752620 -2992130 -4525075
38446 -4525075 -4943325 -4340687 -3043848 -1631356 -758042 -507163 -203651 582984 1066720
$$ packed form
38508B821479l1620k14954J11702P27205K32590j293435j438974O49553K021893
38499C585439K76142k176390j619706R62465J395172j020573k577840j155958
38491b331249Q19089O39938p61838j062745k51604J61466Q3506P00473K051977
38482D9013K685983J749570N2783j224926j897909k322239k203523p56007J765832
38473b101423L463826K647442J45721j347860n84779P39046N46414p28624j137272
38464A642491k79432L56662j02687q02432q39592n65796n88089o32189j83012
38455a994076N46477J015615J130445R85242L62429q28737j970015k239510j532945
38446d525075m18250O02638J296839J412492Q73314K50879L03512P86635M83736
$$ plain form
38437 1066720 129177 -1658108 -1966147 416487 3354790 3463364 370957 -2696148 -3105824
38428 -3105824 -1953123 -1780019 -2601559 -2274610 -233560 1519599 1537469 947546 1335028
38419 1335028 2268549 2402910 1938890 2268925 3608241 4590010 4311202 3472135 3086972
38410 3086972 3076504 2776095 2204576 2077194 2716975 3533649 3748608 3368835 3176127 3735148
38400 3735148 4627780 4867500 3962191 2302180 573960 -811142 -1640898 -1709001 -990329
38391 -990329 215297 1504629 2557916 3088998 3004182 2725959 2876516 3416927 3648444
38382 3648444 3419462 3670904 5078085 6630779 6534304 4454638 1983324 724156 708945
38373 708945 998806 1078011 1063868 1058920 1031845 1155700 1610692 2067422 1966689 1440634
$$ packed form
38437A066720r37543j787285l08039K382634K938303J08574l092407l067105m09676
38428c105824J152701J73104q21540L26949K041050J753159J7870n89923L87482
38419A335028R33521J34361m64020L30035J339316R81769k78808q39067l85163
38410C086972j0468l00409n71519j27382O39781Q16674K14959l79773j92708N59021
38400C735148Q92632K39720r05309j660011j728220j385102q29756o8103P18672
38391i90329J205626J289332J053287N31082q4816k78223J50557N40411K31517
38382C648444k28982K51442J407181J552694r6475k079666k471314j259168j5211
38373G08945K89861P9205j4143m948k7075J23855M54992M56730j00733n26055
$$ plain form
38363 1440634 1387253 2301190 3464832 3769369 3086592 2312851 2171348 2525785 2888045
38354 2888045 2984837 2610017 1528990 2492 -999903 -668945 707886 2041811 2462715
38345 2462715 1751601 217226 -1249068 -1400501 138256 1896192 1760076 -528166 -2790818
38336 -2790818 -2736829 -360744 2291812 3233271 2039897 -243979 -2163169 -2998016 -3172983
38327 -3172983 -3421292 -3611134 -2931438 -1298336 232419 860301 1056002 1517351 1821029
38318 1821029 1092233 -382394 -1299289 -1048513 -309831 188152 592314 1255657 1886277
38309 1886277 1894182 1164052 70003 -925465 -1317293 -593327 1217084 3173637 4148795
38300 4148795 4009342 3696332 3996550 4606619 4736194 4368109 4313678 4865103 4992968 3511855
$$ packed form
38363A440634n3381R13937J163642L04537o82777p73741j41503L54437L62260
38354B888045R6792l74820j081027j526498j002395L30958J376831J333925M20904
38345B462715p11114j534375j466294j51433J538757J757936j36116k288242k262652
38336b790818N3989K376085K652556R41459j193374k283876j919190q34847j74967
38327c172983k48309j89842O79696J633102J530755O27882J95701M61349L03678
38318A821029p28796j474627r16895K50776P38682M97983M04162O63343O30620
38309A886277P905p30130j094049r95468l91828P23966J810411J956553R75158
38300D148795j39453l13010L00218O10069J29575l68085n4431N51425J27865j481113
$$ plain form
38290 3511855 829476 -1241543 -1607959 -1175171 -1597435 -3272988 -5124983 -5967915 -5426386
38281 -5426386 -3787114 -1774843 -470069 -635420 -1881811 -3114664 -3986096 -5176311
38273 -5176311 -6905548 -8038026 -7468192 -5830330 -4782496 -4732806 -4330623 -2460073 163357
38264 163357 1920414 2178960 1602648 977680 490372 72234 -240070 -450619 -634423
38255 -634423 -657076 -258087 437377 923404 1094930 1619574 3078337 4920026 5754443
38246 5754443 4798289 2822415 1554442 2117777 3951695 5268944 4785934 3041423 1734984
38237 1734984 1723220 2107374 1496553 -333853 -2417161 -3716636 -3710243 -2321302 -95936
38228 -95936 1718579 2110168 1392909 737475 658979 717284 685862 1002252 1729924 2060242
$$ packed form
38290C511855k682379k071019l66416M32788m22264j675553j851995q42932N41529
38281e426386J639272K012271J304774j65351j246391j232853q71432j190215
38273e176311j729237j132478N69834J637862J047834M9690M02183J870550K623430
38264A63357J757057K58546n76312o24968m87308m18138l12304k10549j83804
38255f34423k2653L98989O95464M86027J71526N24644J458763J841689Q34417
38246E754443r56154j975874j267973N63335J833918J317249m83010j744511j306439
38237A734984j1764L84154o10821j830406k083308j299475O393J388941K225366
38228i5936J814515L91589p17259o55434p8496N8305l1422L16390P27672L30318
$$ plain form
38218 2060242 1519018 936565 1404043 2741011 3836824 4222725 4426904 4819932 4962871
38209 4962871 4360886 3247896 2225466 1480234 771689 40673 -381482 -258187 134621
38200 134621 305665 140450 -91810 -275265 -550080 -724541 -128184 1446267 3023697
38191 3023697 3333282 2269253 864249 -19604 -244890 202353 1377718 2766359 3450660
38182 3450660 3271257 3017132 3067549 2694125 1260887 -669438 -2080704 -2658929 -2534153
38173 -2534153 -1600059 47517 1563758 2150664 1968876 1443088 218550 -2120146 -4674684
38164 -4674684 -5799589 -5014155 -3352212 -1862307 -793999 -277359 -616733 -1522951 -2012919
38155 -2012919 -1619867 -1046249 -1120799 -1604588 -1502776 -274851 1583661 2997077 3224534
$$ packed form
38218B060242n41224n82453M67478J336968J095813L85901K04179L93028J42939
38209D962871o01985j112990j022430p45232p08545p31016m22155J23295L92808
38200A34621J71044j65215k32260j83455k74815j74461N96357J574451J577430
38191C023697L09585j064029j405004q83853k25286M47243J175365J388641O84301
38182C450660j79403k54125N0417l73424j433238j930325j411266n78225J24776
38173b534153R34094J647576J516241N86906j81788n25788j224538k338696k554538
38164d674684j124905P85434J661943J489905J068308N16640l39374r06218m89968
38155b012919L93052N73618p4550m83789J01812J227925J858512J413416K27457
$$ plain form
38146 3224534 2475727 1606686 1143995 945962 990479 1762515 3218637 4150304 3702941
38137 3702941 2966371 3609971 5210724 5638124 4240600 2869870 3142526 4339376 4939081
38128 4939081 4718521 4099615 2719283 219350 -2377080 -3640738 -3593340 -3223089 -2636693
38119 -2636693 -1179244 902623 2474901 3180522 3650107 3965336 3405217 2073946 1344181
38110 1344181 2002948 3088762 3309034 2690660 2109884 2008510 2288645 2711731 2687402
38101 2687402 1474763 -538359 -1509034 -166117 2327702 3583922 2681415 663725
38093 663725 -1188033 -2325661 -2465105 -1628152 -782820 -1082839 -2161297 -2461155 -1613934
38084 -1613934 -1041173 -1550895 -1888477 -806852 790397 1284298 849759 764676 995566
$$ packed form
38146C224534p48807q69041m62691j98033M4517P72036J456122R31667m47363
38137C702941p36570O43600J600753M27400j397524j370730K72656J196850N99705
38128D939081k20560o18906j380332k499933k596430j263658M7398L70251N86396
38119b636693J457449K081867J572278P05621M69585L15229n60119j331271p29765
38110A344181O58767J085814K20272o18374n80776j01374K80135M23086k4329
38101B687402j212639k013122r70675J342917K493819J256220r02507k017690
38093F63725j851758j137628j39444Q36953Q45332l00019j078458k99858Q47221
38084a613934N72761n09722l37582J081625J597249M93901m34539q5083K30890
$$ plain form
38075 995566 526987 -286189 -12814 1027117 649917 -1601555 -3041051 -1637920 566245
38066 566245 72982 -3003451 -4894515 -3141536 518245 2766000 2501015 1086456 35148
38057 35148 -256074 52608 854958 1915646 2672649 2589733 1638563 340301 -670446
38048 -670446 -1128240 -1190574 -1063119 -728901 -119432 631699 1298258 1847250 2452659 3217041
38038 3217041 3910380 3987174 3025941 1336505 -102790 -718437 -1145626 -2336747 -3968003
38029 -3968003 -4582786 -3500950 -1727688 -591751 -292212 -277454 -242729 -81243 463253
38020 463253 1373571 2165749 2733191 3667651 5016818 5553640 4304680 2150120 792615
38011 792615 653457 898597 1029428 1195638 1316409 1188868 1206245 1714461 1959986 1074283
$$ packed form
38075I95566m68579q13176K73375J039931l77200k251472j439496J403131K204165
38066E66245m93263l076433j891064J752979L659781K247755k64985j414559j051308
38057C5148k91222L08682Q02350J060688P57003q2916r51170j298262j010747
38048f70446m57794o2334J27455L34218O09469P51131O66559N48992O05409P64382
38038C217041O93339P6794r61233j689436j439295o15647m27189j191121j631256
38029c968003o14783J081836J773262J135937K99539J4758L4725J61486N44496
38020D63253R10318P92178N67442R34460J349167N36822j248960k154560j357505
38011G92615j39158K45140J30831J66210J20771j27541J7377N08216K45525q85703
$$ plain form
38001 1074283 -121918 132654 1959144 3543813 3616412 2750140 1906023 1173491 458169
37992 458169 78816 58913 -87585 -392892 -331954 -47757 -466938 -1699863 -2518703 -2047185
37982 -2047185 -950612 -410907 -862414 -2086133 -3458126 -3809864 -2357984 -201431 495609
37973 495609 -672130 -1803505 -1531042 -744487 -648375 -848953 -588355 -290554 -405665
37964 -405665 -76373 1402190 2857877 2659180 1122562 -17017 14814 499512 587455
37955 587455 90854 -606484 -657841 458987 1652851 1003046 -1300497 -2431953 -701197
37946 -701197 1806037 2132378 425029 -1151266 -2059641 -3273356 -4360450 -3535994 -539022
37937 -539022 2862685 5209462 6223078 5744676 4086733 3160853 4725328 7439631 8134559
$$ packed form
38001A074283j196201K54572J826490J584669P2599q66272q44117p32532p15322
37992D58169l79353j9903j46498l05307O0938K84197m19181j232925q18840M71518
37982b047185J096573N39705m51507j223719j371993l51738J451880K156553O97040
37973D95609j167739j131375K72463P86555R6112k00578K60598K97801j15111
37964d05665L29292J478563J455687j98697j536618j139579L1831M84698Q7943
37955E87455m96601o97338n1357J116828J193864o49805k303543j131456J730756
37946g01197K507234L26341j707349j576295r08375j213715j087094Q24456K996972
37937e39022L401707K346777J013616m78402j657943r25880J564475K714303O94928
$$ plain form
37928 8134559 6239991 4443205 4518209 5091229 4380404 2738459 1331186 375781 -86148
37919 -86148 472912 1665481 1758834 -16399 -2013666 -2158441 -273090 2374511 4504068
37910 4504068 5006701 3227288 176559 -1778960 -1450862 34066 1279254 2286219
37902 2286219 3210365 3189797 1812392 352201 23432 109521 -693520 -2036090 -2521823
37893 -2521823 -1823949 -781054 103041 1025267 2115903 3243222 4227437 4662192 4143179
37884 4143179 3133826 2688982 2815384 2247410 482638 -1244620 -1803561 -1637729 -1519140
37875 -1519140 -1267977 -746701 -654055 -1140104 -1081903 30405 1028216 1171622 1531010 2681452
37865 2681452 2997296 1358268 -318899 168198 1641267 1567921 432483 723351 2331584
$$ packed form
37928H134559j894568j796786P5004N73020p10825j641945j407273r55405m61929
37919h6148N59060J192569R3353j775233j997267j44775J885351K647601K129557
37910D504068N02633j779413l050729j955519L28098J484928J245188J006965
37902B286219R24146k0568j377405j460191l28769Q6089q03041j342570m85733
37893b521823O97874J042895Q84095R22226J090636J127319R84215M34755n19013
37884D143179j009353m44844J26402n67974j764772j727258n58941J65832J18589
37875a519140K51163N21276R2646m86049N8201J112308R97811J43406L59388J150442
37865B681452L15844j639028j677167M87097J473069p3346j135438K90868J608233
$$ plain form
37856 2331584 2556390 657693 -1005553 -831300 110794 676002 1266413 1984759 1846494
37847 1846494 875718 573711 1301455 1579370 997469 1257931 2983309 4056146 2921318
37838 2921318 1224813 1058518 1582020 772939 -1039134 -1924442 -1523846 -940015 -190639
37829 -190639 1659555 4002952 4714724 3075644 862918 -16166 381438 841603 833986
37820 833986 882805 1550733 2443372 2324136 597571 -1368213 -1466328 149070 705192
37811 705192 -1401125 -3851563 -3321215 -228233 1760049 752108 -1253738 -1760118 -1049654
37802 -1049654 -945689 -1978249 -3228141 -3958537 -4062059 -3569638 -2923431 -3232971 -5065189
37793 -5065189 -7226752 -7812071 -6356676 -4023583 -1807121 312462 2280091 3238031
$$ packed form
37856B331584K24806j898697j663246J74253R42094N65208N90411P18346j38265
37847A846494r70776l02007P27744K77915n81901K60462J725378J072837j134828
37838B921318j696505j66295N23502q09081j812073q85308M00596N83831P49376
37829a90639J850194K343397P11772j639080k212726q79084L97604M60165p617
37820H33986M8819O67928Q92639j19236j726565j965784r8115J615398N56122
37811G05192k106317k450438N30348L092982J988282j007941k005846n06380P10464
37802a049654J03965j032560j249892p30396j03522M92421O46207l09540j832218
37793e065189k161563n85319J455395K333093K216462K119583J967629R57940
$$ plain form
37785 3238031 2568299 913308 -569195 -1464812 -1938888 -1845128 -981528 -36177 -181758
37776 -181758 -1510142 -2789659 -3125333 -2934937 -2721393 -1891635 99220 2069157 2033477
37767 2033477 -128358 -2137586 -1844803 573642 3326036 5057417 5614912 5490188 5343924
37758 5343924 5788251 6877330 7797302 7581102 6261064 5011564 4975842 6019121 6756568
37749 6756568 5943162 3850061 1981801 1239979 816771 -527649 -2488345 -3500925 -2983170
37740 -2983170 -2133134 -2035423 -2068254 -1129226 327783 764851 -132243 -896214 -358921 743001
37730 743001 973259 340298 172008 910405 1166033 -349742 -2693843 -3655501 -2713154
37721 -2713154 -1705417 -2091692 -2849510 -2219707 -594479 -57537 -1364803 -3052215 -3727076
$$ packed form
37785C238031o69732j654991j482503q95617m74076R3760Q63600R45351j45581
37776a81758j328384j279517l35674J90396K13544Q29758J990855J969937l5680
37767B033477k161835k009228K92783K418445K752394J731381N57495j24724j46264
37758E343924M44327J089079R19972k16200j320038j249500l5722J043279P37447
37749F756568q13406k093101j868260p41822m23208j344420j960696j012580N17755
37740b983170Q50036R7711l2831R39028J457009M37068q97094p63971N37293J101922
37730G43001K30258o32961j68290P38397K55628j515775k344101r61658R42347
37721b713154J007737l86275p57818O29803J625228N36942j307266j687412o74861
$$ plain form
37712 -3727076 -3671478 -3606957 -3305020 -2408931 -1611586 -1890086 -3114738 -4277346 -4625537
37703 -4625537 -3883722 -1997953 437488 2020326 1839265 702212 190932 680184 1145314
37694 1145314 805727 70168 -235613 124787 705868 806674 -14930 -1405862 -2294914
37685 -2294914 -1994965 -1082748 -639947 -822352 -887507 -516782 -233501 -370920 -479190 -143814
37675 -143814 302354 413385 440501 829599 1193376 576701 -1115916 -2593272 -2550299 -1291231
37665 -1291231 -427568 -941409 -2095799 -2521314 -1856741 -780938 191875 1154575 2095447
37656 2095447 2502972 1884048 196712 -2237911 -4674832 -5905114 -5183839 -3345010 -2059126
37647 -2059126 -1750740 -1324990 -323629 24175 -1185097 -2714088 -2756839 -1487078 -524762
$$ packed form
37712c727076N5598O4521L01937Q96089P97345k78500j224652j162608l48191
37703d625537P41815J885769K435441J582838j81061j137053n11280M89252M65130
37694A145314l39587p35559l05781L60400N81081J00806q21604j390932q89052
37685b294914K99949R12217M42801j82405o5155L70725K83281j37419j08270L35376
37675a43814M46168J11031K7116L89098L63777o16675j692617j477356M2973J259068
37665a291231Q63663n13841j154390m25515O64573J075803R72813R62700R40872
37656B095447M07525o18924j687336k434623k436921j230282P21275J838829J285884
37647b059126L08386M25750J001361L47804j209272j528991m2751J269761R62316
$$ plain form
37638 -524762 -429584 -426840 -434350 -1487648 -3665127 -5152155 -4328366 -1847107 276302 1035114
37628 1035114 1030542 1097393 1281426 1299760 1336270 1866405 2807246 3346773 2979846 2451749
37618 2451749 3005066 4578450 5495775 4419024 2015333 44328 -731740 -961558 -1411099
37609 -1411099 -2214284 -3328446 -4747825 -5968445 -5981701 -4334345 -1897993 -145608 348950
37600 348950 451644 1304833 2680519 3001559 1433923 -572260 -786186 1004996 2934311
37591 2934311 3774684 4159198 4727228 4906296 4528014 4848571 6407568 7397640 6066365
37582 6066365 3510397 1966759 1364964 9040 -2022410 -2867193 -2070511 -1106783 -576343
37573 -576343 449117 1835359 1841138 65573 -1514484 -1556570 -1094255 -1023705 -204584 2218306
$$ packed form
37638e24762R5178K744p510j053298k177479j487028Q23789K481259K123409P58812
37628A035114m572O6851J84033J8334L6510N30135R40841N39527l66927n28097
37618B451749N53317J573384R17325j076751k403691j971005p76068k29818m49541
37609a411099q03185j114162j419379j220620j3256J647356K436352J752385M94558
37600C48950J02694Q53189J375686L21040j567636k006183k13926J791182J929315
37591B934311Q40373L84514N68030J79068l78282L20557J558997R90072j331275
37582F066365k555968j543638o01795j355924k031450q44783P96682R63728N30440
37573e76343J025460J386242N779j775565j580057m2086M62315P0550Q19121K422890
$$ plain form
37563 2218306 4652339 5244623 4635301 4465070 4444965 3072494 364045 -2177437 -3708453
37554 -3708453 -4323713 -3757928 -1695977 859620 2197132 1847142 697552 -551200 -1771042
37545 -1771042 -2556769 -2361574 -1437553 -575265 -12897 535294 1059457 1276728 1063991
37536 1063991 192650 -1627858 -3674057 -4266314 -3051743 -2072606 -3067245 -4834150 -5108274
37527 -5108274 -4030318 -3535871 -4026794 -4145446 -3555093 -3351121 -3565226 -2790661 -848536
37518 -848536 450803 4402 -1072322 -1409345 -1067062 -534863 171272 649818 134383
37509 134383 -819525 -506127 1136822 1809733 134934 -2129748 -2561895 -1142769 611326
37500 611326 1995841 2900268 2672457 1151208 -176915 98086 1227457 1598876 1214699
$$ packed form
37563B218306K434033N92284o09322j70231k0105j372471k708449k541482j531016
37554c708453o15260N65785K061951K555597J337512l49990j149590j248752j219842
37545a771042p85727J95195R24021Q62288N62368N48191N24163K17271k12737
37536A063991q71341j820508k046199n92257J214571R79137r94639j766905k74124
37527e108274J077956M94447m90923j18652N90353K03972k14105P74565J942125
37518h48536J299339m46401j076724l37023L42283N32199P06135M78546n15435
37509A34383r53908L13398J642949O72911j674799k264682m32147J419126J754095
37500F11326J384515R04427k27811j521249j328123K75001J129371L71419l84177
$$ plain form
37491 1214699 1098288 1074740 125251 -1598120 -2994349 -3761040 -4122330 -3503085 -1642948
37482 -1642948 -447015 -2056710 -5071728 -5470244 -1924544 2333859 3899854 3029766
37474 3029766 1790219 718672 -667826 -1716512 -1296581 190654 1352540 1814123
37466 1814123 2077353 1938062 756453 -979219 -1985786 -2003162 -1824175 -1589139 -597561
37457 -597561 1043829 2120546 2027106 1369957 418334 -1476328 -4030784 -5064156 -2863010
37448 -2863010 1251500 4162130 4437533 3338936 2548833 2236816 1660515 609688 -369403
37439 -369403 -693517 -313538 119521 -399233 -2192837 -4109279 -4402581 -2690952 -482205
37430 -482205 563057 321442 -219106 -426270 -394812 -287962 -115422 -65408 -397654 -962778
$$ packed form
37491A214699j16411k3548r49489j723371j396229p66691l61290O19245J860137
37482a642948J195933j609695l015018l98516L545700M258403J565995q70088
37474C029766j239547j071547j386498j048686M19931J487235J161886M61583
37466A814123K63230j39291j181609j735672j006567j7376J78987K35036R91578
37457e97561J641390J076717r3440o57149r51623j894662k554456j033372K201146
37448b863010M114510K910630K75403j098597p90103l12017n76301j050827r79091
37439c69403l24114L79979M33059n18754j793604j916442k93302J711629K208747
37430d82205J045262k41615n40548k07164L1458J06850J72540N0014l32246n65124
$$ plain form
37420 -962778 -1277358 -1066577 -407672 470280 1130672 1021096 254010 -60966 796485 1630116
37410 1630116 450616 -2601216 -4768225 -3922400 -1291076 124875 -868421 -2913761
37402 -2913761 -4479964 -5433574 -6076873 -6086106 -5201073 -4041538 -3291970 -2585506 -1132072
37393 -1132072 768991 1779065 1205721 -111652 -915201 -937194 -719426 -456882 264291
37384 264291 1596023 2963368 3802084 4326522 5026295 5541501 4704885 2045301 -1146760
37375 -1146760 -2864728 -2576590 -1903454 -2787733 -5260586 -7467003 -7759863 -6165391 -3709738
37366 -3709738 -1129181 1125743 2264135 1692207 160868 -735627 -575438 -617074 -1657516
37357 -1657516 -2388446 -1060870 1786367 3701385 3412093 2172005 1615335 1540324 726442
$$ packed form
37420i62778l14580K10781O58905Q77952O60392j09576p67086l14976Q57451Q33631
37410A630116j179500l051832k167009Q45825K631324J415951r93296k045340
37402b913761j566203r53610o43299r233Q85033J159535P49568P06464J453434
37393a132072J901063J010074n73344j317373q03549k1993K17768K62544P21173
37384B64291J331732J367345Q38716N24438O99773N15206q36616k659584l192061
37375a146760j717968K88138O73136q84279k472853k206417k92860J594472K455653
37366c709738K580557K254924J138392n71928j531339q96495J60189m1636j040442
37357a657516p30930J327576K847237J915018k89292j240088n56670p5011q13882
$$ plain form
37348 726442 -921113 -2264960 -2709742 -2937882 -3622857 -4231539 -3684878 -1895450 -121188
37339 -121188 251953 -995236 -2892883 -4273854 -4581518 -3962747 -3068644 -2752537 -3301209
37330 -3301209 -3647017 -2058054 1633609 4999611 5318834 2860842 731207 1151031 2998403
37321 2998403 3692383 2525925 1047076 679041 1228369 1800519 2123668 2452683 2738438
37312 2738438 2519433 1585435 365741 -558896 -1252699 -2387854 -4099761 -5130049 -3816091
37303 -3816091 -167778 3622914 5199776 4235477 2288605 970089 821709 1609386 2870253
37294 2870253 4090865 4935116 5492812 6003805 6331951 6052562 5053540 3699094 2381709
37285 2381709 1228136 244656 -563286 -1196380 -1457345 -822909 961884 3045000 3798564
$$ packed form
37348G26442j647555j343847m44782k28140o84975o08682N46661J789428J774262
37339a21188L73141j247189j897647j380971l07664O18771Q94103L16107n48672
37330c301209l45808J588963L691663L366002L19223k457992k129635M19824J847372
37321B998403O93980j166458j478849l68035N49328N72150L23149L29015K85755
37312B738438k19005r33998j219694r24637o93803j135155j711907j030288J313958
37303c816091L648313L790692J576862r64299j946872j318516j48380P87677J260867
37294B870253J220612Q44251N57696N10993L28146k79389r99022j354446j317385
37285B381709j153573r83480q07942o33094k60965O34436J784793K083116P53564
$$ plain form
37276 3798564 2476506 308895 -598123 462051 2042359 2329362 1322215 642217 1251665
37267 1251665 2199725 2075291 943682 -50994 -523352 -1089476 -1873173 -2093059 -1455454
37258 -1455454 -706204 -211884 804448 2752360 4508961 4927933 4655272 5111799 6269007
37249 6269007 6835868 6251061 5021254 3314870 853577 -1645853 -2526231 -1307144 410613
37240 410613 798412 -320821 -1946584 -3368930 -4538684 -5619806 -6726264 -7699826 -7975853
37231 -7975853 -7285406 -6542390 -7080214 -8715116 -9584708 -8441987 -6216267 -4702068 -4536547
37222 -4536547 -5123118 -5724752 -5818440 -5009849 -3412426 -1675473 -93543 1677759 3476231
37213 3476231 4089984 2743463 389234 -1456510 -2483151 -3119743 -3038524 -1617896 403674
$$ packed form
37276C798564j322058k167611r07018J060174J580308K87003j007147o79998O09448
37267A251665R48060j24434j131609r94676m72358n66124p83697k19886O37605
37258a455454P49250M94320J016332J947912J756601M18972k72661M56527J157208
37249F269007N66861n84807j229807j706384k461293k499430q80378J219087J717757
37240D10613L87799j119233j625763j422346j169754j081122j106458r73562k76027
37231g975853O90447P43016n37824j634902q69592J142721K225720J514199J65521
37222d536547n86571o01634r3688Q08591J597423J736953J581930J771302J798472
37213C476231O13753j346521k354229j845744j026641o36592Q1219J420628K021570
$$ plain form
37204 403674 1310782 643771 -213652 -14740 838332 1189014 670001 -148633 -578754 -401355
37194 -401355 -23455 -182800 -1074677 -1802652 -1274174 366446 1818215 2116644 1397158
37185 1397158 269421 -716045 -962516 -176258 909922 998857 -321787 -2348184 -4514298
37176 -4514298 -6750287 -8373444 -8091817 -5920687 -3819969 -3308398 -3477086 -2617311 -862887
37167 -862887 324079 568534 685449 755548 74626 -927521 -747084 704088 1589123
37158 1589123 991374 435640 1311131 2499280 2352816 1650982 2301683 3884698 4023285
37149 4023285 2103439 113647 -676310 -1416022 -3006212 -4008228 -2969149 -1153608
37141 -1153608 -862985 -2051970 -2698358 -1930990 -724289 255690 1438956 2862415 3772710
$$ packed form
37204D03674R07108o67011q57423J98912Q53072L50682n19013q18634m30121J77399
37194d01355L77900j59345q91877p27975N28478J640620J451769K98429p19486
37185A397158j127737r85466k46471P86258J086180Q8935j320644k026397k166114
37176d514298k235989j623157K81627K171130K100718N11571j68688Q59775J754424
37167h62887J186966K44455J16915P0099o80922j002147J80437J451172Q85035
37158A589123n97749n55734Q75491J188149j46464p01834O50701J583015J38587
37149D023285j919846j989792p89957p39712j590190j002016J039079J815541
37141a153608K90623j188985o46388P67368J206701R79979J183266J423459R10295
$$ plain form
37132 3772710 4079466 4524421 4980148 4259162 2201359 291574 -546336 -1090611 -1830355
37123 -1830355 -1663918 -52036 1151383 -9665 -2534904 -3741882 -2893195 -1465061
37115 -1465061 -256773 1417259 3498709 4443578 3544597 2231185 1969111 2167432 1342974
37106 1342974 -540814 -2081909 -2319374 -1635501 -968130 -827390 -1072562 -1246104 -1059416
$$ packed form
37132C772710L06756M44955M55727p20986k057803j909785q37910n44275p39744
37123a830355J66437J611882J203419j161048k525239j206978Q48687J428134
37115a465061J208288J674032K081450R44869q98981j313412k62074J98321q24458
37106A342974j883788j541095k37465O83873O67371J40740k45172j73542J86688
$$ [...]
##END NTUPLES=NMR SPECTRUM
##END=
