##TITLE=31Pdec_68-2023Bay
 CDCl3 24 sc
 6.9.2023
##JCAMPDX= 6.0         $$ Bruker NMR JCAMP-DX V2.0
##DATA TYPE= NMR SPECTRUM
##DATA CLASS= NTUPLES
##ORIGIN= UXNMR, Bruker Analytische Messtechnik GmbH
##OWNER= root
$$ XWIN-NMR		Version 3.5
$$ Wed Sep  6 14:36:07 2023 Russian Standard Time (UT+4h)  she@DPX200
##.OBSERVE FREQUENCY= 81.013821
##.OBSERVE NUCLEUS= ^31P
##.ACQUISITION MODE= SIMULTANEOUS
##.ACQUISITION SCHEME= undefined
##.AVERAGES= 24
##.DIGITISER RES= 16
##SPECTROMETER/DATA SYSTEM= spect
##.PULSE SEQUENCE= zgpg30
##.SOLVENT NAME= DMSO
##.SHIFT REFERENCE= (INTERNAL, DMSO, 0, 248.564)
##AUDIT TRAIL= $$ (NUMBER, WHEN, WHO, WHERE, WHAT)
$$ ##TITLE= Audit trail, XWIN-NMR		Version 3.5
$$ ##JCAMPDX= 5.01
$$ ##ORIGIN= Bruker BioSpin GmbH
$$ ##OWNER= she
$$ F:/spectra/data/she/nmr/P31/1/pdata/1/auditp.txt
$$ ##AUDIT TRAIL=  $$ (NUMBER, WHEN, WHO, WHERE, WHAT)
(   1,<2023-09-06 14:35:24.75 +0400>,<she>,<DPX200>,
      <created by zg, POWCHK disabled, PULCHK disabled
       configuration hash MD5:
       00 E9 B6 7A A2 85 ED C7 34 08 36 98 17 FE 4E 26
       data hash MD5: 32K
       8C 7A 59 37 0E A6 10 9E 83 20 E0 FB F1 1D 8E D0>)
(   2,<2023-09-06 14:35:26.92 +0400>,<she>,<DPX200>,
      <Start of raw data processing
       efp BC_mod = 2 LB = 5 FT_mod = 6 PKNL = 1 PHC0 = -10599.06 PHC1 = -13.31499 SI = 64K 
       data hash MD5: 64K
       3D 13 F3 2A 9B 66 AF BD 23 70 52 F7 F4 DE 74 6B>)
(   3,<2023-09-06 14:35:38.78 +0400>,<she>,<DPX200>,
      <abs ABSG = 5 
       data hash MD5: 64K
       E6 72 78 60 C5 9A A8 69 43 9A DD 90 59 51 44 99>)
$$ ##END=
$$ 
$$ hash MD5
$$ 81 2A 94 8B C0 57 17 81 5E 3E FC E6 A4 D0 2E 69
##$RELAX= 
##$RELAX= 
##$RELAX= 
##$RELAX= 
##$RELAX= 
##$RELAX= 
##$RELAX= 
##$RELAX= 
##$RELAX= 
$$ Bruker specific parameters
$$ --------------------------
##$DU= <F:/spectra>
##$EXPNO= 1
##$NAME= <P31>
##$PROCNO= 1
##$TYPE= <nmr>
##$USER= <she>
##$AMP= (0..31)
100 100 100 100 100 100 100 100 100 100 100 100 100 100 100 100 100 100 
100 100 100 100 100 100 100 100 100 100 100 100 100 100 
##$AQSEQ= 0
##$AQ_mod= 1
##$AUNM= <au_zg>
##$AUTOPOS= <>
##$BF1= 81.014009
##$BF2= 200.13
##$BF3= 200.13
##$BF4= 200.13
##$BF5= 200.13
##$BF6= 200.13
##$BF7= 200.13
##$BF8= 200.13
##$BYTORDA= 1
##$CFDGTYP= 0
##$CFRGTYP= 5
##$CHEMSTR= <none>
##$CNST= (0..31)
1 1 145 1 1 1 1 1 1 1 1 1 1 1 1 1 1 1 1 1 1 1 1 1 1 1 1 1 1 1 1 1 
##$CPDPRG= <waltz16>
##$CPDPRG1= <>
##$CPDPRG2= <waltz16>
##$CPDPRG3= <>
##$CPDPRG4= <mlev>
##$CPDPRG5= <mlev>
##$CPDPRG6= <mlev>
##$CPDPRG7= <mlev>
##$CPDPRG8= <mlev>
##$CPDPRGB= <>
##$CPDPRGT= <>
##$D= (0..31)
0 1 0 0 0 0 0 0 0 0 0 0.03 2e-05 3e-06 0 0 0 0 0 0 0 0 0 0 0 0 0 0 0 0 
0 0 
##$DATE= 1693996524
##$DBL= (0..7)
120 120 120 11 120 120 24 19 
##$DBP= (0..7)
150 150 150 150 150 150 150 150 
##$DBP07= 0
##$DBPNAM0= <>
##$DBPNAM1= <>
##$DBPNAM2= <>
##$DBPNAM3= <>
##$DBPNAM4= <>
##$DBPNAM5= <>
##$DBPNAM6= <>
##$DBPNAM7= <>
##$DBPOAL= (0..7)
0.5 0.5 0.5 0.5 0.5 0.5 0.5 0.5 
##$DBPOFFS= (0..7)
0 0 0 0 0 0 0 0 
$$ [...]
##$SUBNAM3= <"">
##$SUBNAM4= <"">
##$SUBNAM5= <"">
##$SUBNAM6= <"">
##$SUBNAM7= <"">
##$SUBNAM8= <"">
##$SUBNAM9= <"">
##$SW= 501.771253377433
##$SWIBOX= (0..15)
0 1 3 0 0 0 0 0 0 0 0 0 0 0 0 0 
##$SW_h= 40650.406504065
##$TD= 32768
##$TD0= 1
##$TE= 0
##$TE2= 300
##$TE3= 300
##$TEG= 300
##$TL= (0..7)
0 120 53 12 22 120 120 120 
##$TP= (0..7)
150 150 150 150 150 150 150 150 
##$TP07= 0
##$TPNAME0= <>
##$TPNAME1= <>
##$TPNAME2= <>
##$TPNAME3= <>
##$TPNAME4= <>
##$TPNAME5= <>
##$TPNAME6= <>
##$TPNAME7= <>
##$TPOAL= (0..7)
0.5 0.5 0.5 0.5 0.5 0.5 0.5 0.5 
##$TPOFFS= (0..7)
0 0 0 0 0 0 0 0 
##$TUNHIN= 0
##$TUNHOUT= 0
##$TUNXOUT= 0
##$USERA1= <user>
##$USERA2= <user>
##$USERA3= <user>
##$USERA4= <user>
##$USERA5= <user>
##$V9= 5
##$VALIST= <valist>
##$VCLIST= <CCCCCCCCCCCCCCC>
##$VD= 0
##$VDLIST= <DDDDDDDDDDDDDDD>
##$VPLIST= <PPPPPPPPPPPPPPP>
##$VTLIST= <TTTTTTTTTTTTTTT>
##$WBST= 1024
##$WBSW= 4
##$XGAIN= (0..3)
0 0 0 0 
##$XL= 0
##$YL= 0
##$YMAX_a= 5839
##$YMIN_a= -5769
##$ZGOPTNS= <>
##$ZL1= 120
##$ZL2= 120
##$ZL3= 120
##$ZL4= 120
##$ABSF1= 248.5645
##$ABSF2= -253.2056
##$ABSG= 5
##$ABSL= 3
##$ALPHA= 0
##$AQORDER= 0
##$ASSFAC= 0
##$ASSFACI= 0
##$ASSFACX= 0
##$ASSWID= 0
##$AUNMP= <proc_1d>
##$AZFE= 0.1
##$AZFW= 0.5
##$BCFW= 0
##$BC_mod= 2
##$BYTORDP= 0
##$COROFFS= 0
##$CY= -3
##$DATMOD= 1
##$DC= 0
##$DFILT= <>
##$DTYPP= 0
##$F1P= 0
##$F2P= 0
##$FCOR= 1
##$FTSIZE= 65536
##$FT_mod= 6
##$GAMMA= 0
##$GB= 0
##$INTBC= 1
##$INTSCL= 6.047779e-11
##$ISEN= 30
##$LB= 5
##$LEV0= 0
##$LPBIN= 0
##$MAXI= 10000
##$MC2= 0
##$MEAN= 0
##$ME_mod= 0
##$MI= 50
##$NCOEF= 0
##$NC_proc= -7
##$NLEV= 6
##$NOISF1= 182.463
##$NOISF2= 159.3651
##$NSP= 0
##$NTH_PI= 0
##$NZP= 0
##$OFFSET= 248.5645
##$PC= 4
##$PHC0= -10599.06
##$PHC1= -13.31499
##$PH_mod= 1
##$PKNL= yes
##$PPARMOD= 0
##$PSCAL= 0
##$PSIGN= 0
##$REVERSE= no
##$SF= 81.0140089999694
##$SI= 65536
##$SIGF1= 159.3651
##$SIGF2= -187.1042
##$SINO= 113.3802
##$SIOLD= 16384
##$SREGLST= <1H.CDCl3>
##$SSB= 0
##$STSI= 65536
##$STSR= 0
##$SW_p= 40650.406504065
##$SYMM= 0
##$S_DEV= 0
##$TDeff= 32768
##$TDoff= 0
##$TI= <>
##$TILT= no
##$TM1= 0
##$TM2= 0
##$TOPLEV= 0
##$USERP1= <user>
##$USERP2= <user>
##$USERP3= <user>
##$USERP4= <user>
##$USERP5= <user>
##$WDW= 1
##$XDIM= 65536
##$YMAX_p= 367810114
##$YMIN_p= -19631105
$$ End of Bruker specific parameters
$$ ---------------------------------
##NTUPLES= NMR SPECTRUM
##VAR_NAME=  FREQUENCY,     SPECTRUM/REAL,   SPECTRUM/IMAG
##SYMBOL=    X,             R,               I
##VAR_TYPE=  INDEPENDENT,   DEPENDENT,       DEPENDENT
##VAR_FORM=  AFFN,          ASDF,            ASDF
##VAR_DIM=   65536,         65536,           65536
##UNITS=     HZ,            ARBITRARY UNITS, ARBITRARY UNITS
##FACTOR=    0.620285442955139, 1,           1
##FIRST=     20137.2065510682, 0,            0
##LAST=      -20513.1999529968, 0,           0
##MIN=       -20513.1999529968, -19631105,   0
##MAX=       20137.2065510682, 367810114,    0
$$ Real data points
##PAGE= N=1
##DATA TABLE= (X++(R..R)), XYDATA
$$ [...]
38100B9911M144O9480P0945L4911L6166J21560K59856L68387L78794K75915R0866
38089A740935j23436l08460m13051m17927l56686k94060k62448k28039j43061
38080h06233k6180M2217J4211o7106j22020j21388r4199o8817m0833N580P1377
38069a213391J38537J75613J54945Q5540K0771O272K1853K869p7330j71892k13033
38058a069246j75154p8071M3692J55178K25455K44848K33246K14382J86066J31250
38048A11646N5581l651j1728L0971R7160J64711K28109K79197K93555K50894J62731
38037A659176O2090l4084j31493k23033k74649k67385k32881k18097k26134k22590
38027a09080j93845j63484j47826j30419r4408n2180k5506j7356j9294k6800k9816
$$ y = [29911, 34055, 103535, 174480, 209391, 245557, 367117, 626973, 995360, 1374154, 1650069, 1740935, 1617499, 1309039, 895988, 478061, 121375, -172685, -435133, -663172, -806233, -832413, -790196, -775985, -843091, -965111, -1086499, -1180698, -1249515, -1290348, -1284768, -1213391, -1074854, -899241, -744296, -658756, -637985, -631713, -609860, -606991, -684321, -856213, -1069246, -1244400, -1322471, -1278779, -1123601, -898146, -653298, -420052, -205670, -19604, 111646, 167227, 163576, 151848, 182819, 279979, 444690, 672799, 951996, 1245551, 1496445, 1659176, 1721266, 1687182, 1555689, 1332656, 1058007, 790622, 557741, 339644, 113510, -109080, -302925, -466409, -614235, -744654, -839062, -891242, -916748, -934104, -953398, -980198, -1010014]
38016a010014p179M7466J06379J34926J30191J16216J10065J08731J00017O9019
38006i4183M812p7173j28449j12858o2065n8599j48411k83362l62230l21081j77799
37995a821398l342J30596J78917J28025L166j26337j75711j06705L6204J64520
37985a592065K20625K05178J44820O6967R846J4857P8843J37985J32136P2258
37975e08550J5792q964j6008q652L7474J24891K06298K32008K05105J68708J52505
37964F00607J49910J39504J15032R7546J20446J91106K66092K83294K25346J32635
37954B321518M8129k3538q8147j26218j18887r1037q8797j16001j27644r4398
37944A494980m6109l6153p7403j26579j26863o2894K0297N4196J1043p2041j40886
$$ y = [-1010014, -1017193, -969727, -863348, -728422, -598231, -482015, -371950, -263219, -163202, -94183, -89371, -166544, -294993, -407851, -469916, -528515, -676926, -960288, -1322518, -1643599, -1821398, -1824740, -1694144, -1515227, -1387202, -1384036, -1510373, -1686084, -1792789, -1756585, -1592065, -1371440, -1166262, -1021442, -954475, -944629, -929772, -850929, -712944, -580808, -508550, -492758, -501722, -517730, -526382, -488908, -364017, -157719, 74289, 279394, 448102, 600607, 750517, 890021, 1005053, 1102599, 1223045, 1414151, 1680243, 1963537, 2188883, 2321518, 2369647, 2346109, 2257962, 2131744, 2012857, 1921820, 1833023, 1717022, 1589378, 1494980, 1448871, 1412718, 1335315, 1208736, 1081873, 1018979, 1039276, 1093472, 1104515, 1032474, 891588]
37933H91588j83266k19355k45286k25124j49516o8837m3614q0476j37678j75044
37923f36608j71994j13392N81J24275J81688J35667K9523n6808q3617p1254n3938
37912g15877l7483p908L5944P3365Q1087N2669L096l5742k9264L1312J07563J36419
37900c04819Q9819P492m1026k4115K9749O8848O3025J8843k9800m5786k2300M567
37888a85503o138m7499p1057n0576j3213N822J1944L0012N5600N9462L0205j8952
37876a99893q0631j56572k27632k54499k22712j62586j08889o1487m607N1931
37866a427577P5077M7121j6086q2552j23878j19558o1916L0676J11833J31706
37856a435154P3311l0449j16515j35426q4157j307O7576J01462J08486J07589
$$ y = [891588, 708322, 488967, 243681, 18557, -130959, -199796, -243410, -323886, -461564, -636608, -808602, -921994, -921413, -797138, -615450, -479783, -450260, -507068, -590685, -661939, -715877, -753360, -761268, -725324, -651959, -570872, -518203, -515107, -550849, -580113, -548801, -441238, -304819, -215000, -207508, -248534, -272649, -242900, -174052, -111027, -92184, -121984, -167770, -190070, -185503, -191641, -239140, -310197, -360773, -373986, -368164, -356220, -326208, -270608, -211146, -180941, -199893, -280524, -437096, -664728, -919227, -1141939, -1304525, -1413414, -1474901, -1479508, -1427577, -1352500, -1305379, -1321465, -1404017, -1527895, -1647453, -1709369, -1678693, -1566860, -1435154, -1361843, -1392292, -1508807, -1644233, -1728390, -1729697, -1662121, -1560659, -1452173, -1344584]
37846a344584J07833J05778J05071J33821K26559L79217N33694O22350O22909
37837A492648N59712M64675L57662K52624J49849K2619j51983l36440m38866l98529
37827A973971k47841p5443M9021R7478O4983l0543j41154k18419k53098k64901
37817I54054k60364k28652j76046j34713j31422j67052k24629k72545k63555j67106
37807a072030j4585J16341J76832J82785J66971J30802O8761R629q032Q276J0165
37796b24085k8946q2995j08128q5859k7806M1544R9304J36180J59354J73178J61533
37785B13274J10101M4524J5410L2439M1515q115r2432j36481r9812j0123Q2481
37774A92781J51018J84277J65489Q1856n3992k03985l18846l52439k88024j69401
$$ y = [-1344584, -1236751, -1130973, -1025902, -892081, -665522, -286305, 247389, 869739, 1492648, 2052360, 2517035, 2874697, 3127321, 3277170, 3299789, 3147806, 2811366, 2372500, 1973971, 1726130, 1650687, 1699708, 1797186, 1862169, 1831626, 1690472, 1472053, 1218955, 954054, 693690, 465038, 288992, 154279, 22857, -144195, -368824, -641369, -904924, -1072030, -1086615, -970274, -793442, -610657, -443686, -312884, -244123, -234494, -242526, -234250, -224085, -253031, -336026, -444154, -530013, -557819, -516275, -416971, -280791, -121437, 51741, 213274, 323375, 367899, 383309, 415748, 457263, 449148, 356716, 220235, 120423, 110300, 192781, 343799, 528076, 693565, 775421, 721429, 517444, 198598, -153841, -441865, -611266]
37764f11266q6997j02908j89604k59589k51018j67570m6070Q1073J85187K35484
37754a213278K17615J48777O2468j3590n9861o2042j8693N7608J54045K59350
37744d67601L46067L74579L34951K68107K19966J84088J16708M727j09241j73258
37734A099093j74348j35563q9150o4622q3367j44323k18482k68154k71974k32387
37724e83277j68520j02770m1968L0877J30926K32166K72803K16294R6969j0881
37714G2619o4212p9730r8649j38305j75809j66073p9827N8942J73902J97213J42041
37703a57888R9289J43117K43513K89954K06305L1320j20074j65501j16950m4878
37693D08207j845J1062J7928K9797L7058K6407o869o1094j30998k02347k49232
$$ y = [-611266, -698263, -801171, -990775, -1250364, -1501382, -1668952, -1715022, -1633949, -1448762, -1213278, -995663, -846886, -784418, -798008, -857869, -919911, -938604, -880996, -726951, -467601, -121534, 253045, 587996, 856103, 1076069, 1260157, 1376865, 1381592, 1272351, 1099093, 924745, 789182, 700032, 635410, 552043, 407720, 189238, -78916, -350890, -583277, -751797, -854567, -896535, -865658, -734732, -502566, -229763, -13469, 83500, 72619, 8407, -71323, -169972, -308277, -484086, -650159, -729986, -671044, -497142, -299929, -157888, -58599, 84518, 328031, 617985, 824290, 855610, 735536, 570035, 453085, 408207, 406362, 417424, 435352, 465149, 502207, 528614, 521745, 460651, 329653, 127306, -121926]
37682a21926k46585j89137r4538J4206J23595K21167K78907K62312J67061M1033
37672D56095m3238m4541J9491R8875J57261J86556J85143J42343N7051m0202j06864
37661A067970j32576j42521j48292j20988l7064O7367J23347J07792O4177M2835
37651H92047N3994Q7686J42131K08634K55627K54792K05221J11908l3121k17248
37641A961671l78801m55212m50534m14858l63230k63647j13886J9501P0888N7255
37631c30853N5758J06565J63327J47155M1893p2284q9490J2989J47472K05626
37621C88158J56678L9891j08188k68773l94309m12503l03218j30411K8906J53481
37611h50288K51503L06727K95321K33453J62008R1888L539j01345j83389k07409
$$ y = [-121926, -368511, -557648, -652186, -637980, -514385, -293218, -14311, 248001, 415062, 456095, 412857, 368316, 387807, 486682, 643943, 830499, 1015642, 1157985, 1215036, 1174834, 1067970, 935394, 792873, 644581, 523593, 486529, 553896, 677243, 785035, 849212, 892047, 946041, 1033727, 1175858, 1384492, 1640119, 1894911, 2100132, 2212040, 2178919, 1961671, 1582870, 1127658, 677124, 262266, -100964, -364611, -478497, -458996, -388108, -330853, -275095, -168530, -5203, 141952, 183845, 111561, 22071, 35060, 182532, 388158, 544836, 584727, 476539, 207766, -186543, -599046, -902264, -1032675, -1003769, -850288, -598785, -292058, 3263, 236716, 398724, 490612, 494151, 392806, 209417, 2008]
37601B008j77332j26530r1955r4390j21099j29024q9518l2461k2177q1714j58441
37590a122633j71485q1354Q4339K50393L34348K95994J69696L8410l9642p2807
37580c14741r6966j11498q1093k643N8819K7864r1421k07823k36950j87576j38383
37569a382411j39964j63215j42896m8903Q9819K10066K56177K20120J52397J16048
37559h32762J22468J34126J33385J47871J85114J86372R5395m8176j37026j14220
37549a27453j9942P5615J37097J55534J26744O5287R472j0458J0175P1704J73858
37538F67633K80485L18025K44652J03228k1897q4982r3198o4957j2724M0368O3413
37527A440046M2435j9275j21653k60123l94300m53675l91415k22553o469J91225
$$ y = [2008, -175324, -301854, -393809, -488199, -609298, -738322, -827840, -860301, -882478, -964192, -1122633, -1294118, -1375472, -1291133, -1040740, -706392, -410398, -240702, -202292, -241934, -314741, -411707, -523205, -604298, -606941, -548122, -520258, -611679, -819502, -1056452, -1244028, -1382411, -1522375, -1685590, -1828486, -1877389, -1787570, -1577504, -1321327, -1101207, -948810, -832762, -710294, -576168, -442783, -294912, -109798, 76574, 171969, 123793, -13233, -127453, -147395, -71780, 65317, 220851, 347595, 412882, 422354, 411896, 422071, 493775, 667633, 948118, 1266143, 1510795, 1614023, 1592126, 1507144, 1413946, 1348989, 1336265, 1376633, 1440046, 1482481, 1463206, 1341553, 1081430, 687130, 233455, -157960, -380513, -386982, -195757]
37517a95757L16896L38278K63213J45596N4297K8639O3942J32141K05172K58809
37507A611226K66423K02184N8411j36772l20717m23674m08049k93504j49892n9310
37497C46326o6740j49927k34152k47344j73217n6125M5029J07157J49547J96946
37487h2500K43986K59292K20848J41747O0994J3207O986K5038L9420L0341j966
37476I57393m0774o8912q0541p7324n8171j8507L9133R4164J08934N0374p4805
37465H30964k06557k70922k43096j61498p6362n575M8415O9701N0606K3008K4250
37454H2934L7092J0476n3508q4048l7002L8243O5162M0860K4398M4283O9500O9763
37442C08153N3832L3765p869q7548j78648k24277j86316p3868O3215J60728J78812
$$ y = [-195757, 121139, 459417, 722630, 868226, 922523, 951162, 1015104, 1147245, 1352417, 1611226, 1877649, 2079833, 2138244, 2001472, 1680755, 1257081, 849032, 555528, 405636, 346326, 279586, 129659, -104493, -351837, -525054, -581179, -536150, -428993, -279446, -82500, 161486, 420778, 641626, 783373, 844367, 857574, 864560, 889598, 929018, 959359, 957393, 916619, 847707, 767166, 689842, 631671, 613164, 652297, 746461, 855395, 905769, 830964, 624407, 353485, 110389, -51109, -127471, -133046, -84631, -14930, 35676, 58684, 82934, 120026, 130502, 76994, -7054, -44056, -5813, 59349, 100209, 124607, 168890, 238390, 308153, 361985, 395750, 387881, 300333, 121685, -102592, -288908, -362776, -299561, -138833, 39979]
37431C9979J33534Q4056P7786J14342J67397K22189K71966K89971K34867R5067
37421A731154q1530k08590k16231j01628N7398J47452J05576k7533j50510k02055
37411A053503k07193k22860k62805k95002k93429k57811j82048m0048J70956L85429
37401a51308M94445M26657K06460n9025k45988k87084k10772j17842j01200j71244
37391b16901k57498k81888k22797j11974P924J08642J76626K12749K30158K34817
37381a20142K08903J31556J7674q4242j40901j62544j72272j69104j43744j14263
37371g49079j11181j26120j08282k6297R0323J88627K48111K72602K44203J28772
37361E1679o2249k46749l32451k93355j75203m0687P2233J49473J88047J93892
$$ y = [39979, 173513, 257569, 335355, 449697, 617094, 839283, 1111249, 1401220, 1636087, 1731154, 1649624, 1441034, 1224803, 1123175, 1180573, 1328025, 1433601, 1406068, 1255558, 1053503, 846310, 623450, 360645, 65643, -227786, -485597, -667645, -707693, -536737, -151308, 343137, 769794, 976254, 917229, 671241, 384157, 173385, 55543, -45657, -216901, -474399, -756287, -979084, -1091058, -1083134, -974492, -797866, -585117, -354959, -120142, 88761, 220317, 237991, 153749, 12848, -149696, -321968, -491072, -634816, -749079, -860260, -986380, -1094662, -1120959, -1030636, -842009, -593898, -321296, -77093, 51679, -10570, -257319, -589770, -883125, -1058328, -1099015, -1026782, -877309, -689262, -495370]
37351d95370J77819J42992Q3454M347n9553n6258M3613K14218L80314M60482M15658
37340A311716K68280Q3624o8552j49678j69089j68460j77886j82924j45187n8594
37330E43250L0092O6617M1477j6206q2538j54444k28030k87039l17620l17117
37320g21558k84873k22500j48365r2003o2803l9507k238M1609P9891J27927K08885
37309a115535L02223L41041K79667J52651M7459J7920L8079M4689Q527n1593j12572
37298d7444j72003k19316k12833j19503K9454J53817K00817J84383J45655J02966
37288D5993N4859O807l0466n7796q1529r8184j03106j06216j17765j22175q8485
37277f98063r871Q5110J64293K17412K43351K30364J65639N8300o0600j60299
$$ y = [-495370, -317551, -174559, -91105, -86758, -146311, -202569, -158956, 55262, 435576, 896058, 1311716, 1579996, 1663620, 1595068, 1445390, 1276301, 1107841, 929955, 747031, 601844, 543250, 573342, 639959, 681436, 665230, 582692, 428248, 200218, -86821, -404441, -721558, -1006431, -1228931, -1377296, -1469299, -1532102, -1571609, -1573847, -1532238, -1452347, -1324420, -1115535, -813312, -472271, -192604, -39953, 7506, 25426, 63505, 108194, 116721, 65128, -47444, -219447, -438763, -651596, -771099, -741645, -587828, -387011, -202628, -56973, 45993, 100852, 107659, 77193, 19397, -62132, -160316, -263422, -369638, -487403, -609578, -698063, -707934, -622824, -458531, -241119, 2232, 232596, 398235, 456535, 395935, 235636]
37267B35636k22730k33272j74204m3714J17312K34904K58224K07554J50755J26276
37257F56741J05288M3065m5962q8624l1309R7657K10039K32969J59070L5131q2918
37246A291147j61002j85870j54361p8540M945N2710N2066K8339N757k5008q5815
37235G44368j69223k36688k54134k15291j39035o3819l6409p6416j46836j82811
37225g76294j57213r9862n0140j7342L288O329p988j3453K0220R4083J86692K79348
37213e32332L50430L59550K76236J30360L187m9001m8043o1238j27953k23848
37203G7348k80560k31330n7800J83401L83007M48148L61960J80420j9248j81577
37193H63769k80900l13220k89747k28691j44442m5866N4569J35781J75828J63634
$$ y = [235636, 12906, -220366, -394570, -438284, -320972, -86068, 172156, 379710, 530465, 656741, 762029, 805094, 759132, 670508, 639199, 736856, 946895, 1179864, 1338934, 1374065, 1291147, 1130145, 944275, 789914, 711374, 716319, 769029, 821095, 849434, 855191, 830183, 744368, 575145, 338457, 84323, -130968, -270003, -333822, -370231, -446647, -593483, -776294, -933507, -1033369, -1083509, -1100851, -1097563, -1091234, -1099222, -1112675, -1092455, -998372, -811680, -532332, -181902, 177648, 453884, 584244, 587431, 538430, 490387, 429149, 301196, 77348, -203212, -434542, -492342, -308941, 74066, 522214, 884174, 1064594, 1045346, 863769, 582869, 269649, -20098, -248789, -393231, -439097, -384528, -248747, -72919, 90715]
37183I0715J05902K8941k9012m1808k0375n133k2288n2175n2631j0608M4556Q0033
37171A16117R2790R5341Q8143O7992N2469O4520Q7067O2231m3013j85691k84464
37160B13502l02805k74657k50651k41723k20274j56455m4209R0559J95340K22392
37150g68981J75464J16433J05676J40041J67266J54209J13596O2128j3098j23058
37140A29676k31251k71490k14352r8689P208O3599P3837N2841m002j12160k57916
37129h62699l77746l96689k97650j43926k1877L4758N7277R0185J43160J89792
37119a585415J95472J43575M8140n4001j31535j79274k02855j91986j31330l7040
37109b126249M7649J06955J75802K83051L88433M08373L03650J17970o8554j97107
$$ y = [90715, 196617, 225558, 196546, 154738, 134363, 129230, 106942, 54767, 2136, -8472, 36084, 116117, 208907, 304248, 392391, 460383, 512852, 577372, 664439, 726670, 683657, 497966, 213502, -89303, -363960, -614611, -856334, -1076608, -1233063, -1277272, -1186713, -991373, -768981, -593517, -477084, -371408, -231367, -64101, 90108, 203704, 265832, 252734, 129676, -101575, -373065, -587417, -686106, -678898, -615299, -541462, -488621, -492623, -604783, -862699, -1240445, -1637134, -1934784, -2078710, -2100587, -2065829, -2008552, -1918367, -1775207, -1585415, -1389943, -1246368, -1198228, -1252229, -1383764, -1563038, -1765893, -1957879, -2089209, -2126249, -2078600, -1971645, -1795843, -1512792, -1124359, -715986, -412336, -294366, -362920, -560027]
37099e60027k38309j78821l0489J55941L11487L90029L83040L01610J63710M033
37089G02204j23031j71963j40897o8750M826O9395J31968J87141K10893J81738
37079I83524R9911j0620j08449j48118j09219k3375M1344L9068j3554o4256q5726
37068F00530r6368j23728j63058j78385j37468m1733P2418J57380J83714J54391
37058D27693R7820N0885M2437P6581J21515J23279M5636j00485k69903m17628
37048A97830n10591n16625m11918k16993j2964J03957R9741L3364M86L8867R2833
37037a102013P9399j4448j15197j44053r4032j6753M2207O8458N6840O171n5619
37026a289040p2208n925J24325K57491L30996L10343K07923Q7644K7770N3920
$$ y = [-560027, -798336, -977157, -1007646, -851705, -540218, -150189, 232851, 534461, 698171, 702204, 579173, 407210, 266313, 197563, 202389, 271784, 403752, 590893, 801786, 983524, 1083435, 1072815, 964366, 816248, 707029, 683654, 724998, 764066, 750512, 686256, 600530, 504162, 380434, 217376, 38991, -98477, -140210, -67792, 89588, 273302, 427693, 525513, 576398, 618835, 695416, 816931, 940210, 985846, 885361, 615458, 197830, -312761, -829386, -1241304, -1458297, -1471261, -1367304, -1267563, -1234199, -1233713, -1194846, -1102013, -1022614, -1037062, -1152259, -1296312, -1390344, -1407097, -1364890, -1296432, -1239592, -1233421, -1289040, -1361248, -1367173, -1242848, -985357, -654361, -344018, -136095, -48451, -20681, 33239]
37016C3239J15202J40572J10413O2870M6278Q2977J63464K48493K82677K34024
37006A520209J25373J0034q3624j65639k44974l02248l12562k79845k38651k30605
36996b02532k79349l70180m46665m45195l47904j94959m0263R0251J89706K43277
36986a803813K35057J75530J02529N5382N8355J17723K10618K77935K56871J38205
36976a75608j7608j31635j69534j53083j24288j10126j13114j17402r8452l7881
36966a248731N7088J44554J68874J09835J7943j6883M6911J50576J90978J26795
36956b52060O940j02733j81450k26096k06236r6000O3781J87250K36912K58593
36946c11099L10484L89602M44958M33727L43560J88897J6748j04800j41632j30720
$$ y = [33239, 148441, 289013, 399426, 462296, 508574, 591551, 755015, 1003508, 1286185, 1520209, 1645582, 1655616, 1571992, 1406353, 1161379, 859131, 546569, 266724, 28073, -202532, -481881, -852061, -1298726, -1743921, -2091825, -2286784, -2327047, -2236796, -2047090, -1803813, -1568756, -1393226, -1290697, -1235315, -1176960, -1059237, -848619, -570684, -313813, -175608, -193216, -324851, -494385, -647468, -771756, -881882, -994996, -1112398, -1210850, -1248731, -1191643, -1047089, -878215, -768380, -750437, -767320, -720409, -569833, -378855, -252060, -245120, -347853, -529303, -755399, -961635, -1057635, -993854, -806604, -569692, -311099, -615, 388987, 833945, 1267672, 1611232, 1800129, 1816877, 1712077, 1570445, 1439725]
36936A439725j32404j53464j51873j13850q3022r8883j41142j58907j33440r0240
36926A82500o5369q0316j35323k04202k43867k30316j81013j26954p3266q627
36916a166753N6863R4591J00395J05066J30546J58114J54145J08622L3047n9809
36906b85173j49150j92164j50626l8050Q3642J66574K18918K70642L13893L03435
36896E41941K15974Q5381l1866j09182j51207j55718j04486j921R8634J30920
36886E18470P8086j3498q3115j08079j07229j06162j08510r7166n7085L894N9035
36875b1359R4501J34978K19748L40527M16843L59633J66084o4462k17745k56833
36865A171915k22688j65338j01894l8252P05j6419r4556k05799l09114l64582
$$ y = [1439725, 1307321, 1153857, 1001984, 888134, 805112, 706229, 565087, 406180, 272740, 182500, 117131, 36815, -98508, -302710, -546577, -776893, -957906, -1084860, -1158126, -1166753, -1109890, -1015299, -914904, -809838, -679292, -521178, -367033, -258411, -225364, -285173, -434323, -626487, -777113, -815163, -731521, -564947, -346029, -75387, 238506, 541941, 757915, 843296, 811430, 702248, 551041, 395323, 290837, 288916, 387550, 518470, 596556, 583058, 499943, 391864, 284635, 178473, 69963, -27203, -84288, -80394, -21359, 73142, 208120, 427868, 768395, 1185238, 1544871, 1710955, 1646493, 1428748, 1171915, 949227, 783889, 681995, 643743, 644448, 628029, 533473, 327674, 18560, -346022]
36855c46022l39383k26425o6116O6962J15039P4407j9561j32786k47759l48702
36845a470346m11241m13041l47296k23367o2182J04613K38589L08921L08528K56330
36835a710492J80937R8505P395q9517j58969j51355n7008N9819J07243N3171m6818
36824a707089j10804j00224k4294R1102K07673K68081K33069J35271O0056N0901
36814h96258N7685M070j11336k12037k34134j85801j11311k8817P2528J88630
36804a456781K79365K96376K26640J13389L7650O2882J76052K85412K98020K08550
36794E27555J00070N1557N8797N6728M812p0561j13591r6117l2687M0762Q9868
36783F17193R7546P5872N9379P1297R4769Q7475K5461p4921j74039k34296k32343
$$ y = [-346022, -685405, -911830, -977946, -910984, -795945, -721538, -741099, -873885, -1121644, -1470346, -1881587, -2294628, -2641924, -2865291, -2927473, -2822860, -2584271, -2275350, -1966822, -1710492, -1529555, -1431050, -1423655, -1513172, -1672141, -1823496, -1880504, -1820685, -1713442, -1660271, -1707089, -1817893, -1918117, -1942411, -1851309, -1643636, -1375555, -1142486, -1007215, -947159, -896258, -838573, -834503, -945839, -1157876, -1392010, -1577811, -1689122, -1717939, -1645411, -1456781, -1177416, -881040, -654400, -541011, -503361, -440479, -264427, 20985, 319005, 527555, 627625, 679182, 737979, 794707, 799519, 728958, 615367, 519250, 486563, 527325, 617193, 714739, 790611, 849990, 921287, 1016056, 1103531, 1128992, 1054071, 880032, 645736, 413393]
36772D13393j68852p6672m393K1319J0217j8585o1457j16193j60202j63252j14007
36761d38684j9247J07442K31696K89066K31119Q6527n6127j34698j53411j33467
36751A0216p1466K3699R1284O5040n0272j83387k70505k96571k77089k38307k10433
36740a407791j98498j56891l5568J36880K58198K61748J85974J11756O8423L8320
36730g37449K1671M1576R1839J31488J42051J51468J84811K23056K33387K17004
36720G00902J98472J78236J23829J1679j39636k82706l74892l92720l27085j84099
36710d88020M850J87638L21147L97080M30045M22930L60113K40905J03283k813
36700A977158o1692r9397j47794k10779k62078k67485k16022j40757r9701j17592
$$ y = [413393, 244541, 167869, 163476, 184795, 195012, 176427, 114970, -1223, -161425, -324677, -438684, -457931, -350489, -118793, 170273, 401392, 487919, 431792, 297094, 143683, 10216, -61250, -37551, 53733, 118773, 68501, -114886, -385391, -681962, -959051, -1197358, -1407791, -1606289, -1763180, -1798748, -1661868, -1403670, -1141922, -955948, -844192, -775769, -737449, -715778, -674202, -582363, -450875, -308824, -157356, 27455, 250511, 483898, 700902, 899374, 1077610, 1201439, 1213118, 1073482, 790776, 415884, 23164, -303921, -488020, -483170, -295532, 25615, 422695, 852740, 1275670, 1635783, 1876688, 1979971, 1977158, 1915466, 1816069, 1668275, 1457496, 1195418, 927933, 711911, 571154, 471453, 353861]
36690C53861j51961j38044o3891K4835R3548J55886K28467K86212K97665K83046
36680A369624K92673L26257L10950J77307n9454l04594m57887m78070l94128k72366
36670E10312j68174r3926k4483O8564J86393K97220L52801L19681K11438Q9122
36660A748948J0902k4410o8142j51123k42787k93899k98552k87526k71711k26778
36650a05078j40120m2588K6942P0583J18385J70352J79620J08737j0198r1466
36640B85169p5524J5785J04547J25426O4119n4817j92654l05238l49207l00338
36630f82732j67475J5374K05059L55186M23193L92858K90171J62487L9889p1059
36620I62951j56156j78120j09850K2637J46045J94049J54223O5798j9534p1809
$$ y = [353861, 201900, 63856, -35, 24800, 118348, 274234, 502701, 788913, 1086578, 1369624, 1662297, 1988554, 2299504, 2476811, 2417357, 2112763, 1654876, 1176806, 782678, 510312, 342138, 248212, 223729, 292293, 478686, 775906, 1128707, 1448388, 1659826, 1748948, 1759850, 1735440, 1667298, 1516175, 1273388, 979489, 680937, 393411, 121700, -105078, -245198, -287786, -260844, -190261, -71876, 98476, 278096, 386833, 376635, 285169, 209645, 225430, 329977, 455403, 519522, 464705, 272051, -33187, -382394, -682732, -850207, -834833, -629774, -274588, 148605, 541463, 831634, 994121, 1034010, 962951, 806795, 628675, 518825, 541462, 687507, 881556, 1035779, 1101577, 1082043, 1010234]
36610A010234q6337o5924r434P8973J74148K32692K19613J37679L1936m0454n6616
36599A626510n1261q7706j95266l33123m19141l94129k60778p4780Q9002J72840
36589G2168J66558J13441P4032P2927Q4474P2313L3665l56o96K8356M8704J9417
36577G85003o1255j42342j60714j01160q133O2858R1603R0092P6185O3751O1062
36566G56950O1019M4257P151k5222k9348j2508N501K2621M2221M8632L0637J9009
36554I70920N6267J24647J48191Q5393j3505o3415l1914N0068J35962J93183K07427
36543A863224J91427J78733J81783J67647J02628P432o5331r9693j26037j68382
36533B233431k24108k96338l94835m86332m93384l81265k15735r5989n2340m8186
$$ y = [1010234, 923897, 857973, 848539, 927512, 1101660, 1334352, 1553965, 1691644, 1723580, 1683126, 1626510, 1575249, 1487543, 1292277, 959154, 540013, 145884, -114894, -189674, -100672, 72168, 238726, 352167, 426199, 499126, 583600, 655913, 689578, 689222, 688526, 716882, 765586, 785003, 723748, 581406, 420692, 319532, 311399, 374257, 465860, 555952, 632137, 695888, 756950, 817969, 862226, 869377, 844155, 814807, 802299, 807800, 830421, 872642, 921274, 951911, 970920, 1027187, 1151834, 1300025, 1385418, 1371913, 1308498, 1276584, 1326652, 1462614, 1655797, 1863224, 2054651, 2233384, 2415167, 2582814, 2685442, 2692874, 2627543, 2527850, 2401813, 2233431, 2009323, 1712985, 1318150, 831818, 338434, -42831, -258566, -354555, -406895, -455081]
36523d55081n9019r3851j41504j53340j00991j3747O3161J17221J54270J66989
36513e15892J50004J26971J28346J50202J62584J51985J29405J02860P1014M1321
36503F98800K3180j53o1059j58161k44050k75271k51006j90280j00916M121Q4026
36492d70769R9778N9858P222l6855q7456j50287j88685j54287m1585R9413K01640
36481f62013K27836J85692J07652K3995m3000p1682n0042K269M0288L7251J1730
36470a90024L71J6085M3912N8972L0123p0016k22458l41669l42657k34367j09993
36459a361721l5949J1309Q1302J63345K00952J71583J14560Q3793R9270J43273
36449c28283J81727J87497J60181J26979J14559J21877J29016J25053J12676R1535
$$ y = [-455081, -514100, -607951, -749455, -902795, -1003786, -1017533, -954372, -837151, -682881, -515892, -365888, -238917, -110571, 39631, 202215, 354200, 483605, 586465, 657479, 698800, 721980, 721827, 660768, 502607, 258557, -16714, -267720, -458000, -558916, -554795, -470769, -370991, -311133, -303911, -340766, -428222, -578509, -767194, -921481, -963066, -863653, -662013, -434177, -248485, -140833, -116838, -159838, -231520, -281562, -279293, -239005, -201754, -190024, -189653, -173568, -129656, -70684, -40561, -110577, -333035, -674704, -1017361, -1251728, -1361721, -1397670, -1386361, -1305059, -1141714, -940762, -769179, -654619, -570826, -471556, -328283, -146556, 40941, 201122, 328101, 442660, 564537, 693553, 818606, 931282, 1022817]
36439A022817N6215J1624k5934m7062n6733o0687n6342m1978k5539j8823k8482
36428G29076n3941q5224r9409p0026Q075J03147J63947J61116J16092Q6106J09580
36417A168539J59356J58879N9401r8992k17465k36038j92195j75355k31066l19465
36407G5599l60416l04062j59838K0257J73292K57198K76297K74384K82637K73343
36397H08691J88799K4079j44917k35554k39719k05739j59799q8129N539P4312
36387B7563Q4149O4229P0317J13060J50092J41104Q5876J1866n0503p7000n7980
36376E62773j2051J9798Q429l5586p6119r3204j00734j15212j15850n8080O3356
36365D7520J84470K29361J90501J26276Q1189M0984k3377j00001j49830j58189
$$ y = [1022817, 1079032, 1090656, 1064722, 1017660, 960927, 900240, 843898, 801920, 776381, 757558, 729076, 675135, 589911, 490502, 420476, 428551, 531698, 695645, 856761, 972853, 1058959, 1168539, 1327895, 1486774, 1546175, 1447183, 1229718, 993680, 801485, 626130, 395064, 75599, -284817, -588879, -748717, -728460, -555168, -297970, -21673, 252711, 535348, 808691, 997490, 1021569, 876652, 641098, 401379, 195640, 35841, -52288, -46749, 27563, 111712, 175941, 246258, 359318, 509410, 650514, 736390, 748256, 697753, 620753, 562773, 550722, 570520, 578949, 543363, 467244, 374040, 273306, 158094, 42244, -15836, 47520, 231990, 461351, 651852, 778128, 859317, 900301, 876924, 776923, 627093, 468904]
36355D68904j47625j48255j74220k20228k61530k63164k07442j09681N232J32581
36345i25428K77360M21661N22063N38658M55504K83155O2464j38655k58131k80391
36335I58260k37706j73064j10962n8280j6875Q164Q125j5449l3986j0033N0321
36324C68515Q3773L8343n5693j15633j01149m6062J90K0846J3924k9128r8024
36313G9902j43238j13710j0320J12213J88422J80618R4379k4924j19129j55617
36303H8596j38699q5355o672Q1296J48563J67964J31660M6431p0028j81027k42377
36292e9648k39753k00469j55760j09960o2212l5370n6239j19811j96818k63501
36282a499541k97698k61979j33251M6445J84421K18524J64618P8173k249n7612
$$ y = [468904, 321279, 173024, -1196, -221424, -482954, -746118, -953560, -1063241, -1058009, -925428, -648068, -226407, 295656, 834314, 1289818, 1572973, 1635437, 1496782, 1238651, 958260, 720554, 547490, 436528, 378248, 361373, 369537, 377662, 362213, 328227, 318194, 368515, 452288, 490631, 434938, 319305, 218156, 172094, 172284, 193130, 207054, 177926, 79902, -63336, -177046, -187366, -75153, 113269, 293887, 388266, 363342, 244213, 88596, -50103, -135458, -142130, -60834, 87729, 255693, 387353, 433784, 363756, 182729, -59648, -299401, -499870, -655630, -765590, -827802, -863172, -919411, -1039222, -1236040, -1499541, -1797239, -2059218, -2192469, -2146024, -1961603, -1743079, -1578461, -1500288, -1502537, -1560149]
36272a560149o4900q523Q7276J65897J89864J73387J56494J55829J50509J12733
36262d41583M1518l7933j01966j47804j84841k12686k13711j69721q5711O443
36252a547995P2908J06052J21136J26024J10037P2954M8241P2053J31748J70481
36242e16361J49774Q7298K3864k6302p6350j32252j75893j78446j22379j9686
36232i86733Q3640J35641J25249R1132P2290O4678M4047J4606N105K1597L5410
36221b93338K4815L877k257P501J5144J3159J2937K3518L2203J4974k9429o0302
36209b37198k4510Q6523K20585L16346L58830L68756L54395L05649K31414J66848
36199B147638J33157J18800J13401J29921J69674J90963J49114O1172j328J1535
$$ y = [-1560149, -1625049, -1633572, -1546296, -1380399, -1190535, -1017148, -860654, -704825, -554316, -441583, -400065, -437998, -539964, -687768, -872609, -1085295, -1299006, -1468727, -1554438, -1547995, -1475087, -1369035, -1247899, -1121875, -1011838, -938884, -890643, -818590, -686842, -516361, -366587, -279289, -255425, -281727, -358077, -490329, -666222, -844668, -967047, -986733, -903093, -767452, -642203, -551071, -478781, -414103, -370056, -355450, -350345, -328748, -293338, -268523, -264646, -266903, -259402, -244258, -231099, -218162, -194644, -162441, -147467, -176896, -237198, -261708, -175185, 45400, 361746, 720576, 1089332, 1443727, 1749376, 1980790, 2147638, 2280795, 2399595, 2512996, 2642917, 2812591, 3003554, 3152668, 3213840, 3212512, 3224047]
36189C224047Q0378J46535J66992J33380O1253k0207q0021j08007j26188j65765
36179C312397k31694k97609l33052l24532k71423j80540p6888n696p20m8349j00834
36168A441060j31986j64224k27768l05374l37077k78403j39243L3296J92721L10337
36158C93339L74868L90661L68167L04693J82498J001j93101l26242l55548k97809
36148H42527k00216r8205j2393L0769O888o7643j25111r7386K0558J65438K59504
36137G24730K61675J77743M6192q0922j67380k21113k81931l66957m39135m44854
36127g91952l72479k57491j42585n5620j3884j3176r884M9171J62508K65918L04468
36116h75006K86013K43159J73025N3662r3518j99800k12891j38049j5626J11432
$$ y = [3224047, 3304425, 3450960, 3617952, 3751332, 3812585, 3792378, 3712357, 3604350, 3478162, 3312397, 3080703, 2783094, 2450042, 2125510, 1854087, 1673547, 1596659, 1590963, 1590243, 1541894, 1441060, 1309074, 1144850, 917082, 611708, 274631, -3772, -143015, -109719, 83002, 393339, 768207, 1158868, 1527035, 1831728, 2014226, 2015227, 1822126, 1495884, 1140336, 842527, 642311, 544106, 531713, 562482, 569370, 501727, 376616, 279230, 299788, 465226, 724730, 986405, 1164148, 1210340, 1129418, 962038, 740925, 458994, 92037, -347098, -791952, -1164431, -1421922, -1564507, -1620127, -1634011, -1647187, -1657071, -1607900, -1445392, -1179474, -875006, -588993, -345834, -172809, -119147, -212665, -412465, -625356, -763405, -779031, -667599]
36106f67599K01037K17138J58165P0588J7619L5180J16622K22735K99474L05675
36096I76634K43036J54947Q7357N6652N7480Q3064J22908J52986J47784J01902
36086B184750L2685l2866p1349q0203r2814j57236k78467l93185m23177l46585
36076C41553k00694l3312J17567K11058K20076J74470J53679K15887L49273M95499
36066B045056N93360N94606M78508K79379P5297p7153j79652k47650k62813k07139
36056C091799j21223p9887j11859j80519k41351k78783k84875k48794j88329j56647
36046A199532j87542k50437k81390k46801j62055o5059O301K2438k2745r6660
36036h4418j39674j01504K5957J98927L40791L86944L28475K13290J01220K2205
$$ y = [-667599, -466562, -249424, -91259, -20671, -3052, 32128, 148750, 371485, 670959, 976634, 1219670, 1374617, 1461974, 1518626, 1576106, 1659170, 1782078, 1935064, 2082848, 2184750, 2217435, 2184569, 2113220, 2033017, 1940203, 1782967, 1504500, 1111315, 688138, 341553, 140859, 107547, 225114, 436172, 656248, 830718, 984397, 1200284, 1549557, 2045056, 2638416, 3233022, 3711530, 3990909, 4066206, 3989053, 3809401, 3561751, 3298938, 3091799, 2970576, 2890689, 2778830, 2598311, 2356960, 2078177, 1793302, 1544508, 1356179, 1199532, 1011990, 761553, 480163, 233362, 71307, 6248, 12549, 34987, 12242, -84418, -224092, -325596, -299639, -100712, 240079, 627023, 955498, 1168788, 1270008, 1292213]
36026A292213k4431m8914o2027p5722r7146j24145j52012j75186j75077j22362
36016B35191j1337J14541J93086K02149J72806J41172J03809L1458q3140k05218
36006H94517k85656l00190k59135j86654j00696j4943M9090O4091J6323p6464
35996a99717j65085j90941j23347J2261J49636K38383K82091L09934L22490K91486
35986I27191K11022J17112M4375r550n7385q3537o1509p89N1425N8262K6720q935
35974A214402k6818m0486q7677j89087l11557l84893l69767k99689k40346k17119
35964i53037k02015j63623j03504m1169J2967N8900R5459J18922J30392J42525
35954i04183J78644K53441L42528L82663L24617J85997L5931o9016j15469j08332
$$ y = [1292213, 1267782, 1218868, 1156841, 1081119, 983973, 859828, 707816, 532630, 357553, 235191, 223854, 338395, 531481, 733630, 906436, 1047608, 1151417, 1182875, 1099735, 894517, 608861, 308671, 49536, -137118, -237814, -252757, -203667, -139576, -123253, -199717, -364802, -555743, -679090, -666829, -517193, -278810, 3281, 313215, 635705, 927191, 1138213, 1255325, 1299700, 1290150, 1232765, 1149228, 1087719, 1086930, 1138355, 1196617, 1223337, 1214402, 1187584, 1147098, 1059421, 870334, 558777, 173884, -195883, -495572, -735918, -953037, -1155052, -1318675, -1422179, -1463348, -1450381, -1391481, -1296022, -1177100, -1046708, -904183, -725539, -472098, -129570, 253093, 577710, 763707, 799638, 730622, 615153, 506821]
35944E06821n0128M2288J26394J62289J45449J01642N9142L3545K6858K8702K5747
35933A208749J9960L1388P4132J33182J70304J50992O9783l8189j11031j04878
35923A604392l6386K9362M0188l590p1457j41395k01052k29641k06684j39265
35913F44472o3539j4329J184K423J5048M8483Q8181J12585J16533J06666P4498
35902A132205k819j21398k30160k73686k46005j84234j21713p0340l7128k5439
35892a80717j8579R414N9636J06079J30079J31569J01770J8998j06163k05035
35882D7051k00891q2391Q5916K16683K52659J87453O3789n1617j16719j43767
35872B58166j67895j90882j79420j22963o7511p3314j49817k47449l06128k96319
$$ y = [506821, 456693, 498981, 625375, 787664, 933113, 1034755, 1093897, 1127442, 1154300, 1183002, 1208749, 1228709, 1260097, 1334229, 1467411, 1637715, 1788707, 1858490, 1820301, 1709270, 1604392, 1568006, 1597368, 1637556, 1633966, 1562509, 1421114, 1220062, 990421, 783737, 644472, 580933, 566604, 567788, 570211, 585259, 633742, 721923, 834508, 951041, 1057707, 1132205, 1129386, 1007988, 777828, 504142, 258137, 73903, -47810, -118150, -155278, -180717, -199296, -189882, -130246, -24167, 105912, 237481, 339251, 358249, 252086, 47051, -153840, -236231, -150315, 66368, 319027, 506480, 570269, 518652, 401933, 258166, 90271, -100611, -280031, -402994, -470505, -543819, -693636, -941085, -1247213, -1543532]
35862a543532k17460q0321R2506K55675L52717L56803L01887K60730K79637L34531
35852C93173L56807L00858J81318N0373m7175r5442j02504q8788p5110o8908n9512
35841G45090l2192J2844N9503R2750J10964J19939J18791R6172M1902l8611j24915
35830A202237j99057k58974l08035l34041l12421k38576j47861q8539p2718o3561
35820h21546j6288P2693J61799K05692J93605J46709Q9913M1525K7726P9517J91242
35809C72587K94876L10536K31119J29509O7648K6215n0764j66816k69581l27844
35799F17485l65217m04817m20334l71099k63419j45159m8310L3413J07729J50812
35789a108916J28710M6923l2054k7903R2137K77902M25396M49093L36806J46344
$$ y = [-1543532, -1760992, -1841313, -1748807, -1493132, -1140415, -783612, -481725, -220995, 58642, 393173, 749980, 1050838, 1232156, 1282529, 1235354, 1139912, 1037408, 948620, 873510, 804602, 745090, 712898, 725742, 785245, 877995, 988959, 1108898, 1227689, 1323861, 1365763, 1327152, 1202237, 1003180, 744206, 436171, 102130, -210291, -448867, -596728, -685267, -757985, -821546, -837834, -765141, -603342, -397650, -204045, -57336, 32577, 74102, 101828, 181345, 372587, 667463, 977999, 1209118, 1338627, 1406275, 1432490, 1381726, 1214910, 945329, 617485, 252268, -152549, -572883, -943982, -1207401, -1352560, -1400870, -1367457, -1259728, -1108916, -980206, -933283, -965337, -993240, -901103, -623201, -197805, 251288, 588094, 734438]
35779G34438m0504j61963j93058j40896l4668Q1954J60853J69674J13226L0879
35769G19935l6136p3469q7636q4632o9063n3030m2535k0314K9797Q0999P8594
35758D42510P460q5337j48349j73180j65700j12001j4321O9644P9556L5404J4256
35747e0058M2898O7964M6533J1904J6410M9051N2092l226r5142j87492k47109
35736b96175k35975j32854K7425J69317K46490K76102K94056K98965K57233J49630
35726A054214k980j51176k41987k44114j68695o6255J0727M9358P9124J34015
35716D52231K13001K73476K62113J62426K2141p2973o7996J3563R5937J23065
35706A476984R7765N5157J5158l0421r2200j52035j56283m7152J80961M52273
$$ y = [734438, 693934, 531971, 338913, 198017, 163349, 245303, 406156, 575830, 689056, 719935, 683799, 610330, 522694, 438062, 368999, 315969, 273434, 253120, 282917, 363916, 442510, 449970, 364633, 216284, 43104, -122596, -234597, -248918, -179274, -99718, -64314, -50058, -7160, 60804, 107337, 119241, 135651, 184702, 236794, 233568, 138426, -49066, -296175, -532150, -665004, -637579, -468262, -221772, 54330, 348386, 647351, 904584, 1054214, 1051234, 900058, 658071, 413957, 245262, 179007, 189734, 239092, 318216, 452231, 665232, 938708, 1200821, 1363247, 1385388, 1312415, 1244419, 1257982, 1353919, 1476984, 1574749, 1629906, 1645064, 1614643, 1522443, 1370408, 1214125, 1166973, 1347934, 1800207]
35696A800207O56956P41717P39272O95211N89250L63648K4568l22688n54638o26099
35686D107404n79486m86967m04358l59157l47664l41078l16309k86775k89361
35677F96249l37858m02365m39195m28718l76433k88515j62183k358J60479K75991
35667a304906L02492K37395J25712L4876R107L9923Q2681J04191J08237J10195
35657a50097J00764N7292r357m7301k1142L9209P0310N0061K0581L7490J13132
35646B60942K09742K73710K77056K39162K06093J95915J72848R6149j3499q6460
35636A831658q3301l0919K3810O0992P7118O6722M1372L8065P6397J23689J29399
35625B355002Q0055k224r6209j87528k55989k92644l19713l57742l79040l33427
$$ y = [1800207, 2457163, 3198880, 3938152, 4633363, 5222613, 5586261, 5610829, 5288141, 4733503, 4107404, 3527918, 3040951, 2636593, 2277436, 1929772, 1588694, 1272385, 985610, 696249, 358391, -43974, -483169, -911887, -1288320, -1576835, -1739018, -1741376, -1580897, -1304906, -1002414, -765019, -639307, -604431, -595324, -555401, -472720, -368529, -260292, -150097, -49333, 7959, -1398, -48699, -69841, -30632, 39678, 89739, 110320, 147810, 260942, 470684, 744394, 1021450, 1260612, 1466705, 1662620, 1835468, 1931617, 1918118, 1831658, 1748357, 1717438, 1741248, 1802240, 1879358, 1946080, 1987452, 2025517, 2101914, 2225603, 2355002, 2435057, 2432833, 2336624, 2149096, 1893107, 1600463, 1280750, 923008, 543968, 210541]
35615B10541k23174j12847n1489j9929K1634O1009M5241l8540j23949j26978m1845
35604d00326M4501M8573q785k5105N4121J59778J77754Q2295m0927r2951m7699
35593d8771N5546J64593K43356K74847K58471K01953J13658R951p6921j17835
35583A078848j14043q8371n1030M150O7745J04309Q6534K5610m2012q8651j11516
35572H71573j23917j33163j22279o1631M8726J58708K10311J92399J31867M2735
35562A215329p9969k18331l26784l82831m06444m09429l59190k23870l3081J39127
35552a085473K46172L00449L35093L53466L23803K21843P7924k8690m0139J8038
35542G22486O7077O5842M0457J7308l0531j37356k72268l54994l39868k52341
$$ y = [210541, -12633, -125480, -176969, -196898, -175264, -114255, -69014, -107554, -231503, -358481, -400326, -355825, -307252, -316037, -341142, -287021, -127243, 50511, 132806, 91879, -1072, -48771, 6775, 171368, 414724, 689571, 948042, 1149995, 1263653, 1273604, 1196683, 1078848, 964805, 876434, 825404, 829554, 897299, 1001608, 1088142, 1113752, 1071740, 983089, 871573, 747656, 614493, 492214, 430583, 479309, 638017, 848328, 1040727, 1172594, 1215329, 1135360, 917029, 590245, 207414, -199030, -608459, -967649, -1191519, -1224600, -1085473, -839301, -538852, -203759, 149707, 473510, 695353, 773277, 744587, 704448, 722486, 789563, 855405, 895862, 913170, 882639, 745283, 473015, 118021, -221847, -474188]
35532d74188j42402l3494P0381J50626J73926J30599O0156K2031L4685N6787M3630
35521I2737R460N618M0873O2283K9247k9437n9062n0850l5038k1631R118O1725
35509A15043J12847J52517K02894K76388L38041L32066K35531P0977j20153k93094
35499A423057l95272l80703k51890p7145N5601J04742Q4534J8662q3459j94021
35489C04106k48291j99323q0417K6452Q6433J40736K32008L36200L87140L42452
35479A327496K08834L1731j15867j64519j08405k3514P875j5572l2130j1049J4637
35468A119517J3086M568K1542N0813N2602K2733k226k857n810l9647q5288r4169
35456A054864m6623K9208R3240J26386J25643R1200L3633k1848n7376q2167j15967
$$ y = [-474188, -616590, -650084, -579703, -429077, -255151, -124552, -64396, -42365, -7680, 49107, 92737, 102197, 107815, 148688, 210971, 240218, 210781, 151719, 100869, 65831, 44200, 53318, 115043, 227890, 380407, 583301, 859689, 1197730, 1529796, 1765327, 1836304, 1716151, 1423057, 1027785, 647082, 395192, 318047, 373648, 478390, 562924, 581586, 498127, 304106, 55815, -143508, -223925, -197473, -111040, 29696, 261704, 597904, 985044, 1327496, 1536330, 1568061, 1452194, 1287675, 1179270, 1155756, 1163631, 1148059, 1115929, 1104880, 1119517, 1132603, 1137171, 1158713, 1209526, 1262128, 1284861, 1282635, 1279778, 1273968, 1234321, 1149033, 1054864, 1008241, 1037449, 1130689, 1257075, 1382718, 1473918, 1507551, 1485703, 1428327, 1346160, 1230193]
35445A230193j59707j97844k23006k38865k40008k09238j41332n7505Q453L1652
35435a97207P802m0711o8537l3818O7556J97155L06643L73117M03331M06974L68116
35424A790421K52890O2110j28679k15434j69753p0315p751J2064L4669N7348K3224
35413A640794q5822k05370k54912k10723r9740L9269J64552K31641K16725J34988
35403A571402K6536o7654j19925j29009j20834j15196r4540l3028M7036Q3831
35393A048619M6574l3101j01764j22467p6187K6077J22325J39001P1619j2147
35383A108549o1569q7475j02548p7150Q398J16653K01041K59254K94737K68503
35373A928393J50354o177j00484r0016j4028P6309J61924K30806K57347K26110
$$ y = [1230193, 1070486, 872642, 649636, 410771, 170763, -38475, -179807, -237312, -228859, -197207, -189405, -230116, -298653, -332471, -264915, -67760, 238883, 612000, 1015331, 1422305, 1790421, 2043311, 2105421, 1976742, 1761308, 1591555, 1521240, 1513489, 1525553, 1560222, 1617570, 1640794, 1554972, 1349602, 1094690, 883967, 784227, 823496, 988048, 1219689, 1436414, 1571402, 1597938, 1530284, 1410359, 1281350, 1160516, 1045320, 950780, 917752, 964788, 1048619, 1095193, 1062092, 960328, 837861, 761674, 787751, 910076, 1049077, 1120696, 1108549, 1046980, 959505, 856957, 779807, 788205, 904858, 1105899, 1365153, 1659890, 1928393, 2078747, 2072570, 1972086, 1882070, 1868042, 1944351, 2106275, 2337081, 2594428, 2820538]
35363B820538J55365Q6020N2575N7837O6328L3299n0468j53651k42891l00218
35353B524734l03837k38353j41796r4223j26919j83287k03883k07214k42557l04151
35343D78514l47507l58661l45881k84721j38642O7461K47867L34847L22503K43863
35333B19643J46212P8521N8280N4403L6271K2064L7951N5507K9971j3292J088
35322G26619Q9310J82196K18789K08316J83478J48770J02849O7652O2800P7323
35312B068102Q7064P6635L4029m4433j27926j59118j07744K596J29127K45322
35302B203654L31955L64342L32183K55914J64912O8901l7473j50954k51262l13747
35292B968425l27949l05892k69274k27153j75256j17859p1767m1684j2897K2041
$$ y = [2820538, 2975903, 3061923, 3114498, 3172335, 3238663, 3271962, 3221494, 3067843, 2824952, 2524734, 2220897, 1982544, 1840748, 1746525, 1619606, 1436319, 1232436, 1025222, 782665, 478514, 131007, -227654, -573535, -858256, -996898, -929437, -681570, -346723, -24220, 219643, 365855, 444376, 502656, 557059, 593330, 615394, 653345, 708852, 738823, 725531, 726619, 815929, 998125, 1216914, 1425230, 1608708, 1757478, 1860327, 1927979, 1990779, 2068102, 2155166, 2231801, 2265830, 2221397, 2093471, 1934353, 1826609, 1829205, 1958332, 2203654, 2535609, 2899951, 3232134, 3488048, 3652960, 3721861, 3684388, 3533434, 3282172, 2968425, 2640476, 2334584, 2065310, 1838157, 1662901, 1545042, 1473275, 1431591, 1418694, 1440735]
35282A440735N4175Q5173J28718J67203J49479O4678k1593m8645m3802p1963j29308
35271A774850j47525r1054O724R9095J65386J96351J90617J72329J73241J90914
35261B730928J91239J47078N1189q7129k22905k80650k30601j43357j15816j54928
35251A885048j87208j70319j36095j27969j53228j96837k29508k03946r7278M2620
35241D25280J44188K01281K59787L20978L26175K49675J46861Q8520R0197J18943
35231B371885J31310J00545M7120M2658J39389K93373L96860L83232K65858R7324
35221D269554n4283j11941m9252N5935R2731M3147k2887o8288j26574k13499k81136
35210C533507k85519k40654j83808j35772j07712j01249r5868p7779p2721j01140
$$ y = [1440735, 1494910, 1580083, 1708801, 1876004, 2025483, 2090161, 2068568, 2019923, 1976121, 1904158, 1774850, 1627325, 1536271, 1542995, 1642090, 1807476, 2003827, 2194444, 2366773, 2540014, 2730928, 2922167, 3069245, 3120434, 3033305, 2810400, 2529750, 2299149, 2155792, 2039976, 1885048, 1697840, 1527521, 1391426, 1263457, 1110229, 913392, 683884, 479938, 382660, 425280, 569468, 770749, 1030536, 1351514, 1677689, 1927364, 2074225, 2162745, 2252942, 2371885, 2503195, 2603740, 2650860, 2693518, 2832907, 3126280, 3523140, 3906372, 4172230, 4269554, 4215271, 4103330, 4054078, 4110013, 4202744, 4245891, 4223004, 4154716, 4028142, 3814643, 3533507, 3247988, 3007334, 2823526, 2687754, 2580042, 2478793, 2382925, 2305146, 2232425, 2131285]
35200B131285j18538o2435N6884J79188K90006M18631N55284O48963O75894O34545
35190E409707M97163K59496J8593j03974j08413q7248o8855p973Q1555J21995
35180F012046J10646J31038K02924K46732K22947J83462J56837J07286M0605K9788
35170G444311J00454K04212L28241N07200P04603Q16839Q25481Q16772Q30716
35161A2578829Q32035Q44681R50539J124244J236832J261399J311273J446542
35153B1586374J621480J847376K204973K659660L073079L430613L837859M282750
35145D4544164M672578N124208N894042O972602Q105362R283744J0822031J2872560
35137A08291291J5321441J8241537K1867490K5984622L0027094L3836072L7038318
$$ y = [2131285, 2012747, 1950312, 2007196, 2186384, 2476390, 2895021, 3450305, 4099268, 4775162, 5409707, 5906870, 6166366, 6184959, 6080985, 5972572, 5885324, 5816469, 5808496, 5890051, 6012046, 6122692, 6253730, 6456654, 6703386, 6926333, 7109795, 7266632, 7373918, 7414523, 7444311, 7544765, 7748977, 8077218, 8584418, 9289021, 10105860, 10931341, 11748113, 12578829, 13410864, 14255545, 15206084, 16330328, 17567160, 18828559, 20139832, 21586374, 23207854, 25055230, 27260203, 29919863, 32992942, 36423555, 40261414, 44544164, 49216742, 54340950, 60234992, 67207594, 75312956, 84596700, 95418731, 108291291, 123612732, 141854269, 163721759, 189706381, 219733475, 253569547, 290607865]
35130B90607865L7000682K9073611J1127956j2219407l1827188m1303372m1315490
35123B41144657l6780463l1526361k6564862k1900075j7870579j4703084j2146721
35116G9652512j0007087q393877p260864o261004n222236m325490l695483l206474
35108C1279997k786499k540954k458944k321018k021057j709576j513230j358252
35100A4570467j171679j030407j000536j014741j003771r90602r80830r08957
35092F468944p56458n88339m29922k44130o1327J7578j4896n2346n7098j14575
35082D167431k55772l70707l65385k81942j99173j25323n1689r814j0722j0506
35072B486398J2983K5176J1465P045J8737J802n3648r7594j12410j44529k10546
$$ y = [290607865, 327608547, 356682158, 367810114, 355590707, 323763519, 282460147, 241144657, 204364194, 172837833, 146272971, 124372896, 106502317, 91799233, 79652512, 69645425, 61251548, 53990684, 47729680, 42507444, 38181954, 34486471, 31279997, 28493498, 25952544, 23493600, 21172582, 19151525, 17441949, 15928719, 14570467, 13398788, 12368381, 11367845, 10353104, 9349333, 8358731, 7377901, 6468944, 5712486, 5124147, 4694225, 4450095, 4388768, 4406346, 4391450, 4339104, 4282006, 4167431, 3911659, 3540952, 3175567, 2893625, 2694452, 2569129, 2517440, 2507626, 2496904, 2486398, 2499381, 2524557, 2536022, 2543067, 2561804, 2563606, 2509958, 2412364, 2299954, 2155425, 1944879]
35061A944879k55410k39971j91273j33639n2335L7363O8558J8658m3412n3899
35051A099519l8774n9746j30246k21666k99949l21108k42696p9400R0061J98093
35041e912K36647K20688J52255M0541q1830j76909k08148j44113p335R8010Q0291
35030B04185k0260p9618n4599j5867j4611j8094o214l2455j33270k52041l11555
35019g34399l05549k68678k09439j25083l9926J9433N4786O9467N0775J1707O267
35008a470639O2988J37411J66547J41095R5308N8020M1423M6086N0333K5345j7053
34997f63136k5371K1890Q4397J19576J34278J51619J66786J67551J63979J66332
34987D87901J64320J56484J65694J92097J83703R6861l1997j13453r7903j8142
$$ y = [1944879, 1689469, 1449498, 1258225, 1124586, 1072251, 1109614, 1178172, 1196830, 1153418, 1099519, 1060745, 1000999, 870753, 649087, 349138, 28030, -214666, -294066, -204005, -5912, 230735, 451423, 603678, 644219, 562389, 385480, 177332, 33219, 25884, 123894, 204185, 183925, 104307, 49708, 33841, 19230, 1136, -5078, -37533, -170803, -422844, -734399, -1039948, -1308626, -1518065, -1643148, -1683074, -1663641, -1608855, -1539388, -1488613, -1476906, -1470639, -1407651, -1270240, -1103693, -962598, -867290, -809270, -767847, -721761, -671428, -646083, -663136, -688507, -666617, -582220, -462644, -328366, -176747, -9961, 157590, 321569, 487901, 652221, 808705, 974399, 1166496, 1350199, 1447060, 1415063, 1301610, 1203707, 1185565]
34977A185565M9225M3782m3827j70300k70887l04009k70623j99763j28373q6628
34967a95838q0395q8849r3028r4161q6062l6704O3647J57889J76217J22092N1546
34956a03646j8606j12629k06603k15844r8406Q8079K58910L78164M39068M28216
34946H36703L48257K33137J07281l2425j69071k47842k42465k00945j88380k15777
34936B28473k55747k91601l12254k87610j91194l6356J32201K67172L29093L00804
34926a17019K12128J23397O9252M6308N8444J21680K04078K18469J16902m7325
34916A006314j89444k85499l53758l83945l42400k32108j01408J403N2462M5565
34906g82818o678p0263j08677j00178l6585O7314J58246J79973J43101J20185
$$ y = [1185565, 1234790, 1278572, 1234745, 1064445, 793558, 489549, 218926, 19163, -109210, -195838, -276233, -365082, -458110, -552271, -638333, -675037, -611390, -453501, -277284, -155192, -103646, -122252, -234881, -441484, -657328, -755734, -667655, -408745, -30581, 408487, 836703, 1184960, 1418097, 1525378, 1492953, 1323882, 1076040, 833575, 632630, 444250, 228473, -27274, -318875, -631129, -918739, -1109933, -1146289, -1014088, -746916, -417823, -117019, 95109, 218506, 287758, 334066, 392510, 514190, 718268, 936737, 1053639, 1006314, 816870, 531371, 177613, -206332, -548732, -780840, -882248, -880845, -828383, -782818, -789496, -859759, -968436, -1068614, -1105199, -1037885, -879639, -699666, -556565, -436380]
34896d36380J50451J91923J92046J56093J11552N8071J346j3034L5704Q0137L8165
34885E66074o5524j18510n7762P0333J86785K58297K86047K67563K00683J05022
34875A699008J9798j7542L546N1721P4799N0786O406k4679l6717k7622K4353J21310
34863A945167K07129K12606J28920O90j38286k78200l90207m20404l41516j85310
34853G40589j8036R9475J37336J12284P6858O8958P4322N6778J2402l2988o6530
34842A261448r3573j06944q8636m6889k2431m9197j23657k07864k44629j84269
34832I3359l1493J33291K08154J52787O872j59557k87351l36106k97013k06069
34822g23126j11778k0852R5118K31882L26192L18803K22496J05652K1872k2838
$$ y = [-436380, -285929, -94006, 98040, 254133, 365685, 423756, 425102, 412068, 447772, 527909, 566074, 500550, 382040, 324278, 394611, 581396, 839693, 1125740, 1393303, 1593986, 1699008, 1718806, 1701264, 1704810, 1756531, 1831330, 1882116, 1888522, 1863843, 1827126, 1799504, 1823857, 1945167, 2152296, 2364902, 2493822, 2494512, 2356226, 2078026, 1687819, 1267415, 925899, 740589, 722553, 822028, 959364, 1071648, 1148506, 1217464, 1291786, 1348564, 1360966, 1327978, 1261448, 1167875, 1060931, 972295, 925406, 902975, 853778, 730121, 522257, 277628, 93359, 61866, 195157, 403311, 556098, 562970, 403413, 116062, -220044, -517057, -723126, -834904, -855756, -760638, -528756, -202564, 116239, 338735, 444387, 466259, 443421]
34812D43421m0949k8782K4560J02577J56390J47778Q9772K7770j6467o0341j18673
34801G27056j74869k07431k21432k35554k56556k81603l02438k88316j94366k1524
34791a457033J49738K23516J82496R2875K6622Q326K8091O7165J03860J21440
34781d52904J20203J08715Q5724M7138N521j7452j5774n14J7021K6301J1016l5070
34769a00075q7491j04455o1081L6525J57637K54426K82640K38341J63030R5547
34759H75044L6902j9870n6017n8883o2604j10761j90362k47861k63232k61639
34749c59283k54187k17158j39149m5635L6915J05876J60525J90096J95220J88190
34739a38590J61996R6499J0090l5584j0473L4145K2221n8926j52977k01832j92322
$$ y = [443421, 402472, 373690, 398250, 500827, 657217, 804995, 894767, 922537, 906070, 845729, 727056, 552187, 344756, 123324, -112230, -368786, -650389, -952827, -1241143, -1435509, -1457033, -1307295, -1083779, -901283, -808408, -781786, -773460, -745369, -678204, -574344, -452904, -332701, -223986, -138262, -91124, -85603, -103055, -118829, -119343, -102322, -76021, -65005, -100075, -187566, -292021, -353102, -316577, -158940, 95486, 378126, 616467, 779497, 875044, 911946, 892076, 836059, 777176, 714572, 603811, 413449, 165588, -97644, -359283, -613470, -830628, -969777, -1015412, -978497, -872621, -712096, -522000, -326780, -138590, 23406, 119905, 129995, 94411, 83938, 118083, 140304, 81378, -71599, -273431, -465753]
34728d65753j45948q9738m1483q531R206K0128M6282J13880K18881L08637L26001
34717B91562K76039K21115J97633J63138M7073j59472l81733n19462n15082l78327
34707g57516j67874M4123J98434K55817K01343O2099q6168j59375j29082l9422
34697e77621M3953R1069J10830J14698R5413M3082k7194p5132p1835l3683m366
34686b90786o71K030K0738L2116J7588J5849Q4937K16679L30512L56288K87926
34675A073206J55467o379j42844j80436q8855P2284J99716K35422J94961J23802
34665A636344N0737k1419j01811j91485k66560k84470k19767r5237K9521J01406
34655F37259J05212O0316l149o3180j08016j30334j30200j23480j31017j46946
$$ y = [-465753, -611701, -701439, -742922, -751453, -742247, -722119, -675837, -561957, -343076, -34439, 291562, 567601, 788716, 986349, 1149487, 1196560, 1037088, 655355, 135893, -379189, -757516, -925390, -881267, -682833, -427016, -225673, -163574, -249742, -409117, -538199, -577621, -533668, -442599, -331769, -217071, -121658, -78576, -105770, -180902, -252737, -286420, -290786, -291457, -289427, -268689, -236573, -218985, -203136, -118199, 98480, 428992, 785280, 1073206, 1228673, 1222294, 1079450, 899014, 810159, 882443, 1082159, 1317581, 1512542, 1636344, 1687081, 1665662, 1563851, 1372366, 1105806, 821336, 601569, 506332, 535853, 637259, 742471, 802787, 799638, 736458, 628442, 498108, 367908, 244428, 113411, -33535]
34645c3535j29796m4513Q9134K05985K52706K24696J54128Q1947M0678M2943P6963
34634I61336J20159J56911J77629J73037J47923J32473J57255K18184K82548L20879
34624B848334L11583K29540P0507j11640k32370k56621k24674j89849j64678j46354
34614B133778j58900k30817l40322m13558l84139k47749o4687Q2595J43517J28071
34604F47789Q9015P6042J03258J48191J72836J56878J22415J11049J19733Q3210
34594A830416m4156k04933k84300k38326j30298l5243L7344J04266J43483J10290
34584A288543n437j67731l20298m03412l75501k51639j04859l211M1601M9623
34574b52321K7634k1994p3507r6713r0048o2871j24J16684K58357L54216L56486
$$ y = [-33535, -163331, -207844, -118710, 87275, 339981, 564677, 718805, 800752, 841430, 884373, 961336, 1081495, 1238406, 1416035, 1589072, 1736995, 1869468, 2026723, 2244907, 2527455, 2848334, 3159917, 3389457, 3459964, 3348324, 3115954, 2859333, 2634659, 2444810, 2280132, 2133778, 1974878, 1744061, 1403739, 990181, 606042, 358293, 293606, 376201, 519718, 647789, 736804, 812846, 916104, 1064295, 1237131, 1394009, 1516424, 1627473, 1747206, 1830416, 1786260, 1581327, 1297027, 1058701, 928403, 893160, 930504, 1034770, 1178253, 1288543, 1283106, 1115375, 795077, 391665, 16164, -235475, -340334, -343545, -301944, -252321, -224687, -246681, -320188, -416901, -506949, -569820, -569944, -453260, -194903, 159313, 515799]
34563E15799K79242J75513R3616M8913J7152m0017j26614k00416k28033k33243
34553C01912k58789k93325k77904j86826o4455K8087P0531P3540M0673l3950j41132
34542g41638k48766l17657l20572k53797j37441k030J25885K22731K62958K33253
34532a177074J53446O7840Q665k4133m5371n8916n5747k9872J0590M5150N0466
34521a054956J1435p1448j79196k73088l02521k35508r7076L2101P6648L3593
34511b060016k7285l1912L2594J16904J64073J61882J45676J55593J96374K40606
34501i05511K62590K57895K34431K00793J65706J33519R4572L2718n2136j39854
34491B84723k09559k48714k43984j87020r6125p708O4753J39136K20500K78787
$$ y = [515799, 795041, 970554, 1064170, 1113083, 1130235, 1090218, 963604, 763188, 535155, 301912, 43123, -250202, -528106, -714932, -779387, -751300, -680769, -607229, -566556, -600506, -741638, -990404, -1308061, -1628633, -1882430, -2019871, -2021901, -1896016, -1673285, -1410327, -1177074, -1023628, -955788, -947123, -971256, -1016627, -1075543, -1131290, -1161162, -1150572, -1105422, -1054956, -1043521, -1114969, -1294165, -1567253, -1869774, -2105282, -2202358, -2170257, -2093609, -2060016, -2087301, -2119213, -2086619, -1969715, -1805642, -1643760, -1498084, -1342491, -1146117, -905511, -642921, -385026, -150595, 50198, 215904, 349423, 443995, 476713, 424577, 284723, 75164, -173550, -417534, -604554, -700679, -708387, -643634, -504498, -283998, -5211]
34481e211K92001K81672K73428K46343J62184L3416p9302j37204j56963j72546
34471G37818j96004k22217k42190k38095j86375q0785N5947J86759K77540L05352
34461C97750K68548J90420R8845N206q2549j37449j32935q4134m0304k7881k3387
34450D32130R741P8162J58718K19001K28996J75673Q2238k118m6643o5798r6375
34439A173725j59579k47872l30166l62616l15678k07162r6819l4926k3727l4923
34429f39743m9257o7163r3564j25742j48497j35501p1466J6110O6043M4547j2881
34418a217114l9326q173N1163J00010J27496J40302J40904J28841J10519R4785
34408c70593Q2773O8475M5407Q776m2887j00931j44692j56037j39104j18831j12396
$$ y = [-5211, 286790, 568462, 841890, 1088233, 1250417, 1283833, 1204531, 1067327, 910364, 737818, 541814, 319597, 77407, -160688, -347063, -427848, -371901, -185142, 92398, 397750, 666298, 856718, 955563, 960769, 878220, 740771, 607836, 523702, 483398, 455517, 432130, 441871, 520033, 678751, 897752, 1126748, 1302421, 1384659, 1382541, 1335898, 1270100, 1173725, 1014146, 766274, 436108, 73492, -242186, -449348, -546167, -581093, -604820, -639743, -689000, -756163, -849727, -975469, -1123966, -1259467, -1330933, -1314823, -1248780, -1204233, -1217114, -1256440, -1264613, -1213450, -1113440, -985944, -845642, -704738, -575897, -465378, -370593, -287820, -219345, -173938, -165162, -208049, -308980, -453672, -609709, -748813, -867644, -980040]
34397i80040j04055n7255M3945J69190K59044K63820J69671N616j61965k56017
34387f48046k37192j34896k1605M6940O3001M8933K6691N046k0337n8610j03261
34376a033336j21286q2659m495N6865O8587N5015N3411N7574L1374l2794r7437
34365a049181j21622r7148m1388K4570Q4144J30919J78313K49848L44209M17126
34355A19790M16442L39331K43058J89875J84790J75215J10611o300j28893k14454
34345A429465k51959k51159k24911j89752j70578j89139k43819l01718l11644
34336g05214k33590o9810J30255L06610M33449N16939N49542M92068L21501Q4246
34326A825996j22913k27808k29131j75975j20888r1668q6368q3900o9093n4737
$$ y = [-980040, -1084095, -1141350, -1097405, -928215, -669171, -405351, -235680, -230064, -392029, -648046, -885238, -1020134, -1041739, -994799, -931798, -882865, -856174, -851128, -871465, -930075, -1033336, -1154622, -1237281, -1241776, -1184911, -1116324, -1061309, -1007898, -950324, -918950, -951744, -1049181, -1170803, -1267951, -1309339, -1284769, -1200625, -1069706, -891393, -641545, -297336, 119790, 536232, 875563, 1118621, 1308496, 1493286, 1668501, 1779112, 1772812, 1643919, 1429465, 1177506, 926347, 701436, 511684, 341106, 151967, -91852, -393570, -705214, -938804, -1008614, -878359, -571749, -138300, 378639, 928181, 1420249, 1741750, 1825996, 1703083, 1475275, 1246144, 1070169, 949281, 857613, 771245, 687345, 618252, 563515]
34316E63515p2677j40046k40178l34690l82341l48905k22909l6524J42796K59474
34306h12485L06483L09138K85585K39000J78207J21352P5946L2932j4616o2059
34296F59483j07036j55128k01140k21027k00505j62666j45823j53361j43884p8043
34286i09130L7009J56321K38822K70990K60370K22749J74888J24471O2262k3472
34276F15280j18022j80123j87363j72943j91708k44420k61325j80451k6526J13163
34266h34438J83687K04098K14082K15143J85276J26890O8185K4080j5723n6971
34256C14309q2342p3466l9088j1191j7066n7769j08227j36075j25324q4595l3169
34245d54003J4914N0067O2526N1615L3458K5155K4486J8655R307J3925M5488J04746
$$ y = [563515, 490838, 350792, 110614, -224076, -606417, -955322, -1178231, -1214755, -1071959, -812485, -506002, -196864, 88721, 327721, 505928, 627280, 703226, 736158, 721542, 659483, 552447, 397319, 196179, -24848, -225353, -388019, -533842, -687203, -831087, -909130, -872121, -715800, -476978, -205988, 54382, 277131, 452019, 576490, 638752, 615280, 497258, 317135, 129772, -43171, -234879, -479299, -740624, -921075, -947601, -834438, -650751, -446653, -232571, -17428, 167848, 294738, 362923, 387003, 371280, 314309, 231967, 158501, 119413, 108222, 91156, 33387, -74840, -210915, -336239, -420834, -454003, -439089, -389022, -326496, -274881, -241423, -216268, -191782, -173127, -163820, -149895, -104407, 339]
34233C39J84278K57057K67697J70799j0492j91307l04683l50983l55329l08915
34223f41539j86990j0892J43827K06695J65167O4697k4006m2080K6083J42733
34213a56305K41207K67127K06417R2951l812k0727M5263J30843J69630J53774
34203A126368J17894P8309K0026n8403j22368j41242j33074j49554k17697l06069
34193B14190l53538l33020k81265k52433k42089j82317l0292J58520K76364K76679
34183g49201K13796J69388J67044J68372J33319P1203L8145Q4686J98234L04416
34173G99402L38992L09331K67407K38408K09791J82169J82969K13847K21859J49615
34163C113790m138j88751l44542m28000m24703l67658l27663l54413m25305m64388
$$ y = [339, 184617, 441674, 709371, 880170, 869678, 678371, 373688, 22705, -332624, -641539, -828529, -839421, -695594, -488899, -323732, -259035, -283041, -325121, -299038, -156305, 84902, 352029, 558446, 651397, 647585, 626858, 672121, 802964, 972594, 1126368, 1244262, 1322571, 1342597, 1284194, 1161826, 1020584, 887510, 737956, 520259, 214190, -139348, -472368, -753633, -1006066, -1248155, -1430472, -1460764, -1302244, -1025880, -749201, -535405, -366017, -198973, -30601, 102718, 173921, 212066, 296752, 494986, 799402, 1138394, 1447725, 1715132, 1953540, 2163331, 2345500, 2528469, 2742316, 2964175, 3113790, 3109652, 2920901, 2576359, 2148359, 1723656, 1355998, 1028335, 673922, 248617, -215771]
34153b15771m06422k38973n821K09101L18525K86539J53957n16j21078j92921
34143b13380k19531k05184j54923p5526J9152R3955R9020J4031j17918k18860
34133i79164k37713j76689p3914J7332M5922n193r8132j72441k01960k03031j90972
34122b275955j56074q7157R036J23947K58750M02476N16214N59791N27082M41617
34112C19727L26217J92562N6048n4972j08897q7451R44J17459K11069K54966K65845
34101A493517K78309K99720K98148K36312J11085m0781j67624k30633k17939j45211
34091A914903m5159N0106J20444J51829J26517L5118r4677j96879k15988j59113
34081A687101q7264n3905o2570q0813p5902l5268K2776M7850o119j21343k15059
$$ y = [-215771, -622193, -861166, -866987, -657886, -339361, -52822, 101135, 100619, -20459, -213380, -432911, -638095, -793018, -868544, -849392, -755437, -656417, -642386, -760304, -979164, -1216877, -1393566, -1467480, -1450148, -1404226, -1409419, -1507551, -1679992, -1881952, -2084983, -2275955, -2432029, -2519186, -2510150, -2386203, -2127453, -1724977, -1208763, -648972, -121890, 319727, 645944, 838506, 894554, 839582, 730685, 643234, 644178, 761637, 972706, 1227672, 1493517, 1771826, 2071546, 2369694, 2606006, 2717091, 2676310, 2508686, 2278053, 2060114, 1914903, 1869744, 1919850, 2040294, 2192123, 2318640, 2353758, 2259081, 2062202, 1846214, 1687101, 1599837, 1545932, 1483362, 1402549, 1326647, 1291379, 1314155, 1362005, 1355886, 1234543, 1019484]
34070A019484k27966j98273k10356k76271l13892k55426j37752n6816n7640j02167
34060h17075j32947j33162j20610j12206j12627j25546j55020j88979j90656j22383
34050b211211J2880J61100K62465L06154L25661L40935L29808K69246J80655J06081
34040H3774N0375j9366j12252j82479j78948j08569k7911K1088M5968P5345J17924
34029b35051J59849J86550J89251J56216P9384k2309j00697j15170p0837j1109
34019B16077K6970M1095M7199M7832K9681q899m2196m2201j7711j1105m2347o7561
34007A76834k0876R5743J90778J72588M4613j12921k40846l41999m25497m58171
33997i19754m01173k68723j16656J7355J34067K40086L24654L71085L65888K91264
$$ y = [1019484, 791518, 593245, 382889, 106618, -207274, -462700, -600452, -657268, -714908, -817075, -950022, -1083184, -1203794, -1316000, -1428627, -1554173, -1709193, -1898172, -2088828, -2211211, -2198331, -2037231, -1774766, -1468612, -1142951, -802016, -472208, -202962, -22307, 83774, 134149, 114783, 2531, -179948, -358896, -467465, -495376, -474288, -428320, -352975, -235051, -75202, 111348, 300599, 456815, 536199, 513890, 413193, 298023, 227186, 216077, 243047, 284142, 331341, 379173, 408854, 399955, 357759, 315558, 297847, 286742, 244395, 176834, 155958, 251701, 442479, 615067, 659680, 546759, 305913, -36086, -461583, -919754, -1320927, -1589650, -1706306, -1688951, -1554884, -1314798, -990144, -619059, -253171, 38093]
33987C8093J35501p1765k51433l25690k79573j65404m9992L5348R8438J55007
33977f81470K01534K16621J84557J15565M3927P620K5562Q4015J40402J51031
33967D89364J08681N1610K6587M5878Q8875J35910J78553J98327J65167P3514
33957A562466l9225j30502j96733k59113l15822l36405l05856k49528k03371j76230
33947f50319j53569j25551r6452p2550n3703l5081r039K9869P0472P8993K4532
33936i92398q0697j74931j93313j25841k8707K3547J018o0674j00438r4513p8713
33925a905660j04378j74064k29631k07807j00129M6944J80969K78911L39122L59031
33915a516692L31876K57605J49140L3425m9785o3506m457Q3564J41692J45984
$$ y = [38093, 173594, 101829, -149604, -475294, -754867, -920271, -970263, -934915, -836477, -681470, -479936, -263315, -78758, 36807, 80734, 88354, 113916, 197931, 338333, 489364, 598045, 649655, 676242, 722120, 810995, 946905, 1125458, 1323785, 1488952, 1562466, 1523241, 1392739, 1196006, 936893, 621071, 284666, -21190, -270718, -474089, -650319, -803888, -929439, -1025891, -1098441, -1152144, -1187225, -1196264, -1166395, -1095923, -1016930, -992398, -1073095, -1248026, -1441339, -1567180, -1595887, -1572340, -1571322, -1631996, -1732434, -1826947, -1905660, -2010038, -2184102, -2413733, -2621540, -2721669, -2674725, -2493756, -2214845, -1875723, -1516692, -1184816, -927211, -778071, -744646, -794431, -857937, -862394, -778830, -637138, -491154]
33905d91154J19895R9951J00733J14293J28866J37997J37514J22244Q5832K3959
33895E80130n6605j32636j77994j86118j71447j48696j24489j11351j26110j56567
33885h11883j47681n1368J08163K39485K60964J64519J0339j19415j62066j01847
33875f10790J9503J28297J73489J58359J16959P1582K2822l2312r2610j59250
33865b03951k29273k76732k57534j49335J4320J57687K13988J67664O0033l3596
33855e36729m0051O8354K40996L65146L44694J82950j7207j44734j68885j37339
33845A57195j07390r8851j02924j07058j03459r1652q0651p4531n2217J7099J24640
33834e19799K04870J88984P3235p6551j82071k03849j46854l8286R1869K15958
$$ y = [-491154, -371259, -271308, -170575, -56282, 72584, 210581, 348095, 470339, 556171, 580130, 523525, 390889, 212895, 26777, -144670, -293366, -417855, -529206, -655316, -811883, -959564, -1010932, -902769, -663284, -402320, -237801, -227462, -346877, -508943, -610790, -591287, -462990, -289501, -131142, -14183, 57399, 80221, 47909, -44701, -203951, -433224, -709956, -967490, -1116825, -1102505, -944818, -730830, -563166, -503133, -536729, -576780, -508426, -267430, 97716, 442410, 625360, 608153, 463419, 294534, 157195, 49805, -49046, -151970, -259028, -362487, -454139, -534790, -609321, -661538, -644439, -519799, -314929, -125945, -52710, -129261, -311332, -515181, -662035, -700321, -608452, -392494]
33824c92494L01915L10289K16330M8484j06414j60867r9286J3373R7195J25110
33814C53635J27008J39706J62767J62254J11198K0707p1287j37731j81262k15654
33804D71341k39412k35146j91703j22945o5666n3054p8326q8620l6279N8316J18041
33793d63453R6246L1356l595J6323O1983J06307J45954J71655J57850R3529l130
33782D11025j08845k09075k82455l02416k68963k12701j50469o2172O6762K01426
33772i17883K81946K79927K12009J15559L5650J7011O9524J41155J56126Q7563
33762D78587k6021j32725k06616k31870j84787o0100R6563K06765K16051J32454
33752B88301J7545n5586m6826L2433J36815K18586K44600K02463J13074L0410
$$ y = [-392494, -90579, 219710, 436040, 484524, 378110, 217243, 117957, 131330, 228525, 353635, 480643, 620349, 783116, 945370, 1056568, 1077275, 1005988, 868257, 686995, 471341, 231929, -3217, -194920, -317865, -383531, -436585, -514911, -603531, -639810, -581494, -463453, -367207, -335851, -339446, -323123, -261140, -154833, -8879, 162776, 320626, 414155, 411025, 302180, 93105, -189350, -491766, -760729, -973430, -1123899, -1186071, -1119309, -917883, -635937, -356010, -144001, -28442, 7208, 24219, 93743, 234898, 391024, 478587, 452566, 319841, 113225, -118645, -303432, -363532, -266969, -60204, 155847, 288301, 305846, 250260, 203434, 235867, 372682, 591268, 835868, 1038331, 1151405, 1181815]
33742A181815p08O098n400o1688j29256j67451j78773j82475j70014j27284q1490
33731H3374p6167j02125j02895o0869l3641p9964j81621k65787k81184k27171
33721a328050j31698l3652K6529L1381j066m7705j09287j84977k37400k23445
33711b239370j55166q9342n1574q499P2884J72922K44660K64074K35530J70894
33701a382987Q6824R082l9153m6066m721P9374J64535J88640J36848P4722Q4128
33690f48774J75394K85674L51627L56436L14828K45105J61247P1869j7351q8811
33680A207244j08648n7983L4942J14884J51460J53332J34070Q6954q30j23349
33670A592076k47709l21995l01024j85865l7889O3698Q1821L5928k5943n2739
$$ y = [1181815, 1181107, 1187205, 1181805, 1120117, 990861, 823410, 644637, 462162, 292148, 164864, 83374, 7207, -94918, -197813, -258682, -292323, -372287, -553908, -819695, -1100879, -1328050, -1459748, -1493400, -1466871, -1435490, -1436556, -1484261, -1593548, -1778525, -2015925, -2239370, -2394536, -2483878, -2535452, -2543951, -2471067, -2298145, -2053485, -1789411, -1553881, -1382987, -1296163, -1287081, -1326234, -1372300, -1377021, -1297647, -1133112, -944472, -807624, -732902, -648774, -473380, -187706, 163921, 520357, 835185, 1080290, 1241537, 1313406, 1296055, 1207244, 1098596, 1040613, 1075555, 1190439, 1341899, 1495231, 1629301, 1716255, 1715425, 1592076, 1344367, 1022372, 721348, 535483, 497594, 561292, 643113, 679041, 653098, 600359]
33660F00359j2817P0808J18335P0229l2050q4041m2747L1632P0540Q1094J02517
33649I73859J24412J03304M2435J237K0223P3842J08464J00121O1493J1942m1437
33638A579895j00185j66030k36593l00303l30566k92395j71309k765J41424K12058
33628C33231K20276K01896J59469P0755n0770j44497j65676j30236q2091m4625
33618C67732k3053k4870m7979o6867o0022m1029l9044n7784p4458o9626m0052
33607a77052M544L7421K3789l9029j01259j08312o2605j4065K517m669r761O096
33595d42385M6653Q5302O6048m0309j79681k55048k32891j71873j32568r9909
33585a356661k3637R4866J92897K12015J47537M2927m1231o0577j5009N2553R6366
$$ y = [600359, 587542, 658350, 776685, 846914, 814864, 730823, 688076, 719708, 790248, 871342, 973859, 1098271, 1201575, 1244010, 1245247, 1265470, 1339312, 1447776, 1547897, 1609390, 1621332, 1579895, 1479710, 1313680, 1077087, 776784, 446218, 153823, -17486, -20251, 121173, 333231, 553507, 755403, 914872, 985627, 934857, 790360, 624684, 494448, 412357, 367732, 344679, 319809, 271830, 204963, 144941, 103912, 64868, 7084, -67374, -137000, -177052, -172508, -135087, -111298, -150327, -251586, -359898, -422503, -436568, -434051, -438720, -448481, -442385, -395732, -310430, -244382, -284691, -464372, -719420, -952311, -1124184, -1256752, -1356661, -1380298, -1285432, -1092535, -880520, -732983, -690056, -731287, -791864, -806873, -754320, -657954]
33574f57954J04468R0354O5521M0544M1912R7335J97289K89801L23299K86080
33564H78649K01728J00019J140q1136j33711j44510j08725l8653L3715P4692P7456
33553H60664O7620P2008Q5046P6081K9666l4056q4943j17210j46004j77714k01875
33542D29283k11959k12612j97155j39646l1998Q1677J35755J11514N3197R432
33532B7488j9018n9404j16759j69532k04970k27516k29494j85832r6874j3678
33522a295589Q207k7196o4403o5795m3954j9960J6225P9587J46787J72794J46181
33511i47116R9852O4973L9430R549j8984k6775o021L1421O5041P8497O8019M2964
33499d99150J3870j8104n0484o3080l1973L5067R5218J14366J04568J09522J57772
$$ y = [-657954, -553486, -463132, -397611, -357067, -315155, -217820, -20531, 269270, 592569, 878649, 1080377, 1180396, 1181536, 1100400, 966689, 822179, 713454, 674801, 708516, 783208, 860664, 928284, 1000292, 1085338, 1161419, 1191085, 1157029, 1072086, 954876, 808872, 631158, 429283, 217324, 4712, -192443, -332089, -364087, -282410, -146655, -35141, 18056, 27488, 8470, -50934, -167693, -337225, -542195, -769711, -999205, -1185037, -1281911, -1295589, -1287382, -1314578, -1378981, -1444776, -1488730, -1508690, -1492465, -1412878, -1266091, -1093297, -947116, -847264, -782291, -742861, -733312, -752296, -779071, -785092, -753671, -688630, -610133, -542114, -499150, -485280, -503384, -553868, -616948, -648921, -613854, -518636, -404270, -299702, -190180, -32408]
33488c2408K30228K65349K04508N5696q8799j28466n9380K1646K6491m1952j30457
33477C22456k14155k92640l34954k85504j31662O9029K37366L26713L30007K61237
33467B87893J40971j1897j75570l07557l52094k93775j91910j25040j02836o9415
33457a201230M532P8049J06309J09371J38601J95987K23784J69234L2564j45777
33447b88576l16762m34492m62021l90705k54870j13818j0507N1650R1286J18420
33437b010395J32302J42840J71457K22048K68381K82750K61277K06445J05643
33428b17252m3456j95809k82009k76655k23357j85124j83566j87721j47781m0940
33418a983670R9575K02869K24759J89850J51800J24737Q8303N4220P6948J76652
$$ y = [-32408, 197820, 463169, 667677, 723373, 634574, 506108, 446728, 468374, 494865, 452913, 322456, 108301, -184339, -519293, -804797, -936459, -867430, -630064, -303351, 26656, 287893, 428864, 416967, 241397, -66160, -418254, -712029, -903939, -1028979, -1131815, -1201230, -1196698, -1118649, -1012340, -902969, -764368, -568381, -344597, -175363, -142799, -288576, -605338, -1039830, -1501851, -1892556, -2147426, -2261244, -2271751, -2220101, -2128815, -2010395, -1878093, -1735253, -1563796, -1341748, -1073367, -790617, -529340, -322895, -217252, -260708, -456517, -738526, -1015181, -1238538, -1423662, -1607228, -1794949, -1942730, -1983670, -1884095, -1681226, -1456467, -1266617, -1114817, -990080, -901777, -847557, -770609, -593957]
33408e93957K89439L27149K67096J56459M7129m0524r8191j12254q1923m0265
33398A20158l9832j07951k11712k73877k39432j30211k1252L8749O7559J07598
33388f90203J66939K14370K15166J56377N1287o4497j51793j97552k17132k17728
33378g34766j77677q2060L6580J22384J58022J75433K00287K11008J68221P1289
33368A48721l1721q7293p8496k6772L1597O1832L7240m6221j54884k35016k60785
33357f41798k54709k46500k25230j56828m2847O8063J33502J58507J74887K00893
33347h32060K32967K59265K66824K47350K06757J58345J00124J4613r7454j96041
33337C60690k27525j67164l6101J07593J91772J70263O2859n0989r2333l8341
$$ y = [-593957, -304518, 22631, 289727, 446186, 493315, 452791, 354600, 242346, 160423, 120158, 80326, -27625, -239337, -513214, -752646, -882857, -904109, -865360, -797801, -690203, -523264, -308894, -93728, 62649, 113936, 49439, -102354, -299906, -517038, -734766, -912443, -994503, -957923, -835539, -677517, -502084, -301797, -90789, 77432, 148721, 117000, 29707, -48789, -75561, -43964, 17868, 55108, 8887, -145997, -381013, -641798, -896507, -1143007, -1368237, -1525065, -1567912, -1499849, -1366347, -1207840, -1032953, -832060, -599093, -339828, -73004, 174346, 381103, 539448, 639572, 654185, 556731, 360690, 133165, -33999, -70100, 37493, 229265, 399528, 462387, 411398, 319065, 280724]
33327B80724P5795J92329K66222K86462K72913K40632J69712L4314j37744k67493
33317A413866k99336k46567j56400o8014j8597l9507j06704j32547n6776P4457
33307C63875J63071J71802J36042Q4080R400p4708j13292o9420K6347J04487J12888
33296I14572L9667q9208k20784l05252l27619k99166k25295j08739K0691J17284
33286d83849J66871J89361J87546J33410K2884r2985j58508j68762j50111j11163
33276d65306m3211M7623J38085K08203K43284K30088J75687J17725Q8712P8263
33266H19153N6963K8931K7099N5298O9717L2291m1980j08912j49195j78866k15903
33255C94596k56659k82777k73696k12196r8892K7040R8148P3345j5765q7962q5614
$$ y = [280724, 356519, 548848, 815070, 1101532, 1374445, 1615077, 1784789, 1819103, 1681359, 1413866, 1114530, 867963, 711563, 643549, 624952, 585445, 478741, 346194, 289418, 363875, 526946, 698748, 834790, 918870, 928270, 853562, 740270, 670850, 697197, 801684, 914572, 954239, 865031, 644247, 338995, 11376, -287790, -513085, -621824, -601133, -483849, -316978, -127617, 59929, 193339, 216223, 123238, -35270, -204032, -354143, -465306, -508517, -460894, -322809, -114606, 128678, 358766, 534453, 652178, 740890, 819153, 876116, 905047, 932146, 987444, 1057161, 1089452, 1047472, 938560, 789365, 610499, 394596, 137937, -144840, -418536, -630732, -729624, -702584, -604436, -531091, -546856, -634818, -720432]
33244g20432j5013Q2797J76950K50899K85321K65666K03708J31501P3491L6494
33234G71382J8120M567l1889j03122j70163j68663q2467L1478J05143J23249J08451
33223F06086O9314k898r3228j52850j42795p6219j0177K599m1265r1727r2433
33212b5593m0797N722o881o8750j23894j39698j37135j52215j89392k21292k18670
33201a318595j70807q8900k315N5202O9145N6776N1841P4929J15657J38476J08867
33190i09724K6761o0418q8551l1563P5570J68795K01051J57719N1414p7363j70046
33179f56355j93504j76957j80198k19340k49432k29511j73313j12175l5448R2383
33169b133850K63779M16051M91755M80879L98257K55829P9250p4513j49858j41521
$$ y = [-720432, -735445, -652648, -475698, -224799, 60522, 326188, 529896, 661397, 734888, 771382, 789502, 794069, 762180, 659058, 488895, 320232, 237765, 269243, 374386, 497635, 606086, 675400, 672502, 579274, 426424, 283629, 207410, 197233, 199832, 158567, 66840, -25593, -66390, -60668, -67549, -136299, -260193, -399891, -537026, -689241, -878633, -1099925, -1318595, -1489402, -1578302, -1580617, -1525415, -1456270, -1399494, -1347653, -1272724, -1157067, -1018591, -909724, -882963, -943381, -1031932, -1063495, -987925, -819130, -618079, -460360, -408946, -486309, -656355, -849859, -1026816, -1207014, -1426354, -1675786, -1905297, -2078610, -2190785, -2226233, -2133850, -1870071, -1454020, -962265, -481386, -83129, 172700, 251950, 177437, 27579, -113942]
33159a13942r4710n9497n5477p3089r2504j00246r7942r8163j08510j20167j12919
33148a127166p0426L499P4669R2107L1850p1369j54935j91909k00357j87850j24677
33137a926564M653J53087K48478K65640K33699J87654J46709J30650J54577J94776
33127b06641J85915P1259j43688l79560n18397m75425k70533k5770J34791J82406
33117a445643J66483J24581N5056k8462p5268n5725l724K6319K0002n86j5021
33106a231988j3923Q897M5737O8926N8559K5798j1444o2901j49044k52685l11378
33095a825446k66630j15191Q5296K54906L42519L50326L11217K48065J67486Q7296
33085c60156M0217L6985M9145M7584M0104M9883P2140P7282M9780M002l1703l0646
$$ y = [-113942, -208652, -268149, -323626, -396715, -489219, -589465, -687407, -785570, -894080, -1014247, -1127166, -1197592, -1194093, -1119424, -1027317, -995467, -1066836, -1221771, -1413680, -1614037, -1801887, -1926564, -1921911, -1768824, -1520346, -1254706, -1021007, -833353, -686644, -555994, -401417, -206641, -20726, 50533, -93155, -472715, -991112, -1466537, -1737070, -1762840, -1628049, -1445643, -1279160, -1154579, -1099523, -1127985, -1203253, -1258978, -1262702, -1236383, -1216381, -1216967, -1231988, -1245911, -1237014, -1191277, -1122351, -1063792, -1037994, -1049438, -1112339, -1261383, -1514068, -1825446, -2092076, -2207267, -2121971, -1867065, -1524546, -1174220, -863003, -614938, -447452, -360156, -319939, -282954, -233809, -186225, -146121, -96238, -24098, 53184, 102964, 106966, 75263, 44617]
33073D4617J9345R5911J45349J32734Q4719N7840O8808Q4245P8198O6632P4868
33062I53266R8603J13645J04570O7704J635q6791j74600k33401k42473j87282
33052D14876o3000J03664K48794L11840K84916K09790J29586O0647J0509m554
33042A707068J9086M6484K7914m3639j15983j32027r1822m6214l3650m1217l1911
33031A264089O070M8630O4654M2994l880m9231o4693l5776K7442R5463J35882
33020A531644J27348O8654j4537p6779q3439m2232K966J6073J944r224m045q45
33008A517528k0205n1185n9417l0754L576m300o7263j50197k08764k28130k17320
32997D83569j80944j16031l2074M9190J21498K00516K83741L17497K35064L7281
$$ y = [44617, 63962, 159873, 305222, 437956, 522675, 580515, 649323, 733568, 811766, 878398, 953266, 1051869, 1165514, 1270084, 1337788, 1339423, 1252632, 1078032, 844631, 602158, 414876, 351876, 455540, 704334, 1016174, 1301090, 1510880, 1640466, 1701113, 1711622, 1707068, 1726154, 1772638, 1800552, 1756913, 1640930, 1508903, 1417081, 1370867, 1337217, 1296000, 1264089, 1270159, 1318789, 1383443, 1426437, 1422557, 1373326, 1308633, 1272857, 1300299, 1395762, 1531644, 1658992, 1727646, 1713109, 1636330, 1552891, 1510659, 1513625, 1529698, 1531642, 1522418, 1518373, 1517528, 1497323, 1446138, 1386721, 1355967, 1359543, 1355243, 1287980, 1137783, 929019, 700889, 483569, 302625, 186594, 154520, 203710, 325208, 525724, 809465, 1126962, 1362026, 1399307]
32987A399307j85039l26547l58511l34459l17527l22346l22119k82989j80670
32978a230900q868K02587L84772M66945M23324K80860R2515q4579k00321k33620
32968I2715k11882j89076j91830j95991j61567p9640K2173J10650J74720K26890
32958d02838K80675L23536L17732K41898J29320M4425J5870J2901m337l6189o3306
32947H59687r0647j38150j96871k31831k36330k51785l10975l76571l61420k14699
32937a549592K0453K36981L48859L51321L06587K74775K58499K13498J08497l4170
32927E35708j59030k27132k34529j89566r5449L3039J51980K11744K00699J50443
32917C77907R3829L2706m5141j31000j90771j91339j26851k9213M2158L8938l0997
$$ y = [1399307, 1214268, 887721, 529210, 194751, -122776, -445122, -767241, -1050230, -1230900, -1239768, -1037181, -652409, -185464, 237860, 518720, 611235, 526656, 326335, 92715, -119167, -308243, -500073, -696064, -857631, -937271, -915098, -804448, -629728, -402838, -122163, 201373, 519105, 761003, 890323, 934748, 950618, 963519, 959182, 922993, 859687, 769040, 630890, 434019, 202188, -34142, -285927, -596902, -973473, -1334893, -1549592, -1529139, -1292158, -943299, -591978, -285391, -10616, 247883, 461381, 569878, 535708, 376678, 149546, -84983, -274549, -369998, -336959, -184979, 26765, 227464, 377907, 471736, 504442, 459301, 328301, 137530, -53809, -180660, -209873, -167715, -128777, -159774]
32906a59774j08111j46433j61110j91720k35610k52220k28096j96778j82544j58183
32896b020579q0542N2047J95821K98177L23505K64941J58500P7786Q7398J92215
32886d50731L37147M52485M94163M51906L37504J71461k1233k03521l24038l43856
32876I01287k76865j92295j62284k04105k70878k91235k24836j00614l254J536
32866h23543o1687j01420o2572J8016P1485P8857O3375K9473m0877j31360j74859
32855a135112j16197K3940J60607K14138J68353P4419N546K207N3499J23951J89568
32844b35081K50028L20469M12624N04378N24418L99416J41383j31145k86469k86790
32834A613231j90306p4603R392L0816j9616j11607j91261k25697k14078j61243
$$ y = [-159774, -267885, -414318, -575428, -767148, -1002758, -1254978, -1483074, -1679852, -1862396, -2020579, -2101121, -2049074, -1853253, -1555076, -1231571, -966630, -808130, -730344, -642946, -450731, -113584, 338901, 833064, 1284970, 1622474, 1793935, 1772702, 1569181, 1245143, 901287, 624422, 432127, 269843, 65738, -205140, -496375, -721211, -821825, -825079, -823543, -885230, -986650, -1049222, -1031206, -959721, -880864, -817489, -788016, -828893, -960253, -1135112, -1251309, -1227369, -1066762, -852624, -684271, -609852, -604306, -602099, -548600, -424649, -235081, 14947, 335416, 748040, 1252418, 1776836, 2176252, 2317635, 2186490, 1900021, 1613231, 1422925, 1348322, 1357714, 1388530, 1368914, 1257307, 1066046, 840349, 626271, 465028]
32824D65028p2636K4445R0668J16417J26146J34549J30025J10581R7466R0096
32814A312785M1677q2936k40663l36313l14510k05186q3461o484J2593o154l2802
32803E8546m7753m6055k3854L1036J24408K33947L14941L34226K95288K27503
32793A502233J55249Q3004Q047o4253j26764j83310k36609k63996k30699j42183
32783E00719o2317n3368j06204j53846j48990j04050n9329m2857o5988j25138
32773d21368j87795j98213j22748J3000J43726K18547K33398K21786K23130K53019
32763C76482K93733L11212K80295J95029O8876o1283j44108j53739j22276j10921
32753I33300j45849k02089k49222k83593l07503l06792k67156j91765q7546M2639
$$ y = [465028, 392392, 416837, 507505, 623922, 750068, 884617, 1014642, 1125223, 1222689, 1312785, 1354462, 1271526, 1030863, 694550, 380040, 174854, 91393, 84909, 97502, 91348, 58546, 10793, -35262, -59116, -28080, 96328, 330275, 645216, 979442, 1274730, 1502233, 1657482, 1740486, 1748533, 1684280, 1557516, 1374206, 1137597, 873601, 642902, 500719, 438402, 385034, 278830, 124984, -24006, -128056, -187385, -230242, -296230, -421368, -609163, -807376, -930124, -917124, -773398, -554851, -321453, -99667, 123463, 376482, 670215, 981427, 1261722, 1456751, 1525627, 1464344, 1320236, 1166497, 1044221, 933300, 787451, 585362, 336140, 52547, -254956, -561748, -828904, -1020669, -1108215, -1065576]
32743a065576J73376K43628K01248N7847j16706k47853k94104k50828j45255k5791
32733a470014O6478J23837J64525K03209K35162K41314J99457R9524l9310j71417
32723c47235k54494k74154k39286j69548r5496n0498m1871l9545r747M8136J09860
32712a363878J55869J74205J50532Q3746O106l7859l1711J3957R6703K26296L86665
32701a39369N18065N53387M67402K91028Q8922p9394j93594k72377l31484l49977
32691E52609k97152j87007p9611k5206k9495p4359j40068j94204j90894j10405
32681g75792J2868J21624J83784J95720J59403Q6367J3659j9252j4387j0906l1657
32670g8569n8632p0159p5772r4693j18945j22302r5107m5856K3638J14228J99513
$$ y = [-1065576, -892200, -648572, -447324, -389477, -506183, -754036, -1048140, -1298968, -1444223, -1470014, -1403536, -1279699, -1115174, -911965, -676803, -435489, -236032, -136508, -175818, -347235, -601729, -875883, -1115169, -1284717, -1380213, -1430711, -1472582, -1512127, -1521874, -1473738, -1363878, -1208009, -1033804, -883272, -799526, -793420, -831279, -862990, -849033, -752330, -526034, -139369, 378696, 932083, 1399485, 1690513, 1779435, 1700041, 1506447, 1234070, 902586, 552609, 255457, 68450, -11161, -36367, -65862, -140221, -280289, -474493, -665387, -775792, -762924, -641300, -457516, -261796, -102393, -16026, -2367, -21619, -36006, -46912, -78569, -137201, -207360, -283132, -377825, -496770, -619072, -714179, -760035, -736397, -622169, -422656]
32659d22656K33255K02403J48333J15646R9497O5877N202o3624j27502j79963
32649G6468j95547j50267p5696m4477p6124r7517l5727P7383J36967Q6122l8192
32638c36607j68175k59980k79622j92619o158K06788L63728M43770M76170M68817
32628G16112L85062K05039j1635j50167j35634K37J50688K28578K23560J72116
32618A783956R7007k895j16343k06095k40289k18448j59355q2625j2893J8546
32608H60566j491m7865p8542p6673o4513p9404j39756k24981k82026k63044j68155
32597e65884m4464O2882J45767K13209K59526K73024K57480K16210J29034j7346
32587I29438j80449k86789l14619l10501l04828k55002j12365Q4174K32676K78624
$$ y = [-422656, -189401, 13002, 161335, 276981, 376478, 442355, 447557, 383933, 256431, 76468, -119079, -269346, -345042, -389519, -465643, -563160, -598887, -521504, -384537, -298415, -336607, -504782, -764762, -1044384, -1237003, -1243161, -1036373, -672645, -228875, 247295, 716112, 1101174, 1306213, 1294578, 1144411, 1008777, 1009014, 1159702, 1388280, 1611840, 1783956, 1880963, 1878068, 1761725, 1555630, 1315341, 1096893, 937538, 854913, 842020, 860566, 859075, 811210, 732668, 655995, 591482, 512078, 372322, 147341, -134685, -397729, -565884, -610348, -547466, -401699, -188490, 71036, 344060, 601540, 817750, 946784, 929438, 748989, 462200, 147581, -162920, -467748, -722750, -835115, -750941, -518265, -239641]
32577b39641K55139K14197J69060J22594J03802J33349J74927J64919Q9030k216
32567A185160n5850o5208n0432k1783J6556M5295M0596L617l9544o8467q2503
32556I07437q1771n4235K913O0491P8323N3101K8946M8547J01153J31067R6237
32545A372209R668p5238j10284q4677k7586J2334J86n7254j14101j22281p0520
32534G32456J0358P6528J04920J04335R8260R7085Q9553O3676K6163j3020o6078
32523A324236j47623k23905k18729j00751N5585J33257R1773p069q6062j26387
32513F94325j50417j74267k01931k37146k70107k67184k02267r4521K634M5836
32503h55045K6136l3411q3102o3818M7919K05709L22932L43754K78324J75533
$$ y = [-239641, 15498, 229695, 398755, 521349, 625151, 758500, 933427, 1098346, 1187376, 1185160, 1129310, 1064102, 1013670, 991887, 1008443, 1053738, 1094334, 1097951, 1058407, 989940, 907437, 825666, 771431, 774344, 834835, 913158, 966259, 995205, 1043752, 1144905, 1275972, 1372209, 1381877, 1306639, 1196355, 1111678, 1084092, 1096426, 1096612, 1039358, 925257, 802976, 732456, 742814, 819342, 924262, 1028597, 1126857, 1223942, 1313495, 1377171, 1403334, 1390314, 1324236, 1176613, 952708, 733979, 633228, 688813, 822070, 913843, 906774, 820712, 694325, 543908, 369641, 167710, -69436, -339543, -606727, -808994, -903515, -900881, -855045, -828909, -862320, -945422, -1009240, -961321, -755612, -432680, -88926, 189398, 364931]
32493C64931P9036O373n1837j18106j97150k54223k41497j53307l9591M5211R2477
32482d67683J26950J57365J59648J10675K6524m0690m6909p90L7464J1966o8826
32471E694j35187j25176m3893N2482J22769J76501K43269L17955L44758K58267
32461A217439M6289k20949m27029m88410m10218k69017j43264o1500r772K9085
32451g37346N6440P0817Q1614J01537J32803J70143K14422K71792L34116L67455
32441A063793L31057K12773M4260j20054k38119k97464l08721k93415k75425k67571
32431a48886k55478k04338r7558L3539J34114J81165J99220K18874K40745K50632
32421E52029K47384K33659J95545J21980M0388K900L0099Q8835J30036J28309
$$ y = [364931, 443967, 450340, 398503, 280397, 83247, -170976, -412473, -565780, -605371, -560160, -467683, -340733, -183368, -23720, 86955, 113479, 72789, 25880, 25090, 62554, 74520, 5694, -129493, -254669, -298562, -246080, -123311, 53190, 296459, 614414, 959172, 1217439, 1263728, 1042779, 615750, 127340, -282878, -551895, -695159, -756659, -766431, -737346, -680906, -610089, -528475, -426938, -294135, -123992, 90430, 362222, 696338, 1063793, 1394850, 1607623, 1651883, 1531829, 1293710, 996246, 687525, 394110, 118685, -148886, -404364, -608702, -706260, -672721, -538607, -357442, -158222, 60652, 301397, 552029, 799413, 1033072, 1228617, 1350597, 1390985, 1393885, 1423984, 1512819, 1642855, 1771164]
32411A771164Q1552n60r3014j61853j92665j99526j92640j54697o8500M5542J41504
32400I76307J90541J93773J61852J04231L5531l0137r5568j75538k70912l58006
32390G32074m04886l89037l02480j55953J6661J69128K67063L03363K95255K71130
32380H02318K52344K36249J99995J30007M2709l3934r1867j41132j82516k01551
32370A012622j90967j61476j24822p9795k2495L8161Q1934R2027O9137L3425N302
32359G53053k2720q3183j86784k87429l16403k50292j26311M471J11220J69475
32349b34903J49646M2738j19189k86303m22751n04058n05404m21501k92197j80506
32339b774428j16179p3270q136Q9936J89292K47200K43332J87687J06758K7532
$$ y = [1771164, 1852716, 1852156, 1759142, 1597289, 1404624, 1205098, 1012458, 857761, 789261, 834803, 976307, 1166848, 1360621, 1522473, 1626704, 1662235, 1632098, 1536530, 1360992, 1090080, 732074, 327188, -61849, -364329, -520282, -503621, -334493, -67430, 235933, 531188, 802318, 1054662, 1290911, 1490906, 1620913, 1663622, 1629688, 1537821, 1396689, 1214173, 1012622, 821655, 660179, 535357, 455562, 433067, 471228, 553162, 645189, 714326, 747751, 753053, 730333, 647150, 460366, 172937, -143466, -393758, -520069, -515598, -404378, -234903, -85257, -42519, -161708, -448011, -870762, -1374820, -1880224, -2301725, -2593922, -2774428, -2890607, -2963877, -2972013, -2882077, -2692785, -2445585, -2202253, -2014566, -1907808, -1880276]
32329a880276l0675o1459p4795q7346r9811q7540k1812J01830K59319M09302M98381
32318a074882M75138L30423J22053o8586k08508l16890l96417l99704k86253q6191
32308a909817J19988K69421L41869L35087K50424J05280o2158k08203l00011l27015
32298a385135l08271k78140k50349k06236j31606m8065J5267O6509J36138K22860
32288b167028K86904L00652K77849K46136K15799J84164J48138J03089N0230J3063
32278c41004K2122P0421J07553R5606N0479Q284k7882p9113j42080j83037j81753
32267f00404j56094j37497j40350j58769j73529j54990p8800M4825J65143K28051
32257a162414K21219J81435J62894J98903K81837L67767M02780L56087K36447
$$ y = [-1880276, -1910951, -1972410, -2047205, -2134551, -2234362, -2321902, -2343714, -2241884, -1982565, -1573263, -1074882, -599744, -269321, -147268, -215854, -424362, -741252, -1137669, -1537373, -1823626, -1909817, -1789829, -1520408, -1178539, -843452, -593028, -487748, -549906, -758109, -1058120, -1385135, -1693406, -1971546, -2221895, -2428131, -2559737, -2607802, -2592535, -2526026, -2389888, -2167028, -1880124, -1579472, -1301623, -1055487, -839688, -655524, -507386, -404297, -354067, -341004, -318882, -248461, -140908, -45302, 5177, 13461, -14421, -93534, -235614, -418651, -600404, -756498, -893995, -1034345, -1193114, -1366643, -1521633, -1600433, -1555608, -1390465, -1162414, -941195, -759760, -596866, -397963, -116126, 251641, 654421, 1010508, 1246955]
32248A246955Q3315n1528j17781q3025M1862J89200K61874J95266O389k14402
32238A558125l65906m01428l43262k42052j30594j9148P8270J34999J35895R8212
32228E03111O0365N8012J13251K25158L49935M05619L31571J50520n1336k11771
32218A934435l34896m39025n00938m87151m18978l59560l33616k98545k08514
32209a446788p8061L3880P7665L3344r2125k52552l63254l58841k60156j55719
32199b862607j04557p9801k2091P5326J63051K08205K38493L00942L94502M64261
32189a224276M62372M00835L36876L12392L15498K99372K31808J26794L4349j113
32179A294907J8041M0498J4993n5206j20188j51986j84147k60726l60347m05756
$$ y = [1246955, 1330270, 1278742, 1160961, 1077936, 1119798, 1308998, 1570872, 1766138, 1772527, 1558125, 1192219, 790791, 447529, 205477, 74883, 55735, 134005, 269004, 404899, 503111, 563476, 621488, 734739, 959897, 1309832, 1715451, 2047022, 2197542, 2146206, 1934435, 1599539, 1160514, 659576, 172425, -246553, -606113, -939729, -1238274, -1446788, -1524849, -1490969, -1413304, -1379960, -1472085, -1724637, -2087891, -2446732, -2706888, -2862607, -2967164, -3046965, -3069056, -2993730, -2830679, -2622474, -2383981, -2083039, -1688537, -1224276, -761904, -361069, -24193, 288199, 603697, 903069, 1134877, 1261671, 1296020, 1294907, 1312948, 1353446, 1368439, 1313233, 1193045, 1041059, 856912, 596186, 235839, -169917]
32169a69917l52439k36641j24201m2801J2372L4706J0662l6893n1573o711N7941
$$ y = [-169917, -522356, -758997, -883198, -925999, -913627, -878921, -868259, -905152, -956725, -963436, -905495]
$$ [...]
##END NTUPLES=NMR SPECTRUM
##END=
