##TITLE=31Pdec_68-2022
 CDCl3, 24 sc
 25.8.2022
##JCAMPDX= 6.0         $$ Bruker NMR JCAMP-DX V2.0
##DATA TYPE= NMR SPECTRUM
##DATA CLASS= NTUPLES
##ORIGIN= UXNMR, Bruker Analytische Messtechnik GmbH
##OWNER= root
$$ XWIN-NMR		Version 3.5
$$ Thu Aug 25 09:53:26 2022 Russian Standard Time (UT+4h)  she@DPX200
##.OBSERVE FREQUENCY= 81.013821
##.OBSERVE NUCLEUS= ^31P
##.ACQUISITION MODE= SIMULTANEOUS
##.ACQUISITION SCHEME= undefined
##.AVERAGES= 24
##.DIGITISER RES= 16
##SPECTROMETER/DATA SYSTEM= spect
##.PULSE SEQUENCE= zgpg30
##.SOLVENT NAME= DMSO
##.SHIFT REFERENCE= (INTERNAL, DMSO, 0, 248.564)
##AUDIT TRAIL= $$ (NUMBER, WHEN, WHO, WHERE, WHAT)
$$ ##TITLE= Audit trail, XWIN-NMR		Version 3.5
$$ ##JCAMPDX= 5.01
$$ ##ORIGIN= Bruker BioSpin GmbH
$$ ##OWNER= she
$$ F:/spectra/data/she/nmr/P31/1/pdata/1/auditp.txt
$$ ##AUDIT TRAIL=  $$ (NUMBER, WHEN, WHO, WHERE, WHAT)
(   1,<2022-08-25 09:52:04.62 +0400>,<she>,<DPX200>,
      <created by zg, POWCHK disabled, PULCHK disabled
       configuration hash MD5:
       00 E9 B6 7A A2 85 ED C7 34 08 36 98 17 FE 4E 26
       data hash MD5: 32K
       74 68 A6 99 86 5C 02 9F 83 2A F6 75 4C D0 41 05>)
(   2,<2022-08-25 09:52:17.20 +0400>,<she>,<DPX200>,
      <Start of raw data processing
       efp BC_mod = 2 LB = 1 FT_mod = 6 PKNL = 1 PHC0 = -10235.59 PHC1 = -23.74365 SI = 64K 
       data hash MD5: 64K
       83 AC 89 81 9F 55 7D AC CB 9A D0 9F 73 6E 24 B8>)
(   3,<2022-08-25 09:52:37.09 +0400>,<she>,<DPX200>,
      <pk PHC0 = 19.18379 PHC1 = 0 
       data hash MD5: 64K
       66 CD E8 FA 6E 4B B1 44 FA 9B 6B 37 07 EF 1A F2>)
(   4,<2022-08-25 09:52:40.34 +0400>,<she>,<DPX200>,
      <abs ABSG = 5 
       data hash MD5: 64K
       BA DA 6F A1 5F 68 93 F6 C6 55 18 67 A2 DD 72 83>)
$$ ##END=
$$ 
$$ hash MD5
$$ 70 2D 71 C4 63 2B A8 C0 9B CB F0 7C 88 B8 DE 47
##$RELAX= 
##$RELAX= 
##$RELAX= 
##$RELAX= 
##$RELAX= 
##$RELAX= 
##$RELAX= 
##$RELAX= 
$$ Bruker specific parameters
$$ --------------------------
##$DU= <F:/spectra>
##$EXPNO= 1
##$NAME= <P31>
##$PROCNO= 1
##$TYPE= <nmr>
##$USER= <she>
##$AMP= (0..31)
100 100 100 100 100 100 100 100 100 100 100 100 100 100 100 100 100 100 
100 100 100 100 100 100 100 100 100 100 100 100 100 100 
##$AQSEQ= 0
##$AQ_mod= 1
##$AUNM= <au_zg>
##$AUTOPOS= <>
##$BF1= 81.014009
##$BF2= 200.13
##$BF3= 200.13
##$BF4= 200.13
##$BF5= 200.13
##$BF6= 200.13
##$BF7= 200.13
##$BF8= 200.13
##$BYTORDA= 1
##$CFDGTYP= 0
##$CFRGTYP= 5
##$CHEMSTR= <none>
##$CNST= (0..31)
1 1 145 1 1 1 1 1 1 1 1 1 1 1 1 1 1 1 1 1 1 1 1 1 1 1 1 1 1 1 1 1 
##$CPDPRG= <waltz16>
##$CPDPRG1= <>
##$CPDPRG2= <waltz16>
##$CPDPRG3= <>
##$CPDPRG4= <mlev>
##$CPDPRG5= <mlev>
##$CPDPRG6= <mlev>
##$CPDPRG7= <mlev>
##$CPDPRG8= <mlev>
##$CPDPRGB= <>
##$CPDPRGT= <>
##$D= (0..31)
0 1 0 0 0 0 0 0 0 0 0 0.03 2e-05 3e-06 0 0 0 0 0 0 0 0 0 0 0 0 0 0 0 0 
0 0 
##$DATE= 1661406724
##$DBL= (0..7)
120 120 120 11 120 120 24 19 
##$DBP= (0..7)
150 150 150 150 150 150 150 150 
##$DBP07= 0
##$DBPNAM0= <>
##$DBPNAM1= <>
##$DBPNAM2= <>
$$ [...]
##$SUBNAM3= <"">
##$SUBNAM4= <"">
##$SUBNAM5= <"">
##$SUBNAM6= <"">
##$SUBNAM7= <"">
##$SUBNAM8= <"">
##$SUBNAM9= <"">
##$SW= 501.771253377433
##$SWIBOX= (0..15)
0 1 3 0 0 0 0 0 0 0 0 0 0 0 0 0 
##$SW_h= 40650.406504065
##$TD= 32768
##$TD0= 1
##$TE= 0
##$TE2= 300
##$TE3= 300
##$TEG= 300
##$TL= (0..7)
0 120 53 12 22 120 120 120 
##$TP= (0..7)
150 150 150 150 150 150 150 150 
##$TP07= 0
##$TPNAME0= <>
##$TPNAME1= <>
##$TPNAME2= <>
##$TPNAME3= <>
##$TPNAME4= <>
##$TPNAME5= <>
##$TPNAME6= <>
##$TPNAME7= <>
##$TPOAL= (0..7)
0.5 0.5 0.5 0.5 0.5 0.5 0.5 0.5 
##$TPOFFS= (0..7)
0 0 0 0 0 0 0 0 
##$TUNHIN= 0
##$TUNHOUT= 0
##$TUNXOUT= 0
##$USERA1= <user>
##$USERA2= <user>
##$USERA3= <user>
##$USERA4= <user>
##$USERA5= <user>
##$V9= 5
##$VALIST= <valist>
##$VCLIST= <CCCCCCCCCCCCCCC>
##$VD= 0
##$VDLIST= <DDDDDDDDDDDDDDD>
##$VPLIST= <PPPPPPPPPPPPPPP>
##$VTLIST= <TTTTTTTTTTTTTTT>
##$WBST= 1024
##$WBSW= 4
##$XGAIN= (0..3)
0 0 0 0 
##$XL= 0
##$YL= 0
##$YMAX_a= 1783
##$YMIN_a= -1790
##$ZGOPTNS= <>
##$ZL1= 120
##$ZL2= 120
##$ZL3= 120
##$ZL4= 120
##$ABSF1= 248.5645
##$ABSF2= -253.2056
##$ABSG= 5
##$ABSL= 3
##$ALPHA= 0
##$AQORDER= 0
##$ASSFAC= 0
##$ASSFACI= 0
##$ASSFACX= 0
##$ASSWID= 0
##$AUNMP= <proc_1d>
##$AZFE= 0.1
##$AZFW= 0.5
##$BCFW= 0
##$BC_mod= 2
##$BYTORDP= 0
##$COROFFS= 0
##$CY= -3
##$DATMOD= 1
##$DC= 0
##$DFILT= <>
##$DTYPP= 0
##$F1P= 0
##$F2P= 0
##$FCOR= 1
##$FTSIZE= 65536
##$FT_mod= 6
##$GAMMA= 0
##$GB= 0
##$INTBC= 1
##$INTSCL= 5.30512e-09
##$ISEN= 30
##$LB= 1
##$LEV0= 0
##$LPBIN= 0
##$MAXI= 10000
##$MC2= 0
##$MEAN= 0
##$ME_mod= 0
##$MI= 50
##$NCOEF= 0
##$NC_proc= -6
##$NLEV= 6
##$NOISF1= 182.463
##$NOISF2= 159.3651
##$NSP= 0
##$NTH_PI= 0
##$NZP= 0
##$OFFSET= 248.5645
##$PC= 4
##$PHC0= -10216.41
##$PHC1= -23.74365
##$PH_mod= 1
##$PKNL= yes
##$PPARMOD= 0
##$PSCAL= 0
##$PSIGN= 0
##$REVERSE= no
##$SF= 81.0140089999908
##$SI= 65536
##$SIGF1= 159.3651
##$SIGF2= -187.1042
##$SINO= 113.3802
##$SIOLD= 16384
##$SREGLST= <1H.CDCl3>
##$SSB= 0
##$STSI= 65536
##$STSR= 0
##$SW_p= 40650.406504065
##$SYMM= 0
##$S_DEV= 0
##$TDeff= 32768
##$TDoff= 0
##$TI= <>
##$TILT= no
##$TM1= 0
##$TM2= 0
##$TOPLEV= 0
##$USERP1= <user>
##$USERP2= <user>
##$USERP3= <user>
##$USERP4= <user>
##$USERP5= <user>
##$WDW= 1
##$XDIM= 65536
##$YMAX_p= 304416207
##$YMIN_p= -36959234
$$ End of Bruker specific parameters
$$ ---------------------------------
##NTUPLES= NMR SPECTRUM
##VAR_NAME=  FREQUENCY,     SPECTRUM/REAL,   SPECTRUM/IMAG
##SYMBOL=    X,             R,               I
##VAR_TYPE=  INDEPENDENT,   DEPENDENT,       DEPENDENT
##VAR_FORM=  AFFN,          ASDF,            ASDF
##VAR_DIM=   65536,         65536,           65536
##UNITS=     HZ,            ARBITRARY UNITS, ARBITRARY UNITS
##FACTOR=    0.620285442955139, 1,           1
##FIRST=     20137.2065510736, 0,            0
##LAST=      -20513.1999529914, 0,           0
##MIN=       -20513.1999529914, -36959234,   0
##MAX=       20137.2065510736, 304416207,    0
$$ Real data points
##PAGE= N=1
##DATA TABLE= (X++(R..R)), XYDATA
$$ [...]
##PAGE= N=2
##DATA TABLE= (X++(I..I)), XYDATA
$$ plain form
39748 1723556 1159309 630561 644874 1278073 2059419 2211199 1363620 21276 -884109
39739 -884109 -873634 -223773 519253 1118557 1684130 2253875 2529081 2169149 1277124 356883
39729 356883 -233463 -512817 -534802 -255719 56043 -194289 -1074028 -1690241 -1236971 -179070
39719 -179070 327437 23332 -261098 -5314 292554 91344 -290785 -279938 -21565 -121350
39709 -121350 -639442 -906388 -379521 641929 1269329 910745 -106260 -802382 -501763
39700 -501763 510333 1361975 1516015 1157476 787338 671679 646166 303852 -511038 -1293416
39690 -1293416 -1280950 -505596 23678 -319922 -728564 -71548 1273147 1769196 903581
39681 903581 -112020 -132273 506934 931881 1092061 1319875 1323798 732794 191869 685496
$$ packed form
39748A723556n64247n28748J4313O33199P81346J51780q47579j342344r05385
39739h84109J0475O49861P43026N99304N65573N69745K75206l59932q92025r20241
39729C56883n90346k79354k1985K79083L11762k50332q79739o16213M53270J057901
39719a79070N06507l04105k84430K55784K97868k01210l82129J0847K58373r9785
39709a21350n18092k66946N26867J021450O27400l58584j017005o96122L00619
39700e01763J012096Q51642J54040l58539l70138j15659k5513l42314q14890p82378
39690a293416J2466P75354N29274l43600m08642O57016J344695M96049q65615
39681I03581j015601k0253O39207M24947J60180K27814L923n91004n40925M93627
$$ plain form
39671 685496 1827571 2019477 639743 -926097 -1053103 68081 946565 887170 572925
39662 572925 632631 715391 438443 339924 981876 1635825 1052639 -478993 -1069573 308797
39652 308797 2318251 2966582 2016874 753879 -6278 -477179 -777107 -537884 215914
39643 215914 838112 988184 952702 820817 206323 -873765 -1663049 -1668606 -1332491 -1244494
39633 -1244494 -1285884 -1055256 -657206 -552994 -923122 -1524063 -1940107 -1845266 -1349366 -1075693
39623 -1075693 -1401982 -1720078 -1178630 -102655 279484 -393210 -1202157 -1506467 -1655030
39614 -1655030 -1744612 -1105306 193448 723770 -294178 -1574203 -1634913 -991076 -1003542
39605 -1003542 -1527194 -1455876 -911463 -970383 -1542800 -1438039 -509077 98722 22597 260497
$$ packed form
39671F85496J142075J91906j379734j565840j27006J121184Q78484n9395l14245
39662E72925N9706Q2760k76948r8519O41952O53949n83186j531632n90580J378370
39652C08797K009454O48331r49708j262995p60157m70901k99928K39223P53798
39643B15914O22198J50072l5482j31885o14494j080088p89284n557L36115Q7997
39633a244494m1390K30628L98050J04212l70128o00941m16044R4841M95900K73673
39623a075693l26289l18096N41448J075975L82139o72694q08947l04310j48563
39614a655030q9582O39306J298754N30322j017948j280025o0710O43837j2466
39605a003542n23652P1318N44413n8920n72417J04761R28962O07799p6125K37900
$$ plain form
39595 260497 1280044 2151291 2131079 1721987 1560369 1504811 1402385 1548205 1792744 1390003
39585 1390003 384177 -18504 811179 1896713 2099758 1540330 831849 3357 -914059
39576 -914059 -1238377 -585771 335366 758659 872397 1008553 811938 154621 -158833 309779
39566 309779 661392 195969 -180259 451981 1115523 454781 -712655 -514484 810702
39557 810702 1197106 125941 -666879 -231037 174034 -449025 -1017503 -299871 946835
39548 946835 1208560 451869 -213703 -283396 -69133 199953 443124 393850 27933 -194967
39538 -194967 -173228 -543927 -1525209 -2206490 -1858049 -1144508 -1047194 -1326975 -1157188 -625041
39528 -625041 -409276 -487249 -369849 -191503 -372115 -601318 -375840 -116016 -420392 -666260
$$ packed form
39595B60497J019547Q71247k0212m09092j61618n5558j02426J45820K44539m02741
39585A390003j005826m02681Q29683J085534K03045n59428p08481q28492r17416
39576i14059l24318O52606R21137M23293J13738J36156j96615o57317l13454M68612
39566C09779L51613m65423l76228O32240O63542o60742j167436J98171J325186
39557H10702L86404j071165p92820M35842M05071o23059n68478P17632J246706
39548I46835K61725p56691o65572o9693K14263K69086K43171m9274l65917k22900
39538a94967K1739l70699r81282o81281L48441P13541R7314k79781J69787N32147
39528f25041K15765p7973J17400J78346j80612k29203K25478K59824l04376k45868
$$ plain form
39518 -666260 68341 1030864 626639 -784025 -991069 688583 2162525 1619395 37352
39509 37352 -616999 -184747 182090 134053 114260 60345 -253886 -134382 1158025 2751729
39499 2751729 2960601 1689753 602552 789194 1630336 2199099 2426063 2386162 1661027
39490 1661027 182786 -1142463 -1416255 -791704 23365 744703 1437334 1977163 2182848
39481 2182848 2122624 1810875 990769 -286144 -1249826 -1153669 -182700 853457 1461131
39472 1461131 1619020 1334254 707961 290236 682378 1729488 2628494 2878702 2637825
39463 2637825 2122647 1263101 168395 -587443 -525665 165706 883147 1182987 917923
39454 917923 170549 -593763 -630236 294802 1330625 1333130 332444 -308907 497987 2177720
$$ packed form
39518f66260P34601R62523m04225j410664k07044J679652J473942n43130j582043
39509C7352o54351M32252L66837m8037j9793n3915l14231J19504J292407J593704
39499B751729K08872j270848j087201J86642Q41142N68763K26964l9901p25135
39490A661027j478241j325249k73792O24551Q15069P21338O92631N39829K05685
39481B182848o0224l11749q20106j276913r63682R6157R70969J036157O07674
39472A461131J57889k84766o26293m17725L92142J047110Q99006K50208k40877
39463B637825n15178q59546j094706p55838O1778O91371P17441K99840k65064
39454I17923p47374p64312l6473R25038J035823K505j000686o41351Q06894J679733
$$ plain form
39444 2177720 3111740 2443599 830396 -514418 -1022957 -906173 -577269 -333396 -388521
39435 -388521 -782222 -1207891 -1213512 -707993 -136173 -24843 -392374 -720239 -574890 -188966
39425 -188966 -220866 -841286 -1324707 -891822 203794 952506 962089 898299 1285817 1577926
39415 1577926 1048390 76121 -344213 -136642 -199280 -838267 -1123207 -258762 1138466
39406 1138466 1783453 1325819 577649 349271 656868 1089837 1454038 1800953 2038104
39397 2038104 1823358 987696 -31646 -473473 -140434 242079 -131093 -1121493 -1839349
39388 -1839349 -1693462 -808566 410101 1519984 1964059 1489471 678239 333306 323174
39379 323174 -91489 -766291 -718579 20195 29567 -1212103 -2067907 -1086943 537729 575370
$$ packed form
39444B177720R34020o68141j613203j344814n08539J16784L28904K43873n5125
39435c88521l93701m25669n621N05519N71820J11330l67531l27865J45349L85924
39425a88966l1900o20420m83421M32885J095616P48712R583o3790L87518K92109
39415A577926n29536r72269m20334K07571o2638o38987k84940Q64445J397228
39406A138466O44987m57634p48170k28378L07597M32969L64201L46915K37151
39397B038104k14746q35662j019342m41827L33039L82513l73172r90400p17856
39388a839349J45887Q84896J218667J109883M44075m74588q11232l44933j0132
39379C23174m14663o74802M7712P38774R372j241670q55804R80964J624672L7641
$$ plain form
39369 575370 -905362 -1750931 -1011985 13535 250612 378243 1153878 1909849 1823846
39360 1823846 1396846 1445684 1613354 1173391 581616 839662 1706330 1910118 1100146 375979
39350 375979 652250 1479987 1899713 1745201 1577295 1709190 1796559 1372896 551426 27289
39340 27289 254463 729294 514958 -405644 -872396 -65076 1252558 1703841 1180937 895497
39330 895497 1595560 2593042 2808039 2093732 1145855 589623 563354 867787 1128200 997130
39320 997130 515775 178801 441899 1252416 2158031 2714478 2721442 2317324 1971663 2087750
39310 2087750 2408877 2141740 997730 -185816 -356898 379490 919665 741676 623006
39301 623006 1389664 2550939 2898757 2165549 1226518 671348 141232 -578589 -801692
$$ packed form
39369E75370j480732q45569P38946J025520K37077J27631P75635P55971q6003
39360A823846m27000M8838J67670m39963n91775K58046Q66668K03788q09972p24167
39350C75979K76271Q27737M19726j54512j67906J31895Q7369m23663q21470n24137
39340B7289K27174M74831k14336r20602m66752Q07320J317634M51283n22904k85440
39330H95497P00063R97482K14997p14307r47877n56232k6269L04433K60413j31070
39320I97130m81355l36974K63098Q10517R05615N56447O964m04118l45661J16087
39310B087750L21127k67137j144010j183546j71082P36388N40175j77989j18670
39301F23006P66658J161275L47818p33208r39031n55170n30116p19821k23103
$$ plain form
39292 -801692 -84981 613417 76877 -1197549 -1442564 -95923 1422760 1784325 1393002
39283 1393002 1263813 1354300 1082329 732030 1051814 1792432 1912231 1223535 674940 762751
39273 762751 700280 -317133 -1757699 -2309426 -1468204 -98313 494264 -177902 -1398286
39264 -1398286 -2059900 -1842811 -1372200 -1179103 -1047484 -713880 -498559 -520824 22157 1681663
39254 1681663 3341579 3351771 1886233 679721 413981 67076 -822250 -1145560 -329828
39245 -329828 338875 -208868 -939149 -460012 600417 722855 32495 -177243 258522
39236 258522 503910 616060 1248291 1787583 1006581 -457260 -597408 686896 1193533
39227 1193533 -27582 -1118352 -554076 414587 65125 -994511 -1268216 -1053423 -1512253
$$ packed form
39292h01692P16711O98398n36540j274426k45015J346641J518683L61565l91323
39283A393002j29189R0487k71971l50299L19784P40618J19799o88696n48595Q7811
39273G62751o2471j017413j440566n51727Q41222J369891N92577o72166j220384
39264a398286o61614K17089M70611J93097J31619L33604K15321k2265N42981J659506
39254A681663J659916J0192j465538j206512k65740l46905q89326l23310Q15732
39245c29828O68703n47743p30281M79137J060429J22438o90360k09738M35765
39236B58522K45388J12150O32231N39292p81002j463841j40148J284304N06637
39227A193533j221115j090770N64276R68663l49462j059636k73705K14793m58830
$$ plain form
39218 -1512253 -2211019 -1881744 -927524 -882559 -1713444 -1864511 -944488 -235102 -288114 -68618
39208 -68618 936238 1608533 1072398 181354 148521 825131 1267384 1122216 643083 86003
39198 86003 -237622 -18727 397823 198130 -564507 -715160 357073 1680236 2088880
39189 2088880 1733216 1360609 967510 226109 -414142 -221175 571642 1021125 752408
39180 752408 152889 -427480 -850958 -850210 -342798 156340 238444 434022 1451473 2814959
39170 2814959 3273928 2543808 1657576 1432082 1464886 977867 -13936 -796011 -889680 -622305
39160 -622305 -797229 -1674568 -2276767 -1288387 1019566 2542486 1769151 -254285 -1408604
39151 -1408604 -1285563 -1100728 -1283944 -968035 -5788 371480 -353667 -807449 240831
$$ packed form
39218a512253o98766L29275R54220M4965q30885j51067R20023P09386n3012K19496
39208f8618J004856O72295n36135q91044l2833O76610M42253j45168m79133n57080
39198H6003l23625K18895M16550j99693p62637j50653J072233J323163M08644
39189B088880l55664l72607l93099p41401o40251J92967P92817M49483k68717
39180G52408n99519n80369m23478P48N07412M99138Q2104J95578J017451J363486
39170B814959M58969p30120q86232k25494L2804m87019r91803p82075r3669K67375
39160f22305j74924q77339o02199R88380K307953J522920p73335k023436j154319
39151a408604J23041J84835j83216L15909R62247L77268p25147m53782J048280
$$ plain form
39142 240831 1838973 2170280 1178378 496571 1034292 1909134 1957380 1353805 1222379 2037404
39132 2037404 2904355 2560695 963709 -462436 -431848 665525 1366379 1024339 289547
39123 289547 -235689 -777839 -1518644 -1949079 -1717818 -1338089 -1338936 -1359500 -855571 -152712
39113 -152712 93949 135578 872492 2394225 3563780 3264710 1626564 -151073 -981509
39104 -981509 -834616 -535348 -571798 -348233 880296 2497124 2850236 1347541 -651165
39095 -651165 -1520945 -1149853 -448962 78729 447337 535617 282218 110971 321678 450314
39085 450314 8379 -614637 -816231 -810996 -1035626 -1077266 -357969 556658 639541 80041
39075 80041 -128128 -44140 -574549 -1376734 -845588 1225172 2714904 1933425 -95278
$$ packed form
39142B40831J598142L31307r91902o81807N37721Q74842M8246o03575j31426Q15025
39132B037404Q66951l43660j596986j426145L0588J097373P00854l42040p34792
39123B89547n25236n42150p40805m30435K31261L79729q47k0564N03929P02859
39113a52712K46661M1629P36914J521733J169555k99070j638146j777637q30436
39104i81509J46893K99268l6450K23565J228529J616828L53112j502695j998706
39095f51165q69780L71092P00891N27691L68608Q8280k53399j71247K10707J28636
39085D50314m41935o23016k01594N235k24630m1640P19297R14627Q2883n59500
39075H0041k08169Q3988n30409q02185N31146K070760J489732p81479k028703
$$ plain form
39066 -95278 -1316986 -1436702 -1555124 -1863238 -1459172 -284323 391422 -187347 -1123940
39057 -1123940 -1196737 -509024 -64399 -164443 -97221 558543 1077404 527640 -786640 -1500044
39047 -1500044 -870504 317724 840849 485411 -86171 -452647 -695299 -791064 -537374
39038 -537374 -72660 190825 170604 77705 -117240 -499999 -643501 -104846 556764 311595
39028 311595 -640312 -847177 307466 1626437 1860911 1402910 1313449 1522327 1136533
39019 1136533 68732 -757654 -708098 -95412 426954 502523 169963 -176796 -38358 603917
39009 603917 1181146 1326989 1356265 1569810 1648612 1306000 940865 893385 634976 -336221
38999 -336221 -1251868 -889387 539532 1473893 1038971 -39640 -704320 -747943 -451110
$$ packed form
39066i5278j221708j19716j18422l08114M04066J174849O75745n78769r36593
39057a123940p2797O87713M44625j00044O7222O55764N18861n49764j314280p13404
39047a500044O29540J188228N23125l55438n71582l66476k42652r5765K53690
39038e37374M64714K63485k0221r2899j94945l82759j43502N38655O61610k45169
39028C11595r51907k06865J154643J318971K34474m58001q9461K08878l85794
39019A136533j067801q26386M9556O12686N22366P5569l32560l46759J38438O42275
39009F03917N77229J45843K9276K13545P8802l42612l65135m7480k58409r71197
38999c36221r15647L62481J428919R34361m34922j078611o64680m3623K96833
$$ plain form
38990 -451110 40045 542233 741106 655155 628421 625323 181055 -696674 -1288666 -1172255
38980 -1172255 -787395 -604500 -412388 74191 544792 638187 625280 885073 1111796 749067
38970 749067 -34328 -466519 -171882 471731 896743 843961 409125 -2367 138764 976969
38960 976969 2009021 2576219 2461218 1800375 758570 -335791 -899292 -682463 -229803
38951 -229803 -227586 -595072 -769454 -661689 -633922 -642777 -199527 710982 1382524 1281481
38941 1281481 623715 -112207 -664953 -799411 -283942 619525 1212578 1257178 1277463 1617725
38931 1617725 1808391 1357990 603073 168980 89160 136637 551890 1590835 2654349
38922 2654349 2793569 1991699 1097622 531080 -49547 -716294 -865165 -174416 802562
$$ packed form
38990d51110M91155N02188J98873q5951k6734l098m44268q77729n91992J16411
38980a172255L84860J82895J92112M86579M70601R3395j2907K59793K26723l62729
38970G49067p83395m32191K94637O43613M25012n2782m34836m11492J41131Q38205
38960I76969J032052N67198j15001o60843j041805j094361n63501K16829M52660
38951b29803K217l67486j74382J07765K7767q855M43250R10509O71542j01043
38941A281481o57766p35922n52746j34458N15469R03467N93053M4600K0285L40262
38931A617725J90666m50401p54917m34093p9820M7477M15253J038945J063514
38922B654349J39220q01870q94077n66542n80627o66747j48871O90749R76978
$$ plain form
38913 802562 1393659 1526782 1368067 923864 418631 402590 948460 1305951 917452 255390
38903 255390 44494 165083 65942 -142614 131501 874837 1378840 1219012 632041 -93020
38893 -93020 -933774 -1757235 -2224310 -2228884 -1966460 -1482752 -640385 365971 967282 886040
38883 886040 453552 120384 39257 263730 909061 1836518 2496773 2404999 1645617 736357
38873 736357 107218 -178948 -294480 -337396 -183789 255171 658681 519248 -79629 -318966
38863 -318966 322700 1238979 1438279 871901 398279 539901 914288 917876 422244 -272837
38853 -272837 -749091 -746820 -501246 -638665 -1326463 -1846878 -1580521 -995285 -871126 -981138
38843 -981138 -606355 -32704 -221334 -1076617 -1464707 -1091795 -904795 -1323588 -1593282 -1364883
$$ packed form
38913H02562N91097J33123j58715m44203n05233j6041N45870L57491l88499o62062
38903B55390k10896J20589r9141k08556K74115P43336N04003j59828n86971p25061
38893i3020q40754q23461m67075m574K62424M83708Q42367J006356O01311q1242
38883H86040m32488l33168q1127K24473O45331R27457O60255r1774p59382r09260
38873G36357o29139k86166j15532m2916J53607M38960M03510j39433n98877k39337
38863c18966O41666R16279J99300n66378m73622J41622L74387L588m95632o95081
38853b72837m76254K271K45574j37419o87798n20415K66357N85236J24159j10012
38843i81138L74783N73651j88630q55283l88090L72912J87000m18793k69694K28399
$$ plain form
38833 -1364883 -1318261 -1522960 -876520 787552 1690440 616296 -996888 -1082929 180114
38824 180114 1289213 2056184 3229522 4317295 4140230 3202900 3175212 4007341 3842706
38815 3842706 2114445 521635 307971 634209 510215 395179 747189 751792 -98553
38806 -98553 -641173 155334 1196303 770636 -772891 -1603331 -1177410 -702167 -934931
38797 -934931 -1132335 -503763 536497 1077691 849359 196629 -528713 -1177590 -1700909
38788 -1700909 -2023123 -1897390 -1037360 359115 1507878 1864216 1756774 1731035 1638629
38779 1638629 1056512 303739 149050 550048 588534 -140511 -878286 -810802 -186029 162387
38769 162387 -30200 -306521 -283438 -135904 -252140 -638429 -786620 -210624 828513 1344119
$$ packed form
38833a364883M6622k04699O46440J664072R02888j074144j613184q6041J263043
38824A80114J109099P66971J173338J087773j77065r37330k7688Q32129j64635
38815C842706j728261j592810k13664L26238j23994j15036L52010M603q50345
38806i8553n42620P96507J040969m25667j543527q30440M25921M75243k32764
38797i34931j97404O28572J040260N41194k28332o52730p25342o48877n23319
38788a700909l22214J25733Q60030J396475J148763L56338j07442k5739r2406
38779A638629n82117p52773j54689M00998L8486p29045p37775O7484O24773L48416
38769A62387j92587k76321K3083J47534j16236l86289j48191N75996J039137N15606
$$ plain form
38759 1344119 695274 -471318 -825750 13190 938229 726633 -438902 -1269214 -1007941
38750 -1007941 -259435 -64937 -550302 -878812 -473861 167249 185957 -382816 -618739 -9614
38740 -9614 873925 1298173 1363514 1503805 1484457 780022 -241641 -522439 134549 652193
38730 652193 231139 -491645 -431734 430543 1228521 1452964 1305623 1114669 1052120 1171703
38720 1171703 1135022 283925 -1271881 -2089301 -995175 975230 1548776 228824 -1049392
38711 -1049392 -718777 413633 884743 991092 1999515 3693321 4413655 3478892 2085014
38702 2085014 1488780 1490234 1243092 642004 203537 99746 -55322 -643176 -1583180 -2295206
38692 -2295206 -2085062 -901071 300554 435975 -385197 -956845 -532899 301895 581790
$$ packed form
38759A344119o48845j166592l54432Q38940R25039k11596j165535q30312K61273
38750a007941P48506J94498m85365l28510M04951O41110J8708n68773k35923O09125
38740i614Q83539M24248O5341J40291j9348p04435j021663k80798O56988N17644
38730F52193m21054p22784N9911Q62277P97978K24443j47341j90954o2549J19583
38720A171703l6681q51097j555806q17420J094126J970405N73546j319952j278216
38711a049392L30615J132410M71110J06349J008423J693806P20334r34763j393878
38702B085014n96234J454k47142o01088m38467j03791j55068n87854r40004p12026
38692b295206K10144J183991J201625J35421q21172n71648M23946Q34794K79895
$$ plain form
38683 581790 220499 -80512 214514 1013847 1833644 2194304 1979961 1593814 1568521 1950338
38673 1950338 2296336 2235308 1710473 821909 -76791 -317436 344938 1063196 824638 -11944
38663 -11944 -127373 757674 1479972 1243399 500386 -360730 -1660296 -3012421 -2919689 -1039724
38653 -1039724 600264 244849 -966191 -864252 307657 570931 -258718 -219158 1510693
38644 1510693 3274244 3459791 2409863 1077886 -431011 -1971672 -2510865 -1401609
38636 -1401609 451512 1692331 2012790 1829062 1348786 767793 603044 1013515 1424352
38627 1424352 1457462 1516294 1862940 1973784 1512846 1070000 1142511 1274455 1100650 1299501
38617 1299501 2366448 3283980 2794674 1400774 601971 511278 -143867 -1659216 -2637793
$$ packed form
38683E81790l61291l01011K95026P99333Q19797L60660k14343l86147k5293L81817
38673A950338L45998o1028n24835q88564q98700k40645O62374P18258k38558q36582
38663a1944j15429Q85047P22298k36573p43013q61116j299566j352125R2732J879965
38653a039724J639988l55415j211040J01939J171909K63274q29649L9560J729851
38644A510693J763551J85547j049928j331977j508897j540661n39193J109256
38636a401609J853121J240819L20459j83728m80276n80993j64749M10471M10837
38627A424352L3110N8832L46646J10844m60938m42846P2511J31944j73805J98851
38617A299501J066947R17532m89306j393900p98803r0693o55145j515349r78577
$$ plain form
38608 -2637793 -2081053 -826391 -190023 -236917 -251860 -144264 -370273 -818225 -754670 47636
38598 47636 857168 986490 809986 1284905 2541068 3472732 3027616 1559040 402160
38589 402160 263650 648202 888108 980254 1107246 1076986 808975 789440 1328033 1788419
38579 1788419 1364383 367843 -104147 291535 780745 733682 463637 453829 477830 5181
38569 5181 -906587 -1610312 -1580332 -778741 535464 1994945 3122435 3441632 2780317 1466919
38559 1466919 189872 -410091 -161767 488090 773990 233285 -810764 -1412107 -841614
38550 -841614 621190 1849609 1952079 1118319 303587 218389 754868 1217587 935806
38541 935806 -128423 -1133840 -974952 524070 2256699 2996778 2606001 1737216 870815
$$ packed form
38608b637793N56740J254662O36368m6894j4943J07596k26009m47952O3555Q02306
38598D7636Q09532J29322j76504M74919J256163R31664m45116j468576j156880
38589D02160j38510L84552K39906R2146J26992l0260k68011j9535N38593M60386
38579A788419m24036r96540m71990L95682M89210m7063k70045r808K4001m72649
38569E181r11768p03725K9980Q01591J314205J459481J127490L19197o61315j313398
38559A466919j277047n99963K48324O49857K85900n40705j044049o01343N70493
38550h41614J462804J228419J02470q33760q14732q5198N36479M62719k81781
38541I35806j064229j005417J58888J499022J732629P40079l90777q68785q66401
$$ plain form
38532 870815 295464 474769 1402933 1949710 1079969 -398502 -656351 523630 1438261
38523 1438261 1118067 631082 982283 1372236 833161 239397 1010047 2636785 3230498
38514 3230498 2170093 678905 -101217 -262100 -370194 -734533 -1480134 -2362909 -2557201
38505 -2557201 -1573250 -241446 227554 -38928 42501 588700 607705 -132188 -552264 3959
38495 3959 785890 943862 672197 422208 54010 -486589 -615472 -84591 299267 -177027
38485 -177027 -935920 -986610 -456498 -255312 -548056 -567842 98260 878149 1030470 551815
38475 551815 88768 206587 808408 1227194 1054699 830279 1417381 2614229 3121157
38466 3121157 2272445 1034164 645547 995878 1218724 1228583 1468834 1547866 599979 -943020
$$ packed form
38532H70815n75351J79305R28164N46777q69741j478471k57849J179981R14631
38523A438261l20194m86985L51201L89953n39075n93764P70650J626738N93713
38514C230498j060405j491188p80122j60883j08094l64339p45601q82775j94292
38505b557201R83951J331804M69000k66482Q1429N46199J9005p39893m20076N56223
38495C959P81931J57972k71665k49989l68198n40599j28883N30881L83858m76294
38485a77027p58893n0690N30112K01186k92744j9786O66102P79889J52321m78655
38475E51815m63047J17819O01821M18786j72495k24420N87102J196848N06928
38466C121157q48712j238281l88617L50331K22846R859K40251P9032r47887j542999
$$ plain form
38456 -943020 -1421306 -274484 991977 918059 24193 -382571 -347389 -803680 -1545294 -1325961
38446 -1325961 -27382 843664 372637 -343214 121974 1380003 1887981 1211615 468206
38437 468206 648919 1517167 2278877 2493197 2060579 998582 -381183 -1490720 -1962379
38428 -1962379 -1875334 -1406615 -628846 256752 909694 1223193 1345298 1256401 789528 193746
38418 193746 127090 783273 1455000 1313662 334501 -793963 -1374857 -1120141 -233449 655358
38408 655358 936723 643265 389614 577382 981093 1209585 1168854 945486 665315 593545
38398 593545 913216 1288859 1151500 511189 -75414 -397812 -749625 -1108570 -1010686 -468789
38388 -468789 -142372 -319944 -654136 -1134986 -2124781 -3010906 -2297360 85134 1984375
$$ packed form
38456i43020m78286J146822J266461p3918q93866m06764L5182m56291p41614K19333
38446a325961J298579Q71046m71027p15851M65188J258029N07978o76366p43409
38437D68206J80713Q68248P61710K14320m32618j061997j379765j109537m71659
38428a962379Q7045M68719P77769Q85598O52942L13499J22105q8897m66873n95782
38418A93746o6656O56183O71727j41338r79161j128464n80894K54716Q86692Q88807
38408F55358K81365k93458k53651J87768M03711K28492m0731k23368k80171p1770
38398E93545L19671L75643j37359o40311n86603l22398l51813l58945R7884N41897
38388d68789L26417j77572l34192m80850r89795q86125P13546K382494J899241
$$ plain form
38379 1984375 1784682 700489 786517 1747239 1643455 149412 -967250 -576536 443165
38370 443165 872581 675828 385527 152358 -63747 -165814 -139693 -48268 206766 559905
38360 559905 506704 -88936 -339933 490790 1555934 1390936 61401 -972999 -1009813
38351 -1009813 -759454 -878118 -1229152 -1679174 -2242763 -2283653 -979341 1139851 2434650
38342 2434650 2231265 1408408 744414 94725 -517137 -504655 122176 583518 701919 1009298
38332 1009298 1208141 317228 -1138434 -1150370 572419 1503946 -82461 -2240113 -2064597
38323 -2064597 98133 1408327 705630 -375611 -333549 217401 -18447 -1017260 -1605122
38314 -1605122 -997364 289700 947061 353872 -475986 4352 1713452 2806031 2117880
$$ packed form
38379A984375j99693j084193Q6028R60722j03784j494043j116662L90714J019701
38370D43165M29416j96753k90301k33169k16105j02067K6121R1425K55034L53139
38360E59905n3201n95640k50997Q30723J065144j64998j329535j034400l6814
38351a009813K50359j18664l51034m50022n63589m0890J304312K119192J294799
38342B434650k03385q22857o63994o49689o11862J2482O26831M61342J18401L07379
38332A009298J98843q90913j455662j1936J722789R31527j586407k157652J75516
38323b064597K162730J310194p02697j081241M2062N50950k35848r98813n87862
38314a605122O07758J287064O57361n93189q29858M80338J709100J092579o88151
$$ plain form
38305 2117880 689314 121612 458112 702261 530334 269782 -179884 -1138658 -2202159
38296 -2202159 -2567929 -2078216 -1164172 -154630 634997 692232 10886 -559199 -461618 -267155
38286 -267155 -544926 -761203 -342682 79883 -195866 -411306 473788 1705209 1619169 309361
38276 309361 -380219 448894 1706893 2176006 1930567 1585272 1445408 1748501 2554594
38267 2554594 3090288 2406261 1046932 828634 2394469 4090842 3996287 2212942 396465
38258 396465 -344041 -304654 -304158 -627468 -864164 -516628 320160 988934 1043611 700901
38248 700901 337778 1618 -235355 -22437 612622 943820 556037 48863 -41144 -274880
38238 -274880 -1222681 -2057352 -1566042 -74487 1047072 1423824 1726631 1972891 1464134
$$ packed form
38305B117880j428566n67702L36500K44149j71927k60552m49666r58774j063501
38296b202159l65770M89713R14044J009542P89627N7235o81346n70085R7581J94463
38286b67155k77771k16277M18521M22565k75749k15440Q85094J231421q6040j309808
38276C09361o89580Q29113J257999M69113k45439l45295j39864L03093Q06093
38267B554594N35694o84027j359329k18298J565835J696373r4555j783345j816477
38258C96465p40506L9387M96l23310k36696L47536Q36788O68774N4677l42710
38248G00901l63123l36160k36973K12918O35059L31198l87783n07174r0007k33736
38238b74880r47801q34671M91310J491555J121559L76752L02807K46260n08757
$$ plain form
38229 1464134 426448 45392 611462 1127445 1045944 942857 1146442 1175604 964189 1189752
38219 1189752 1858368 1955304 1106640 284748 243647 496548 442928 268619 141352 -215922
38209 -215922 -570879 -147170 854150 1152494 481081 174866 809685 1002096 -237720
38200 -237720 -1663665 -1810866 -1292721 -1340422 -1466453 -612449 510366 451292 -393088 -474373
38190 -474373 151831 64582 -792719 -976419 -205339 155650 -353650 -511125 124263 152327
38180 152327 -1154346 -2195554 -1380658 366541 1084424 669350 550509 1139766 1405335
38171 1405335 846697 267507 278817 320207 -266966 -1120589 -1493846 -1395545 -1346300 -1320190
38161 -1320190 -756695 292179 780231 -38040 -1314822 -1344445 351152 2326162 2928622
$$ packed form
38229A464134j037686l81056N66070N15983q1501j03087K03585K9162k11415K25563
38219A189752O68616R6936q48664q21892m1101K52901n3620j74309j27267l57274
38209b15922l54957M23709J001320K98344o71413l06215O34819J92411j239816
38200b37720j425945j47201N18145m7701j26031Q54004J122815n9074q44380q1285
38190d74373O26204q7249q57301j83700P71080L60989n09300j57475O35388K8064
38180A52327j306673j041208Q14896J747199P17883m15074j18841N89257K65569
38171A405335n58638n79190J1310M1390n87173q53623l73257R8301M9245K6110
38161a320190N63495J048874M88052q18271j276782k9623J695597J975010O02460
$$ plain form
38152 2928622 2189054 1475590 1635182 2155897 2076197 1086099 -348415 -1428306 -1469085
38143 -1469085 -385776 1083422 2002991 2211100 2298453 2571138 2591172 2004285 1273939
38134 1273939 1101120 1446879 1647291 1316991 654837 -30933 -585260 -798284 -468655
38125 -468655 153400 421950 62713 -437555 -495864 -206064 -100566 -355679 -632544 -583982
38115 -583982 -139316 592413 1298373 1515443 1241469 1292741 2265109 3231352 2585285 467125
38105 467125 -901255 -53229 1704021 2228448 1486490 1029529 1249687 1081658 294691
38096 294691 79841 921067 1638264 1274584 421168 -157397 -751683 -1553526 -1689099 -696705
38086 -696705 251651 85729 -264560 590080 1904198 1743408 136507 -799007 -4193
$$ packed form
38152B928622p39568p13464J59592N20715p9700r90098j434514j079891m0779
38143a469085J083309J469198R19569K08109Q7353K72685K0034n86887p30346
38134A273939j72819L45759K00412l30300o62154o85770n54327k13024L29629
38125d68655O22055K68550l59237n00268n8309K89800J05498k55113k76865M8562
38115e83982M44666P31729P05960K17070k73974N1272R72368R66243o46067k118160
38105D67125j368380Q48026J757250N24427p41958m56961K20158j68029p86967
38096B94691k14850Q41226P17197l63680q53416n78565n94286q01843j35573R92394
38086f96705R48356j65922l50289Q54640J314118j60790j606901r35514P94814
$$ plain form
38077 -4193 1161876 1189968 376470 -216009 -357158 -330483 -116870 209644 153528 -285339
38067 -285339 -158680 1069031 2376551 2380227 1217006 282437 380789 1059571 1647170 2029893
38057 2029893 2277251 2252676 1902398 1459202 1088387 650479 23901 -611703 -1044193 -1365334
38047 -1365334 -1734550 -1887100 -1257743 216532 1695842 2238483 1917975 1635807 1752467
38038 1752467 1591780 713919 -51783 280687 1159177 1060025 -293386 -1470294 -1392790
38029 -1392790 -714842 -515065 -602662 -61108 1173357 2287417 2784566 2778856 2351281 1565965
38019 1565965 1031284 1470780 2599464 3275569 3012281 2578189 2773520 3332226 3519410
38010 3519410 3232309 2910633 2734179 2513349 2178024 1851072 1543638 1219465 1062811
$$ packed form
38077d193J166069K8092q13498n92479j41149K6675K13613L26514n6116m38867
38067b85339J26659J227711J307520L676j163221r34569R8352O78782N87599L82723
38057B029893K47358k4575l50278m43196l70815m37908o26578o35604m32490l21141
38047a365334l69216j52550O29357J474275J479310N42641l20508k82168J16660
38038A752467j60687q77861p65702L32470Q78490r9152j353411j176908P7504
38029a392790O77948J99777q7597N41554J234465J114060M97149n710m27575p85316
38019A565965n34681M39496J128684O76105k63288m34092J95331N58706J87184
38010C519410k87101l21676j76454k20830l35325l26952l07434l24173j56654
$$ plain form
38001 1062811 1239838 1458457 1239133 647081 287273 461238 782622 839838 816546 1112302
37991 1112302 1657626 2020364 2020911 1833627 1566774 1159500 699860 440266 406656 359347
37981 359347 277612 498332 1108277 1519755 1058744 -126106 -1085410 -1022192 -26387 1115701
37971 1115701 1649839 1399791 779490 354047 374307 737494 1271425 1796589 1961408 1499799
37961 1499799 844170 937432 1978906 2845227 2447051 1286504 732143 908986 511742
37952 511742 -978487 -2116238 -1392465 535060 1641592 1148168 157226 -243786 -286904
37943 -286904 -538045 -649997 29277 1092429 1279078 129853 -1243691 -1410661 -300981
37934 -300981 805761 861393 101043 -647196 -1123865 -1508552 -1511552 -608000 695621 933732
$$ packed form
38001A062811J77027K18619k19324n92052l59808J73965L21384N7216k3292K95756
37991A112302N45324L62738N47j87284k66853m07274m59640k59594l3610m7309
37981C59347q1735K20720O09945M11478m61011j184850r59304O3218R95805J142088
37971A115701N34138k50048o20301m25443K0260L63187N33931N25164J64819m61609
37961A499799o55629R3262J041474Q66321l98176j160547n54361J76843l97244
37952E11742j490229j137751P23773J927525J106532m93424r90942m01012m3118
37943b86904k51141j11952O79274J063152J86649j149225j373544j66970J109680
37934c00981J106742N5632p60350p48239m76669l84687l000R03552J303621K38111
$$ plain form
37924 933732 -328599 -1492040 -900726 853700 1845056 1575917 1290691 1601408 1582390
37915 1582390 764637 311241 1099169 2039177 1785972 1038581 1307449 2026816 1037430
37906 1037430 -1948066 -4390830 -4189205 -2327078 -1225818 -1616756 -2244630 -1916646 -625699
37897 -625699 984377 2194506 2390741 1557815 596098 498988 1249611 2031409 2324311
37888 2324311 2202305 1795597 1201822 792394 826594 841178 269438 -372383 38721 1371299
37878 1371299 2027800 1205929 297970 1004714 2788225 3480209 2151534 110102 -1017804
37869 -1017804 -982250 -329944 691542 1849275 2389465 1840819 959499 868382 1414143
37860 1414143 1378123 365163 -556980 -457869 158671 300559 -902 16185 463294 644928
$$ packed form
37924I33732j262331j163441N91314J754426R91356k69139k85226L10717j9018
37915A582390q17753m53396P87928R40008k53205p47391K68868P19367r89386
37906A037430k985496k442764K01625J862127J101260l90938o27874L27984J290947
37897f25699J610076J210129J96235q32926r61717r7110P50623P81798K92902
37888B324311j22006m06708n93775m09428L4200J4584n71740o41821M11104J332578
37878A371299O56501q21871r07959P06744J783511O91984j328675k041432j127906
37869a017804L5554O52306J021486J157733N40190n48646q81320r1117N45761
37860A414143l6020j012960r22143R9111O16540J41888l01461J7087M47109J81634
$$ plain form
37850 644928 199374 -406784 -638449 -534696 -427499 -471453 -582204 -510678 7660 831749
37840 831749 1310914 1104728 870373 1378457 2105711 1738750 194378 -1013989 -866596
37831 -866596 -166838 -60726 -287511 39268 724873 846095 339290 -48236 -145224 -412014
37821 -412014 -687126 -220419 838306 1269798 580831 -144246 163765 1054696 1443530
37812 1443530 1269780 1353762 2003631 2632045 2645557 2093099 1469436 1266301 1584739 1906608
37802 1906608 1540332 602208 96937 525267 937445 194769 -1175879 -1476113 -218635
37793 -218635 1120657 1181144 540310 630119 1552868 2116911 1801988 1454151 1734630 1945739
37783 1945739 1146076 -230583 -816702 -155433 779965 986225 570117 194630 49674
$$ packed form
37850F44928m45554o06158k31665J03753J07197m3954j10751P1526N18338Q24089
37840H31749M79165k06186k34355N08084P27254l66961j544372j208367J47393
37831h66596O99758J06112k26785L26779O85605J21222n06805l87526r6988k66790
37821d12014k75112M66707J058725M31492o88967p25077L08011Q90931L88834
37812A443530j73750Q3982O49869O28414J3512n52458o23663k03135L18438L21869
37802A906608l66276r38124n05271M28330M12178p42676j370648l00234J257478
37793b18635J339292O0487o40834Q9809R22749N64043l14923l47837K80479K11109
37783A945739p99663j376659n86119O61269R35398K06260m16108l75487j44956
$$ plain form
37774 49674 -83968 -124251 327567 1304029 2197850 2321631 1611583 727271 464661 999332
37764 999332 1720304 1939794 1686746 1525351 1666335 1729786 1486139 1295582 1494204 1769764
37754 1769764 1565385 845727 114055 -125174 328369 1321742 2348389 2896472 3016650
37745 3016650 3167562 3321449 2829298 1547361 402757 199564 464141 278215 -233363
37736 -233363 -197919 518756 1112942 1060689 677707 471004 664427 1296202 2068622 2254931
37726 2254931 1556829 856120 1159939 1968897 1855151 659987 -215781 -10075 281319
37717 281319 -340072 -1186228 -931796 450460 1825830 2470867 2551155 2311227 1713726
37708 1713726 918829 434634 553710 948166 994217 441504 -253378 -311167 544126 1741023
$$ packed form
37774D9674j33642m0283M51818R76462Q93821J23781p10048q84312k62610N34671
37764I99332P20972K19490k53048j61395J40984O3451k43647j90557J98622K75560
37754A769764k04379p19658p31672k39229M53543R93373J026647N48083J20178
37745C016650J50912J53887m92151j281937j144604k03193K64577j85926n11578
37736b33363L5444P16675N94186n2253l82982k06703J93423O31775P72420J86309
37726B254931o98102p00709L03819Q08958j13746j195164q75768K05706K91394
37717B81319o21391q46156K54432J382256J375370O45037Q0288k39928n97501
37708A713726p94897m84195J19076L94456M6051n52713o94882n7789Q55293J196897
$$ plain form
37698 1741023 2490414 2537263 2044033 1125215 29253 -566338 -196811 596266 838998
37689 838998 402630 40572 327968 1264777 2605021 3695309 3420560 1522109 -376414
37680 -376414 -513363 500523 664260 -55851 385115 2397841 3397100 1453039 -1735330
37671 -1735330 -3197541 -2431317 -1017839 138830 1216277 2072184 2369333 2476291 2594416
37662 2594416 1736954 -655658 -2836104 -2546217 -272201 1371612 1307524 919361 1275410
37653 1275410 1639707 1275174 781575 827924 1107500 1336593 1908389 2774071 2974407 2148432
37643 2148432 1345985 1412464 1595532 789728 -640882 -1363059 -890788 64111 772716
37634 772716 1194618 1564912 1866080 1852513 1461712 1162615 1651814 2891002 3786334 3428106
$$ packed form
37698A741023P49391M6849m93230r18818j095962n95591L69527P93077K42732
37689H38998m36368l62058K87396R36809J340244J090288k74749j898451j898523
37680c76414j36949J013886J63737p20111M40966K012726R99259j944061l188369
37671a735330j462211P66224J413478J156669J077447Q55907K97149J06958J18125
37662B594416q57462k392612k180446K89887K274016J643813o4088l88163L56049
37653A275410L64297l64533m93599M6349K79576K29093N71796Q65682K00336q25975
37643B148432q02447O6479J83068q05804j430610p22177M72271R54899P08605
37634G72716M21902L70294L01168j3567l90801k99097M89199J239188Q95332l58228
$$ plain form
37624 3428106 2321206 1570224 1206752 496398 -303623 -36926 1261390 1955479 1146262
37615 1146262 -13772 -230556 32433 -279793 -875163 -745049 38482 604312 894833
37606 894833 1600657 2705678 3388170 3345633 3101304 2961954 2687070 2254566 1989186 1828662
37596 1828662 1385884 852770 883303 1388571 1460853 857179 555984 1251981 2179615 2226407
37586 2226407 1559907 1239562 1606675 2005478 2002578 2018339 2561018 3427122 3917485 3511959
37576 3511959 2214300 551340 -668352 -905015 -352211 309236 613868 544636 180737
37567 180737 -416153 -876061 -587269 570768 1835880 2227425 1487034 216980 -695442
37558 -695442 -647328 352598 1608514 2193373 1802772 1082014 940562 1669327 2788678
$$ packed form
37624C428106j106900p50982l63472p10354q00021K66697J298316O94089q09217
37615A146262j160034k16784K62989l12226n95370J30114P83531N65830K90521
37606H94833P05824J105021O82492m2537k44329j39350k74884m32504k65380j60524
37596A828662m42778n33114L0533N05268P2282o03674l01195O95997R27634M6792
37586B226407o66500l20345L67113L98803k900J5761N42679Q66104M90363m05526
37576C511959j297659j662960j219692k36663N52804O61447L04632o9232l63899
37567A80737n96890m59908K88792J158037J265112L91545p40391j270054r12422
37558f95442M8114R99926J255916N84859l90601p20758j41452P28765J119351
$$ plain form
37549 2788678 3474513 3068687 1633864 195998 -95310 682115 1336655 1362274 1735295
37540 1735295 3183973 4566241 4199336 2303280 784476 762702 1562191 2094026 1986500
37531 1986500 1296529 352351 21327 894715 2051149 1954259 786372 394412 1511450
37522 1511450 2648810 2463821 1637070 1381386 1536442 1409017 1301559 1816624 2551424
37513 2551424 2784548 2672824 2578731 2070466 880207 28020 562988 1832937 2391679
37504 2391679 2022815 1484521 899903 -32007 -735798 -357738 585470 745344 5922
37495 5922 -458851 -74525 615422 1184189 1606788 1433128 251713 -1000550 -791021 755840
37485 755840 1860082 1575192 797682 506023 519797 502124 774490 1457717 1936006 1792547
$$ packed form
37549B788678O85835m05826j434823j437866k91308P77425O54540K5619L73021
37540A735295J448678J382268l66905j896056j518804k1774P99489N31835j07526
37531A986500o89971r44178l31024Q73388J156434r6890j167887l91960J117038
37522A511450J137360j84989q26751k55684J55056j27425j07458N15065P34800
37513B551424K33124j11724r4093n08265j190259q52187N34968J269949N58742
37504B391679l68864n38294n84618r31910p03791L78060R43208J59874p39422
37495E922m64773L84326O89947N68767M22599j73660j181415j252263K09529J546861
37485G55840J104242k84890p77510k91659J3774j7673K72366O83227M78289j43459
$$ plain form
37475 1792547 1358270 944024 485322 216271 618401 1406086 1669074 1314560 1223558 1703785
37465 1703785 2043857 1941942 2013312 2383441 2179537 1140354 442266 1036320 2205047
37456 2205047 2621728 1975323 855588 -91724 -292366 505572 1501096 1383275 229036
37447 229036 -262260 846201 2330510 2742105 2517508 2859928 3493979 3121837 1683706
37438 1683706 665326 1076956 2186549 2529514 1603355 377347 314023 1810589 3609756
37429 3609756 4103431 3147143 1986901 1500577 1442479 1493437 1905492 2706134 3317086 3474852
37419 3474852 3593982 3785527 3545538 2880072 2596084 2900953 2923868 2328051 2110259 2875367
37409 2875367 3569596 3083212 2036594 1728501 2235610 2833315 3455724 4349711 4943395
$$ packed form
37475A792547m34277m14246m58702k69051M02130P87685K62988l54514r1002M80227
37465A703785L40072j01915P1370L70129k03904j039183o98088N94054J168727
37456B205047M16681o46405j119735r47312k00642P97938R95524j17821j154239
37447B29036m91296J108461J484309M11595k24597L42420O34051l72142j438131
37438A683706j018380M11630J109593L42965r26159j226008o3324J496566J799167
37429C609756M93675r56288j160242m86324n8098N0958M12055Q00642O10952J57766
37419C474852J19130J91545k39989o65466k83988L04869K2915n95817k17792P65108
37409B875367O94229m86384j046618l08093N07109N97705O22409Q93987N93684
$$ plain form
37400 4943395 4489023 3423771 2829818 2892229 3036607 3185498 3647808 4057048 3681100
37391 3681100 2716644 2179189 2468292 2929481 2877125 2333469 1751981 1559476 1883600 2327753
37381 2327753 2242477 1513110 684999 136926 -181524 -25826 1058365 2506921 2864146
37372 2864146 1862188 1068910 1547384 2292374 2200478 2063467 2902680 3681960 2826127
37363 2826127 1083833 552469 1368399 1716857 963748 447521 968266 1666216 1841459
37354 1841459 1913970 2001355 1404365 259414 7597 1299587 2862230 3371365 3178185
37345 3178185 3240808 3516138 3447144 3089216 2729769 2162010 1285454 748023 1057289 1620497
37335 1620497 1588133 1198072 1343561 2079164 2487460 2037228 1313102 1159937 1579249 1835428
$$ packed form
37400D943395m54372j065252n93953O2411J44378J48891M62310M09240l75948
37391C681100r64456n37455K89103M61189n2356n43656n81488j92505L24124M44153
37381B327753q5276p29367q28111n48073l18450J55698J084191J448556L57225
37372B864146j001958p93278M78474P44990r1896j37011Q39213P79280q55833
37363B826127j742294n31364Q15930L48458p53109n16227N20745O97950J75243
37354A841459P2511Q7385n96990j144951k51817J291990J562643N09135j93180
37345C178185O2623K75330o8994l57928l59447n67759q76556n37431L09266N63208
37335A620497l2364l90061J45489P35603M08296m50232p24126j53165M19312K56179
$$ plain form
37325 1835428 1529112 1207466 1640626 2614097 2951865 1969375 403529 -537581 -576631
37316 -576631 -227404 272266 1038830 1812208 2064884 1818400 1592693 1592048 1658667 1890457
37306 1890457 2472011 3016861 3005846 2794795 3150102 3793844 3591890 2373988 1347541
37297 1347541 1318703 1695907 1802032 1967606 2505174 2691302 1886907 914682 1106668 2380150
37287 2380150 3385753 3386978 2956672 2815619 2937320 2986489 2838291 2372028 1432662 376930
37277 376930 69547 824621 1780035 1916061 1404057 1255908 1785109 2268134 2252357 2224123
37267 2224123 2455975 2150212 745205 -603727 -244514 1469664 2410661 1652172 714174
37258 714174 1169836 2401139 2839829 2382792 2203374 2773305 3442708 3715078 3685581 3275494
$$ packed form
37325A835428l06316l21646M33160R73471L37768r82490j565846r41110l9050
37316e76631L49227M99670P66564P73378K52676k46484k25707o45O6619K31790
37306A890457N81554N44850j1015k11051L55307O43742k01954j217902j026447
37297A347541k8838L77204J06125J65574N37568J86128q04395r72225J91986J273482
37287B380150J005603J225m30306j41053J21701M9169j48198m66263r39366j055732
37277C76930l07383P55074R55414J36026n12004j48149N29201M83025j5777k8234
37267B224123K31852l05763j405007j348932L59213J714178R40997p58489r37998
37258G14174M55662J231303M38690m57037j79418N69931O69403K72370k9497m10087
$$ plain form
37248 3275494 2189981 791787 48579 322860 929857 1153270 1109814 1339313 1982725
37239 1982725 2646310 2871889 2602401 2225436 2091156 2050949 1821727 1748203 2503451 3834809
37229 3834809 4475339 3831522 2945659 3037262 3791239 3979758 3234936 2278410 1797810 1955432
37219 1955432 2639961 3410972 3610177 3287884 3464943 4615770 5569258 5029802 3567824
37210 3567824 2764981 2858322 2755716 2151127 1961479 2509078 2828733 2276027 1584473 1715044
37200 1715044 2564444 3353380 3616396 3420762 3161480 3354043 4114057 4801361 4740814 4198189
37190 4198189 3970099 4185541 4349706 4409188 4753359 5165301 4868611 3844281 3110339
37181 3110339 3323485 3917170 4029153 3622982 3283952 3383380 3787538 4111033 4095757 3898670
$$ packed form
37248C275494j085513j398194p43208K74281O06997K23413m3456K29499O43412
37239A982725O63585K25579k69488l76965j34280m0207k29222p3524P55248J331358
37229C834809O40530o43817q85863R1603P53977J88519p44822r56526m80600J57622
37219A955432O84529P71011J99205l22293J77059J150827R53488n39456j461978
37210C567824q02843R3341j02606o04589j89648N47599L19655n52706o91554J30571
37200A715044Q49400P88936K63016j95634k59282J92563P60014O87304o0547n42625
37190D198189k28090K15442J64165N9482L44171M11942k96690j024330p33942
37181C110339K13146N93685J11983m06171l39030R9428M04158L23495j5276j97087
$$ plain form
37171 3898670 3915732 4173467 4247916 4041755 4084178 4625783 5106017 5121317 5159899 5576443
37161 5576443 5666798 4840657 3967897 4246939 5263398 5539252 4654995 3520190 2861984
37152 2861984 2744386 3250195 4266208 4858965 4234274 3076201 2624226 2818739 2819092 2855490
37142 2855490 3777475 5114508 5585441 5404222 5958084 7110776 7079428 5422602 3948840
37133 3948840 3942084 4546948 4785283 5159405 6097645 6641570 6089222 5455420 5837760 6532478
37123 6532478 6203409 4939885 3785032 3066669 2578198 2735386 4066391 5818042 6404177
37114 6404177 5382877 4081471 3992352 5089067 6033590 5837761 4971371 4578046 4806344
37105 4806344 4680382 3888493 3681512 5085946 7046602 7641107 6675873 5721588 5828220
$$ packed form
37171C898670J7062K57735P4449k06161M2423N41605M80234J5300L8582M16544
37161E576443R0355q26141q72760K79042J016459K75854q84257j134805o58206
37152B861984j17598N05809J016013N92757o24691j158073m51975J94513L53L6398
37142B855490R21985J337033M70933j81219N53862J152692l1348j656826j473762
37133C948840o756O04864K38335L74122R38240N43925n52348o33802L82340O94718
37123F532478l29069j263524j154853p18363m88471J57188J331005J751651N86135
37114F404177j021300j301406q9119J096715R44523j95829q66390l93325K28298
37105D806344j25962p91889k06981J404434J960656N94505r65234r54285J06632
$$ plain form
37096 5828220 6548164 7097176 7186592 6763111 6122942 6156493 7296927 8481384 8442582 7678268
37086 7678268 7637940 8282687 8207026 7099729 6279114 6599101 7433382 7967060 8080895 7854099
37076 7854099 7523608 7839068 9086414 10059754 9520064 8215119 7728306 7929217 7630037
37067 7630037 7155912 7802951 9145684 9563222 9231135 9730264 10716100 10085984 7792773
37058 7792773 6349349 6898227 7850341 8231976 9241370 11316749 12632437 11952094 10416227
37049 10416227 9230690 8084857 7003520 7125652 8386058 9014724 8569935 8822006 10407367
37040 10407367 11434797 10819398 10124343 10504969 10699562 9834010 9401621 10457062 11443681
37031 11443681 10866471 9764637 9605469 9999348 10277795 11025173 12347087 12938692 12419933
$$ packed form
37096E828220P19944N49012Q9416m23481o40169L3551J140434J184457l8802p64314
37086G678268m0328O44747p5661j107297q20615L19987Q34281N33678J13835k26796
37076G854099l30491L15460J247346R73340n39690j304945m86813K00911k99180
37067G630037m74125O47039J342733M17538l32087M99129R85836o30116k293211
37058G792773j443424N48878R52114L81635J009394K075379J315688o80343j535867
37049A0416227j185537j145833j081337J22132J260406O28666m44789K52071J585361
37040A0407367J027430o15399o95055L80626J94593q65552m32389J055441R86619
37031A1443681n77210j101834j59168L93879K78447P47378J321914N91605n18759
$$ plain form
37022 12419933 12205207 12764305 12762022 12143889 12866465 15086005 16090201 14768767 13553762
37013 13553762 14016569 14397262 13726760 14305423 17309014 19883998 19730162 18874731 19710853
37004 19710853 20932955 20723531 20415775 21572104 22811779 22816093 23083613 24653245 25737223
36995 25737223 25465548 25898589 27600869 28008476 27028762 28615145 33484590 36677923 36229024
36986 36229024 37034817 41465053 44297059 42891567 43566058 50474338 57342219 58942823
36978 58942823 60963225 68152006 73414114 71510644 72233859 84084623 96972178 101431265
36970 101431265 111594743 138796195 150075959 93434665 -26626669 -135351788 -169099288
36963 -169099288 -142516303 -112874672 -104428242 -99333971 -85275933 -73689293 -72398634
$$ packed form
37022A2419933k14726N59098k283o18133P22576K219540J004196j321434j215005
37013A3553762M62807L80693o70502N78663L003591K574984j53836q55431Q36122
37004A9710853J222102k09424l07756J156329J239675M314K67520J569632J083978
36995B5737223k71675M33041J702280M07607r79714J586383M869445L193333m48899
36986C6229024Q05793M430236K832006j405492O74491O908280O867881J600604
36978E8942823K020402P188781N262108j903470P23215J1850764J2887555M459087
36970A01431265J0163478K7201452J1279764n6641294j20061334j08725119l3747500
36963a69099288K6582985K9641631Q446430N094271J4058038J1586640J290659
$$ plain form
36956 -72398634 -71846076 -65072838 -58913155 -58186377 -56439026 -49464125 -43484519 -43054506
36948 -43054506 -43044086 -39090480 -35354292 -35586376 -35804172 -32127886 -27993419 -27579227 -28727712
36939 -28727712 -27878261 -26246336 -26098680 -25984083 -24217719 -22615472 -22788298 -22898656 -21549920
36930 -21549920 -20721709 -21593477 -21650205 -19241734 -16979681 -17221306 -17961796 -16658213 -14651451
36921 -14651451 -14276734 -14671653 -13974591 -13072820 -13771154 -15332096 -15858062 -15353531 -14887090
36912 -14887090 -14438691 -13784455 -13756527 -14611187 -14898787 -13753236 -12486972 -12282985 -12269786
36903 -12269786 -11493193 -10725139 -10652447 -10377119 -9444133 -9236779 -10503033 -11532899 -10740462
36894 -10740462 -9165254 -8468124 -8291208 -7650086 -7202819 -7901770 -8784272 -8312082 -6892467
$$ packed form
36956g2398634N52558O773238O159683P26778J747351O974901N979606M30013
36948d3054506J0420L953606L736188k32084k17796L676286M134467M14192j148485
36939b8727712Q49451J631925J47656J14597J766364J602247j72826j10358J348736
36930b1549920Q28211q71768n6728K408471K262053k41625p40490J303583K006762
36921a4651451L74717l94919O97062R01771o98334j560942n25966N04531M66441
36912a4887090M48399O54236K7928q54660k87600J145551J266264K03987J3199
36903a2269786P76593P68054P2692K75328R32986K07354j266254j029866P92437
36894a0740462J575208O97130J76916O41122M47267o98951q82502M72190J419615
$$ plain form
36885 -6892467 -6138293 -6496158 -7291129 -8251003 -9379089 -10065848 -9795235 -9154325 -9002256
36876 -9002256 -9255513 -9367346 -9238218 -8923917 -8350736 -7924825 -8333201 -9184823 -9130085 -7929450
36866 -7929450 -7006985 -7304110 -8064861 -8420894 -8579834 -8689812 -8218766 -7324491 -7118699
36857 -7118699 -7659998 -7507965 -6284682 -5714504 -6849247 -8228368 -8321505 -7902150 -8202761
36848 -8202761 -8452524 -7352266 -5674953 -5238441 -6144255 -6927447 -6791980 -6082505 -5185039
36839 -5185039 -4432662 -4493641 -5540209 -6610717 -6842472 -6578031 -6358786 -5906672 -5122464
36830 -5122464 -4850667 -5460928 -5923690 -5524881 -5118148 -5329895 -5098771 -3697674 -2653866
36821 -2653866 -3590708 -5461524 -6160108 -5781472 -5909451 -6560861 -6389836 -5393568 -4879212
$$ packed form
36885f892467P54174l57865p94971r59874j128086o86759K70613O40910J52069
36876i002256k53257j11833J29128L14301N73181M25911m08376q51622N4738J200635
36866g929450R22465k97125p60751l56033j58940j09978M71046Q94275K05792
36857g118699n41299J52033J223283N70178j134743j379121r3137M19355l00611
36848h202761k49763J100258J677313M36512r05814p83192J35467P09475Q97466
36839e185039P52377o0979j046568j070508k31755K64441K19245M52114P84208
36830e122464K71797o10261m62762L98809M06733k11747K31124J401097J043808
36821b653866r36842j870816o98584L78636j27979o51410J71025R96268N14356
$$ plain form
36812 -4879212 -4980630 -4637135 -3979886 -4348553 -5749222 -6541016 -6012990 -5225840 -4907486
36803 -4907486 -4522797 -3943687 -4080672 -5122335 -5878590 -5669619 -5337072 -5605119 -5868295
36794 -5868295 -5421609 -4625490 -4087307 -3856218 -4085363 -5249751 -6971030 -7845029 -7266530
36785 -7266530 -6307849 -5960711 -5652582 -4493670 -2953697 -2150282 -2249778 -2682538 -3309682
36776 -3309682 -4272010 -5138501 -5256553 -4709274 -4119422 -3759315 -3517787 -3403138 -3441602 -3466924
36766 -3466924 -3594927 -4356407 -5656427 -6270206 -5373491 -4034248 -3957334 -5027285 -5432667
36757 -5432667 -4270934 -2722975 -2276584 -2898876 -3539368 -3582853 -3165042 -2672215 -2513232
36748 -2513232 -2907483 -3426676 -3239906 -2275537 -1602603 -2085076 -3134628 -3473480 -2791615
$$ packed form
36812d879212j01418L43495O57249l68667j400669p91794N28026P87150L18354
36803d907486L84689N79110j36985j041663p56255K08971L32547k68047k63176
36794e868295M46686P96119N38183K31089k29145j164388j721279q73999N78499
36785g266530R58681L47138L08129J158912J539973Q03415r9496m32760o27144
36776c309682r62328q66491j18052N47279N89852L60107K41528J14649l8464k5322
36766c466924j28003p61480j300020o13779Q96715J339243P6914j069951m05382
36757e432667J161733J547959M46391o22292o40492m3485M17811M92827J58983
36748b513232l94251n19193J86770R64369O72934m82473j049552l38852O81865
$$ plain form
36739 -2791615 -1952281 -1779775 -2312017 -3092675 -3542391 -3145661 -1937213 -777436 -520474
36730 -520474 -922329 -1009583 -529521 -309988 -1034325 -2350565 -3460065 -3996556 -4018314 -3653091
36720 -3653091 -3113656 -2704847 -2540864 -2511251 -2588043 -2797915 -2916297 -2705644 -2439443 -2576280
36710 -2576280 -2940350 -2979546 -2845394 -3283677 -4289432 -4887345 -4581450 -4023004 -3838270
36701 -3838270 -3828055 -3781899 -3941624 -4072158 -3302737 -1647328 -417857 -253537 -143804
36692 -143804 492052 368237 -1390818 -3037230 -2438502 -472177 224730 -778263 -1567557
36683 -1567557 -1410663 -1640578 -2726902 -3175851 -2240209 -1383410 -1826713 -2594557 -2385571
36674 -2385571 -1760100 -1936671 -2643400 -2716868 -2038010 -1513624 -1645646 -2202581 -2929238 -3745623
$$ packed form
36739b791615Q39334J72506n32242p80658m49716L96730J208448J159777K56962
36730e20474m01855q7254M80062K19533p24337j316240j109500n36491k1758L65223
36720c653091N39435M08809J63983K9613p6792k09872j18382K10653K66201j36837
36710b576280l64070l9196J34152m38283j005755n97913L05895N58446J84734
36701c838270J0215M6156j59725j30534P69421J655409J229471J64320J09733
36692a43804O35856j23815j759055j646412N98728J966325O96907j002993p89294
36683a567557J56894k29915j086324m48949R35642Q56799m43303p67844K08986
36674b385571O25471j76571p06729p3468O78858N24386j32022n56935p26657q16385
$$ plain form
36664 -3745623 -4539172 -5274823 -5929395 -6101935 -5373006 -4211638 -3596182 -3552303 -3217231
36655 -3217231 -2568577 -2589415 -3220111 -2893771 -1093856 326277 -207488 -1488704 -1392724
36646 -1392724 -83583 548367 -148529 -1164025 -1890814 -2606104 -3012311 -2262588 -752232
36637 -752232 -203344 -1395024 -3112541 -3921504 -3855197 -3703606 -3606270 -3184812 -2523702 -2271267
36627 -2271267 -2897152 -4179140 -5313054 -5488481 -4641484 -3675201 -3637448 -4653967 -5901847
36618 -5901847 -6517015 -6218716 -5215747 -3957226 -2965256 -2542010 -2559324 -2656829 -2551122
36609 -2551122 -2116857 -1477954 -1104099 -1369060 -1886290 -1874492 -1369647 -1287720 -1926840 -2360147
36599 -2360147 -1966669 -1577652 -2122937 -3005541 -3061223 -2476013 -2346497 -2760339 -2810776 -2325410
$$ packed form
36664c745623p93549p35651o54572j72540P28929J161368O15456M3879L35072
36655c217231O48654k0838o30696L26340J799915J420133n33765j281216R5980
36646a392724J309141O31950o96896j015496p26789p15290m06207P49723J510356
36637g52232N48888j191680j717517q08963O6307J51591R7336M21458O61110K52435
36627b271267o25885j281988j133914j75427Q46997R66283L7753j016519j247880
36618e901847o15168K98299J002969J258521R91970M23246j7314r7505J05707
36609b551122M34265O38903L73855k64961n17230J1798N04845Q1927o39120m33307
36599b360147L93478L89017n45285q82604n5682N85210J29516m13842n0437M85366
$$ plain form
36589 -2325410 -2038635 -2002398 -1370502 -72898 723094 303003 -709175 -1639464 -2622949
36580 -2622949 -3518098 -3309579 -1628131 168271 572421 -163640 -766549 -880370 -1053140
36571 -1053140 -1298702 -1027086 -292711 80593 -278288 -886023 -1303074 -1553486 -1574036 -1157513
36561 -1157513 -622136 -657448 -1259617 -1680927 -1699843 -1949211 -2525661 -2373294 -927140 526676
36551 526676 317036 -1290105 -2449794 -2180600 -1240755 -598118 -283589 -62258 -109553
36542 -109553 -457823 -637584 -471455 -521298 -1165740 -1887651 -2092229 -2014346 -2131454 -2249690
36532 -2249690 -1964384 -1574568 -1685883 -2198543 -2506967 -2496910 -2558346 -2759950 -2791446 -2656286
36522 -2656286 -2676848 -2796028 -2532177 -1705427 -724211 -155577 -353685 -1269237 -2220413 -2282960
$$ packed form
36589b325410K86775L6237O31896J297604P95992m20091j012178r30289r83485
36580b622949q95149K08519J681448J796402M04150p36061o02909j13821j72770
36571a053140k45562K71616P34375L73304l58881o07735m17051k50412k0550M16523
36561a157513N35377l5312o02169m21310j8916k49368n76450J52367J446154J453816
36551E26676k09640j607141j159689K69194R39845O42637L14529K21331m7295
36542a09553l48270j79761J66129m9843o44442p21911k04578P7883j17108j18236
36532b249690K85306L89816j11315n12660l08424J0057o1436k01604l1496J35160
36522b656286k0562j19180K63851Q26750R81216N68634j98108r15552r51176o2547
$$ plain form
36512 -2282960 -1483286 -1085121 -1934604 -3097997 -3132390 -2141633 -1317924 -934547 -381935
36503 -381935 25423 -860298 -2852642 -4142064 -3804374 -3003682 -2888654 -2817766 -1798568
36494 -1798568 -427836 -57377 -850606 -1875098 -2496853 -2604596 -2032025 -859430 110162
36485 110162 165886 -309652 -458452 -206817 -121522 -380052 -694015 -955937 -1203363 -1213347
36475 -1213347 -832620 -433766 -402487 -506901 -413898 -418695 -927728 -1615773 -1913619 -1981327
36465 -1981327 -2286883 -2472283 -1676637 -27925 1116638 712798 -783775 -2020895 -2136345
36456 -2136345 -1373186 -600420 -370624 -407081 -110758 476046 629601 -292 -819003 -1079389
36446 -1079389 -759548 -300299 28825 98349 -238589 -830156 -1229512 -1382111 -1696997 -2049395
$$ packed form
36512b282960P99674L98165q49483j163393l4393R90757Q23709L83377N52612
36503c81935M07358q85721j992344j289422L37690Q00692J15028P0888J019198
36494a798568J370732L70459p93229j024492o21755j07743N72571J172595R69592
36485A10162N5724m75538j48800K51635Q5295k58530l13963k61922k47426r984
36475a213347L80727L98854L1279j04414R3003m797n09033o88045k97846o7708
36465a981327l05556j85400P95646J648712J144563m03840j496573j237120j15450
36456b136345P63159P72766K29796l6457K96323N86804J53555o29893q18711k60386
36446a079389L19841M59249L29124O9524l36938n91567l99356j52599l14886l52398
$$ plain form
36436 -2049395 -1588127 -250380 430389 -845801 -3082808 -4020982 -3020940 -1719247 -1744434
36427 -1744434 -2831030 -3517366 -2967269 -1698592 -883813 -1182944 -2153672 -2839459 -2934718
36418 -2934718 -2973164 -3245545 -3213595 -2444112 -1439086 -854683 -474303 228929 963728 944431
36408 944431 64813 -1056523 -1960642 -2520575 -2501026 -1772792 -817630 -283449 -164733 -34120
36398 -34120 188945 363347 638734 1023154 789222 -715495 -2844288 -4194549 -4300465
36389 -4300465 -3903096 -3639980 -3440424 -3239210 -3279117 -3456434 -3193725 -2295836 -1347006 -1021606
36379 -1021606 -1438032 -2236840 -2820190 -2571792 -1427774 -225669 88947 -385096 -682057
36370 -682057 -284088 292208 261983 -542060 -1593257 -2166436 -1997299 -1653904 -1907391 -2477148
$$ packed form
36436b049395M61268J337747O80769j276190k237007r38174J000042J301693k5187
36427a744434j086596o86336N50097J268677Q14779k99131r70728o85787r5259
36418b934718l8446k72381L1950P69483J005026N84403L80380P03232P34799j9297
36408I44431q79618j121336r04119n59933J9549P28234R55162N34181J18716J30613
36398c4120K23065J74402K75387L84420k33932j504717k128793j350261j05916
36389d300465L97369K63116J99556K01214l9907j77317K62709Q97889R48830L25400
36379a021606m16426p98808n83350K48398J144018J202105L14616m74043k96961
36370f82057L97969N76296l0225q04043j051197n73179J69137L43395k53487n69757
$$ plain form
36360 -2477148 -2048928 -129699 1797117 1894174 293442 -1215262 -1530826 -1224629 -1297917
36351 -1297917 -1998148 -2976092 -3774343 -3984800 -3520299 -2800928 -2266075 -1901233 -1653500
36342 -1653500 -1825099 -2424987 -2724614 -2318798 -2031822 -2694682 -3556261 -3213577 -1803515
36333 -1803515 -887286 -1240918 -2066880 -2427725 -2240651 -1778046 -1326149 -1384744 -2088070 -2463720
36323 -2463720 -1487596 155947 725987 -84115 -750106 -256663 628176 860043 516294
36314 516294 91638 -354223 -648000 -190657 1037184 1992711 1772031 680167 -305889
36305 -305889 -534911 13096 655296 226865 -1631205 -3402549 -3145940 -1138546 311896
36296 311896 -43155 -1015488 -1162090 -707372 -448566 -246280 258578 588831 247630 -302874
$$ packed form
36360b477148M28220J919229J926816R7057j600732j508704l15564L06197p3288
36351a297917p00231r77944p98251k10457M64501P19371N34853L64842K47733
36342a653500j71599n99888k99627M05816K86976o62860q61579L42684J410062
36333a803515R16229l53632q25962l60845J87074M62605M51897n8595p03326l75650
36323b463720R76124J643543N70040q10102o65991M93443Q84839K31867l43749
36314E16294m24656m45861k93777M57343J227841R55527k20680j091864r86056
36305c05889k29022N48007O42200m28431j858070j771344K56609K007394J450442
36296C11896l55051r72333j46602M54718K58806K02286N04858L30253l41201n50504
$$ plain form
36286 -302874 -474192 -535617 -896724 -1283904 -1476750 -1914528 -2665623 -2804457 -1866770 -948866
36276 -948866 -1168135 -1931360 -2059630 -1811270 -2211449 -2899577 -2382009 -421956 1335652
36267 1335652 1457046 311428 -807370 -1234502 -1123586 -754929 -296642 -55820 -433538
36258 -433538 -1380581 -2081522 -1678721 -539300 -214539 -1493315 -3037962 -2990030 -1546717
36249 -1546717 -569272 -782210 -1056282 -715706 -665908 -1451575 -1986650 -1410742 -681509 -924960
36239 -924960 -1515977 -1325350 -726082 -702574 -944625 -612613 -218377 -849828 -2047287 -2365255
36229 -2365255 -1756618 -1516836 -1963996 -2037687 -1305926 -581659 -277485 134169 607956 162586
36219 162586 -1299006 -2306840 -1821868 -707259 -341808 -811351 -1374308 -1825375 -2414150
$$ packed form
36286c02874j71318o1425l61107l87180j92846m37778p51095j38834R37687R17904
36276i48866k19269p63225j28270K48360m00179o88128N17568J960053J757608
36267A335652J21394j145618j118798m27132J10916L68657M58287K40822l77718
36258d33538r47043p00941M02801J139421L24761j278776j544647M7932J443313
36249a546717R77445k12938k74072L40576M9798p85667n35075N75908P29233k43451
36239i24960n91017J90627N99268K3508k42051L32012L94236o31451j197459l17968
36229b365255O08637K39782m47160p3691P31761P24267L04174M11654M73787m45370
36219A62586j461592j007834M84972J114609L65451m69543n62957m51067n88775
$$ plain form
36210 -2414150 -3021365 -3300319 -3247965 -3004849 -2514787 -1911567 -1724900 -2119605 -2440531 -2153377
36200 -2153377 -1760461 -2046213 -2784359 -3028635 -2540978 -2128267 -2480572 -3310658 -3831726
36191 -3831726 -3632901 -2897380 -2106529 -1713990 -1855225 -2219438 -2375594 -2257614 -2074729
36182 -2074729 -1750547 -928539 223018 720624 -137258 -1635710 -2317819 -1798830 -1176247
36173 -1176247 -1416382 -2081602 -2155347 -1504777 -808293 -419459 -83486 370714 743631 827935
36163 827935 544330 -137394 -923641 -1145558 -608448 -131120 -453830 -1012714 -819588 -181854
36153 -181854 -207674 -776919 -627581 344574 637277 -356750 -1112327 -356423 759181 349132
36143 349132 -1367357 -2543326 -2423214 -1981035 -2067851 -2428520 -2697308 -3085244 -3640908
$$ packed form
36210b414150o07215k78954N2354K43116M90062O03220J86667l94705l20926K87154
36200b153377L92916k85752p38146k44276M87657M12711l52305q30086n21068
36191c831726J98825P35521P90851L92539j41235l64213j56156J17980J82885
36182b074729L24182Q22008J151557M97606q57882j498452o82109N18989O22583
36173a176247k40135o65220p3745O50570O96484L88834L35973M54200L72917Q4304
36163H27935k83605o81724p86247k21917N37110M77328l22710n58884J93126O37734
36153a81854k5820n69245J49338R72155K92703r94027p55577P55904J115604m10049
36143C49132j716489j175969J20112M42179q6816l60669k68788l87936n55664
$$ plain form
36134 -3640908 -3751452 -2963661 -1819010 -1362641 -1930623 -2689688 -2472801 -1072913 449832
36125 449832 940065 401249 -312619 -750715 -1080359 -1242956 -914027 -408328 -568553 -1455797
36115 -1455797 -2156298 -2211951 -2150608 -2203909 -1755948 -700855 -79356 -504649 -1122779 -1089674
36105 -1089674 -927857 -1326389 -1728974 -1409448 -950254 -1223735 -1740063 -1510270 -876677
36096 -876677 -936813 -1631000 -1909219 -1464336 -897106 -450402 57449 274366 -376317 -1542228
36086 -1542228 -2247358 -2207361 -1867229 -1466581 -1043851 -875322 -881988 -269426 1082707 1741174
36076 1741174 701478 -653154 -403589 873795 1074649 12777 -546004 -132650 -247897
36067 -247897 -1436199 -2196784 -1600078 -759724 -679647 -613903 230181 1044888 783211 -154972
$$ packed form
36134c640908j10544P87791J144651M56369n67982p59065K16887J399888J522745
36125D49832M90233n38816p13868m38096l29644j62597L28929N05699j60225q87244
36115a455797p00501n5653O1343n3301M47961J055093O21499m25293o18130L3105
36105a089674J61817l98532m02585L19526M59194k73481n16328K29793O33593
36096h76677o0136o94187k78219M44883N67230M46704N07851K16917o50683j165911
36086a542228p05130L9997L40132M00648M22730J68529o666O12562J352133O58467
36076A741174j039696j354632K49565J277384K00854j061872n58781M13354j15247
36067b47897j188302p60585N96706Q40354Q0077O5744Q44084Q14707k61677r38183
$$ plain form
36057 -154972 -792059 -1030527 -1205616 -1182282 -847874 -650912 -905024 -1367721 -1946617 -2758327
36047 -2758327 -3158647 -2169046 -419670 -158 -1469916 -2683768 -1819828 -14987 533144
36038 533144 -278744 -986830 -1180624 -1607981 -2257907 -2320989 -1942495 -2261571 -3486456 -4346349
36028 -4346349 -3849878 -2538802 -1603691 -1533256 -1969085 -2295939 -2064248 -1215825 -136469
36019 -136469 658578 933785 818477 682239 929676 1541931 1790572 940175 -664773
36010 -664773 -1855620 -2139757 -2178932 -2499817 -2622326 -1997750 -996732 -269091 236473
36001 236473 898123 1570077 1772522 1349628 428839 -854263 -2150833 -2886512 -2858242
35992 -2858242 -2393862 -1714704 -835590 -281082 -868322 -2301494 -3066210 -2417239 -1422170
$$ packed form
36057a54972o37087k38468j75089K3334L34408J96962k54112m62697n78896q11710
36047b758327m00320R89601J749376M19512j469758j213852Q63940J804841N48131
36038E33144q11888p08086j93794m27357o49926o3082L78494l19076j224885q59893
36028d346349M96471J311076R35111P0435m35829l26854K31691Q48423J079356
36019a36469P95047K75207j15308j36238K47437O12255K48641q50397j604948
36010f64773j190847k84137l9175l20885j22509O24576J001018P27641N05564
36001B36473O61650O71954K02445m22894r20789j283102j296570p35679K8270
35992b858242M64380O79158Q79114N54508n87240j433172p64716O48971R95069
$$ plain form
35983 -1422170 -1225603 -1408191 -1138210 -844785 -1324881 -2019310 -1774255 -819339 -394245
35974 -394245 -663940 -575323 232036 866693 735155 325664 130449 -26046 -195954 46195
35964 46195 656339 803787 135596 -452274 -30983 989387 1489956 1241243 1013682 1186895
35954 1186895 1115862 247992 -716476 -505099 933429 2040774 1470260 -197789 -1223981
35945 -1223981 -929479 -322163 -490560 -1238593 -1632600 -1209360 -228392 748639 1173445
35936 1173445 883193 442845 631358 1374939 1747369 1197999 117963 -947896 -1802512
35927 -1802512 -2106771 -1437250 -271998 136258 -546117 -1202213 -1051999 -804985 -1198297
35918 -1198297 -1627876 -1398229 -1202280 -1897953 -2686354 -2152251 -612803 178249 -533676
$$ packed form
35983a422170J96567j82588K69981K93425m80096o94429K45055R54916M25094
35974c94245k69695Q8617Q07359O34657j31538m09491j95215j56495j69908K42149
35964D6195O10144J47448o68191n87870M21291J020370N00569k48713k27561J73213
35954A186895p1033q67870r64468K11377J438528J107345n70514j668049j026192
35945a223981K94502O07316j68397p48033l94007M23240R80968R77031M24806
35936A173445k90252m40348J88513P43581L72430n49370j080036j065859q54616
35927a802512l04259O69521J165252M08256o82375o56096J50214K47014l93312
35918a198297m29579K29647J95949o95673p88401N34103J539448P91052p11925
$$ plain form
35909 -533676 -1768872 -2416957 -2334538 -1893437 -1523646 -1647773 -2155549 -2160792 -1153200 22280
35899 22280 303202 -38536 -136695 -164446 -753250 -1312421 -673800 793788 1448308 731199
35889 731199 -385512 -1260601 -2085747 -2438874 -1350000 689753 1687092 885476 -137080
35880 -137080 51944 790941 866582 466180 324262 189281 -444670 -982801 -488505 762292
35870 762292 1637888 1661448 1258202 888187 696764 652140 442021 -314340 -1312609 -1677791
35860 -1677791 -1291483 -1179466 -1963070 -2786663 -2558533 -1476114 -487960 36781 242901
35851 242901 88668 -371674 -598756 -336653 -196488 -642223 -1049860 -702740 -69625 -59108
35841 -59108 -587081 -961757 -1126754 -1351247 -1213584 -230165 848513 762367 -373578 -1221655
$$ packed form
35909e33676j235196o48085Q2419M41101L69791j24127n07776n243J007592J175480
35899B2280K80922l41738r8159k7751n88804n59171O38621J467588O54520p17109
35889G31199j116711q75089q25146l53127J088874K039753R97339q01616j022556
35880a37080J89024P38997P5641m00402j41918j34981o33951n38131M94296J250797
35870G62292Q75596K3560m03246l70015j91423m4624k10119p56361r98269l65182
35860a677791L86308J12017p83604q23593K28130J082419R88154N24741K06120
35851B42901j54233m60342k27082K62103J40165m45735m07637L47120O33115J0517
35841e9108n27973l74676j64997k24493J37663R83419J078678q6146j135945q48077
$$ plain form
35831 -1221655 -1198940 -996170 -1094832 -1113944 -855691 -738149 -839605 -661509 -230357 -322122
35821 -322122 -1111907 -1651227 -1263210 -514953 -201080 -262869 -392329 -842367 -1790964 -2563802
35811 -2563802 -2377221 -1432913 -544788 -75800 98013 15941 -253105 -328372 -89016 -134704
35801 -134704 -875407 -1570899 -1277864 -479893 -564416 -1636160 -2140317 -1121363 290447
35792 290447 466560 -480802 -1073676 -624769 73473 151633 -248629 -576288 -798664 -1207886
35782 -1207886 -1693862 -1719852 -951960 335529 1414088 1565547 620464 -757291 -1509171
35773 -1509171 -1182095 -429599 -305294 -1091681 -1999693 -2014502 -926396 444047 976364
35764 976364 282508 -931212 -1618987 -1479256 -1069600 -910876 -938084 -950738 -1017961 -1078760
$$ packed form
35831a221655K2715K02770r8662j9112K58253J17542j01456J78096M31152r1765
35821c22122p89785n39320L88017P48257L13873o1789j29460m50038r48597p72838
35811b563802J86581R44308Q88125M68988J73813q2072k69046p5267K39356m5688
35801a34704p40703o95492K93035P97971q4523j071744n04157J018954J411810
35792B90447J76113r47362n92874M48907O98242P8160m00262l27659k22376m09222
35782a207886m85976k5990P67892J287489J078559J51459r45083j377755p51880
35773a509171L27076P52496J24305p86387r08012j4809J088106J370443N32317
35764I76364o93856j213720o87775J39731M09656J58724k7208j2654o7223o0799
$$ plain form
35754 -1078760 -731644 7603 301737 -350624 -1034216 -582529 435227 247564 -1438397
35745 -1438397 -2707511 -2019985 -289150 581947 253189 -172174 -145421 -156782 -444032
35736 -444032 -545854 -306295 -256034 -673434 -1096393 -1101250 -866280 -635750 -285091 188053
35726 188053 335001 -83472 -540254 -376444 246931 500499 -85661 -1063619 -1530838 -1005800
35716 -1005800 113529 911400 840527 196025 -394886 -724453 -945020 -1056703 -1022385 -1188871
35706 -1188871 -1823429 -2299340 -1722310 -544241 -400518 -1754378 -2833086 -1938340 63200
35697 63200 897423 -305 -1062188 -1163230 -972887 -1305778 -1614781 -1066582 -83579 308125
35687 308125 66174 -20574 256997 322461 -62820 -457368 -671547 -1169333 -2178812 -3098743
$$ packed form
35754a078760L47116P39247K94134o52361o83592M51687J017756j87663j685961
35745a438397j269114O87526J730835Q71097l28758m25363K6753j1361k87250
35736d44032j01822K39559N0261m17400m22959m857K34970K30530L50659M73144
35726A88053J46948m18473m56782J63810O23375K53568n86160r77958m67219N25038
35716a005800J119329P97871p0873o44502n90911l29567k20567j11683L4318j66486
35706a188871o34558m75911N77030J178069J43723j353860j078708Q94746K001540
35697F3200Q34223q97728j061883j01042J90343l32891l09003N48199R83003L91704
35687C08125k41951q6748K77571O5464l85281l94548k14179m97786j009479r19931
$$ plain form
35677 -3098743 -3305222 -3067624 -3076731 -3351488 -3264510 -2608046 -1993056 -1960864 -2199510 -2065697
35667 -2065697 -1573491 -1311407 -1461417 -1498817 -1005063 -212261 547031 1338219 2056529 1932201
35657 1932201 466903 -1421928 -2203152 -1690863 -1195970 -1540779 -2018063 -1788401 -1199738
35648 -1199738 -903962 -620392 146914 901370 896663 534666 638606 714170 -411321 -2206106
35638 -2206106 -2499191 -527575 1669675 1906231 643594 -102913 283463 628814 103568
35629 103568 -682117 -814923 -279060 232059 71640 -890403 -2056498 -2435286 -1730922
35620 -1730922 -960034 -1333716 -2624909 -3386842 -2807809 -1577803 -766101 -599321 -656672
35611 -656672 -605987 -324570 185945 566085 217998 -881642 -1842332 -1798024 -891117 133757
$$ packed form
35677c098743k06479K37598r107k74757Q6978O56464O14990L2192k38646J33813
35667b065697M92206K62084j50010l7400M93754P92802P59292P91188P18310j24328
35657A932201j465298j888831p81224N12289M94893l44809m77284K29662N88663
35648a199738K95776K83570P67306P54456m707l61997J03940P5564j125491j794785
35638b206106k93085J971616K197250K36556j262637p46507L86376L45351n25246
35629A03568p85685j32806N35863N11119j60419r62043j166095l78788P04364
35620a730922P70888l73682j291193p61933N79033J230006Q11702J66780n7351
35611f56672N0685K81417N10515L80140l48087j099640r60690M4308R06907J024874
$$ plain form
35601 133757 969203 1714307 2009157 1113725 -855536 -2498776 -2561735 -1425877 -530043
35592 -530043 -506560 -662345 -368378 -62942 -344519 -791613 -592744 -11419 -175109 -1350256
35582 -1350256 -2425212 -2449710 -1795787 -1242576 -720346 216286 1234513 1515988 969006
35573 969006 269175 -205659 -624776 -900164 -583334 131379 116146 -1390628 -3610527
35564 -3610527 -4866070 -4242761 -2356528 -674299 -277752 -1055610 -1867974 -1663132 -587690
35555 -587690 212808 29183 -502003 -253106 864454 1729048 1419765 327471 -462222
35546 -462222 -573891 -564136 -770568 -685619 53504 667735 144814 -1062333 -1329178 -70048
35536 -70048 1380588 1619752 971112 657937 982406 1321497 1359772 1240577 888537 303595
$$ packed form
35601A33757Q35446P45104K94850q95432j969261j643240o2959J135858Q95834
35592e30043K3483j55785K93967L05436k81577m47094J98869N81325j63690j175147
35582a350256j074956k4498O53923N53211N22230R36632J018227K81475n46982
35573I69006o99831m74834m19117k75388L16830P14713j5233j506774k219899
35564c610527j255543O23309J886233J682229L96547p77858q12364K04842J075442
35555e87690Q00498j83625n31186K48897J117560Q64594l09283j092294p89693
35546d62222j11669R755k06432Q4949P39123O14231n22921j207147k66845J259130
35536g0048J450636K39164o48640l13175L24469L39091L8275j19195l52040n84942
$$ plain form
35526 303595 222294 1252403 2511547 2467344 1154179 133403 44742 -228093 -1387357
35517 -1387357 -2320566 -1916388 -953133 -816363 -1303100 -1223621 -559331 -382371 -845291 -878213
35507 -878213 -107470 353836 -408996 -1728813 -2353190 -2021477 -1311021 -529173 363882
35498 363882 1013917 767340 -328853 -1260388 -1183983 -531271 -506087 -1490575 -2433326 -2159245
35488 -2159245 -970494 -323585 -897576 -1712740 -1591595 -871709 -855589 -1811572 -2497698
35479 -2497698 -1916475 -745751 -444262 -1376018 -2491012 -2757308 -2308087 -2008213 -2280710
35470 -2280710 -2648429 -2315317 -1044145 489145 1207891 691645 -228466 -222302 1006406
35461 1006406 2259118 2260616 1233723 495171 660651 1034086 880941 431615 168720
$$ packed form
35526C03595q1301J030109J259144m4203j313165j020776q8661k72835j159264
35517a387357r33209M04178R63255J36770m86737P9479O64290J76960m62920l2922
35507h78213P70743M61306p62832j319817o24377L31713P10456P81848Q93055
35498C63882O50035k46577j096193r31535P6405O52712K5184r84488r42751K74081
35488b159245J188751O46909n73991q15164J21145P19886J6120r55983o86126
35479b497698N81223J170724L01489r31756j114994k66296M49221K99874k72497
35470b280710l67719L33112J271172J533290P18746n16246r20111O164J228708
35461A006406J252712J498j026893p38552J65480L73435j53145m49326k62895
$$ plain form
35452 168720 -95884 -692374 -1211712 -1042853 -449491 -174705 -156886 339564 1276147 1576365
35442 1576365 653847 -666537 -1252005 -1028561 -725718 -760344 -899227 -724241 -61838
35433 -61838 794775 1113193 378726 -897852 -1534706 -1068561 -239411 140338 88085 -162579
35423 -162579 -841507 -1970326 -2671729 -2114543 -832152 -198964 -723766 -1643769 -2117324
35414 -2117324 -2030885 -1615797 -1054162 -653764 -762670 -1227912 -1407941 -975759 -350845 -138077
35404 -138077 -451132 -955505 -1292699 -1292934 -993980 -593787 -240576 149489 663739 1016308
35394 1016308 734312 -183709 -1102878 -1432897 -1260187 -1105651 -1234351 -1473209 -1630640
35385 -1630640 -1752237 -1826704 -1523388 -570686 674973 1432052 1363041 880794 458047 108648
$$ packed form
35452A68720k64604n96490n19338J68859N93362K74786J7819M96450R36583L00218
35442A576365r22518j320384n85468K23444L02843l4626j38883J74986O62403
35433f1838Q56613L18418p34467j276578o36854M66145Q29150L79749n2253k50664
35423a62579o78928j128819p01403N57186J282391O33188n24802r20003m73555
35414b117324Q6439M15088N61635M00398j08906m65242j80029M32182O24914K12768
35404a38077l13055n04373l37194k35K98954M00193L53211L90065N14250L52569
35394A016308k81996r18021r19169l30019J72710J54536j28700k38858j57431
35385a630640j21597p4467L03316R52702J245659P57079o9011m82247m22747l49399
$$ plain form
35375 108648 -174890 -91608 282324 108423 -978687 -1751027 -829161 907119 970062 -1251469
35365 -1251469 -3258950 -2672349 -378263 898144 237258 -851854 -1005362 -546254 -331098
35356 -331098 -434290 -481297 -400507 -339080 -365061 -566068 -1025451 -1525141 -1670699 -1436255
35346 -1436255 -1228043 -1327475 -1584137 -1697386 -1551463 -1305349 -1320748 -1811410 -2405961 -2449223
35336 -2449223 -1989066 -1879751 -2435042 -2677874 -1738907 -395918 -109331 -847488 -1109952
35327 -1109952 -133437 1091048 1285303 419442 -594405 -1002468 -638196 166101 778996
35318 778996 794612 495989 427178 589311 574582 341053 195655 140499 -45100 -221571
35308 -221571 -168879 -227068 -709320 -915191 49342 1526005 1777952 436544 -919855
$$ packed form
35375A08648k83538Q3282L73932j73901j087110p72340R21866J736280O2943k221531
35365a251469k007481N86601K294086J276407o60886j089112j53508M59108K15156
35356c31098j03192m7007Q0790O1427k5981k01007m59383m99690j45558K34444
35346a436255K08212r9432k56662j13249J45923K46114j5399m90662n94551m3262
35336b449223M60157J09315n55291k42832R38967J342989K86587p38157k62464
35327a109952R76515J224485J94255q65861j013847m08063L64272Q04297O12895
35318G78996J5616k98623o8811J62133j4729k33529j45398n5156j85599j76471
35308b21571N2692n8189m82252k05871R64533J476663K51947j341408j356399
$$ plain form
35299 -919855 -1059116 -593935 -580594 -961125 -1231767 -1472474 -1768527 -1660196 -1143571 -1203594
35289 -1203594 -2268854 -3095043 -2427212 -957105 -268445 -490386 -489612 2221 11346 -948291
35279 -948291 -2114776 -2631323 -2407052 -1691277 -744192 -61609 -33475 -230621 153558 1046244
35269 1046244 1508848 1127744 525855 270832 139548 -157402 -289206 130970 829568
35260 829568 1237063 1232632 1109765 1048735 1001853 978754 1113412 1366397 1297352 379901 -1213593
35249 -1213593 -2300441 -1751550 -35205 990399 285584 -1054137 -1393270 -784971 -525663
35240 -525663 -938032 -1015134 -337131 75129 -607261 -1636333 -1771814 -1048328 -575341 -924543
35230 -924543 -1527295 -1636620 -1270621 -1008426 -1158461 -1393561 -1232490 -712933 -316988 -231353
$$ packed form
35299i19855j39261M65181J3341l80531k70642k40707k96053J08331N16625o0023
35289a203594j065260q26189O67831J470107O88660k21941P74M91833R125r59637
35279i48291j166485n16547K24271P15775R47085O82583K8134j97146L84179Q92686
35269A046244M62604l81104o01889k55023j31284k96950j31804M20176O98598
35260H29568M07495m431j22867o1030m6882k3099J34658K52985o9045r17451j593494
35249a213593j086848N48891J716345J025604p04815j339721l39133O08299K59308
35240e25663m12369p7102O78003M12260o82390j029072j35481P23486M72987l49202
35230i24543o02752j09325L65999K62195j50035k35100J61071N19557L95945Q5635
$$ plain form
35220 -231353 -140003 13733 -355642 -1515989 -2585831 -2539583 -1756426 -1538043 -2135901 -2371267
35210 -2371267 -1450959 -117137 453115 9289 -1001218 -2191555 -3174957 -3471090 -3116805
35201 -3116805 -2781189 -2719821 -2285077 -1111643 -60465 -121014 -952572 -1484594 -1546768 -1863877
35191 -1863877 -2656761 -3290882 -3310561 -2926053 -2416395 -1851438 -1471035 -1554474 -1797715 -1557183
35181 -1557183 -822666 -193138 222479 986595 2122535 2658869 1987259 952036 820605
35172 820605 1595359 2082121 1421758 -63656 -1432975 -2010985 -1772207 -1277498 -1213902
35163 -1213902 -1687490 -2052392 -1715978 -946273 -522042 -722621 -1079255 -1069592 -663942 -194576
35153 -194576 -30997 -351738 -884522 -948696 -213138 618416 460202 -682277 -1515648 -1091774
$$ packed form
35220b31353R1350J53736l69375j160347j069842M6248P83157K18383n97858k35366
35210b371267R20308J333822N70252m43826j010507j190337r83402k96133L54285
35201c116805L35616O1368M34744J173434J051178o0549q31558n32022o2174l17109
35191a863877p92884o34121j9679L84508N09658N64957L80403q3439k43241K40532
35181a557183P34517O29528M15617P64116J135940N36334o71610j035223j31431
35172H20605P74754M86762o60363j485414j369319n78010K38778M94709O3596
35163a213902m73588l64902L36414P69705M24231k00579l56634R663M05650M69366
35153a94576J63579l20741n32784o4174P35558Q31554j58214j142479q33371M23874
$$ plain form
35143 -1091774 -78789 179979 -502434 -1030287 -676879 -86824 -302006 -1305470 -2040011
35134 -2040011 -1689038 -492477 710043 1369531 1498157 1308666 908202 386600 -17417
35125 -17417 -52919 237622 505661 481566 277062 174523 188368 61613 -255170 -389122
35115 -389122 -45054 451713 490649 60077 -146012 269664 721642 437648 -326416 -552364
35105 -552364 43142 525704 92154 -746984 -918335 -276737 353069 387221 19125 -355693
35095 -355693 -525899 -250170 623891 1673177 2173374 2030758 1812724 1717705 1301418 504090
35085 504090 60464 359560 722874 505846 147676 280441 510749 147613 -418777 -298797
35075 -298797 277778 256629 -428093 -712732 -232758 69057 -407566 -907949 -613017 104445
$$ packed form
35143a091774J012985K58768o82413n27853L53408N90055k15182j003464p34541
35134b040011L50973J196561J202520O59488J28626j89491m00464n21602m04017
35125a7417l5502K90541K68039k4095k04504j02539J3845j26755l16783j33952
35115c89122L44068M96767L8936m30572k06089M15676M51978k83994p64064k25948
35105e52364N95506M82562m33550q39138j71351O41598O29806L4152l68096l74818
35095c55693j70206K75729Q74061J049286N00197j42616k18034r5019m16287p97328
35085E04090m43626K99096L63314k17028l58170J32765K30308l63136n66390J19980
35075b98797N76575k1149o84722k84639M79974L01815m76623n00383K94932P17462
$$ plain form
35065 104445 466699 443324 312529 -113274 -873893 -1134258 -179875 1217851 1538452 544097
35055 544097 -423566 -326944 261270 144291 -798930 -1477127 -1001548 200705 835760 132848
35045 132848 -1438900 -2816942 -3371019 -3116298 -2335101 -1458213 -1005513 -1028570 -850289
35036 -850289 -61102 509919 -206525 -1711724 -2356006 -1650747 -784325 -489345 37748
35027 37748 1292488 2078658 1270073 -219318 -724736 -235754 36362 -167355 -93189 271118
35017 271118 83045 -738594 -1319462 -1388967 -1642472 -2326671 -2778173 -2700591 -2683057 -3021741
35007 -3021741 -3125591 -2593351 -1926224 -1654769 -1584415 -1398646 -1263156 -1331402 -1280883 -819323
34997 -819323 -180483 227054 276622 69843 -158837 -63581 405405 695969 312443 -391257
$$ packed form
35065A04445L62254k3375j30795m25803p60619k60365R54383J397726L20601r94355
35055E44097r67663R6622N88214j16979r43221o78197M75579J202253O35055p02912
35045A32848j571748j378042n54077K54721P81197Q76888M52700k3057J78281
35036h50289P89187N71021p16444j505199o44282P05259Q66422K94980N27093
35027C7748J254740P86170q08585j489391n05418M88982K72116k03717P4166L64307
35017B71118j88073q21639n80868o9505k53505o84199m51502P7582J7534l38684
35007c021741j03850N32240O67127K71455P0354J85769J35490o8246N0519M61560
34997h19323O38840M07537M9568k06779k28680R5256M68986K90564l83526p03700
$$ plain form
34987 -391257 -720976 -662965 -605613 -430099 78137 300307 -404226 -1228291 -836769 317554
34977 317554 397720 -865549 -1556916 -549979 763677 710433 -334695 -1028917 -1061274
34968 -1061274 -805653 -199405 698676 1022716 234212 -894538 -1496670 -1869983 -2468643
34959 -2468643 -2712195 -2035814 -1128976 -836573 -783288 -387626 -200813 -782177 -1295147 -877321
34949 -877321 -427531 -1183651 -2372397 -2289329 -1052502 -168108 118716 767288 1549896
34940 1549896 1151845 -258169 -925220 -348139 -742 -676869 -1269853 -960377 -593609
34931 -593609 -907329 -1210175 -900842 -655412 -942913 -845953 384296 1843444 2266396
34922 2266396 1753711 1116260 522144 -113795 -341951 126298 730533 992567 1306664
$$ packed form
34987c91257l29719N8011N7352J75514N08236K22170p04533q24065L91522J154323
34977C17554Q0166j263269o91367J006937J313656n3244j045128o94222l2357
34968a061274K55621O06248Q98081L24040p88504j128750o02132l73313n98660
34959b468643k43552O76381R06838K92403N3285L95662J86813n81364n12970M17826
34949h77321M49790p56120j188746Q3068J236827Q84394K86824O48572P82608
34940A549896l98051j410014o67051N77081L47397o76127n92984L09476L66768
34931e93609l13720l02846L09333K45430k87501R6960J230249J459148M22952
34922B266396n12685o37451n94116o35939k28156M68249O04235K62034L14097
$$ plain form
34913 1306664 1979511 2442855 2283651 2014888 1901437 1186608 -408327 -1624711 -1444986
34904 -1444986 -785762 -876849 -1040166 48967 1713167 2014570 772877 -282733 -368307
34895 -368307 -566357 -1506592 -2063648 -1220873 226234 820992 328506 -368370 -529867
34886 -529867 -24680 888149 1662824 1779606 1347028 1006215 1031802 1011993 571833 -152818
34876 -152818 -917375 -1626726 -2026277 -1825877 -1380792 -1527232 -2368043 -2908921 -2385170 -1329125
34866 -1329125 -724139 -625682 -372874 138033 245248 -346216 -930277 -683634 175655 597292
34856 597292 57849 -714779 -669385 158929 668456 159028 -752500 -974342 -277616 608415
34846 608415 940159 586329 -70157 -492522 -443063 -310782 -644775 -1174978 -956856 81351
$$ packed form
34913A306664O72847M63344j59204k68763j13451p14829j594935j216384J79725
34904a444986O59224r1087j63317J089133J664200L01403j241693j055610q5574
34895c68307j98050r40235n57056Q42775J447107N94758m92486o96876j61497
34886e29867N05187R12829P74675J16782m32578l40813K5587j9809m40160p24651
34876a52818p64557p09351l99551K00400M45085j46440q40811n40878N23751J056045
34866a329125O04986R8457K52808N10907J07215n91464n84061K46643Q59289M21637
34856E97292n39443p72628M5394Q28314N09527n09428r11528k21842O96726Q86031
34846F08415L31744l53830o56486m22365M9459J32281l33993n30203K18122J038207
$$ plain form
34836 81351 600069 -286960 -1414582 -1094646 305066 849976 -87008 -1117114 -1184308
34827 -1184308 -913425 -1027510 -1019926 -361226 296870 262945 76408 429033 745121 172786
34817 172786 -753229 -884411 -357670 -217626 -516046 -435444 -199555 -1058771 -2992167 -4098151
34807 -4098151 -3085866 -1063550 107712 177178 154589 453308 630476 533246 534910 769604
34797 769604 1053333 1436838 1976102 2088912 1092041 -594802 -1715378 -1798883 -1612112
34788 -1612112 -1754911 -1790571 -1289528 -827364 -1117030 -1755106 -1761230 -1061147 -550999 -783564
34778 -783564 -1389118 -1840729 -2054418 -2033773 -1554707 -573634 419920 799079 406861 -367831
34768 -367831 -982292 -1167813 -1106415 -1153565 -1296494 -1122546 -533940 -89918 -160800 -156254
$$ packed form
34836H1351N18718q87029j127622L19936J399712N44910r36984j030106o7194
34827a184308K70883j14085P584O58700O58096l3925j86537L52625L16088n72335
34817A72786r26015j31182N26741J40044k98420Q0602K35889q59216j933396j105984
34807d098151J012285K022316J171262O9466k2589K98719J77168r7230J664K34694
34797G69604K83729L83505N39264J12810r96871j686843j120576q3505J86771
34788a612112j42799l5660N01043M62164k89666o38076o124P00083N10148k32565
34778g83564o05554m51611k13689K0645M79066R81073R93554L79159l92218p74692
34768c67831o14461j85521O1398m7150j42929J73948N88606M44022p0882M546
$$ plain form
34758 -156254 625638 1627857 1506558 19254 -1571992 -2243599 -2347673 -2537770 -2541638
34749 -2541638 -1784835 -549570 316708 436899 26416 -571169 -910222 -546715 266623
34740 266623 565479 3246 -497965 -209981 124961 -402612 -1112916 -827646 -144403 -692234
34730 -692234 -2200892 -2440642 -639969 1055602 658383 -843952 -1324898 -881260 -1345233
34721 -1345233 -2994938 -3875227 -2722905 -880555 -433861 -1509425 -2463533 -2241729 -1485071
34712 -1485071 -1228851 -1349996 -887002 394998 1472830 1363443 470858 59341 532131
34703 532131 901306 148568 -1434066 -2616422 -2581582 -1538197 -249650 630437 844271
34694 844271 517449 -22287 -482620 -689911 -544859 -91680 411152 717594 825929 723199
$$ packed form
34758a56254P81892J002219j21299j487304j591246o71607j04074j90097l868
34749b541638P56803J235265Q66278J20191m10483n97585l39053L63507Q13338
34740B66623K98856n62233n01211K87984L34942n27573p10304K85270O83243n47831
34730f92234j508658k39750J800673J695571l97219j502335m80946M43638m63973
34721a345233j649705q80289J152322J842350M46694j075564r54108K21804P56658
34712a485071K56220j21145M62994J282000J077832j09387q92585m11517M72790
34703E32131L69175p52738j582634j182356L4840J043385J288547Q80087K13834
34694H44271l26822n39736m60333k07291J45052M53179N02832L06442J08335j02730
$$ plain form
34684 723199 97437 -1166047 -2290659 -2145950 -685112 810339 1239952 839029 469381
34675 469381 419685 478709 650818 1069854 1493204 1527245 1190995 785129 466494 404186
34665 404186 931644 1885665 2199792 1054144 -740005 -1452704 -576860 647750 1036418
34656 1036418 865848 1024197 1511559 1489994 500027 -926353 -1763309 -1349820 24545
34647 24545 1190651 1068675 -183826 -1294061 -1355056 -757739 -319650 -32427 636129
34638 636129 1512237 1690198 839625 -234427 -683038 -669612 -862691 -1334063 -1586977 -1441923
34628 -1441923 -1208244 -996955 -553859 50062 252003 -67277 -104402 724926 1598578 1167121
34618 1167121 -487222 -1791882 -1823616 -1480919 -1891808 -2561771 -2190756 -847423 -35762
$$ packed form
34684G23199o25762j263484j124612J44709J460838J495451M29613m00923l69648
34675D69381m9696N9024J72109M19036M23350L4041l36250m05866l18635o2308
34665D04186N27458R54021L14127j145648j794149p12699Q75844J224610L88668
34656A036418j70570J58349M87362k1565r89967j426380q36956M13489J374365
34647B4545J166106j21976j252501j110235o0995N97317M38089K87223O68556
34638F36129Q76108J77961q50573j074052m48611J3426j93079m71372k52914J45054
34628a441923K33679K11289M43096O03921K01941l19280l7125Q29328Q73652m31457
34618A167121j654343j304660l1734L42697m10889o69963L71015J343333Q11661
$$ plain form
34609 -35762 -570415 -1598299 -2101989 -2253555 -2561791 -2628685 -1833862 -688312 -289733 -640553
34599 -640553 -738334 -376945 -531841 -1534269 -2162786 -1416784 -159019 129909 -526497
34590 -526497 -986174 -930387 -964011 -1068026 -573072 256057 276027 -496967 -566070 606109
34580 606109 1464705 757984 -435626 -509492 140803 136642 -365089 -210309 355050 58504
34570 58504 -860074 -801454 278615 395521 -1338427 -3192967 -3429447 -2596256 -2010144
34561 -2010144 -1607837 -780040 24044 140191 76504 459912 531021 -584017 -1841361
34552 -1841361 -1434937 356547 1368611 630065 -481627 -473650 378728 917981 705571
34543 705571 156073 -101515 408836 1593562 2537162 2381161 1529389 1141250 1389517
$$ packed form
34609c5762n34653j027884n03690j51566l08236o6894P94823J145550L98579l50820
34599f40553r7781L61389j54896j002428o28517P46002J257765K88928o56406
34590e26497m59677N5787l3624j04015M94954Q29129J9970p72994o9103J172179
34580F06109Q58596p06721j193610p3866O50295m161n01731J54780N65359k96546
34570E8504r18578N8620J080069J16906j733948j854540k36480Q33191N86112
34561b010144M02307Q27797Q04084J16147o3687L83408P1109j115038j257344
34552a841361M06424J791484J012064p38546j111692P977Q52378N39253k12410
34543G05571n49498k57588N10351J184726R43600j56001q51772l88139K48267
$$ plain form
34534 1389517 1273013 376827 -348623 -120406 368090 -32673 -1247981 -2091045 -1699939
34525 -1699939 -298587 1193658 1874292 1425095 336919 -540353 -779970 -550079 -163534
34516 -163534 90579 -174359 -1056886 -1895821 -1922134 -1380764 -1169103 -1356275 -1126874 -378886
34506 -378886 -125507 -787737 -1327815 -904859 -265689 -405504 -788756 -221438 1129370
34497 1129370 1962361 1752548 1126689 492580 -406064 -1480806 -2009568 -1633712 -769715
34488 -769715 147368 1021826 1624940 1661122 1430244 1512363 1669111 1082996 -107000 -688058
34478 -688058 -217069 256798 6039 -91536 846483 1907773 1628411 343141 -307842
34469 -307842 67651 190017 -656758 -1544830 -1579353 -1304815 -1584922 -2062306 -1748530 -598261
$$ packed form
34534A389517j16504q96186p25450K28217M88496m00763j215308q43064L91106
34525a699939J401352J492245O80634m49197j088176q77272k39617K29891L86545
34516a63534K54113k64938q82527q38935k6313N41370K11661j87172K29401P47988
34506c78886K53379o62230n40078M22956O39170j39815l83252N67318J350808
34497A129370Q32991k09813o25859o34109q98644j074742n28762L75856Q63997
34488g69715R17083Q74458O03114L6182k30878Q2119J56748n86115j189996n81058
34478f88058M70989M73867k50759r7575R38019J061290k79362j285270o50983
34469c07842L75493J22366q46775q88072l4523K74538k80107m77384L13776J150269
$$ plain form
34459 -598261 432612 649989 222025 -341994 -728874 -875603 -883324 -869986 -769449 -478625
34449 -478625 -255449 -516320 -1074514 -1161800 -515330 169771 252684 -74390 -479135 -1116127
34439 -1116127 -1859493 -1827690 -724607 145752 -479523 -1787720 -2001834 -1062955 -471171
34430 -471171 -691956 -712665 -309868 -578730 -1565882 -1558330 72169 1272343 209554 -1801348
34420 -1801348 -2237069 -1101011 -549270 -1375702 -2066835 -1377309 44386 996770 1251507
34411 1251507 1258887 1371587 1733410 2173846 2107831 1279432 475049 575266 1066377 625440
34401 625440 -831255 -1886084 -1580512 -522305 223326 319451 -38343 -509822 -495039
34392 -495039 441128 1736494 2284098 1888197 1332935 940664 267049 -587736 -793873
$$ packed form
34459e98261J030873K17377m27964n64019l86880j46729p721J3338J00537K90824
34449d78625K23176k60871n58194q7286O46470O85101Q2913l27074m04745o36992
34439a116127p43366L1803J103083Q70359o25275j308197k14114R38879N91784
34430d71171k20785k0709M02797k68862r87152P552J630499J200174j062789k010902
34420a801348m35721J136058N51741q26432o91133O89526J421695R52384K54737
34411A251507P380J12700L61823M40436o6015q28399q04383J00217M91111m40937
34401F25440j456695j054829L05572J058207P45631R6125l57794m71479J4783
34392d95039R36167J295366N47604l95901n55262l92271o73615q54785k06137
$$ plain form
34383 -793873 -382619 -537148 -1540459 -1888350 -512080 1406786 2112720 1654333 1171431
34374 1171431 804176 16679 -671720 -188878 1028981 1273530 33955 -1363123 -1909707
34365 -1909707 -2157260 -2681977 -2738515 -1468918 494357 1683321 1493244 420948 -824416
34356 -824416 -1612222 -1330782 -31574 1175310 1322130 927499 1122426 1683149 1293183
34347 1293183 -123047 -879280 4393 1244959 1286565 594206 480138 644551 -184934
34338 -184934 -1670299 -2092917 -1227735 -815795 -1648504 -2303933 -1733995 -1084950 -1567089
34329 -1567089 -2326766 -2156157 -1741886 -2189464 -2628771 -1631691 -86240 -100460 -1490510
34320 -1490510 -1941979 -649147 683315 753941 228682 -120162 -602664 -1203653 -1053619
$$ packed form
34383g93873M11254j54529j003311l47891J376270J918866P05934m58387m82902
34374A171431l67255p87497o88399M82842J217859K44549j239575j397078n46584
34365a909707k47553n24717n6538J269597J963275J188964j90077j072296j245364
34356h24416p87806K81440J299208J206884J46820l94631J94927N60723l89966
34347A293183j416230p56233Q83673J240566M1606o92359j14068J64413q29485
34338a84934j485365m22618Q65182M11940q32709o55429N69938O49045m82139
34329a567089p59677J70609M14271m47578m39307R97080J545451j4220j390050
34320a490510m51469J292832J332462P0626n25259l48844m82502o00989J50034
$$ plain form
34311 -1053619 -179018 116541 -494564 -622122 349257 963352 120309 -1038849 -1130564
34302 -1130564 -737038 -980498 -1362363 -838540 90531 185732 -460095 -809782 -672797 -643052
34292 -643052 -871443 -1191257 -1761206 -2385585 -2096425 -735572 48697 -1053166 -2774872
34283 -2774872 -2896904 -1367056 -30990 141473 -273905 -815018 -1600014 -2321527 -2438716
34274 -2438716 -2247805 -2321895 -2215452 -1239649 -84695 55676 -391672 -20280 1000827
34265 1000827 1026806 -334601 -1547364 -1503027 -789195 -234922 188707 614323 878050
34256 878050 1180794 1807422 2114596 1285238 39627 -165195 363959 -83846 -1543631
34247 -1543631 -1964124 -546966 797884 440627 -589546 -605859 132470 409772 232442
$$ packed form
34311a053619Q74601K95559o11105j27558R71379O14095q43043j159158r1715
34302a130564L93526k43460l81865N23823R29071R5201o45827l49687J36985K9745
34292f43052k28391l19814n69949o24379K89160J360853P84269j101863j721706
34283b774872j22032J529848J336066J72463m15378n41113p84996p21513j17189
34274b438716J90911p4090J06443R75803J154954J40371m47348L71392J021107
34265A000827K5979j361407j212763M4337P13832N54273M23629M25616K63727
34256H78050L02744O26628L07174q29358j245611k04822N29154m47805j459785
34247a543631m20493J417158J344850l57257j030173j6313P38329K77302j77330
$$ plain form
34238 232442 353085 619697 343431 -339066 -702802 -516199 -12112 593476 876488 307100
34228 307100 -785736 -1258410 -730257 -63771 236306 745537 1560858 1591060 417985
34219 417985 -686766 -832149 -1033114 -2173894 -2978559 -1910675 113455 1006036 657071
34210 657071 677396 1535856 2080170 1735557 1233755 1076016 919709 606116 382194 97901
34200 97901 -478118 -685072 232825 1484617 1469051 165335 -819882 -718516 -441961 -639694
34190 -639694 -624929 108587 799390 702886 248444 25118 -362434 -1456475 -2699326 -2951093
34180 -2951093 -1860099 -102556 1395037 2078663 2025690 1877106 2104573 2268924 1635843
$$ packed form
34238B32442J20643K66612k76266o82497l63736J86603N04087O05588K83012n69388
34228C07100j092836m72674N28153O66486L00077N09231Q15321L0202j173075
34219D17985j104751j45383k00965j140780q04665J067884K024130Q92581l48965
34210F57071K0325Q58460N44314l44613n01802j57739j56307l13593k23922k84293
34200I7901n76019k06954R17897J251792j5566j303716r85217J01366K76555j97733
34190f39694J4765P33516O90803r6504m54442k23326l87552j094041j242851k51767
34180b951093J090994J757543J497593O83626n2973j48584K27467J64351o33081
$$ [...]
##END NTUPLES=NMR SPECTRUM
##END=
