##TITLE=31Pdec_67-2024
 DMSO-d6, 24 sc
 2.9.2024
##JCAMPDX= 6.0         $$ Bruker NMR JCAMP-DX V2.0
##DATA TYPE= NMR SPECTRUM
##DATA CLASS= NTUPLES
##ORIGIN= UXNMR, Bruker Analytische Messtechnik GmbH
##OWNER= root
$$ XWIN-NMR		Version 3.5
$$ Mon Sep  2 14:30:27 2024 Russian Standard Time (UT+4h)  she@DPX200
##.OBSERVE FREQUENCY= 81.013821
##.OBSERVE NUCLEUS= ^31P
##.ACQUISITION MODE= SIMULTANEOUS
##.ACQUISITION SCHEME= undefined
##.AVERAGES= 24
##.DIGITISER RES= 17
##SPECTROMETER/DATA SYSTEM= spect
##.PULSE SEQUENCE= zgpg30
##.SOLVENT NAME= CDCl3
##.SHIFT REFERENCE= (INTERNAL, CDCl3, 0, 198.062)
##AUDIT TRAIL= $$ (NUMBER, WHEN, WHO, WHERE, WHAT)
$$ ##TITLE= Audit trail, XWIN-NMR		Version 3.5
$$ ##JCAMPDX= 5.01
$$ ##ORIGIN= Bruker BioSpin GmbH
$$ ##OWNER= she
$$ F:/spectra/data/she/nmr/P31/2/pdata/1/auditp.txt
$$ ##AUDIT TRAIL=  $$ (NUMBER, WHEN, WHO, WHERE, WHAT)
(   1,<2024-09-02 14:29:27.46 +0400>,<she>,<DPX200>,
      <created by zg, POWCHK disabled, PULCHK disabled
       configuration hash MD5:
       00 E9 B6 7A A2 85 ED C7 34 08 36 98 17 FE 4E 26
       data hash MD5: 32K
       69 B1 7B 11 CA 87 8B 0F 88 CC A7 C0 BA 98 B2 B3>)
(   2,<2024-09-02 14:29:30.56 +0400>,<she>,<DPX200>,
      <Start of raw data processing
       efp BC_mod = 2 LB = 1.5 FT_mod = 6 PKNL = 1 PHC0 = 2727.844 PHC1 = -26.71252 SI = 64K 
       data hash MD5: 64K
       CB 99 C7 98 52 3B 39 EB 6F 9F AD 81 50 FB C1 E4>)
(   3,<2024-09-02 14:29:47.73 +0400>,<she>,<DPX200>,
      <pk PHC0 = -6.926614 PHC1 = 0 
       data hash MD5: 64K
       41 99 87 92 AC E1 94 30 71 49 4B 95 2E A3 01 D7>)
$$ ##END=
$$ 
$$ hash MD5
$$ 28 86 F6 4C 1E 2A 60 EF 5D C0 1E D2 07 20 9D BE
##$RELAX= 
##$RELAX= 
##$RELAX= 
##$RELAX= 
##$RELAX= 
##$RELAX= 
##$RELAX= 
##$RELAX= 
$$ Bruker specific parameters
$$ --------------------------
##$DU= <F:/spectra>
##$EXPNO= 2
##$NAME= <P31>
##$PROCNO= 1
##$TYPE= <nmr>
##$USER= <she>
##$AMP= (0..31)
100 100 100 100 100 100 100 100 100 100 100 100 100 100 100 100 100 100 
100 100 100 100 100 100 100 100 100 100 100 100 100 100 
##$AQSEQ= 0
##$AQ_mod= 1
##$AUNM= <au_zg>
##$AUTOPOS= <>
##$BF1= 81.014009
##$BF2= 200.13
##$BF3= 200.13
##$BF4= 200.13
##$BF5= 200.13
##$BF6= 200.13
##$BF7= 200.13
##$BF8= 200.13
##$BYTORDA= 1
##$CFDGTYP= 0
##$CFRGTYP= 5
##$CHEMSTR= <none>
##$CNST= (0..31)
1 1 145 1 1 1 1 1 1 1 1 1 1 1 1 1 1 1 1 1 1 1 1 1 1 1 1 1 1 1 1 1 
##$CPDPRG= <waltz16>
##$CPDPRG1= <>
##$CPDPRG2= <waltz16>
##$CPDPRG3= <>
##$CPDPRG4= <mlev>
##$CPDPRG5= <mlev>
##$CPDPRG6= <mlev>
##$CPDPRG7= <mlev>
##$CPDPRG8= <mlev>
##$CPDPRGB= <>
##$CPDPRGT= <>
##$D= (0..31)
0 1 0 0 0 0 0 0 0 0.06 0 0.03 2e-05 3e-06 0 0 0.0002 0 0 0 0 0 0 0 0 0 
0 0 0 0 0 0 
##$DATE= 1725272967
##$DBL= (0..7)
120 120 120 11 120 120 24 19 
##$DBP= (0..7)
150 150 150 150 150 150 150 150 
##$DBP07= 0
##$DBPNAM0= <>
##$DBPNAM1= <>
##$DBPNAM2= <>
##$DBPNAM3= <>
##$DBPNAM4= <>
##$DBPNAM5= <>
##$DBPNAM6= <>
##$DBPNAM7= <>
##$DBPOAL= (0..7)
0.5 0.5 0.5 0.5 0.5 0.5 0.5 0.5 
##$DBPOFFS= (0..7)
$$ [...]
##$SUBNAM2= <"">
##$SUBNAM3= <"">
##$SUBNAM4= <"">
##$SUBNAM5= <"">
##$SUBNAM6= <"">
##$SUBNAM7= <"">
##$SUBNAM8= <"">
##$SUBNAM9= <"">
##$SW= 400.765351723535
##$SWIBOX= (0..15)
0 1 3 0 0 0 0 0 0 0 0 0 0 0 0 0 
##$SW_h= 32467.5324675325
##$TD= 32768
##$TD0= 1
##$TE= 0
##$TE2= 300
##$TE3= 300
##$TEG= 300
##$TL= (0..7)
0 120 53 12 22 120 120 120 
##$TP= (0..7)
150 150 150 150 150 150 150 150 
##$TP07= 0
##$TPNAME0= <>
##$TPNAME1= <>
##$TPNAME2= <>
##$TPNAME3= <>
##$TPNAME4= <>
##$TPNAME5= <>
##$TPNAME6= <>
##$TPNAME7= <>
##$TPOAL= (0..7)
0.5 0.5 0.5 0.5 0.5 0.5 0.5 0.5 
##$TPOFFS= (0..7)
0 0 0 0 0 0 0 0 
##$TUNHIN= 0
##$TUNHOUT= 0
##$TUNXOUT= 0
##$USERA1= <user>
##$USERA2= <user>
##$USERA3= <user>
##$USERA4= <user>
##$USERA5= <user>
##$V9= 5
##$VALIST= <valist>
##$VCLIST= <CCCCCCCCCCCCCCC>
##$VD= 0
##$VDLIST= <DDDDDDDDDDDDDDD>
##$VPLIST= <PPPPPPPPPPPPPPP>
##$VTLIST= <TTTTTTTTTTTTTTT>
##$WBST= 1024
##$WBSW= 4
##$XGAIN= (0..3)
0 0 0 0 
##$XL= 0
##$YL= 0
##$YMAX_a= 6797
##$YMIN_a= -6868
##$ZGOPTNS= <>
##$ZL1= 120
##$ZL2= 120
##$ZL3= 120
##$ZL4= 120
##$ABSF1= 0
##$ABSF2= 0
##$ABSG= 0
##$ABSL= 0
##$ALPHA= 0
##$AQORDER= 0
##$ASSFAC= 0
##$ASSFACI= 0
##$ASSFACX= 0
##$ASSWID= 0
##$AUNMP= <proc_1d>
##$AZFE= 0.1
##$AZFW= 0.5
##$BCFW= 0
##$BC_mod= 2
##$BYTORDP= 0
##$COROFFS= 0
##$CY= -3
##$DATMOD= 1
##$DC= 0
##$DFILT= <>
##$DTYPP= 0
##$F1P= 0
##$F2P= 0
##$FCOR= 1
##$FTSIZE= 65536
##$FT_mod= 6
##$GAMMA= 0
##$GB= 0
##$INTBC= 1
##$INTSCL= 9.790993e-09
##$ISEN= 30
##$LB= 1.5
##$LEV0= 0
##$LPBIN= 0
##$MAXI= 10000
##$MC2= 0
##$MEAN= 0
##$ME_mod= 0
##$MI= 50
##$NCOEF= 0
##$NC_proc= -7
##$NLEV= 6
##$NOISF1= 182.463
##$NOISF2= 159.3651
##$NSP= 0
##$NTH_PI= 0
##$NZP= 0
##$OFFSET= 198.0616
##$PC= 4
##$PHC0= 2720.917
##$PHC1= -26.71252
##$PH_mod= 1
##$PKNL= yes
##$PPARMOD= 0
##$PSCAL= 0
##$PSIGN= 0
##$REVERSE= no
##$SF= 81.0140089999434
##$SI= 65536
##$SIGF1= 159.3651
##$SIGF2= -187.1042
##$SINO= 113.3802
##$SIOLD= 16384
##$SREGLST= <1H.CDCl3>
##$SSB= 0
##$STSI= 65536
##$STSR= 0
##$SW_p= 32467.5324675325
##$SYMM= 0
##$S_DEV= 0
##$TDeff= 32768
##$TDoff= 0
##$TI= <>
##$TILT= no
##$TM1= 0
##$TM2= 0
##$TOPLEV= 0
##$USERP1= <user>
##$USERP2= <user>
##$USERP3= <user>
##$USERP4= <user>
##$USERP5= <user>
##$WDW= 1
##$XDIM= 65536
##$YMAX_p= 442882152
##$YMIN_p= -10525039
$$ End of Bruker specific parameters
$$ ---------------------------------
##NTUPLES= NMR SPECTRUM
##VAR_NAME=  FREQUENCY,     SPECTRUM/REAL,   SPECTRUM/IMAG
##SYMBOL=    X,             R,               I
##VAR_TYPE=  INDEPENDENT,   DEPENDENT,       DEPENDENT
##VAR_FORM=  AFFN,          ASDF,            ASDF
##VAR_DIM=   65536,         65536,           65536
##UNITS=     HZ,            ARBITRARY UNITS, ARBITRARY UNITS
##FACTOR=    0.49542278885378, 1,            1
##FIRST=     16045.7642231865, 0,            0
##LAST=      -16421.768244346, 0,            0
##MIN=       -16421.768244346, -10525039,    0
##MAX=       16045.7642231865, 442882152,    0
$$ Real data points
##PAGE= N=1
##DATA TABLE= (X++(R..R)), XYDATA
$$ [...]
42672 156226 517888 280026 -255008 -983029 -1572204 -1366362 -338004 410173 -123077
42663 -123077 -1439866 -2203793 -2095133 -2057979 -2635137 -3034969 -2300193 -706345 587023
42654 587023 891955 505643 126514 201300 730424 1372468 1742200 1740464 1526907 1186150
42644 1186150 685966 195606 46069 180527 22919 -772394 -1678282 -1769701 -804463 381789
42634 381789 603129 -527202 -2096075 -2687620 -1907420 -884235 -844601 -1485297 -1502740
42625 -1502740 -586063 162010 8794 -313470 103280 920719 1276571 1190733 1262385 1460575
42615 1460575 1219657 455426 -399883 -1133484 -1709690 -1799446 -1244784 -709155 -890623 -1321831
42605 -1321831 -1013810 -114487 272402 -115922 -394694 -197858 -299872 -1122996 -1878527
42596 -1878527 -1855147 -1478531 -1343662 -1169153 -544664 156776 520999 963181 1858780 2490472
42586 2490472 2006038 955024 662860 1293035 1695443 1162141 237521 -381691 -746246
42577 -746246 -1090501 -1196689 -856050 -442054 -503230 -1043497 -1571286 -1701221 -1453417 -1073245
42567 -1073245 -750621 -484412 -146855 303123 704850 846347 636646 46179 -959294
42558 -959294 -2231735 -3296350 -3629346 -3105676 -2093095 -1148846 -650832 -598078 -713692
42549 -713692 -832167 -1113349 -1662673 -2077770 -1799112 -895339 -14914 475578 738204 788468
42539 788468 324447 -493425 -875666 -497585 -55265 -176973 -510142 -591410 -867476 -1870453
42529 -1870453 -2955993 -3016163 -2138697 -1412657 -1239712 -989966 -328574 266131 466614
42520 466614 505099 384154 -261337 -1166608 -1366731 -675276 -284096 -1160144 -2574213 -3004847
42510 -3004847 -1985433 -324604 1089393 1954156 2270112 2095121 1580465 856828 -42536
42501 -42536 -915638 -1312993 -1038034 -467705 -50120 263916 761792 1394850 1817079 1817211
42491 1817211 1432813 822587 238934 -123352 -440516 -1085619 -1931614 -2273360 -1780785
42482 -1780785 -1070845 -865667 -985884 -739222 9286 769678 1203871 1334575 1125790
42473 1125790 539850 12946 200166 1057223 1696848 1430990 620266 244812 827745
42464 827745 1932261 2579403 2081495 586433 -1117467 -2297353 -2670879 -2222753 -1119979
42455 -1119979 -27730 66551 -1048731 -2218807 -2134013 -973391 -114074 -284018 -856178
42446 -856178 -1098990 -1194338 -1557419 -1934857 -1885279 -1653952 -1809625 -2267677 -2372637 -1832489
42436 -1832489 -936508 77449 1164421 1894312 1496246 -75911 -1617225 -1787973 -584631
42427 -584631 759739 1243592 983288 594802 224475 -427917 -1373215 -2088301 -2073408 -1361300
42417 -1361300 -339550 711765 1690184 2402354 2514405 1861862 684206 -520588 -1311180
42408 -1311180 -1482979 -1113507 -551675 -233257 -293564 -359287 95152 1113285 2105189 2415670
42398 2415670 1945047 1131876 468570 191800 304678 610254 731723 414256 -73307
42389 -73307 -99076 581228 1442203 1795537 1625175 1524868 1853659 2239027 1986225 825605
42379 825605 -769280 -1894093 -1902120 -973829 4897 304311 89123 135971 831624 1647958
42369 1647958 1661432 481837 -1325322 -2640279 -2692575 -1723252 -687159 -205916 -31278
42360 -31278 285008 604594 606169 667416 1521065 2973658 3786405 3175595 1772247 651931
42350 651931 9005 -624753 -1334246 -1734396 -1693781 -1449365 -1081291 -488685 127193 339796
42340 339796 125717 -91056 -100970 -113244 -186068 7243 585989 1096789 1097736 788805 706022
42329 706022 1026488 1517315 1949545 2134245 1667967 182737 -1951958 -3521230 -3424530
42320 -3424530 -1763681 183209 1143087 969279 546379 616072 867175 390348 -1029285
42311 -1029285 -2471327 -2993221 -2856453 -3073918 -3779230 -3788608 -2211431 68863 1260926
42302 1260926 787566 -243945 -665298 -451960 -54991 525982 1320347 1719163 1121994
42293 1121994 -87572 -1015924 -1427347 -1608269 -1377912 -354354 823555 794273 -634492
42284 -634492 -1994815 -2129824 -1665381 -1779097 -2427528 -2818903 -2974908 -3593027 -4604535
42275 -4604535 -5018647 -4269904 -2830209 -1382650 -202354 487185 372491 -338292 -758284
42266 -758284 -249799 796176 1421603 1109633 136712 -805685 -1106370 -577961 394129
42257 394129 1069284 895085 -54624 -1102727 -1443683 -805807 212221 632211 102460
42248 102460 -727700 -978608 -472320 270388 673498 493335 -128731 -668730 -562832 83738
42238 83738 420527 -110861 -976526 -1258070 -834315 -297575 -22442 -29644 -548918 -1883378
42228 -1883378 -3701934 -5174261 -5871229 -5952393 -5539637 -4622181 -3568363 -2951218 -2764284
42219 -2764284 -2522568 -2191570 -2200212 -2414435 -2023041 -775987 489827 966562 786645
42210 786645 438961 47211 -284842 -142795 580437 1302854 1520342 1419992 1275882 885025
42200 885025 169448 -316105 -168042 138945 22739 -255040 -204766 -157759 -731155 -1564348
42190 -1564348 -1626363 -738251 127801 179160 -327913 -716361 -718483 -400658 237339 1187856
42180 1187856 2107599 2335548 1428590 -163660 -1140466 -584349 810215 1407986 713540
42171 713540 -72653 1969 182999 -604851 -1813074 -2026417 -1183683 -638425 -1123643 -1979879
42161 -1979879 -2507366 -2827415 -3074597 -2836111 -1898695 -751697 62365 438055 341282
42152 341282 -245625 -771988 -411702 692493 1323011 804526 -62736 -213505 307195
42143 307195 789764 952864 863078 385871 -443730 -917562 -348446 931203 1897564 1962977
42133 1962977 1269172 196751 -774276 -982589 -113742 1188844 1782908 1166801 -89614
42124 -89614 -886848 -366676 1417545 3194100 3356495 1789551 349040 717315 2173586
42115 2173586 2511140 973973 -898257 -1475754 -903186 -293785 -82186 65982 388900
42106 388900 878364 1581637 2333548 2483507 1600239 299635 -289868 135073 809649
42097 809649 1001484 805198 744524 1096812 1811568 2669405 3262946 3176658 2502819 1921186
42087 1921186 1937544 2232427 2104541 1417097 720469 493523 669723 956317 1214368 1367218
42077 1367218 1295789 1067465 980460 1119512 1152749 894982 772413 1240429 1939473 2056719
42067 2056719 1518059 1135045 1350472 1503360 814266 -399093 -1132606 -1068869 -870514
42058 -870514 -1132048 -1651342 -1896686 -1717431 -1346294 -1029982 -899522 -968235 -1061638 -964565
42048 -964565 -795288 -963630 -1542078 -1969626 -1705349 -944787 -304022 -278 144644 9013
42038 9013 -824628 -2190870 -3126647 -2984849 -2298633 -1994628 -2101836 -1920007 -1281565 -835935
42028 -835935 -968037 -1194154 -996114 -658670 -769426 -1293600 -1708464 -1823363 -1900615 -2031503
42018 -2031503 -1912008 -1345161 -627566 -289963 -582196 -1222286 -1594218 -1348229 -903468
42009 -903468 -1063655 -1925202 -2566666 -2239572 -1476744 -1369621 -1981957 -2275349 -1607058 -507108
41999 -507108 209767 357660 99736 -526805 -1298690 -1553978 -850023 398955 1390029
41990 1390029 1807612 1897240 1980633 2286480 2960698 3808444 4260336 3984255 3273208 2473222
41980 2473222 1443806 131207 -770631 -585342 122575 79819 -829781 -1216309 -136675
41971 -136675 1436269 1809454 703928 -614021 -1074686 -824767 -476123 -181462 121202
41962 121202 143075 -392510 -1032013 -943595 -103748 479993 83585 -689866 -746292 -66676
41952 -66676 314719 -132072 -713564 -642940 -168207 -32366 -345387 -679328 -944857 -1390194
41942 -1390194 -1823447 -1610657 -613460 450682 809621 378224 -448052 -1290981 -1870906
41933 -1870906 -2008701 -1830414 -1667912 -1539872 -1071765 -177244 574284 666425 409022 505365
41923 505365 995109 1163609 556296 -369924 -802223 -472491 237649 892086 1379339 1685338
41913 1685338 1579680 812439 -378018 -1260964 -1397217 -1297504 -1897458 -3308187 -4516769
41904 -4516769 -4592493 -3810971 -3137289 -2866468 -2408114 -1404091 -401460 -167109 -835192
41895 -835192 -2021944 -3265642 -3908435 -3074742 -568452 2371966 4023252 3987674 3389675
41886 3389675 3154172 2894708 1904439 470564 -525852 -816689 -727588 -250503 938860
41877 938860 2527168 3477210 3167928 2051420 959973 262824 -122271 -431842 -1006030
41868 -1006030 -2003959 -2914030 -2908505 -2008369 -1297077 -1518949 -2042583 -1828765 -937990 -310358
41858 -310358 -348693 -544383 -426795 -115837 145288 349331 453997 284923 -101423 -369581
41848 -369581 -355777 -208973 -31578 208096 364146 205471 -65455 95404 752463 1261074
41838 1261074 1157471 822100 878916 1338893 1812135 2247164 2857065 3422460 3292188 2244137
41828 2244137 926379 195950 250492 610038 771668 660893 545881 731731 1298150
41819 1298150 1927275 2013744 1222060 16844 -656715 -435394 -35798 -384175 -1435746
41810 -1435746 -2246060 -2109171 -1211254 -244351 131164 -500720 -1979674 -3325417 -3484832
41801 -3484832 -2561753 -1681759 -1424222 -1189494 -480089 188955 385720 785955 1975778
41792 1975778 2972072 2355311 532637 -592172 -182810 683788 897428 668852 595420
41783 595420 634207 642478 925722 1570852 2052093 2074469 2004000 1945559 1330996 89433
41773 89433 -734586 -406895 291915 274763 -179322 -90329 460111 495131 -209885 -866638
41763 -866638 -1014921 -1038375 -1241486 -1339443 -1043172 -410561 490346 1569897 2303210 2054536
41753 2054536 954200 -186449 -931675 -1542590 -2156045 -2379169 -1951562 -1178870 -420290
41744 -420290 297769 871131 883703 197617 -618072 -864581 -502133 -81448 -65048 -403577
41734 -403577 -620792 -217537 811922 1814166 2075063 1646505 1325104 1745442 2732836
41725 2732836 3592886 3785956 3263725 2384668 1597229 1102186 838100 793703 1029332 1231967
41715 1231967 728486 -603431 -1847107 -2074194 -1511250 -962437 -434300 634976 1887088
41706 1887088 2018236 620896 -956311 -1203600 -219738 676812 548345 -485213 -1689099
41697 -1689099 -2287163 -1931744 -1048427 -449959 -344254 -115917 676343 1624665 2131622
41688 2131622 2175960 1996944 1599286 1102092 1018790 1546807 2051190 1924018 1499872 1376627
41678 1376627 1299517 675742 -108867 -7642 1040327 1840245 1558858 676942 -42538
41669 -42538 -651899 -1489728 -2267507 -2478930 -2320896 -2393890 -2638004 -2368541 -1470901 -821158
41659 -821158 -1132812 -1913897 -2110350 -1454968 -529736 336355 1374408 2408857 2518997
41650 2518997 1326087 -68757 -353186 208758 307362 -325850 -614106 -15173 637449
41641 637449 657620 602424 1039202 1341610 811875 123997 369835 1274967 1705270 1524484
41631 1524484 1504882 1611868 972895 -290381 -759125 230662 1556818 2007159 1822585
41622 1822585 1717085 1449959 504361 -563208 -697473 80835 781325 971281 1182042
41613 1182042 1775926 2338727 2409103 2064878 1506776 690108 -266400 -802639 -511140 235358
41603 235358 627191 283505 -469095 -1062254 -1165900 -759928 -32810 658651 915816 635705
41593 635705 235071 312922 943724 1469019 1228810 422061 -38615 472236 1711366 2982295
41583 2982295 3754609 3757068 2910823 1558571 513496 425473 1094317 1677563 1561362 830975
41573 830975 -12862 -503918 -401968 242745 1093716 1753180 2050436 2034844 1774876 1368675
41563 1368675 1073162 1096575 1209015 876013 -74391 -1191137 -1994967 -2558320 -3195172
41554 -3195172 -3792866 -3878406 -3304389 -2454348 -1706282 -1086914 -578258 -320025 -221220 223642
41544 223642 1280646 2401702 2796102 2402074 1785268 1267217 830981 789141 1640186
41535 1640186 3032607 3758183 3265508 2415493 2109692 1901676 837049 -886874 -2140245
41526 -2140245 -2437238 -2243544 -1861266 -1138016 -386061 -472302 -1585576 -2769928 -3127697
41517 -3127697 -2809301 -2457038 -2361023 -2545893 -3006530 -3425404 -3285670 -2668047 -2280272 -2305638
41507 -2305638 -1992973 -900482 272799 755114 781280 800745 438192 -689879 -1787309
41498 -1787309 -1750833 -824196 -149155 35388 442084 1145703 1353440 867645 430923 349704
41488 349704 84677 -388247 -145117 1101656 2197976 2172877 1616463 1458166 1302230
41479 1302230 188448 -1600366 -2751189 -2676121 -1979490 -1339107 -938971 -954641 -1589093
41470 -1589093 -2460406 -2773047 -2326098 -1712430 -1362782 -1026433 -391828 373821 947688
41461 947688 1210725 1081828 507149 -150688 -239557 326937 780929 442509 -416561 -1045041
41451 -1045041 -1222211 -1330312 -1625213 -1919909 -1932886 -1540549 -694113 525877 1709373
41442 1709373 2323824 2270130 1971975 1762783 1449996 733934 -152140 -594366 -368997 87598
41432 87598 278148 207546 164663 229783 313475 491748 889404 1266943 1134831 376556
41422 376556 -559907 -1199193 -1486607 -1620630 -1759249 -2001508 -2313895 -2339438 -1677245 -552005
41412 -552005 224458 235490 -37532 -14728 212845 399152 854393 1872391 2844226 2860529
41402 2860529 2032079 1308332 1064558 836825 458034 311122 193030 -841118 -2860044
41393 -2860044 -4371496 -4172858 -3039329 -2522616 -2760322 -2709161 -2088263 -1670979 -1733401
41384 -1733401 -1643066 -1257967 -1390206 -2272166 -2717269 -1712601 -20128 830486 599370
41375 599370 312124 496272 633743 447115 581456 1479695 2405456 2346739 1465342 883894
41365 883894 1172665 1752564 1870510 1512826 1047494 498058 -284658 -1016679 -1211874 -1035859
41355 -1035859 -1286233 -2223192 -2925585 -2320175 -579938 1065825 1810556 1951023 2021197
41346 2021197 1923259 1342763 566101 256734 521558 743343 432976 -168246 -518500 -491074
41336 -491074 -412813 -598731 -1132224 -1989023 -3038488 -3871435 -3928304 -3027343 -1669290 -631560
41326 -631560 -280695 -411418 -687082 -975356 -1175635 -999848 -223122 909703 1799649
41317 1799649 2083067 1944201 1792933 1798599 1831770 1727158 1479435 1249821 1248914 1515061
41307 1515061 1746250 1506869 738600 -72097 -417134 -328370 -168661 24335 580614 1498363
41297 1498363 2128242 1907284 1188099 900205 1389304 1997947 1958831 1370816 979930 1185332
41287 1185332 1662554 1964202 2080304 2209980 2311593 2249412 2230751 2639271 3358610 3675236
41277 3675236 3114980 2087666 1338425 938718 311462 -706083 -1355448 -860076 470111
41268 470111 1485113 1460503 711700 -46608 -470207 -495864 80741 1415075 3061274
41259 3061274 4068533 3841747 2737719 1669151 1216042 1218969 1148815 731476 175315
41250 175315 -164289 -239129 -289795 -380833 -232124 244738 462064 -322444 -1955445 -3313269
41240 -3313269 -3509337 -2838745 -2241677 -2149811 -2278457 -2344729 -2451511 -2727958 -3032751 -3160677
41230 -3160677 -3038707 -2610324 -1851389 -1070796 -870461 -1497272 -2407223 -2786877 -2453482
41221 -2453482 -1979517 -1944991 -2342109 -2798676 -3121152 -3359987 -3442199 -3082662 -2210343 -1256439
41211 -1256439 -753183 -747239 -897681 -1063151 -1341143 -1467868 -780725 818955 2333291
41202 2333291 2705765 2150054 1813646 2252789 2931025 3212310 3076904 2662407 1847328
41193 1847328 690222 -305172 -799202 -1006677 -1100047 -790736 -7333 590143 469180
41184 469180 147906 470200 1284469 1713460 1562476 1540755 2080153 2822738 3415793 3962582
41174 3962582 4422813 4347214 3564586 2468789 1311920 -58057 -1362789 -1619090 -381819
41165 -381819 1351209 2218236 2002488 1342762 473283 -748363 -1848245 -1931311 -1007022
41156 -1007022 -165499 -134393 -453470 -435278 -177862 -83661 140 439610 948717 788164
41146 788164 -221815 -1425306 -2093121 -2042518 -1468271 -591449 334898 961877 1058373 738423
41136 738423 353178 167693 171417 170619 55917 -10238 270555 952450 1676961 1993657 1799279
41125 1799279 1338890 831182 286897 -274130 -627251 -517849 22463 634431 900950
41116 900950 641163 11099 -611016 -874337 -685380 -246486 106177 88176 -431129 -1328385
41106 -1328385 -2124626 -2130709 -976192 875820 2264807 2196693 696845 -1179081 -2212226
41097 -2212226 -1965070 -980500 -164520 -12888 -362713 -743964 -865973 -797988 -791462 -966243
41087 -966243 -1129327 -937877 -361740 54413 -337099 -1402124 -2071670 -1423123 157763
41078 157763 1255849 918216 -450918 -1769626 -2469369 -2740092 -2883354 -2867692 -2543394
41069 -2543394 -2005660 -1596493 -1574452 -1785228 -1713225 -1037289 -142354 206745 -193686 -712566
41059 -712566 -745540 -428874 -130068 311249 1187035 2065103 2165091 1564917 1192172 1455566
41049 1455566 1728766 1524203 1306931 1540608 1704082 1135395 316366 272472 937885 1223517
41039 1223517 765902 502275 1097795 1744011 1243680 -281358 -1518295 -1503974 -396291
41030 -396291 1063492 2162754 2358840 1540707 361125 -229605 -58967 77159 -422523
41021 -422523 -1057916 -950430 -162620 327591 -52297 -739207 -797238 7688 1125556 1885592
41011 1885592 1972171 1481626 786526 205995 -350448 -1185006 -2108916 -2337402 -1466560 -212758
41001 -212758 357888 124105 -153624 -43447 110500 -23339 -238027 -241816 -27444 414676
40991 414676 1131725 1723515 1523804 646218 152244 663207 1476721 1702407 1600349 1919866
40981 1919866 2458948 2390484 1781648 1635678 2352127 3171778 3381613 3148277 2802524 2141633
40971 2141633 984744 -180838 -672235 -383322 275115 847473 966440 453298 -356621
40962 -356621 -751734 -435970 139901 467429 550128 485042 19287 -949751 -1823284 -1849730
40952 -1849730 -1034593 -28540 700934 1132570 1327457 1315913 1266854 1341756 1443657 1442980
40942 1442980 1466651 1553639 1270675 274166 -860458 -1080362 -234911 646278 719890 378395
40932 378395 496620 1092393 1354410 826446 -63494 -740404 -1200317 -1657678 -1839330 -1180561
40922 -1180561 272192 1644045 2160445 1965642 1708464 1607754 1389229 975422 654259
40913 654259 525913 328415 -46763 -375584 -620255 -1091608 -1820405 -2307310 -2276679 -2159198
40903 -2159198 -2347359 -2464390 -1979748 -1157391 -715930 -836816 -1197501 -1712359 -2424053
40894 -2424053 -2815343 -2178006 -806209 8851 -517474 -1788452 -2717444 -2898564 -2585926
40885 -2585926 -2082437 -1594318 -1337867 -1411921 -1744877 -2281577 -2907690 -3170658 -2615548 -1557549
40875 -1557549 -930926 -1096701 -1395254 -1230583 -928190 -950649 -883113 -40628 1244113 1844304
40865 1844304 1334788 499114 197590 365810 413074 134779 -154335 -165655 13970 84905
40855 84905 -120616 -480702 -730755 -744851 -629376 -551457 -579179 -695717 -828875 -860927
40845 -860927 -781899 -794194 -992798 -1002247 -387148 521233 791353 133876 -614651 -651571
40835 -651571 -254777 -91190 -50161 393925 1005838 948973 85706 -738561 -824357 -335986
40825 -335986 186164 355300 -62608 -932234 -1456377 -932689 61989 216042 -492118 -440044
40815 -440044 1309979 3396097 3900671 2913690 2106283 2209853 2283756 1438809 22046
40806 22046 -1173497 -1829336 -1834567 -994793 434380 1548600 1677038 1078756 434100 117322
40796 117322 303055 1215202 2713520 4024954 4471297 4243872 3969006 3719958 2997227
40787 2997227 1619573 167875 -520263 -74513 1094663 2002480 1835206 809766 94726
40778 94726 531191 1629336 2209478 1818211 1039913 567329 493375 479871 173311 -496227
40768 -496227 -1041719 -650657 776117 2070103 2026644 1017855 445109 637036 477928
40759 477928 -600008 -1569318 -1475673 -958104 -989746 -1045071 23725 1790516 2529288 1689423
40749 1689423 660516 737096 1553120 2079122 2123576 2090525 1996502 1547926 774602 -73728
40739 -73728 -948885 -1773168 -2080627 -1440549 -80535 1311771 2221076 2440067 1921141
40730 1921141 941185 135389 -119168 -149867 -385588 -582640 -208285 612411 1180042 1174875
40720 1174875 876063 423477 -414101 -1509923 -2077966 -1556108 -407851 388143 426338
40711 426338 106667 -30327 167184 522824 792820 819696 624612 412171 393173 579240
40701 579240 792466 855209 743527 605657 653942 962509 1333486 1444409 1178587 739414
40691 739414 399010 222758 100416 -46357 -194387 -318751 -469050 -737568 -1180546 -1741142
40681 -1741142 -2216148 -2356016 -2085413 -1606259 -1176197 -771379 -124599 779683 1405361
40672 1405361 1163260 228310 -489402 -378568 190409 525753 611356 871112 1122411 575747
40662 575747 -911919 -2317881 -2666631 -2230178 -1960296 -2158616 -2390489 -2430847 -2504881 -2630397
40652 -2630397 -2452256 -1845860 -1069393 -177527 1093930 2613453 3611849 3546087 2786165
40643 2786165 2062573 1580564 1072692 434299 -131587 -447049 -477253 -216377 274149 821588
40633 821588 1337120 1887516 2394777 2540511 2250705 1987522 2157551 2435872 2135243 1151690
40623 1151690 115772 -353826 -170175 365847 793107 626596 -218899 -1071429 -1061454 -187380
40613 -187380 626084 688897 258243 -160723 -645225 -1456948 -2231215 -2298769 -1756285 -1550573
40603 -1550573 -2284045 -3366105 -3640587 -2657169 -1123201 -209618 -520839 -1634642 -2542380
40594 -2542380 -2574625 -1916366 -1212608 -829467 -684610 -624985 -572634 -307319 407146 1256238
40584 1256238 1353396 201687 -1531918 -2625958 -2614755 -2113184 -1864261 -1895674 -1771243
40575 -1771243 -1324284 -829226 -571559 -533673 -560736 -674283 -1065225 -1760609 -2443063 -2768653
40565 -2768653 -2793657 -2811763 -2753389 -2160244 -992632 -48878 -118392 -979219 -1765842 -2127360
40555 -2127360 -2361459 -2497098 -2080961 -1080895 -220875 3101 7595 337102 774135 837231
40545 837231 680058 754147 878020 440468 -530191 -1198206 -917235 95966 1131248
40536 1131248 1604636 1309279 489738 -256928 -452240 -115182 482819 1153298 1567586
40527 1567586 1162365 -80660 -1107659 -895971 56478 235957 -903695 -2387301 -3245966
40518 -3245966 -3596893 -3882741 -3991737 -3667474 -3052119 -2312012 -1386761 -550944 -461150 -1086340
40508 -1086340 -1366496 -639516 305087 408910 -70330 -104691 491428 1042135 1254906 1386346
40498 1386346 1323841 604122 -586516 -1401764 -1492756 -1342605 -1295082 -1104176 -708963 -616380
40488 -616380 -1056871 -1414666 -1048058 -266361 22472 -548397 -1379361 -1578169 -913740 -85517
40478 -85517 65034 -348050 -335080 509397 1195335 671970 -513604 -919888 -324988 118333
40468 118333 -91926 -42572 799331 1366355 580556 -794965 -1128444 -226197 539005 211201
40458 211201 -734955 -1404132 -1531393 -1253797 -581852 472030 1634284 2550551 3005107
40449 3005107 2838741 1927869 419281 -1186556 -2331560 -2749711 -2567362 -2161167 -1842499
40440 -1842499 -1556457 -980061 -24806 916904 1389235 1376178 1198748 1071153 984454 912040
40430 912040 912702 1078961 1451437 1817811 1605731 406049 -1210670 -1923404 -1150654 111855
40420 111855 512843 44738 -225664 74565 60961 -1007138 -2563168 -3437306 -3214940
40411 -3214940 -2408036 -1626414 -1121934 -1020596 -1471706 -2400075 -3367642 -3891637 -3892374 -3759101
40401 -3759101 -3928237 -4373844 -4564791 -4026370 -2962352 -2211576 -2450031 -3379041 -3806728
40392 -3806728 -2769581 -671225 961849 1154039 669520 1008336 2338146 3219982 2640194
40383 2640194 1480455 1297547 2227964 2993742 2723116 1839103 1122582 743299 477343
40374 477343 235672 16248 -256651 -557123 -709674 -687797 -695877 -871379 -1193900 -1703706
40364 -1703706 -2444596 -3171207 -3522985 -3513181 -3399782 -3073855 -2147934 -742302 445512
40355 445512 1057063 1439839 1846964 1944714 1510596 967003 688031 357259 -348158 -940143
40345 -940143 -758474 -112231 5474 -783201 -1913471 -2775640 -3284568 -3543336 -3532800 -3236387
40335 -3236387 -2662488 -1772305 -789860 -401115 -1019703 -1923568 -1858194 -641027 507943
40326 507943 498699 -350781 -913336 -655683 -50737 87221 -659247 -1995162 -3076123 -3196046
40316 -3196046 -2478611 -1652955 -1098269 -537329 195081 649779 396859 -300775 -884944
40307 -884944 -1171523 -1146377 -523427 800797 2083311 2299192 1409824 437866 174211
40298 174211 389785 495798 390795 299552 225688 33176 -163208 -136756 -19591 -274807
40288 -274807 -1112904 -2117591 -2554986 -2039677 -902270 101202 477899 370910 225482
40279 225482 258554 456777 911737 1723924 2556980 2774576 2261759 1734254 1892963 2529046
40269 2529046 2826976 2368021 1454915 581658 31355 -7578 590261 1560340 2164907 1771049
40259 1771049 545261 -575213 -733427 -16000 640127 537104 55442 52695 514446
40250 514446 434761 -735243 -2215653 -3015378 -3281520 -3676882 -3883780 -2912124 -840475
40241 -840475 982007 1765214 2166814 2839592 3210935 2557466 1376661 601567 88364
40232 88364 -915806 -2178369 -2626143 -2015934 -1266273 -972789 -692413 -24259 612319
40223 612319 784933 785294 949174 928170 334648 -395239 -534390 -192896 -228576 -1088576
40213 -1088576 -2241442 -2779180 -2271566 -1070406 -26900 144453 -579145 -1629245 -2505635
40204 -2505635 -3104770 -3367179 -3026645 -1980682 -613692 521557 1125611 1110794 518151
40195 518151 -255251 -516212 71890 1126142 2048286 2542866 2449443 1648229 574348
40186 574348 224556 946938 1656206 1078971 -476562 -1469096 -1145034 -302982 71913
40177 71913 57490 284508 786612 856326 -149460 -2032774 -3617949 -3531513 -1579445 730062
40167 730062 1615782 969519 233992 338638 644761 258579 -520621 -776292 -400774 -114850
40157 -114850 -329081 -743380 -1034285 -1298077 -1668819 -1925228 -1699380 -928074 -10932 467589
40147 467589 287216 -86772 50446 759081 1293269 1024420 226763 -363428 -493769 -468118
40137 -468118 -442360 -185292 381857 855983 815509 366220 -56379 -327034 -764156 -1533274
40127 -1533274 -2179878 -2070042 -1242366 -454532 -292094 -643211 -1268668 -2335895 -3817033
40118 -3817033 -4803134 -4316286 -2731239 -1497145 -1300480 -1341858 -696515 463713 1441598
40109 1441598 1997978 2161527 1756172 858879 211330 412027 1047325 1274800 908316
40100 908316 319186 -269798 -669283 -411066 529657 1091563 243006 -1497042 -2709172
40091 -2709172 -3053641 -3408003 -4076775 -4240628 -3519773 -2800955 -2878041 -3286186 -3172293 -2469681
40081 -2469681 -1526310 -368307 906756 1694224 1623882 1151638 701279 -87813 -1371137
40072 -1371137 -2055886 -960003 1328896 2964715 3103716 2521963 2008948 1393904 446513
40063 446513 -424677 -925201 -1384172 -1883755 -1726482 -561956 648870 767571 151850
40054 151850 143295 1015230 1505431 625219 -978572 -1960514 -1908888 -1417671 -975016 -535525
40044 -535525 -85973 71713 -213383 -657048 -944395 -1081187 -1129661 -906506 -226934 759941
40034 759941 1734204 2507952 2913630 2634695 1537506 47805 -1199504 -2031999 -2690569
40025 -2690569 -3180122 -3150592 -2516744 -1773314 -1506755 -1866362 -2591221 -3230595 -3287697 -2583520
40015 -2583520 -1632671 -1223903 -1429561 -1501508 -1028285 -671059 -1263492 -2566165 -3489572
40006 -3489572 -3344486 -2353708 -1105242 -71165 391779 145820 -483653 -930742 -942287
39997 -942287 -657026 -205180 402862 1034077 1511970 1971153 2700312 3546595 3928223 3621727
39987 3621727 3105522 2825730 2490315 1539893 146950 -765509 -626307 22719 185402
39978 185402 -290633 -495103 256263 1253974 1059320 -650926 -2487224 -2912366 -1961005
39969 -1961005 -939430 -744081 -1079434 -1218802 -912727 -438849 -218170 -530730 -1280193
39960 -1280193 -1962787 -2176909 -2166422 -2482052 -3100955 -3352080 -2820328 -1853907 -987821 -309672
39950 -309672 342759 951112 1415580 1810487 2253720 2731918 3241559 3816863 4228047 4042243
39940 4042243 3318878 2881402 3414768 4494444 4999783 4398196 3153439 1900771 754870
39931 754870 -390293 -1327200 -1688309 -1473907 -1089940 -854588 -715748 -531419 -387381
39922 -387381 -408312 -395815 -8882 659499 1062123 939807 734355 968613 1552544 2114540
39912 2114540 2686381 3449783 4005274 3658092 2494298 1479779 1308877 1759133 2350782
39903 2350782 2956756 3466443 3545376 3192673 2969218 3206339 3529132 3621650 3810161 4238118
39893 4238118 4120813 2769542 960321 217816 808042 1414009 936137 -227639 -960433
39884 -960433 -789298 -103593 510946 783404 821669 849857 804930 359005 -394612 -625066
39874 -625066 253214 1495490 1739479 819899 -684 146754 552139 70494 -1247082
39865 -1247082 -2355888 -2607168 -2192767 -1390836 -107917 1655519 3328037 4072443 3540083
39856 3540083 2245347 1142111 757046 766529 513712 -167930 -842632 -1069253 -829368
39847 -829368 -434290 -300998 -714593 -1451851 -1771973 -1253254 -526664 -581126 -1379765 -1877420
39837 -1877420 -1498334 -808948 -476794 -376741 -170422 -24353 -165678 -343771 -355768 -546287
39827 -546287 -1128824 -1571997 -1427025 -1236973 -1697696 -2341720 -2176728 -1452526 -1553894 -2921201
39817 -2921201 -4170149 -3785686 -1917713 32582 1012737 972235 398187 -192279 -498734
39808 -498734 -628582 -958415 -1558727 -1924215 -1516245 -426661 687549 1168837 712647
39799 712647 -577812 -2181986 -3332504 -3539563 -3047981 -2631454 -2809930 -3263264 -3116204
39790 -3116204 -1935260 -386260 386770 112500 -285916 -11745 411270 -125623 -1637691
39781 -1637691 -2895088 -3011829 -2430791 -2024320 -1846747 -1276481 -28336 1467024 2554363
39772 2554363 2909899 2703492 2397734 2306947 2322690 2227107 2137069 2226450 2127748 1293359
39762 1293359 57403 -452518 179667 1013019 1162239 1109023 1787041 2943970 3457942
39753 3457942 3021571 2459887 2387808 2528448 2514215 2451531 2369267 1897910 962833 219877
39743 219877 327593 1159025 2057592 2515956 2375899 1788565 1222435 1080676 1121094 784675
39733 784675 267510 489008 1574780 2237843 1458022 81899 -278510 498273 1045486
39724 1045486 619616 27034 251523 1159685 1931465 1996934 1220762 -101623 -1093262
39715 -1093262 -906159 76598 370646 -766015 -2319226 -2948916 -2727763 -2657853 -3039826
39706 -3039826 -3298230 -3103297 -2688210 -2167928 -1428612 -685967 -372494 -452630 -538388 -602583
39696 -602583 -818324 -846640 -279002 234401 -510741 -2367858 -3634301 -3276658 -2242635
39687 -2242635 -1860528 -2046991 -2072587 -2074813 -2484181 -2666743 -1681593 -97379 474419 -302997
39677 -302997 -1068170 -910643 -553017 -835413 -1300377 -1189903 -874594 -1156822 -1722723 -1491843
39667 -1491843 -383333 341418 -243299 -1469852 -1951822 -1308958 -528884 -686370 -1707237
39658 -1707237 -2608202 -2750871 -2448535 -2238449 -2004945 -1245857 64003 1427017 2510814
39649 2510814 3262825 3368047 2348166 438023 -1302447 -2110917 -2205826 -2028792 -1486488
39640 -1486488 -497873 327375 357710 -51369 -3237 644629 1140347 911753 121087 -813952
39630 -813952 -1585535 -1820993 -1173475 207033 1687697 2693836 2889825 2016047 217804
39621 217804 -1508032 -2020249 -1402245 -884365 -1132529 -1431756 -1027647 -410548 -453443 -923289
39611 -923289 -890788 -298476 -16807 -352435 -587231 -306369 -219825 -1049865 -2281587 -2786531
39601 -2786531 -2338013 -1754943 -1642020 -1683610 -1337637 -704165 -372021 -622663 -1068749 -1088042
39591 -1088042 -518905 153691 405152 405419 806674 1642352 1910920 786946 -1064461 -2136677
39581 -2136677 -1965120 -1489566 -1389847 -1081290 69437 1462549 2142501 2309857 2824516
39572 2824516 3576214 3629837 2946059 2625383 3123215 3457142 2803011 1823311 1576857 1933611
39562 1933611 2025725 1668939 1317359 1005124 408294 -166548 133256 1492392 3050671
39553 3050671 3910300 3935828 3441829 2664177 1755190 900483 242284 -149881 -307328 -527078
39543 -527078 -1169809 -1953953 -1961020 -958634 -144477 -590839 -1396736 -734410 1360514 2777155
39533 2777155 2248654 970527 567075 849415 760346 434930 790431 1629382 1709631 663074
39523 663074 -434467 -596810 -17947 617380 1036204 1234853 1123636 733740 355575
39514 355575 194385 219563 480768 1170667 2215170 3136982 3426243 2772788 1061416
39505 1061416 -1301039 -3082494 -3037716 -1372327 209813 369153 -449386 -947303 -824163
39496 -824163 -929207 -1747087 -2584292 -2521454 -1598318 -629829 -154261 -13361 135618 352203
39486 352203 562138 792688 983776 815602 104915 -738068 -1083284 -930618 -929004 -1413705
39476 -1413705 -1906135 -1842603 -1324892 -733368 -46561 852033 1520132 1378698 716438 532345
39466 532345 1258755 2247124 2649343 2218180 1099976 -478280 -2002062 -2777694 -2677043
39457 -2677043 -2277567 -1895608 -1104750 234770 1133633 575795 -884725 -1643499 -1114833
39448 -1114833 -291774 -66645 -10090 623700 1493737 1644939 980968 352165 231950 165527
39438 165527 -216148 -388067 255150 1172849 1040227 -560774 -2376369 -2773332 -1559562
39429 -1559562 -162580 -45280 -1231516 -2460727 -2581315 -1631299 -626169 -466113 -1159188
39420 -1159188 -2068225 -2691868 -2953893 -2796515 -1937495 -346498 1287099 2026910 1666216
39411 1666216 910951 526874 593930 685572 463742 -102711 -870486 -1610871 -2057285 -2047675
39401 -2047675 -1614142 -934829 -338855 -307077 -1103620 -2251526 -2742565 -2104554 -1020648
39392 -1020648 -512441 -694626 -808161 -412110 31068 -66050 -544301 -777419 -524920 -70279
39382 -70279 347269 745583 992135 680845 -262827 -1157093 -1182128 -351667 511540 771131
39372 771131 570903 391498 474312 880809 1645169 2480647 2723535 2079072 1150480 679323
39362 679323 515783 34013 -601883 -489546 564625 1540424 1531222 817659 112527 -553640
39352 -553640 -1464713 -2236461 -2061566 -801716 810807 1994789 2453597 2239723 1626178
39343 1626178 1051150 747802 510324 177249 104197 693625 1712480 2596486 3123522
39334 3123522 3169402 2220457 105998 -1971376 -2292571 -701027 1159060 1928068 1848324
39325 1848324 1643044 1207822 184828 -1001839 -1586870 -1434052 -856742 -5878 834508
39316 834508 917463 -88622 -1296676 -1615979 -1276053 -1367192 -2071019 -2428659 -1895455 -1088393
39306 -1088393 -766856 -965754 -1408156 -1923224 -2101999 -1359086 169306 1454015 1783388
39297 1783388 1541018 1326853 1016856 353060 -196230 -72719 293091 36128 -672469
39288 -672469 -716444 306859 1451516 1772394 1520648 1487696 1755495 1735742 1116069 154107
39278 154107 -798244 -1481242 -1500099 -541925 979960 1987424 1820408 1015553 642935
39269 642935 991073 1294403 790709 -316867 -1140057 -1086307 -274148 878838 2072081
39260 2072081 3023978 3323082 2754558 1730095 1067098 1194123 1734285 2009436 1817110
39251 1817110 1522638 1496630 1759741 2205346 2828087 3511050 3839297 3484105 2709742 2165776
39241 2165776 2134668 2250948 2008372 1259175 135460 -1178637 -2377268 -3007102 -2811284
39232 -2811284 -1984947 -912449 162189 1017565 1306729 916432 316547 132669 421545
39223 421545 738708 848138 900108 880616 407037 -694365 -1972528 -2778979 -2889386 -2536874
39213 -2536874 -2073695 -1753941 -1592403 -1286153 -560526 260692 419732 -257084 -898300
39204 -898300 -604611 326085 726726 29639 -1106953 -1679825 -1383542 -641508 -19082
39195 -19082 124270 -320683 -1154751 -1878882 -1991319 -1399018 -553455 -164578 -682901 -1939496
39185 -1939496 -3283774 -4106896 -4184095 -3560126 -2423239 -1310234 -1093239 -2207028 -3896004
39176 -3896004 -4757664 -4231718 -3142835 -2526462 -2350223 -1847997 -822609 24106 91394
39167 91394 -355352 -670620 -662656 -560580 -423260 -96141 272378 201554 -398811 -863072
39157 -863072 -522045 366345 863922 497385 -246209 -636164 -515698 -217434 -3643 120059
39147 120059 266507 655754 1572427 2982269 4255250 4603756 3840088 2502654 1274686
39138 1274686 508820 254781 405852 714578 894528 819515 508839 -43040 -783440 -1354028
39128 -1354028 -1247798 -366708 766999 1477935 1485342 967565 320956 -56041 8540 264865
39118 264865 224400 -319575 -1065950 -1562672 -1616767 -1296720 -786474 -375814 -332864 -567107
39108 -567107 -622823 -226921 357638 757901 1026165 1403284 1747350 1675540 1239982 959856
39098 959856 1038484 989255 331605 -655578 -1262420 -1284087 -1220543 -1515174 -1965343 -2086855
39088 -2086855 -1807704 -1486492 -1341085 -1229777 -1083122 -1185988 -1725580 -2271605 -2126616
39079 -2126616 -1201519 -179248 302948 328349 402058 770120 1284147 1721836 1928637 1753522
39069 1753522 1162165 411930 -130364 -373738 -525465 -725111 -847903 -720075 -387566
39060 -387566 -112113 -156064 -528090 -858348 -654789 94407 648533 171062 -1244643 -2471693
39050 -2471693 -2461675 -1309461 -41286 510670 378708 74477 -125663 -305101 -464821
39041 -464821 -271415 586876 1889518 2929155 3133593 2543675 1615765 677221 -266931
39032 -266931 -1241935 -2044705 -2409090 -2350200 -2197694 -2247017 -2451239 -2519056 -2266922 -1776533
39022 -1776533 -1234559 -787699 -602648 -830380 -1298233 -1430678 -834114 100388 588689
39013 588689 490015 471323 933531 1307999 916394 145547 39709 790592 1388951 1020082
39003 1020082 167922 -143152 233094 525368 244042 -228869 -319936 37096 627680 1394083
38993 1394083 2227525 2656824 2288391 1449804 885148 805389 718932 234364 -528064 -1445414
38983 -1445414 -2621221 -3730568 -3816610 -2413603 -422502 864557 1271400 1493270 1693689
38974 1693689 1379131 580593 36622 13138 -10807 -189786 62743 822704 1134812 454580
38964 454580 -407591 -660653 -877935 -1849926 -2925306 -2860577 -1774756 -811151 -195405
38955 -195405 808054 2081418 2455076 1654569 928352 1106039 1341439 622052 -562746
38946 -562746 -1071046 -832904 -659009 -812746 -802763 -412049 -66690 -148828 -542841 -934375
38936 -934375 -1162665 -1228935 -1194997 -1072685 -736946 -101632 585901 918546 875259 845750
38926 845750 996142 977528 413034 -643131 -1792428 -2492069 -2251066 -1165688 -177429
38917 -177429 -76746 -276863 504967 2241343 3385859 3047304 2189866 1975744 2045795
38908 2045795 1460694 428830 -134179 -167744 -349398 -772685 -902043 -653390 -464067
38899 -464067 -383547 -38667 556029 991329 1175932 1288802 1195175 698792 142136 -93610
38889 -93610 -401762 -1298551 -2261622 -2374375 -1928474 -2048843 -2704791 -2532077 -969933 770569
38879 770569 1432679 1236940 1013599 864316 501841 98464 -53235 -142134 -376224 -426181
38869 -426181 6139 512784 508109 78894 -242591 -253442 -171283 -230343 -543456 -1076483
38859 -1076483 -1510074 -1484027 -1143613 -962786 -898888 -395118 542355 1056158 631471 -194709
38849 -194709 -817179 -1458999 -2438887 -3315538 -3595011 -3663072 -4084227 -4450725 -3925684 -2640301
38839 -2640301 -1547234 -971938 -253241 1040505 2294795 2544011 1575513 151166 -687766
38830 -687766 -551653 -54289 -68129 -605367 -890458 -660090 -678434 -1537556 -2656832 -3122613
38820 -3122613 -2918500 -2576732 -2160607 -1475759 -872336 -880213 -1279173 -1398170 -1137293 -876874
38810 -876874 -636333 -245353 -134785 -914576 -2192569 -2810705 -2350770 -1528144 -1026804
38801 -1026804 -838720 -854444 -1171064 -1577395 -1549668 -1002406 -359631 176192 606404 397190
38791 397190 -1134953 -3430417 -4793591 -4397528 -3213905 -2396864 -1731300 -449136 1276993
38782 1276993 2614614 3275655 3507430 3252635 2220914 673370 -578635 -974733 -608577
38773 -608577 16580 294060 -146818 -985770 -1318216 -596531 725670 1738212 1941548
38764 1941548 1342725 208516 -833324 -950428 -6870 981645 898201 -150249 -1065222
38755 -1065222 -1111159 -520706 78286 306541 187211 98283 491896 1319357 1922594 1855908
38745 1855908 1529354 1555933 1747823 1387756 341520 -755152 -1380538 -1581601 -1540170
38736 -1540170 -1324630 -1196656 -1552121 -2273990 -2590366 -1895682 -455120 897737 1510254
38727 1510254 1227630 300587 -747814 -1367954 -1403947 -1250163 -1409582 -1876477 -2086476
38718 -2086476 -1580394 -670699 -232231 -666376 -1282920 -1105707 -218109 262439 -280515
38709 -280515 -1066012 -1008053 -240839 73366 -744207 -2138792 -3013280 -2723803 -1472783
38700 -1472783 -136698 360261 -127134 -838914 -1077469 -1023437 -1186244 -1434218 -1255709
38691 -1255709 -740312 -489542 -621493 -693924 -652821 -975402 -1676347 -2049977 -1751234 -1312552
38681 -1312552 -1131848 -754203 207479 1143567 1235654 673145 261684 184826 12715 -298684
38671 -298684 -339764 -138998 -225406 -636742 -653616 164643 1294662 1927772 1821786 1190037
38661 1190037 306123 -376936 -267091 608056 1259823 820375 -257333 -768536 -400374
38652 -400374 -21777 -257504 -618675 -436647 66489 260820 139028 114275 104877 -340759
38642 -340759 -1081789 -1385660 -1029351 -633023 -617279 -561236 -59314 419008 162485 -715888
38632 -715888 -1507826 -1915055 -2156319 -2260583 -1968793 -1331510 -770502 -460754 -176695 186782
38622 186782 476768 751799 1316439 2092795 2480603 2116134 1356569 786367 665739 1067115
38612 1067115 2013890 3113299 3559069 3028780 2234682 2050395 2370875 2416501 1956215
38603 1956215 1556356 1646731 1999957 2270552 2460524 2592322 2429727 1912073 1495539 1584464
38593 1584464 1804969 1332079 -45956 -1575706 -2350614 -2172995 -1477219 -711947 -90417
38584 -90417 239506 184389 -84913 -203679 -14514 285709 467355 524893 550678 633161
38574 633161 985926 1796099 2702064 2868516 2048397 1168264 1145633 1373941 360157 -1997835
38564 -1997835 -3793904 -3355048 -1353972 85189 -110533 -1216420 -2145447 -2581942 -2583773
38555 -2583773 -2041921 -1083665 -433693 -721047 -1610345 -2106878 -1694643 -829841 -288790
38546 -288790 -311258 -502830 -420350 -83638 114234 -75320 -452143 -658983 -682364 -853830
38536 -853830 -1308119 -1668516 -1494359 -963129 -821246 -1502268 -2427337 -2437122 -1034039 918063
38526 918063 1915214 1274318 -229348 -1223885 -1109556 -452409 -127320 -318531 -461793
38517 -461793 -13591 923841 1745365 1950934 1531908 873169 428839 441603 756639 842839
38507 842839 218980 -959795 -1898602 -1976926 -1443793 -1012971 -880426 -601892 -15865 252295
38497 252295 -405903 -1612279 -2343823 -2137469 -1476744 -965339 -620408 -213791 101891
38488 101891 -32288 -490903 -594110 100399 1160111 1661984 1170587 155260 -607104
38479 -607104 -900413 -1212137 -2057277 -3311190 -4285813 -4412868 -3777793 -2964377 -2411418
38470 -2411418 -2008620 -1416384 -728159 -567020 -1348647 -2608344 -3353192 -3082071 -2209493
38461 -2209493 -1461207 -1148099 -1149631 -1296654 -1484909 -1564878 -1405766 -1042484 -592122 -98810
38451 -98810 375005 624266 516601 271105 248518 461023 569177 433219 387642 787825
38441 787825 1464794 1858082 1656855 1162855 986712 1410360 2045219 2180523 1568375 766577
38431 766577 459975 501678 75125 -1014988 -1737487 -1061170 519972 1428275 962314
38422 962314 48456 -185681 214734 601719 912655 1388704 1573435 746241 -664340
38413 -664340 -1230443 -423044 590915 545698 -371786 -1191347 -1573224 -1684963 -1306184 -160522
38403 -160522 1135043 1519381 855638 -43880 -701745 -1310407 -1760522 -1468604 -525356
38394 -525356 15169 -441271 -1167576 -1302624 -1108985 -1275984 -1657761 -1673280 -1525607 -1966984
38384 -1966984 -2972154 -3620622 -3409666 -2848549 -2479524 -2030088 -1038965 95179 296355
38375 296355 -917722 -2678797 -3518377 -2874253 -1653365 -1118655 -1403375 -1539619 -904738
38366 -904738 -33761 233328 -166152 -705192 -1050207 -1125720 -781584 -9851 738733 1023277
38356 1023277 1010654 1079587 1064601 517177 -447033 -1220552 -1523670 -1497677 -1080349 -53486
38346 -53486 1238066 1968252 1804747 1160309 353332 -733353 -1913562 -2432515 -1973614
38337 -1973614 -1345623 -1548774 -2491730 -3167408 -2884390 -1869292 -793728 -123480 62081
38328 62081 -119763 -581015 -1209759 -1555916 -919971 771113 2380367 2560302 1384139
38319 1384139 265571 113224 382808 276897 -42715 -112251 -259545 -1090117 -2278197
38310 -2278197 -2775336 -2077472 -603050 959248 1962026 1735135 154124 -1717318 -2417223
38301 -2417223 -1675083 -501392 375999 1277829 2501148 3424638 3339165 2529741 1786442
38292 1786442 1240816 439051 -648989 -1456662 -1672031 -1629169 -1701790 -1802853 -1700345 -1445309
38282 -1445309 -1219603 -1007517 -675218 -250432 46369 -35451 -632819 -1591223 -2348549 -2273933
38272 -2273933 -1336238 -212223 515234 1026407 1797936 2719816 3216717 3163796 3031938
38263 3031938 2978809 2459165 1139781 -340640 -1119894 -1299456 -1731067 -2724575 -3589967
38254 -3589967 -3554605 -2670346 -1671983 -1255675 -1559174 -2057675 -1965058 -1058476 -74196 99556
38244 99556 -420696 -663767 -144242 551418 733000 546773 502710 527711 108215 -783901
38234 -783901 -1470434 -1361977 -644735 -39303 -24637 -413800 -689908 -682097 -722999 -1031801
38224 -1031801 -1221661 -804239 -26802 331902 35981 -276428 15259 804915 1646834
38215 1646834 2319315 2702345 2621652 2239073 2148823 2588513 2910801 2366888 1142009 74637
38205 74637 -451832 -783015 -1252118 -1671962 -1591188 -722848 829561 2474488 3374128 3122308
38195 3122308 2125014 1080581 266053 -384905 -763716 -598441 113908 1049677 1869802
38186 1869802 2362552 2482844 2502911 2817360 3276541 3116727 2024656 844610 564817
38177 564817 931880 861076 31701 -777032 -892979 -440546 233619 957055 1364039 986710
38167 986710 67013 -469025 -272568 -122291 -695618 -1404769 -1141375 184248 1505900
38158 1505900 1837841 1143210 116913 -416470 23013 1210934 2256102 2328803 1474824
38149 1474824 544245 277477 603187 863366 593571 -17309 -411397 -289413 153849
38140 153849 551650 674209 377673 -370015 -1138236 -1076467 181956 1818897 2559582
38131 2559582 2073632 1204087 862547 1198444 1822895 2254977 2051278 1071276 -190493
38122 -190493 -993608 -1178789 -1111126 -786223 241739 1779267 2664139 2113197 822318
38113 822318 45091 -30382 -264831 -1122297 -1949824 -1793083 -494008 1144537 2066979
38104 2066979 1830834 947044 364931 563760 1222761 1708841 1601160 772746 -574911
38095 -574911 -1812971 -2285456 -2055885 -1856816 -2068770 -2196345 -1636681 -483203 801582
38086 801582 2028220 3125956 3777612 3769200 3412693 3106031 2726109 1952888 957523 263174
38076 263174 99982 337175 852592 1544687 2193540 2709438 3269634 3861569 4096388 3920107
38066 3920107 3987536 4682487 5284544 4959926 4150184 3947237 4369985 4447935 3966985 3853500
38056 3853500 4549428 5189833 4911045 3980832 3022232 2017124 852757 156834 711998
38047 711998 2405286 4409422 6033871 6823095 6316901 4544564 2524397 1498367 1715435
38038 1715435 2509660 3358897 4175032 4706095 4513223 3706282 3015863 2862014 2854945 2450659
38028 2450659 1652748 857563 451303 764395 1913163 3372603 4212448 4196131 4198745 5006975
38018 5006975 6132509 6519562 6093916 5674802 5435752 4571951 2845598 1402806 1290440
38009 1290440 1948521 2175597 2073904 2817009 4595374 6064028 6187701 5581249 5398335
38000 5398335 5719357 5877048 5854787 6399698 7845262 9619761 11099853 12442842 14326070
37991 14326070 17105100 20409616 23519930 26110122 28585795 31598786 35366347 39781695
37983 39781695 45053565 51681728 59906802 70094609 83693916 102071899 122896290
37976 122896290 138670503 141277508 128937360 107856536 86674907 70106334 57982712
37969 57982712 48597326 41216122 35779446 31887268 28839427 26125443 23421224 20416346
37961 20416346 17052080 13835748 11560383 10545266 10253545 9786454 8698402 7209521
37953 7209521 5764622 4709239 4335539 4713461 5285078 5178596 4310991 3659026 3917409
37944 3917409 4440618 4271082 3702281 3738819 4285081 4225416 3453131 3396519 4868064 6579102
37934 6579102 6786861 5579578 4409128 3940124 3644194 3313172 3602556 4720008 5633626
37925 5633626 5271933 3924518 2771770 2344555 2151466 1796653 1753768 2612034 3921494
37916 3921494 4417190 3494895 1990345 1177583 1316669 1622702 1460399 1002138 698333
37907 698333 670029 846486 1263891 1906397 2513460 2825266 2857817 2744402 2468936 1938348
37897 1938348 1213364 554898 307817 700058 1570867 2356432 2625829 2609313 2878088 3513987
37887 3513987 3980840 3877777 3439736 3177893 3346011 3860465 4474926 5002790 5602044
37878 5602044 6688462 8191888 9173604 8841341 7773187 7314478 7824391 8482619 8869558
37869 8869558 9520281 10525734 10862030 9918431 8638807 8133232 8002006 7189178 5851886
37860 5851886 5086632 5139998 5185556 4829171 4657904 5110674 5768941 6059376 5921335 5505055
37850 5505055 4818510 3960807 3284596 3130434 3645223 4781576 6113938 6837637 6481344
37841 6481344 5539508 4909751 4831327 4905389 4978316 5307601 5874494 6206216 5984682 5320134
37831 5320134 4407802 3430195 2778913 2821916 3434205 4232415 5165449 6307559 7223885
37822 7223885 7272656 6509271 5576033 4731885 3797561 3070943 3314388 4530319 5623187
37813 5623187 5755523 5379361 5464402 6279715 7415542 8524777 9525280 10353975 10909187
37804 10909187 11078084 10711043 9891329 9267158 9598883 10814894 12047125 12822897 13668320
37795 13668320 15208673 17189605 18851884 19962651 21046952 22717971 25031325 27459577
37787 27459577 29463154 31162073 33322820 36572945 40979329 46661422 54230591 63978729
37779 63978729 75125678 86648450 98386504 110575931 123208273 137257833 155709337
37772 155709337 181427693 214626944 254673259 303031381 359340338 412841964 442882152
37765 442882152 433716910 388744385 327290934 268202707 219240765 180295748 150451188
37758 150451188 129065957 113669478 100923621 89279874 78819282 69244222 59834539
37751 59834539 50916440 43651605 38305549 33896136 29610863 25598540 22239037 19454363
37743 19454363 16997000 14860594 13154705 11906796 11125679 10801492 10746109 10627944 10249306
37734 10249306 9687785 9134844 8662189 8173861 7592839 7073880 6895439 7037609 7028934 6417308
37724 6417308 5272502 4021650 2974986 2291898 2164356 2566744 2960527 2777092 2176071
37715 2176071 1832818 1989328 2256314 2379161 2573178 2926206 3066381 2719752 2110536
37706 2110536 1505866 828118 68458 -367245 -203389 121412 -66068 -737693 -1171263
37697 -1171263 -909434 -350100 -247609 -823135 -1541906 -1746232 -1370200 -922540 -851655 -1151602
37687 -1151602 -1562730 -1791258 -1449584 -304950 1104278 1672517 1094020 495858 957180
37678 957180 1883517 1867932 828694 -4248 -196763 -711447 -1962753 -2715875 -1865035
37669 -1865035 -227921 598455 484435 684464 1877508 3406608 4386295 4645038 4501485
37660 4501485 4298889 4249876 4265642 3978856 3331825 2930484 3319811 4131705 4486430 4005557
37650 4005557 2891522 1372233 -176170 -877802 -128264 1329834 2078461 1849347 1682617
37641 1682617 2081234 2155684 1166877 -122282 -555637 -336217 -588088 -1484935 -1899927
37632 -1899927 -1009959 606033 1765308 1973976 1559586 939511 223156 -571078 -1252242
37623 -1252242 -1515274 -1205892 -518766 100099 350605 389608 636761 1249440 1907253 2140814
37613 2140814 1733078 771324 -457141 -1447492 -1579248 -596598 1006053 2357130 3013506
37604 3013506 3155677 3007912 2516674 1812056 1519611 2117906 3195742 3833330 3634148
37595 3634148 2958119 2256027 1700851 1443730 1637316 2075921 2322806 2325835 2394801 2461787
37585 2461787 2015489 1027261 258396 215132 406226 148062 -466847 -986900 -1400664 -1776122
37575 -1776122 -1612579 -475361 1022188 1814828 1811296 1807402 2083127 2104412 1684222 1379197
37565 1379197 1442821 1369640 928053 746961 1273621 1913864 1926999 1570502 1557619 1803448
37555 1803448 1564768 654790 -243190 -479417 -70162 589971 1110309 1114642 382587 -746770
37545 -746770 -1400913 -927235 377673 1443254 1443299 645873 94786 334316 702648 236419
37535 236419 -950752 -1801781 -1804790 -1606284 -1895826 -2419114 -2589496 -2449718 -2358431 -2177589
37525 -2177589 -1520563 -532583 307116 978826 1780905 2500674 2529122 1901290 1497152 1949465
37515 1949465 2897368 3581532 3718319 3510640 3170471 2728807 2102102 1176424 -117
37506 -117 -1084597 -1746353 -2058771 -2239903 -2102304 -1303491 -165422 424015 185400 -79735
37496 -79735 399779 1265643 1534399 848557 -287026 -1265909 -1850683 -2034660 -1970837 -2026584
37486 -2026584 -2425203 -2732124 -2111464 -333404 1705851 2743281 2404390 1527434 1168738
37477 1168738 1413209 1396264 528610 -648646 -1142551 -794738 -392998 -571105 -1170591
37468 -1170591 -1780765 -2291014 -2637108 -2599864 -2311627 -2465636 -3421644 -4419019 -4318956 -3004325
37458 -3004325 -1491239 -710582 -682560 -890401 -983443 -980238 -1072886 -1332002 -1507437 -1260305
37448 -1260305 -726547 -525693 -920100 -1362189 -1329696 -1186426 -1558548 -2218248 -2430864 -2189049
37438 -2189049 -2118395 -2202045 -1703054 -575218 162186 -39307 -327214 261548 1403879
37429 1403879 2182889 2483356 2760121 2907456 2389112 1294005 328523 -215891 -694101
37420 -694101 -1282581 -1651491 -1565543 -1197942 -742250 -266554 -27315 -338614 -974885 -1237152
37410 -1237152 -797653 -9621 755592 1530352 2281445 2586830 2197739 1537044 1203791
37401 1203791 1222812 1156764 771110 235448 -204448 -431684 -415614 -252762 -219147 -537906
37391 -537906 -1081654 -1478077 -1515672 -1302550 -1026666 -720578 -337400 46919 256188 267338
37381 267338 300648 491588 543228 -2884 -1062771 -1895981 -1934463 -1453199 -1087783 -955092
37371 -955092 -748138 -528282 -740033 -1337937 -1581986 -1081753 -527746 -830543 -1810594 -2368104
37361 -2368104 -1964043 -1376631 -1696609 -2882134 -3744215 -3384807 -2264057 -1538940 -1558300
37352 -1558300 -1540561 -839892 57961 269199 -162896 -362232 79905 626404 752030 722214
37342 722214 1076327 1827501 2609908 3296219 3998083 4577475 4549933 3531027 1662345
37333 1662345 -331487 -1462189 -1102174 479662 2300169 3518765 4033063 4203649 4243701
37324 4243701 4066055 3575029 2903555 2379623 2292802 2607142 2936640 2979571 2940126 3271880
37314 3271880 4003280 4591957 4487738 3607903 2292831 1104687 621733 1004657 1701292
37305 1701292 1959814 1677248 1350700 1222737 1034927 705713 627356 1061778 1785872 2553132
37295 2553132 3336343 3889499 3747306 3035748 2634281 3056272 3748459 3999077 3948620 4107220
37285 4107220 4424169 4538517 4522520 4654088 4771234 4541132 4125616 3958319 4084580 4273831
37275 4273831 4518979 4879011 5122925 5081397 5032467 5190511 5200245 4753418 4292708 4395768
37265 4395768 4840763 5037553 5026394 5237102 5572561 5590441 5369601 5386729 5747479 6288561
37255 6288561 7138857 8387925 9565436 10324875 11246131 12993187 15099630 16695016 18059358
37246 18059358 20247215 23462304 27045412 30820113 35199827 40217441 45664788 51796923
37238 51796923 58688845 65712974 73283194 84017276 99909691 119689586 142271882
37231 142271882 171208982 209584110 248981486 269885362 258417342 220418237 175194206
37224 175194206 137630259 110269012 89849395 74509997 63425415 54794655 47333338
37217 47333338 41393360 36868424 32140818 26545136 21762292 19151250 17473591 14917145
37209 14917145 11853561 9815650 8893813 7961921 6760238 6032324 5896166 5532268 4480197
37200 4480197 3170107 2123489 1438139 1078584 989037 866762 384054 -250284 -344485
37191 -344485 500462 1840737 2741636 2708128 2221461 2155234 2628162 2869086 2467086 2140382
37181 2140382 2656355 3568729 3923139 3750037 3725950 3667331 2747559 1232353 565621 1376498
37171 1376498 2661145 3364774 3532522 3379866 2547599 1097358 97931 240241 763959
37162 763959 679717 190382 -89236 -478327 -1586994 -2906724 -3304476 -2686450 -2106597
37153 -2106597 -2311365 -3022885 -3568301 -3493738 -2675302 -1464731 -582518 -327705 -148785
37144 -148785 478289 1147121 1156123 642040 287254 208468 -1420 -319805 -282871 93554
37134 93554 195751 -286226 -992149 -1513673 -1808402 -1902604 -1678418 -1075378 -188863 801583
37124 801583 1560465 1713119 1418658 1500903 2468423 3662570 3968012 3175398 2080229
37115 2080229 1454480 1502965 2058886 2607321 2333571 946473 -638285 -1205720 -779456
37106 -779456 -478392 -863809 -1289449 -1048729 -366375 65811 -45632 -460922 -681664 -225964
37096 -225964 906497 1968771 2133353 1421837 462282 -540514 -1818045 -3025439 -3174168
37087 -3174168 -1939397 -288444 626963 615415 123261 -578091 -1353559 -1858859 -1836843
37078 -1836843 -1493306 -1118854 -566894 467686 1795084 2709462 2583170 1345038 -460189
37069 -460189 -1939592 -2386344 -1779314 -740921 3352 69078 -475022 -1137386 -1282829
37060 -1282829 -744998 -67961 182087 111635 55328 -225432 -1152294 -2326543 -2819041 -2477269
37050 -2477269 -2024450 -1754813 -1171224 -241007 79990 -769423 -1919203 -2186531 -1586255
37041 -1586255 -999554 -920234 -1283432 -2008656 -2866997 -3181913 -2502066 -1352557 -601879
37032 -601879 -320690 14350 431220 403627 -203551 -913497 -1393294 -1732672 -1886779 -1507014
37022 -1507014 -544211 457403 860255 415329 -743654 -2150626 -3031413 -2784985 -1640515
37013 -1640515 -531545 -200379 -638701 -1345867 -1781962 -1616329 -994105 -631510 -1192090
37004 -1192090 -2382523 -3039818 -2369525 -855847 291363 440672 83265 129412 810825
36995 810825 1360096 836867 -752170 -2328327 -2809060 -2125654 -1114409 -693200 -1300033
36986 -1300033 -2726236 -4090871 -4283291 -2984047 -1166914 -152495 -259456 -805037 -1227463
36977 -1227463 -1557652 -1829784 -1803268 -1523170 -1506111 -1962098 -2326260 -2038141 -1414875 -1203032
36967 -1203032 -1464677 -1480929 -774520 257095 908630 1054129 1220939 1893064 2923923
36958 2923923 3635898 3437236 2379267 1156079 492614 455854 435407 -88779 -862521
36949 -862521 -1174764 -820530 -375833 -369733 -599706 -633371 -627834 -1065776 -1846256 -2312971
36939 -2312971 -2230827 -2103995 -2362463 -2790027 -2936687 -2556625 -1502377 136746 1556144
36930 1556144 1682807 534953 -610925 -916859 -1017189 -1661789 -2235829 -1732943 -548699
36921 -548699 6994 -343518 -701619 -650171 -685054 -891677 -570931 399726 1036110 667329
36911 667329 -108388 -510856 -712193 -1149301 -1469335 -1025872 26197 859533 901777 145438
36901 145438 -1056421 -2022001 -2047025 -1251994 -712299 -1178020 -2063502 -2277358 -1608275 -605911
36891 -605911 476737 1727234 2763459 2829689 1832116 570875 -243129 -644876 -935741
36882 -935741 -1101000 -992458 -705957 -459053 -280461 -35157 342850 763429 1068372 1166793
36872 1166793 1114110 1017176 836706 407233 -286162 -1021194 -1629928 -2188223 -2772534 -3207100
36862 -3207100 -3231306 -2826202 -2299202 -2140273 -2701264 -3721012 -4260590 -3604334 -2262864
36853 -2262864 -1506317 -1766441 -2160423 -1852715 -1127322 -625981 -261265 394337 1197902
36844 1197902 1706362 1953774 2202484 2284624 1965024 1620353 1749627 2127284 2273081 2380650
36834 2380650 2784389 2889045 1920249 593471 561046 1969200 3006287 2420689 1171795
36825 1171795 786798 1223442 1403133 1028220 727495 872133 1272050 1782453 2346473
36816 2346473 2611933 2242377 1465702 702632 -114708 -1190901 -2080186 -2059161 -1256709
36807 -1256709 -661278 -862784 -1388231 -1497553 -1174424 -1047980 -1564208 -2435882 -2887512
36798 -2887512 -2478627 -1681094 -1392019 -1805678 -2193239 -2014759 -1681579 -1739189 -1857939 -1395376
36788 -1395376 -582169 -240852 -485489 -658576 -600954 -1005770 -2214392 -3516007 -4103242
36779 -4103242 -4039573 -3773265 -3301223 -2451820 -1572796 -1242853 -1472925 -1764872 -1883726 -2071047
36769 -2071047 -2470476 -2744331 -2389375 -1268433 164882 1065216 779712 -545933 -2070760
36760 -2070760 -3172740 -4056963 -5127741 -5972411 -5573755 -3685133 -1482889 -416941 -617532
36751 -617532 -899856 -358290 514192 589636 -343256 -1356002 -1727948 -1882214 -2536726 -3360245
36741 -3360245 -3228802 -1811131 -171502 508566 247615 -152332 -407952 -988778 -2173086
36732 -2173086 -3506814 -4363984 -4609308 -4461081 -3999685 -3146919 -2060189 -1277101 -1337111
36723 -1337111 -2257253 -3401008 -3934630 -3517374 -2557749 -1724355 -1216755 -629469 428245
36714 428245 1697434 2385597 1920460 489210 -1227512 -2750170 -4039291 -5052432 -5400449
36705 -5400449 -4761139 -3490351 -2396006 -1830439 -1379642 -624910 144835 288155 -367782
36696 -367782 -1404572 -2340653 -2918633 -2993615 -2579967 -2041761 -1849527 -2023356 -2098046 -1741569
36686 -1741569 -1140923 -673274 -484474 -559609 -944316 -1642369 -2431484 -2990579 -3145077 -2894702
36676 -2894702 -2354999 -1799395 -1574772 -1772248 -2089979 -2180711 -2011633 -1746493 -1483088 -1334455
36666 -1334455 -1525264 -2012572 -2156923 -1299455 262334 1388827 1445900 1113862 1446701
36657 1446701 2428067 3018560 2568912 1590396 920295 628120 206014 -414148 -614971
36648 -614971 46696 1171582 1983063 2229778 2321541 2646039 3041188 3026753 2407375 1534188
36638 1534188 973056 926437 1027134 813356 384765 330191 878875 1444903 1357411 795309
36628 795309 477214 527290 324646 -357300 -756903 -141109 1078538 1840474 1728630 1149579
36618 1149579 451376 -368714 -1085498 -1183761 -666409 -288782 -566634 -1034712 -981874 -558139
36608 -558139 -569507 -1327224 -2233143 -2487708 -1779491 -300077 1428951 2624796 2620733 1517439
36598 1517439 244131 -294892 -12527 562324 1012174 1238599 1146576 640015 22572
36589 22572 -62079 608111 1444540 1796158 1835324 2163301 2644203 2374692 1087143 -105721
36579 -105721 479 1064717 1603085 881555 -387641 -1314269 -1947388 -2685817 -3210323
36570 -3210323 -2707504 -989462 1109492 2455688 2529889 1782594 1270651 1692882 2575862
36561 2575862 2746254 1852938 908132 816971 911844 -163623 -2346756 -3979170 -3904377
36552 -3904377 -2810462 -2068797 -2023525 -2051753 -1745941 -1272492 -800245 -246601 436036 1187509
36542 1187509 2026701 2939180 3631554 3743554 3254088 2378872 1203157 -180150 -1281194
36533 -1281194 -1510540 -967772 -458554 -514221 -775303 -602771 41971 678263 1029255 1243224
36523 1243224 1462789 1572305 1450141 1168869 826491 456810 286641 770889 1969236
36514 1969236 3036742 2900168 1605223 483989 600364 1433773 1665730 972732 234902
36505 234902 -5891 -321941 -1222468 -2067805 -1969261 -1251708 -1051746 -1620218 -1977352 -1394910
36495 -1394910 -389593 121001 23121 -105894 77984 335083 248820 -296382 -930593 -1026622
36485 -1026622 -385925 280531 14722 -1121029 -2002855 -1929470 -1499257 -1545651 -1879353 -1847261
36475 -1847261 -1591104 -1719311 -1989571 -1495482 -276765 398021 -186038 -1067760 -938728
36466 -938728 108440 929082 933679 519068 160632 -89440 -211558 -59618 211395 71062
36456 71062 -761694 -1881031 -2561013 -2452073 -1904048 -1686151 -2251175 -3137363 -3343866 -2525262
36446 -2525262 -1469628 -1020510 -952344 -553422 37581 9318 -687792 -1119472 -810661 -430732
36436 -430732 -592017 -876808 -709797 -396647 -471030 -673907 -557129 -585296 -1473391 -2665017
36426 -2665017 -2721912 -1354371 61581 337846 -122279 -229639 361611 1331016 2413582
36417 2413582 3235761 2985514 1208637 -1226603 -2774365 -2864700 -2316230 -2091127 -2285934
36408 -2285934 -2533729 -2772205 -3114213 -3254746 -2595124 -1087419 392146 834558 205476
36399 205476 -547890 -686004 -506982 -657927 -957484 -581277 584998 1535195 1422220
36390 1422220 634744 95409 -19292 -209996 -643361 -974498 -1094565 -1336064 -1835495
36381 -1835495 -2288191 -2488952 -2575236 -2538158 -2045049 -1108377 -507016 -1061901 -2644934 -4243155
36371 -4243155 -4926054 -4550824 -3675410 -3037372 -3026513 -3418413 -3610745 -3218227 -2382327 -1485163
36361 -1485163 -793986 -521336 -929219 -2014129 -3229624 -3925125 -4067163 -4173135 -4495773
36352 -4495773 -4704390 -4577008 -4566717 -5195901 -6088457 -6199520 -5113763 -3629381 -2806417
36343 -2806417 -2848104 -3288768 -3904205 -4807505 -5731283 -5890346 -4823034 -2986255 -1276002
36334 -1276002 -234476 98368 -116795 -669825 -1327074 -1926282 -2350901 -2400812 -1985416
36325 -1985416 -1482256 -1446146 -1777618 -1680168 -760563 323752 737411 502178 130854 -286788
36315 -286788 -905980 -1377223 -1127608 -304030 317078 362736 163951 80261 198655 634663
36305 634663 1364118 1757381 1121149 -174988 -933682 -665203 -75023 146692 77748 -179247
36295 -179247 -906618 -1837691 -1818028 -289434 1599836 2290383 1700864 945950 628998
36286 628998 405419 17091 -225298 -78178 219124 328868 224810 182417 546047 1302284
36276 1302284 1767435 1201165 -30917 -628106 -139414 280532 -366779 -1319984 -1316739 -672397
36266 -672397 -669704 -1352986 -1525790 -801340 -51237 283071 724622 1316946 1291979 756574
36256 756574 1070884 2589925 3503211 2259688 54655 -624431 720895 2274186 2540019
36247 2540019 1852927 1206925 875430 637775 511366 684317 1084792 1364977 1185694
36238 1185694 459823 -542743 -1381148 -1849039 -2045653 -1987136 -1497321 -632587 237665
36229 237665 992712 1830382 2460735 2006116 375195 -991876 -764902 351632 509910
36220 509910 -650212 -1544035 -1000378 161187 502434 -39177 -367964 113395 931968
36211 931968 1429082 1457965 1127096 444508 -457386 -1034684 -701322 421271 1387383 1330114
36201 1330114 400948 -481400 -757894 -664151 -499553 -104969 568705 981930 733202 339023
36191 339023 538111 1090956 1105904 450566 -43470 136695 548090 669044 619262 613480
36181 613480 369272 -419398 -1466875 -2235680 -2593139 -2759798 -2859457 -2809959 -2430682 -1491602
36171 -1491602 17061 1525139 2243527 2109975 1889024 2033879 1976562 980054 -777727
36162 -777727 -2475291 -3584834 -4001336 -3676615 -2846154 -2334823 -2811872 -3779583 -4038438
36153 -4038438 -3222276 -2186139 -1727011 -1613188 -1215318 -529504 -85800 -160434 -536784
36144 -536784 -906767 -1150386 -1262448 -1252749 -1122153 -831176 -382529 -34056 -255813 -1245889
36134 -1245889 -2549308 -3380101 -3359190 -2801063 -2247920 -1869812 -1445131 -875952 -527090
36125 -527090 -876613 -1844119 -2692058 -2765903 -2183042 -1516269 -895782 98861 1478892 2296457
36115 2296457 1643645 37941 -868964 -143819 1410111 2376201 2321504 1778758 1150470
36106 1150470 469018 34618 280050 811553 527180 -841052 -2100201 -2116620 -1228323
36097 -1228323 -378560 403227 1509329 2271744 1503168 -430305 -1594910 -1085569 -328827
36088 -328827 -921740 -2251748 -2498503 -1362918 -387085 -613467 -1180779 -689038 838164
36079 838164 1964053 1513393 -193576 -1739251 -2022126 -1190691 -192654 410488 861078
36070 861078 1473702 1997869 1969904 1291063 155501 -1158616 -2053874 -1716190 -116602
36061 -116602 1449654 1586004 396171 -813799 -1242059 -1200933 -1130377 -967712 -688460
36052 -688460 -580661 -585786 -108179 1025522 2022038 2086957 1466110 960907 783541 513250
36042 513250 -31698 -510692 -641345 -574746 -586674 -703971 -752043 -605180 -302081 42890
36032 42890 403365 808100 1039304 596593 -623766 -1724402 -1520720 -39187 1316622
36023 1316622 1448318 817811 514138 658637 547890 31864 -247629 -33680 48444 -484809
36013 -484809 -1141616 -1128851 -417117 350066 720787 732800 511556 56948 -533366 -989581
36003 -989581 -1158439 -1162370 -1134888 -925559 -247320 860065 1841866 2067211 1502591 798135
35993 798135 542455 542796 128673 -823162 -1533457 -1219968 -102440 816305 843997 124870
35983 124870 -842435 -1721028 -2221380 -1965554 -931916 153827 349035 -542645 -1846051
35974 -1846051 -2849763 -3404440 -3618273 -3391093 -2576226 -1401170 -406380 25041 -30819
35965 -30819 -109736 302651 1255676 2047931 1799540 568994 -443743 -228525 738160 1024063
35955 1024063 -51834 -1759411 -2966305 -3250042 -2900155 -2341565 -1837943 -1458785 -1116090
35946 -1116090 -798611 -761911 -1164230 -1564215 -1308370 -520704 -111541 -533137 -1123955 -1138778
35936 -1138778 -902426 -1302339 -2458857 -3591039 -4081293 -4027459 -3732714 -3265076 -2694767
35927 -2694767 -2273954 -2106054 -1955968 -1635724 -1323030 -1224941 -1113874 -556368 383011 979734
35917 979734 597314 -551052 -1654934 -2263078 -2603572 -2854275 -2641410 -1744264 -855271
35908 -855271 -824251 -1290149 -1021365 225929 1196817 948386 206650 138416 582594 558077
35898 558077 -15925 -330872 -191350 -248871 -657051 -689920 -45039 529567 441104 190809
35888 190809 439683 848871 624950 -255903 -1120037 -1564524 -1633660 -1263754 -330822 745643
35878 745643 1133729 542726 -369017 -723089 -284769 493817 1016040 999074 598754 213649
35868 213649 65477 -60891 -536288 -1338503 -1958737 -1936893 -1358205 -691135 -202240 277682
35858 277682 911804 1337218 904405 -430643 -1729146 -1932466 -1011062 121280 812649
35849 812649 1296739 1937910 2384328 1979717 776771 -412631 -974786 -1037144 -953638 -698709
35839 -698709 -88965 656476 995826 702591 109233 -375362 -708998 -977424 -984221 -520185
35829 -520185 -11038 -356163 -1796318 -3285633 -3466907 -2166817 -486101 559629 970591
35820 970591 1183213 1107606 281686 -1158723 -2216539 -2000583 -748291 398717 621828
35811 621828 162264 -272759 -503888 -849499 -1238905 -1013111 109672 1388156 1863845
35802 1863845 1501810 1025373 842057 690166 250755 -419826 -1054612 -1362492 -1163599
35793 -1163599 -767926 -970588 -2036586 -2919662 -2358286 -707249 298717 -230402 -1366351
35784 -1366351 -1957989 -2119742 -2444887 -2671115 -2125217 -975656 -111168 -39004 -607551
35775 -607551 -1500724 -2312459 -2479035 -1914052 -1438218 -1782551 -2400974 -2146925 -992880
35766 -992880 -125055 -273830 -885388 -1211192 -1384521 -1937263 -2797333 -3269431 -2787013 -1450814
35756 -1450814 -43185 416547 -525686 -2253756 -3626922 -4080838 -3939191 -3710438 -3502401
35747 -3502401 -3184276 -2724862 -2228617 -1874521 -1831003 -2015482 -2070651 -1874013 -1834612 -2241630
35737 -2241630 -2582222 -2121140 -969728 123377 883388 1557060 1926360 1344142 -3045
35728 -3045 -908881 -709681 -126279 39756 156435 877158 1727096 1629453 509442 -616913
35718 -616913 -1079025 -1229142 -1598310 -2070143 -2138155 -1583125 -718699 -165486 -357338 -1055264
35708 -1055264 -1462714 -1077855 -297712 67174 -329052 -1256406 -2374826 -3351471 -3722133
35699 -3722133 -3198009 -2108012 -1106150 -443838 88041 546886 611977 -1501 -1280465
35690 -1280465 -3049762 -4939894 -6223549 -6236320 -5172883 -4043930 -3590919 -3574723 -3356246
35681 -3356246 -2801086 -2266743 -1993332 -1932498 -2007574 -2101530 -1867370 -1037583 2455 415102
35671 415102 -85009 -804013 -967660 -715963 -730417 -1088256 -1125233 -476944 382302 887641
35661 887641 1102330 1294673 1284437 744307 -175501 -1045050 -1673812 -1890283 -1188804 595698
35651 595698 2444606 2902357 1762523 256632 -508997 -507835 -110943 548372 1145903
35642 1145903 1015530 7787 -1190647 -2090909 -3002618 -4023530 -4266540 -2986428 -901350
35633 -901350 538597 819018 463026 -125411 -943693 -1723339 -1944380 -1538338 -866299
35624 -866299 -75212 842382 1517323 1532821 1189346 1114505 1155648 555032 -683868 -1503304
35614 -1503304 -1135412 -11743 939354 1249434 907058 54573 -941899 -1600834 -1825933
35605 -1825933 -1960538 -2201416 -2338193 -2130893 -1519076 -490880 716124 1369349 927322
35596 927322 -8901 -251005 343675 682068 126407 -586692 -594977 -187964 -163542 -594528
35586 -594528 -939013 -863529 -349210 511760 1251051 1133787 208357 -314760 473026 1819020
35576 1819020 2306711 1825229 1505610 1851036 2035520 1258984 -114919 -1167377 -1520674
35567 -1520674 -1401827 -1069882 -638927 -275920 -227696 -628102 -1336968 -1947161 -2056111 -1679724
35557 -1679724 -1279806 -1200559 -1256380 -1147410 -1070014 -1457884 -2158018 -2362446 -1556566 -215139
35547 -215139 718796 920677 994033 1641396 2707695 3305574 2926061 2069307 1456352 938619
35537 938619 -190350 -1902833 -3239331 -3586656 -3386926 -3197996 -2815191 -1946506 -1095715
35528 -1095715 -919510 -1118524 -892490 -323750 -391335 -1527233 -2906546 -3387667 -2662891
35519 -2662891 -1367184 -480043 -648170 -1637601 -2407506 -2133848 -1137052 -369895 -118332
35510 -118332 147649 621018 620127 -448294 -2101295 -3180160 -3017760 -1972501 -986789
35501 -986789 -763976 -1230578 -1731694 -1812445 -1642105 -1494251 -1168153 -421620 286635 202151
35491 202151 -580964 -1057217 -533465 646232 1723547 2287699 2224966 1492901 276672
35482 276672 -1009900 -2087110 -2836560 -2961423 -2200229 -986757 -205797 -30616 289745
35473 289745 1108081 1603339 949466 -371775 -1236133 -1456591 -1818420 -2673358 -3345979
35464 -3345979 -3085382 -1981396 -697172 267621 792481 937831 852636 797328 1037089
35455 1037089 1634923 2385549 3014779 3453360 3800145 3951053 3497085 2260747 749237
35446 749237 -328384 -894596 -1394049 -1934524 -2139066 -1897143 -1583879 -1346184 -883170
35437 -883170 -259146 -184226 -939568 -1669200 -1442667 -550117 -2585 -103102 -295520 -205671
35427 -205671 -29278 59540 156674 223956 43918 -312276 -448595 -159807 391006 995208
35417 995208 1519973 1782054 1728757 1685506 2006176 2561850 2987259 3258013 3494331 3370400
35407 3370400 2405710 824137 -546973 -1286024 -1651244 -1814561 -1560931 -935340 -487514
35398 -487514 -573158 -966235 -1367217 -1684300 -1628936 -795842 509040 1296548 1229368 1161103
35388 1161103 1721997 2144946 1391473 -149209 -1155197 -1227967 -1122199 -1219355 -971828
35379 -971828 -146971 438712 46601 -819263 -1057536 -394560 434726 718709 455948 77709
35369 77709 -82689 21058 217374 273446 97410 -167909 -283552 -135094 158957 270718
35359 270718 -149532 -1098896 -2004210 -2121499 -1289614 -127062 624574 777099 617471
35350 617471 401454 154833 -173228 -598950 -1067523 -1358682 -1169359 -517658 72265 88877
35340 88877 -327398 -564350 -316158 152394 509854 722310 819333 727556 575564 776917
35330 776917 1433203 1920367 1522698 380923 -601925 -788380 -383547 20363 91262 -159623
35320 -159623 -596407 -1040769 -1327022 -1451620 -1554018 -1670237 -1667828 -1498132 -1310825 -1212190
35310 -1212190 -1126762 -1044033 -1164526 -1555926 -1838493 -1540405 -756411 -189386 -437823 -1347056
35300 -1347056 -2116545 -2021541 -1080733 -81393 122872 -561036 -1384077 -1569821 -1103672 -569459
35290 -569459 -326771 -158456 195684 471998 182637 -581786 -1038051 -622178 233018 619218
35280 619218 383236 344659 1101753 2085981 2231074 1300861 67180 -661071 -677544 -197572
35270 -197572 308809 91738 -1320245 -3230229 -4044331 -2890515 -602021 1264187 2009718
35261 2009718 2028854 1894078 1794030 1716973 1662410 1609244 1520851 1378810 1154327 950562
35251 950562 1194249 2243811 3632092 4241109 3597888 2496267 1887354 1682136 1243971
35242 1243971 552271 74082 -198742 -725347 -1548000 -2192245 -2352453 -2030713 -1198379
35233 -1198379 -90314 385009 -486639 -1975341 -2558816 -1961937 -1500293 -2103384 -3085921
35224 -3085921 -3436662 -3317503 -3425731 -3583673 -2982167 -1555658 -256456 57155 -535935
35215 -535935 -1314866 -1677232 -1547649 -1234411 -977376 -742118 -556534 -733109 -1305790 -1536355
35205 -1536355 -740237 499881 868891 151259 -515597 -507012 -639678 -1564116 -2364967 -1870794
35195 -1870794 -599985 -141473 -950818 -1938753 -2159820 -1853341 -1670892 -1717811 -1653074 -1220879
35185 -1220879 -464523 304536 720460 726164 551432 181431 -712880 -1990343 -2743537 -2342400
35175 -2342400 -1296275 -472191 32544 522448 768374 395574 -182851 -256973 -8584
35166 -8584 -185731 -779629 -1106459 -1082182 -1235594 -1442968 -912504 337700 1195442 1039446
35156 1039446 510378 261466 44012 -380358 -483285 83875 643058 426684 -310026
35147 -310026 -894921 -1326521 -1917959 -2374163 -2126806 -1300826 -560735 -151733 288723 1090017
35137 1090017 2157399 3018194 2972432 1636133 -295490 -1387216 -1073136 -351732 -310311
35128 -310311 -667312 -606219 -352311 -726013 -1501758 -1514346 -398130 918015 1567389 1548201
35118 1548201 1020864 -63967 -1237210 -1466369 -493166 561174 588527 -145049 -676210
35109 -676210 -765243 -854292 -1074861 -1200900 -1371822 -1961270 -2714872 -2848477 -2220065 -1708972
35099 -1708972 -2064627 -2901606 -3279076 -2909309 -2305223 -1953512 -1868484 -1932388 -2192206 -2662865
35089 -2662865 -3139055 -3362249 -3192624 -2573311 -1590673 -632956 -141724 -46902 181381 684336
35079 684336 856937 259799 -521651 -573122 20878 284037 -259315 -1063414 -1550435 -1840580
35069 -1840580 -2166250 -2236445 -1668614 -589148 605180 1643668 2175844 1724528 399673
35060 399673 -787305 -965925 -476780 -309971 -731256 -1086741 -812682 -49534 678326
35051 678326 935024 644847 259182 379428 827558 581320 -745853 -1937253 -1656103
35042 -1656103 -472875 -167816 -1146259 -1948350 -1567713 -858312 -1003828 -1769969 -2148788
35033 -2148788 -1860821 -1319942 -790537 -435007 -583499 -1099007 -1082975 -162814 515577 -277192
35023 -277192 -1866077 -2431987 -1574939 -719256 -863170 -1365057 -1427891 -1435348 -1964761 -2527633
35013 -2527633 -2359463 -1772360 -1628410 -1885519 -1735898 -982365 -234342 251490 907737
35004 907737 1812396 2211845 1534807 240989 -803642 -1309024 -1496847 -1524822 -1483178 -1611666
34994 -1611666 -1985154 -2228001 -2050432 -1842780 -2156079 -2732101 -2707519 -1818212 -772488
34985 -772488 -253077 -117707 104243 380597 246747 -552132 -1813290 -3081361 -3863001
34976 -3863001 -3858591 -3238254 -2518360 -1992151 -1536989 -1148547 -1229988 -1935624 -2586861 -2343668
34966 -2343668 -1323032 -459891 -262891 -291598 -1670 442049 515261 124669 -344090 -618988
34956 -618988 -842845 -1246369 -1712458 -1834540 -1487105 -1226961 -1793095 -3053105 -3830945
34947 -3830945 -3224501 -1857898 -1225149 -1831490 -2647740 -2566667 -1727604 -993348 -676080
34938 -676080 -423189 -95580 -56175 -498301 -978914 -878731 -134890 678995 988167 859632
34928 859632 919293 1528551 2162510 1936798 790064 -300158 -536204 -305948 -513837
34919 -513837 -1252381 -1813866 -1899225 -1999073 -2357157 -2336500 -1395252 -177492 135702 -613524
34909 -613524 -1399302 -1464573 -1212782 -1358521 -1813444 -1944543 -1551154 -986577 -497560 -25737
34899 -25737 396875 602643 632760 589076 161294 -1009918 -2377926 -2721061 -1739634 -646782
34889 -646782 -520128 -762677 -123862 1251398 1973155 1492982 834046 970707 1534924
34880 1534924 1654645 1219846 635050 -26824 -819618 -1288970 -893380 55545 591505
34871 591505 280565 -344642 -626954 -573820 -616864 -935620 -1267240 -1244982 -797071 -284474
34861 -284474 -232768 -771251 -1348638 -1220076 -282425 765378 1210783 1114972 1118117 1538367
34851 1538367 1956595 1838028 1330208 1080925 1270241 1249048 396347 -976461 -1980441
34842 -1980441 -2251648 -2239969 -2399741 -2563449 -2326525 -1747213 -1379658 -1677348 -2499916 -3229241
34832 -3229241 -3407767 -3255107 -3359579 -3794838 -3912983 -3287154 -2433439 -2090213 -2160663 -2086145
34822 -2086145 -1984293 -2456688 -3278936 -3337159 -2197533 -835928 -328653 -578619 -857574
34813 -857574 -880420 -697333 -152095 774578 1473235 1265610 235482 -985698 -1944496
34804 -1944496 -2436836 -2295552 -1670460 -1153802 -1086895 -1102203 -831420 -564218 -606669 -548784
34794 -548784 38735 651831 499712 -235674 -707772 -711520 -730258 -862934 -714750 -336911
34784 -336911 -315201 -804890 -1277823 -1326298 -1008291 -382577 556171 1454661 1820786 1662129
34774 1662129 1279286 637912 -263109 -712874 -46578 1115389 1601607 1564576 2230091
34765 2230091 3684690 4460145 3744950 2526023 1896685 1632078 1229282 992339 1084004
34756 1084004 752266 -314071 -944228 -119093 1245282 1559619 918535 713748 1342796
34747 1342796 1822201 1553294 1084240 997640 1187817 1457890 1905633 2465915 2763045 2600334
34737 2600334 2120333 1511823 982101 773764 709591 110223 -1207426 -2319635 -2362724
34728 -2362724 -1814311 -1667605 -1821339 -1458133 -653923 -250607 -268251 114109 892146 992895
34718 992895 53535 -873711 -906604 -455712 -206309 -98742 5027 -320754 -1228819 -1978882
34708 -1978882 -1994874 -1828895 -2236281 -2892522 -2865420 -1897296 -474938 918875 1887728
34699 1887728 1913943 911878 -264105 -602158 -72316 560116 777579 585608 67580
34690 67580 -635693 -1073065 -846190 -139511 582167 1191844 1733232 1951289 1608344 1012122
34680 1012122 578894 124237 -684030 -1400715 -1201904 -132861 929889 1581176 2197240
34671 2197240 2778390 2537177 1170937 -308036 -741442 -257378 178445 190358 160655
34662 160655 208600 -124729 -1053939 -2073638 -2586911 -2602853 -2544379 -2640878 -2765429 -2700147
34652 -2700147 -2337282 -1715448 -1043967 -639216 -676311 -1005249 -1302056 -1357747 -1112655 -486302
34642 -486302 592974 1914365 2926256 3127672 2485223 1391387 303041 -481263 -826544
34633 -826544 -775073 -547698 -350714 -163777 132888 432967 415034 -46482 -643655 -922091
34623 -922091 -726965 -286113 114036 493793 1180845 2328132 3419504 3541904 2401817
34614 2401817 851959 34604 129655 366903 161435 -324029 -757080 -1113827 -1341856
34605 -1341856 -1130045 -382040 532834 1326445 2081025 2610664 2181705 582840 -1006135
34596 -1006135 -1146955 14968 940508 733857 63794 -172331 -165763 -589578 -1346349 -1713217
34586 -1713217 -1457325 -1076531 -949283 -853771 -498444 -77124 12337 -219905 -337150 -39230
34576 -39230 478506 788694 709842 419689 189969 160973 347654 675910 925190 758636
34566 758636 -46642 -1365713 -2699486 -3370755 -2913625 -1516158 -46146 638897 452414
34557 452414 -75811 -640809 -1389271 -2235586 -2574378 -2077218 -1284889 -851491 -565402 198361
34547 198361 1259841 1661337 998179 37016 -276170 52208 245964 -222626 -1083113
34538 -1083113 -1613332 -1420428 -964723 -1225669 -2610013 -4290883 -4968340 -4220246 -2731781
34529 -2731781 -1305042 -191090 577183 829179 513172 -113978 -782474 -1349928 -1554298
34520 -1554298 -1130308 -374163 -73793 -571329 -1332006 -1717971 -1722086 -1656628 -1666738 -1914890
34510 -1914890 -2621919 -3397272 -3157824 -1454119 612563 1635133 1675461 1848258 2412927
34501 2412927 2443464 1483586 394330 102855 351727 232525 -649845 -2029778 -3436186
34492 -3436186 -4273632 -3950338 -2559586 -1140943 -684706 -1046873 -1323646 -1103244 -808771
34483 -808771 -891030 -1238215 -1488339 -1527693 -1508695 -1571334 -1630784 -1372390 -586211 343058
34473 343058 554527 -285956 -1294252 -1262315 -279228 167190 -988165 -2968683 -4050292
34464 -4050292 -3574120 -2480959 -1914574 -1920961 -1765833 -1055726 -79196 762432 1363666 1713439
34454 1713439 1710196 1399403 1125096 1165988 1366162 1393358 1257305 1256626 1425095 1360492 725541
34443 725541 -289856 -1113861 -1264286 -680925 169471 496478 -173202 -1411440 -2234953
34434 -2234953 -2196207 -1813861 -1733904 -1894711 -1904927 -1836583 -2032311 -2339866 -2230532 -1679832
34424 -1679832 -1285935 -1378952 -1581379 -1445628 -1002260 -451053 155967 622902 539254 -84393
34414 -84393 -576871 -464901 -129094 -82061 -76448 320241 616966 -157585 -1887385 -3155920
34404 -3155920 -2910778 -1694085 -868008 -1090623 -1851602 -2112288 -1175315 665337 2135613
34395 2135613 2108095 943308 176441 585002 1216414 838898 -284713 -865385 -418457
34386 -418457 309008 634453 737942 969324 1112917 747790 -98130 -993997 -1533779 -1529593
34376 -1529593 -1087067 -682550 -862304 -1624377 -2324928 -2418085 -2098307 -1987092 -2322616 -2693857
34366 -2693857 -2560982 -1907960 -1335240 -1473112 -2275160 -2997443 -2965364 -2200326 -1165526
34357 -1165526 -207466 411449 266261 -811182 -2172724 -2894652 -2911677 -2909505 -3007209 -2464959
34347 -2464959 -1119381 -180147 -759479 -2225078 -3015162 -2776114 -2627747 -3308423 -4099906
34338 -4099906 -3972045 -3033809 -2286790 -2321917 -2724626 -2613004 -1504436 217049 1555946
34329 1555946 1783020 1118946 368285 -35084 -224423 -208795 343937 1345423 1908330
34320 1908330 1270297 -247807 -1708531 -2664758 -3221251 -3290645 -2620743 -1585424 -1111568
34311 -1111568 -1502614 -2016727 -2045849 -2052950 -2643333 -3210826 -2516406 -563528 1097814 1266208
34301 1266208 479077 -23851 -53518 -400784 -1400000 -2474607 -3080382 -3274253 -3177366 -2627508
34291 -2627508 -1722650 -1077019 -1027731 -1034514 -414608 637384 1305840 1194517 552682 -357916
34281 -357916 -1475281 -2523884 -3020488 -2869709 -2490083 -2189176 -1845901 -1365438 -957540
34272 -957540 -687525 -217680 584851 1133319 734399 -438950 -1471573 -1767199 -1555326
34263 -1555326 -1315570 -1150479 -929277 -700952 -616447 -571091 -256096 396429 1061629 1432803
34253 1432803 1612080 1905660 2331884 2589893 2520556 2301626 2062148 1619997 887667 277049
34243 277049 252846 589081 593031 138667 -63282 496960 1265388 1245825 261533 -844302
34233 -844302 -1211786 -829181 -404423 -637900 -1614988 -2684528 -2933341 -1993454 -424423
34224 -424423 812343 1211201 955981 477154 63613 -134959 -19457 454286 1290749
34215 1290749 2416069 3499974 4013331 3766234 3240577 2998233 2878068 2295302 1303463
34206 1303463 683421 760945 808587 90485 -1027531 -1612405 -1414146 -869213 -102141 1203095
34196 1203095 2845253 3835872 3500839 2342228 1365920 899638 530377 -4647 -370657
34187 -370657 -121181 691642 1538357 1947600 1944280 1934555 2153724 2352317 2182074 1749959
34177 1749959 1471127 1446307 1428576 1430940 1778040 2308041 2152525 859187 -708974 -1282331
34167 -1282331 -766301 -221133 -346159 -697734 -529523 198098 876033 890165 68898 -1102410
34157 -1102410 -1630944 -866634 640807 1577596 1273455 192605 -1008524 -2149192 -2977931
34148 -2977931 -2847048 -1641925 -444643 -454979 -1569237 -2735127 -3391399 -3742818 -3815509
34139 -3815509 -3189087 -1814613 -382217 359706 191829 -695829 -1847331 -2513807 -2122792
34130 -2122792 -992985 -108855 -54098 -629612 -1518734 -2620758 -3558754 -3653872 -2823078
34121 -2823078 -1882259 -1523319 -1596911 -1854095 -2623866 -3957134 -4728001 -3704410 -1335152
34112 -1335152 554280 876976 150957 -856844 -2239856 -4124145 -5626244 -5621031 -4239464
34103 -4239464 -2753180 -2029747 -1846163 -1800693 -2085565 -2885343 -3578911 -3275314 -2025826
34094 -2025826 -879903 -636343 -1023354 -1283934 -1112064 -716644 -357300 -224939 -486174
34085 -486174 -974082 -1044685 -274971 797284 1187805 714901 170109 165883 416477 401479
34075 401479 190266 198912 473251 610047 234373 -644658 -1560272 -1798375 -1031267 152917
34065 152917 779775 672386 565475 846935 910379 243125 -532364 -464783 332342 916936
34055 916936 872389 599871 414759 202276 -23958 -41019 -47310 -638181 -1863735 -2875805
34045 -2875805 -2831503 -1777632 -470371 305825 161350 -661454 -1297646 -953646 211401
34036 211401 1282401 1773186 2116144 2780467 3451768 3451581 2562419 1079249 -583264 -1941103
34026 -1941103 -2443245 -1934214 -990331 -393080 -309454 -277870 63600 532214 702664 436404
34016 436404 8832 -238016 -285603 -376344 -558323 -545861 -232568 -59018 -464480 -1169435
34006 -1169435 -1525949 -1473398 -1527400 -1824339 -1890062 -1521688 -1173348 -1139971 -1039370 -566862
33996 -566862 -158872 -314263 -704654 -590689 146584 916769 1138114 628509 -412336
33987 -412336 -1365230 -1484212 -750208 -106737 -270798 -638235 -81259 1371772 2424265
33978 2424265 2046441 435709 -1550704 -3191669 -4005943 -3809002 -3067699 -2720047 -3190963
33969 -3190963 -3793299 -3442802 -1922069 -231330 415534 -42524 -322459 708792 2436495
33960 2436495 3020624 1708112 -155896 -950311 -784013 -759760 -946949 -457020 716378
33951 716378 1416365 1060099 316970 -296436 -1132089 -2078529 -1852153 263267 2868608
33942 2868608 3879716 3036959 1907116 1699990 2129391 2322998 1892554 1000261 97793
33933 97793 -256068 163871 929847 1452228 1646409 1696584 1479119 894317 530980 1130916
33923 1130916 2364397 2953390 2206354 766550 -336189 -714232 -518766 -53082 146944
33914 146944 -477858 -1712522 -2504308 -2238562 -1650958 -1874096 -2881719 -3508206 -2871215
33905 -2871215 -1217120 560621 1684078 1772337 964840 19400 -113801 813578 1971585
33896 1971585 2178821 1023574 -752805 -1914220 -1771153 -696092 306507 530855 58659
33887 58659 -599069 -1091646 -1321749 -1221865 -800596 -317049 -15342 315499 1068682 1973497
33877 1973497 2027051 683239 -1207147 -2168057 -1710651 -699941 -149962 -194291 -371986
33868 -371986 -374161 -171292 168022 359341 -58708 -1084617 -1939610 -1982450 -1732631 -2239209
33858 -2239209 -3445061 -4023846 -3123817 -1499737 -409925 -39730 297410 882315 1363268
33849 1363268 1594085 1846070 2138097 2071789 1494397 747920 110587 -445885 -779235 -492752
33839 -492752 326053 813335 221105 -1249718 -2847916 -4090163 -4785472 -4721874 -3964590
33830 -3964590 -3186408 -3006009 -3086090 -2540906 -1252167 -130513 82197 -322828 -613416
33821 -613416 -546604 -329401 -54967 352918 829839 1189795 1328393 1122487 348982 -879082
33811 -879082 -1744704 -1342865 232999 1844137 2514545 2337913 2011762 1888593 1854186
33802 1854186 1821362 1808302 1626662 1034015 255193 -171657 -249148 -673672 -1742584 -2594549
33792 -2594549 -2199553 -876885 -50646 -422865 -1141187 -1111144 -472844 -190191 -622621
33783 -622621 -1243430 -1590469 -1704770 -1542784 -736518 638921 1611803 1253769 -105947
33774 -105947 -1130505 -937185 76951 876773 844791 73372 -987840 -1832723 -2038758
33765 -2038758 -1500345 -593697 81208 192923 -141839 -567946 -694279 -204282 850315
33756 850315 1783928 1726264 644715 -380736 -303109 682336 1532983 1759867 1757121 1747410
33746 1747410 1278689 187198 -709888 -642077 -135545 -363644 -1466715 -2434947 -2666465
33737 -2666465 -2698653 -3128995 -3683174 -3844684 -3686280 -3450424 -2898672 -1840029 -882406
33728 -882406 -796664 -1340352 -1574768 -1277784 -1116452 -1287207 -977042 320020 1749489
33719 1749489 2122198 1530175 1123969 1458233 1844066 1435291 324995 -680299 -931634
33710 -931634 -330114 764299 1667198 1660818 561964 -1009167 -2158109 -2495928 -2250051
33701 -2250051 -1753404 -1151209 -593916 -323434 -366811 -408981 -229943 -80815 -302001 -667501
33691 -667501 -513561 389054 1428560 1816160 1417109 691585 20591 -573364 -1124685
33682 -1124685 -1546237 -1872637 -2372727 -3151221 -3768665 -3578894 -2548599 -1533962 -1479248
33673 -1479248 -2311267 -2854796 -2038338 -99357 1604689 1947970 1002180 -289868 -1085526
33664 -1085526 -1202979 -1019376 -1021241 -1312646 -1486685 -1174397 -695945 -748518 -1353391 -1681139
33654 -1681139 -1236054 -620580 -607395 -1023910 -1273948 -1440469 -1903448 -2239234 -1705514 -718280
33644 -718280 -515592 -1161615 -1276626 -256808 636958 272195 -559629 -555950 -58109 -281859
33634 -281859 -1107510 -1348691 -940895 -1116956 -2258748 -3180712 -3007634 -2365738 -2062006
33625 -2062006 -1809581 -1095811 -310648 -58540 -80481 205525 643648 715956 552985 691657
33615 691657 1104766 1284000 1121278 995439 1106333 1340557 1643861 1927246 1796764 1042397
33605 1042397 246790 198656 780152 1170711 1143690 1363202 2228432 3160484 3354589 2683037
33595 2683037 1570719 500841 -61474 203669 991942 1428759 1049195 424285 373755
33586 373755 802820 832888 21396 -1031033 -1434500 -1071032 -644347 -703008 -841113 -128407
33576 -128407 1634100 3434313 4142079 3828438 3482188 3525304 3306709 2249148 794234
33567 794234 -272424 -909755 -1593086 -2315327 -2558635 -2239030 -2010136 -2414420 -3187682
33558 -3187682 -3658320 -3504097 -2836808 -1791406 -411298 1071812 2146950 2412265 2017920
33549 2017920 1557453 1398749 1207866 362563 -1133147 -2431426 -2716834 -2067000 -1210167
33540 -1210167 -698169 -700357 -1348959 -2618772 -3836301 -4044094 -3208385 -2466638 -2643011
33531 -2643011 -3015817 -2321578 -708483 255144 -380159 -1792346 -2647336 -2703673 -2514313
33522 -2514313 -2186028 -1406218 -454610 -152799 -636249 -1008437 -563628 315088 913237
33513 913237 1258183 1839052 2619576 2977632 2529767 1531671 493928 -244774 -633828
33504 -633828 -914628 -1410503 -2053346 -2328066 -1996913 -1559152 -1518841 -1548014 -1085680 -516193
33494 -516193 -791876 -1833515 -2339524 -1578966 -450156 -119725 -388177 -279642 273789
33485 273789 378325 -335940 -1140341 -1271533 -820669 -301362 64387 285954 294735 103561
33475 103561 -8573 141804 238581 -253118 -1439190 -2832796 -3788578 -3949680 -3382271
33466 -3382271 -2529476 -2017812 -2209072 -2783133 -2949727 -2291009 -1293720 -788864 -901851
33457 -901851 -900563 -191619 899302 1613630 1704087 1471915 1097378 507776 -141554 -487874
33447 -487874 -603994 -1025371 -1849898 -2343712 -1862003 -762499 43556 137394 -249893 -827685
33437 -827685 -1463456 -1956814 -2086494 -1872439 -1499850 -1098294 -826412 -895420 -1176698 -1129655
33427 -1129655 -556967 -42321 -60285 -73515 670479 1764979 2105686 1635361 1445776 1909373
33417 1909373 1914036 573983 -1295597 -2260352 -2105991 -1692345 -1504408 -1352274 -1256448 -1641789
33407 -1641789 -2602875 -3718979 -4666852 -5378887 -5560828 -4777716 -3251567 -1954090 -1533881
33398 -1533881 -1578643 -1313525 -694374 -373744 -754458 -1516798 -2110103 -2365731 -2438839 -2337426
33388 -2337426 -1817131 -821643 194064 626657 376882 -63384 -163217 213834 874112
33379 874112 1463909 1564688 1042411 427797 478590 1124774 1367239 626021 -332331 -411872
33369 -411872 311395 896229 1053623 1373257 2024298 2272057 1677898 926463 853414 1260827
33359 1260827 1381962 1105967 996229 1273202 1494904 1306334 960215 932935 1388261 2147935
33349 2147935 2880660 3187348 2802111 1945711 1310923 1440085 2127606 2603945 2355459
33340 2355459 1663630 1260757 1510892 2047115 2212377 1693581 647063 -576870 -1575385
33331 -1575385 -1901262 -1335608 -253901 570600 685689 302206 -145660 -508548 -851665
33322 -851665 -1165709 -1401214 -1614753 -1848939 -1986077 -1883425 -1511685 -866348 -26115 536843
33312 536843 131438 -1241553 -2469353 -2388960 -1134414 137005 767579 1160580 1737687
33303 1737687 2109273 1722615 797722 50324 -229666 -294487 -296316 -55942 506934 1112084
33293 1112084 1391800 1208789 703712 242521 262765 882873 1651400 1953578 1698468 1348147
33283 1348147 1258264 1326243 1383265 1546162 1908858 2164150 1900186 1162089 384472 -206797
33273 -206797 -801009 -1525794 -2018079 -1675036 -309969 1497105 2716739 2653587 1574177
33264 1574177 508840 244721 545945 598281 176740 -51304 425807 1046664 807466
33255 807466 -342921 -1307395 -1171788 -272061 363091 301900 12189 17733 252715 389900
33245 389900 423671 595823 896055 993447 713720 309145 90605 -26310 -372919 -1005842
33235 -1005842 -1604854 -1914075 -2001295 -1951539 -1591591 -800684 92274 587178 628809 576182
33225 576182 553696 261956 -421191 -1081043 -1324735 -1390574 -1800040 -2568055 -3152510 -3121098
33215 -3121098 -2525639 -1669544 -865575 -423427 -511691 -942360 -1345353 -1564280 -1606476 -1293510
33205 -1293510 -440694 575925 1006054 717485 473070 857938 1427012 1414804 854843
33196 854843 341137 -9706 -556751 -1192863 -1276259 -701240 -272374 -611629 -1286303 -1510498
33186 -1510498 -1240699 -989567 -866752 -470222 339733 1153079 1597697 1760472 1850197 1789537
33176 1789537 1377820 653517 -118665 -700401 -941304 -693250 72418 974332 1246886
33167 1246886 354642 -1325194 -2655765 -2815435 -2114667 -1484120 -1291462 -1129368 -782639
33158 -782639 -772607 -1593371 -2897358 -3911191 -4273420 -3945349 -2736144 -728910 1046042
33149 1046042 1358116 356946 -451700 -123698 611575 589828 -206612 -977572 -1413031
33140 -1413031 -1810978 -2185080 -2111842 -1448879 -536699 350773 1194844 1853799 2068890 1941201
33130 1941201 1877718 1924694 1632844 750155 -390047 -1345995 -2013061 -2412294 -2468854 -2256952
33120 -2256952 -2099730 -2169146 -2305786 -2430412 -2726200 -3143030 -3169107 -2513503 -1666776 -1318943
33110 -1318943 -1485547 -1677508 -1697327 -1733838 -1812070 -1702143 -1353830 -958833 -607912 -323381
33100 -323381 -348752 -852663 -1351428 -1076310 -95413 544774 124856 -824317 -1328938 -1265512
33090 -1265512 -1296269 -1768016 -2279320 -2338683 -1964977 -1488417 -1068919 -603994 28531 798121
33080 798121 1592554 2385924 3208691 3850326 3767710 2663038 1166093 444852 856563
33071 856563 1415318 1052940 70297 -293131 420004 1340699 1574342 1321302 1280122 1490789
33061 1490789 1442893 1117439 1183879 1964183 2710670 2332612 672240 -1293572 -2482891
33052 -2482891 -2607645 -2008201 -1039410 10812 680027 625024 223906 312586 1040506 1492457
33042 1492457 907397 -137503 -399786 392779 1306296 1576221 1450244 1448212 1507141 1334304
33032 1334304 1109492 1259605 1751824 2062473 1758020 851110 -245835 -921630 -815115
33023 -815115 -328582 -354130 -1151135 -1869427 -1631407 -714160 -90818 -138861 -511268 -1026721
33013 -1026721 -1801140 -2533221 -2589551 -2003250 -1579780 -1759476 -2177236 -2637471 -3574012 -4981791
33003 -4981791 -5828437 -5401124 -4497835 -4224292 -4173217 -3084529 -1072223 219212 -123570
32994 -123570 -1140330 -1586917 -1534778 -1657706 -1857107 -1570311 -886257 -400721 -279793 -303705
32984 -303705 -553767 -1160774 -1560822 -994766 239483 1022475 1050525 1196466 1878413 2182193
32974 2182193 1365452 298849 318172 1208228 1515639 610121 -753938 -1886438 -2922692
32965 -2922692 -3870024 -4097342 -3397250 -2622568 -2533022 -2761672 -2684102 -2566196 -2875779 -3071202
32955 -3071202 -2306698 -1070518 -829416 -1962409 -3217580 -3499453 -3116079 -2798103 -2482870
32946 -2482870 -1776088 -880916 -292450 -40383 109003 105559 -123854 -258429 -47555 142790
32936 142790 -153370 -765393 -1265766 -1722139 -2373484 -2892263 -2789938 -2338928 -2216903 -2348685
32926 -2348685 -2026525 -1183413 -566177 -465749 -246710 502376 1248690 1449128 1417566 1643404
32916 1643404 1900769 1734788 1327506 1137674 1022546 445493 -632009 -1698795 -2401356
32907 -2401356 -2746791 -2741176 -2401771 -2048947 -2011690 -2044074 -1572628 -583454 235594 357257
32897 357257 -20989 -437306 -795432 -1281163 -1900090 -2369025 -2412945 -2045150 -1548679 -1172059
32887 -1172059 -852929 -373949 194062 490610 453643 545489 1061223 1548658 1402701 781434
32877 781434 318840 62149 -570496 -1682007 -2476050 -2282103 -1449662 -796745 -572987
32868 -572987 -442425 -228160 -144039 -301277 -385832 -1977 766621 1260430 843420 -283811
32858 -283811 -1026012 -478983 932555 1758190 1041077 -781959 -2518948 -3305906 -2947695
32849 -2947695 -1775203 -551525 -73587 -400037 -785366 -762459 -846832 -1597694 -2430988
$$ [...]
##END NTUPLES=NMR SPECTRUM
##END=
