##TITLE=31Pdec_67-2023Bay
 CDCl3 24 sc
 6.9.2023
##JCAMPDX= 6.0         $$ Bruker NMR JCAMP-DX V2.0
##DATA TYPE= NMR SPECTRUM
##DATA CLASS= NTUPLES
##ORIGIN= UXNMR, Bruker Analytische Messtechnik GmbH
##OWNER= root
$$ XWIN-NMR		Version 3.5
$$ Wed Sep  6 14:26:36 2023 Russian Standard Time (UT+4h)  she@DPX200
##.OBSERVE FREQUENCY= 81.013821
##.OBSERVE NUCLEUS= ^31P
##.ACQUISITION MODE= SIMULTANEOUS
##.ACQUISITION SCHEME= undefined
##.AVERAGES= 24
##.DIGITISER RES= 16
##SPECTROMETER/DATA SYSTEM= spect
##.PULSE SEQUENCE= zgpg30
##.SOLVENT NAME= DMSO
##.SHIFT REFERENCE= (INTERNAL, DMSO, 0, 248.564)
##AUDIT TRAIL= $$ (NUMBER, WHEN, WHO, WHERE, WHAT)
$$ ##TITLE= Audit trail, XWIN-NMR		Version 3.5
$$ ##JCAMPDX= 5.01
$$ ##ORIGIN= Bruker BioSpin GmbH
$$ ##OWNER= she
$$ F:/spectra/data/she/nmr/P31/1/pdata/1/auditp.txt
$$ ##AUDIT TRAIL=  $$ (NUMBER, WHEN, WHO, WHERE, WHAT)
(   1,<2023-09-06 14:25:37.62 +0400>,<she>,<DPX200>,
      <created by zg, POWCHK disabled, PULCHK disabled
       configuration hash MD5:
       00 E9 B6 7A A2 85 ED C7 34 08 36 98 17 FE 4E 26
       data hash MD5: 32K
       25 E3 9D 75 D5 D4 3A 56 C6 AD 41 C2 4F 80 D6 62>)
(   2,<2023-09-06 14:25:41.62 +0400>,<she>,<DPX200>,
      <Start of raw data processing
       efp BC_mod = 2 LB = 5 FT_mod = 6 PKNL = 1 PHC0 = -10614.71 PHC1 = -13.31499 SI = 64K 
       data hash MD5: 64K
       3E EC A3 71 47 70 6C F3 2A 0A AE 61 6E BD C6 3F>)
(   3,<2023-09-06 14:26:01.15 +0400>,<she>,<DPX200>,
      <pk PHC0 = 15.65083 PHC1 = 0 
       data hash MD5: 64K
       70 A2 69 21 3B 1D E6 6A 17 35 FE C3 C3 76 BB A1>)
(   4,<2023-09-06 14:26:04.25 +0400>,<she>,<DPX200>,
      <abs ABSG = 5 
       data hash MD5: 64K
       41 B6 11 42 B9 31 A2 54 48 CD 6D 84 90 D7 07 54>)
$$ ##END=
$$ 
$$ hash MD5
$$ BE CD EF AE E9 F4 E2 40 57 35 0C ED 0B 34 EF D5
##$RELAX= 
##$RELAX= 
##$RELAX= 
##$RELAX= 
##$RELAX= 
##$RELAX= 
##$RELAX= 
##$RELAX= 
##$RELAX= 
$$ Bruker specific parameters
$$ --------------------------
##$DU= <F:/spectra>
##$EXPNO= 1
##$NAME= <P31>
##$PROCNO= 1
##$TYPE= <nmr>
##$USER= <she>
##$AMP= (0..31)
100 100 100 100 100 100 100 100 100 100 100 100 100 100 100 100 100 100 
100 100 100 100 100 100 100 100 100 100 100 100 100 100 
##$AQSEQ= 0
##$AQ_mod= 1
##$AUNM= <au_zg>
##$AUTOPOS= <>
##$BF1= 81.014009
##$BF2= 200.13
##$BF3= 200.13
##$BF4= 200.13
##$BF5= 200.13
##$BF6= 200.13
##$BF7= 200.13
##$BF8= 200.13
##$BYTORDA= 1
##$CFDGTYP= 0
##$CFRGTYP= 5
##$CHEMSTR= <none>
##$CNST= (0..31)
1 1 145 1 1 1 1 1 1 1 1 1 1 1 1 1 1 1 1 1 1 1 1 1 1 1 1 1 1 1 1 1 
##$CPDPRG= <waltz16>
##$CPDPRG1= <>
##$CPDPRG2= <waltz16>
##$CPDPRG3= <>
##$CPDPRG4= <mlev>
##$CPDPRG5= <mlev>
##$CPDPRG6= <mlev>
##$CPDPRG7= <mlev>
##$CPDPRG8= <mlev>
##$CPDPRGB= <>
##$CPDPRGT= <>
##$D= (0..31)
0 1 0 0 0 0 0 0 0 0 0 0.03 2e-05 3e-06 0 0 0 0 0 0 0 0 0 0 0 0 0 0 0 0 
0 0 
##$DATE= 1693995937
##$DBL= (0..7)
120 120 120 11 120 120 24 19 
##$DBP= (0..7)
150 150 150 150 150 150 150 150 
##$DBP07= 0
##$DBPNAM0= <>
##$DBPNAM1= <>
$$ [...]
##$SUBNAM3= <"">
##$SUBNAM4= <"">
##$SUBNAM5= <"">
##$SUBNAM6= <"">
##$SUBNAM7= <"">
##$SUBNAM8= <"">
##$SUBNAM9= <"">
##$SW= 501.771253377433
##$SWIBOX= (0..15)
0 1 3 0 0 0 0 0 0 0 0 0 0 0 0 0 
##$SW_h= 40650.406504065
##$TD= 32768
##$TD0= 1
##$TE= 0
##$TE2= 300
##$TE3= 300
##$TEG= 300
##$TL= (0..7)
0 120 53 12 22 120 120 120 
##$TP= (0..7)
150 150 150 150 150 150 150 150 
##$TP07= 0
##$TPNAME0= <>
##$TPNAME1= <>
##$TPNAME2= <>
##$TPNAME3= <>
##$TPNAME4= <>
##$TPNAME5= <>
##$TPNAME6= <>
##$TPNAME7= <>
##$TPOAL= (0..7)
0.5 0.5 0.5 0.5 0.5 0.5 0.5 0.5 
##$TPOFFS= (0..7)
0 0 0 0 0 0 0 0 
##$TUNHIN= 0
##$TUNHOUT= 0
##$TUNXOUT= 0
##$USERA1= <user>
##$USERA2= <user>
##$USERA3= <user>
##$USERA4= <user>
##$USERA5= <user>
##$V9= 5
##$VALIST= <valist>
##$VCLIST= <CCCCCCCCCCCCCCC>
##$VD= 0
##$VDLIST= <DDDDDDDDDDDDDDD>
##$VPLIST= <PPPPPPPPPPPPPPP>
##$VTLIST= <TTTTTTTTTTTTTTT>
##$WBST= 1024
##$WBSW= 4
##$XGAIN= (0..3)
0 0 0 0 
##$XL= 0
##$YL= 0
##$YMAX_a= 1824
##$YMIN_a= -4999
##$ZGOPTNS= <>
##$ZL1= 120
##$ZL2= 120
##$ZL3= 120
##$ZL4= 120
##$ABSF1= 248.5645
##$ABSF2= -253.2056
##$ABSG= 5
##$ABSL= 3
##$ALPHA= 0
##$AQORDER= 0
##$ASSFAC= 0
##$ASSFACI= 0
##$ASSFACX= 0
##$ASSWID= 0
##$AUNMP= <proc_1d>
##$AZFE= 0.1
##$AZFW= 0.5
##$BCFW= 0
##$BC_mod= 2
##$BYTORDP= 0
##$COROFFS= 0
##$CY= -3
##$DATMOD= 1
##$DC= 0
##$DFILT= <>
##$DTYPP= 0
##$F1P= 0
##$F2P= 0
##$FCOR= 1
##$FTSIZE= 65536
##$FT_mod= 6
##$GAMMA= 0
##$GB= 0
##$INTBC= 1
##$INTSCL= 6.047779e-11
##$ISEN= 30
##$LB= 5
##$LEV0= 0
##$LPBIN= 0
##$MAXI= 10000
##$MC2= 0
##$MEAN= 0
##$ME_mod= 0
##$MI= 50
##$NCOEF= 0
##$NC_proc= -8
##$NLEV= 6
##$NOISF1= 182.463
##$NOISF2= 159.3651
##$NSP= 0
##$NTH_PI= 0
##$NZP= 0
##$OFFSET= 248.5645
##$PC= 4
##$PHC0= -10599.06
##$PHC1= -13.31499
##$PH_mod= 1
##$PKNL= yes
##$PPARMOD= 0
##$PSCAL= 0
##$PSIGN= 0
##$REVERSE= no
##$SF= 81.0140089999694
##$SI= 65536
##$SIGF1= 159.3651
##$SIGF2= -187.1042
##$SINO= 113.3802
##$SIOLD= 16384
##$SREGLST= <1H.CDCl3>
##$SSB= 0
##$STSI= 65536
##$STSR= 0
##$SW_p= 40650.406504065
##$SYMM= 0
##$S_DEV= 0
##$TDeff= 32768
##$TDoff= 0
##$TI= <>
##$TILT= no
##$TM1= 0
##$TM2= 0
##$TOPLEV= 0
##$USERP1= <user>
##$USERP2= <user>
##$USERP3= <user>
##$USERP4= <user>
##$USERP5= <user>
##$WDW= 1
##$XDIM= 65536
##$YMAX_p= 492344675
##$YMIN_p= -85292041
$$ End of Bruker specific parameters
$$ ---------------------------------
##NTUPLES= NMR SPECTRUM
##VAR_NAME=  FREQUENCY,     SPECTRUM/REAL,   SPECTRUM/IMAG
##SYMBOL=    X,             R,               I
##VAR_TYPE=  INDEPENDENT,   DEPENDENT,       DEPENDENT
##VAR_FORM=  AFFN,          ASDF,            ASDF
##VAR_DIM=   65536,         65536,           65536
##UNITS=     HZ,            ARBITRARY UNITS, ARBITRARY UNITS
##FACTOR=    0.620285442955139, 1,           1
##FIRST=     20137.2065510682, 0,            0
##LAST=      -20513.1999529968, 0,           0
##MIN=       -20513.1999529968, -85292041,   0
##MAX=       20137.2065510682, 492344675,    0
$$ Real data points
##PAGE= N=1
##DATA TABLE= (X++(R..R)), XYDATA
$$ [...]
$$ plain form
38527 -637669 -613411 -704436 -793803 -791113 -714392 -612025 -452474 -167150 196781 443255 393417
38516 393417 48798 -449072 -981227 -1510814 -2003061 -2379223 -2594957 -2715947 -2861207 -3085420
38506 -3085420 -3353290 -3613500 -3851383 -4066854 -4245389 -4375968 -4477975 -4588454 -4726868
38497 -4726868 -4879512 -5011307 -5089549 -5108141 -5096560 -5097521 -5128529 -5166858 -5169858 -5103319 -4956498
38486 -4956498 -4744814 -4495031 -4210385 -3856679 -3417407 -2975719 -2705994 -2740438 -3036694 -3392302
38476 -3392302 -3595911 -3572118 -3408531 -3272038 -3292928 -3496877 -3825106 -4212789 -4638702 -5092015
38466 -5092015 -5506513 -5758156 -5743729 -5458994 -4998465 -4486565 -4010224 -3602322 -3265726 -2995616
38456 -2995616 -2779955 -2599086 -2444690 -2334029 -2284750 -2275337 -2256287 -2212628 -2191696 -2243800 -2343257
$$ packed form
38527f37669K4258r1025q9367K690P6721J02367J59551K85324L63931K46474m9838
38516C93417l44619m97870n32155n29587m92247l76162k15734j20990j45260k24213
38506c085420k67870k60210k37883k15471j78535j30579j02007j10479j38414
38497d726868j52644j31795p8242j8592J1581r61l1008l8329l000O6539J46821
38486d956498K11684K49783K84646L53706M39272M41688K69725l4444k96256l55608
38476c392302k03609K3793J63587J36493k0890k03949l28229l87683m25913m53313
38466e092015m14498k51643J4427K84735M60529N11900M76341M07902L36596K70110
38456b995616K15661J80869J54396J10661M9279R413J9050M3659K0932n2104r9457
$$ plain form
38445 -2343257 -2387800 -2272280 -1950393 -1439928 -805101 -151130 383515 667087 643213 382784
38435 382784 61365 -148913 -195592 -163321 -181830 -328299 -604303 -955243 -1283113 -1482343
38425 -1482343 -1519906 -1471520 -1432698 -1396736 -1264405 -973275 -566489 -125138 307230 697712
38415 697712 967546 1014104 775465 245648 -542379 -1497096 -2445335 -3192349 -3634181 -3793098
38405 -3793098 -3741806 -3527213 -3178612 -2745947 -2281698 -1784874 -1193165 -449406 421224 1297505
38395 1297505 2027062 2520030 2794666 2933860 2996829 2981391 2872882 2703484 2529479 2348441
38385 2348441 2073415 1618909 1009051 382330 -114734 -435793 -653152 -892619 -1241341
38376 -1241341 -1675009 -2048094 -2186550 -2045604 -1788863 -1670305 -1797847 -2015267 -2039362 -1716288
$$ packed form
38445b343257m4543J15520L21887N10465O34827O53971N34645K83572k3874k60429
38435C82784l21419k10278m6679L2271j8509j46469k76004l50940l27870j99230
38425a482343l7563M8386L8822L5962J32331K91130M06786M41351M32368L90482
38415F97712K69834M6558k38639n29817p88027r54717r48239p47014m41832j58917
38405c793098N1292K14593L48601M32665M64249M96824N91709P43759Q70630Q76281
38395A297505P29557M92968K74636J39194O2969j5438j08509j69398j74005j81038
38385B348441k75026m54506o09858o26721m97064l21059k17359k39467l48722
38376a241341m33668l73085j38456J40946K56741J18558j27542k17420k4095L23074
$$ plain form
38366 -1716288 -1133091 -492467 80022 585963 1053084 1448130 1709989 1832992 1880825 1926837
38356 1926837 2008946 2139451 2326059 2570262 2866025 3213822 3617754 4049244 4422897 4628641
38346 4628641 4593881 4318850 3871985 3366784 2926810 2640235 2532152 2579408 2744060 2984016
38336 2984016 3241872 3441418 3497003 3325501 2873522 2168142 1345708 601762 84932 -171594
38326 -171594 -226865 -158867 -16786 172817 377626 558251 704881 859307 1064425 1278478
38316 1278478 1371874 1243105 925497 551236 223697 -41029 -261448 -433636 -539257 -569918
38306 -569918 -525039 -415481 -281462 -167833 -56214 142416 486448 909527 1261154 1434445
38296 1434445 1431177 1318056 1158824 991726 838752 716349 643183 638268 700690 794598 872819
$$ packed form
38366a716288N83197O40624N72489N05941M67121L95046K61859J23003M7833M6012
38356A926837Q2109J30505J86608K44203K95763L47797M03932M31490L73653K05744
38346D628641l4760k75031m46865n05201m39974k86575j08083M7256J64652K39956
38336B984016K57856J99546N5585j71502m51979p05380q22434p43946n16830k56526
38326a71594n5271O7998J42081J89603K04809J80625J46630J54426K05118K14053
38316A278478R3396j28769l17608l74261l27539k64726k20419j72188j05621l0661
38306e69918M4879J09558J34019J13629J11619J98630L44032M23079L51627J73291
38296A434445l268j13121j59232j67098j52974j22403p3166m915O2422R3908P8221
$$ plain form
38285 872819 923695 988979 1131980 1382198 1691846 1936841 1989578 1833916 1611686 1518353
38275 1518353 1628108 1831301 1950290 1896910 1706175 1449468 1161436 853705 554727 300353
38265 300353 98622 -59998 -149877 -95892 163193 600306 1100721 1532965 1812960 1915304
38255 1915304 1851556 1647881 1331896 932887 496331 92056 -203951 -334139 -258807 53187
38245 53187 604819 1340951 2160245 2956261 3624612 4045241 4121445 3871647 3445732 3006985
38235 3006985 2611187 2226091 1834512 1462047 1116970 775076 453746 253002 268640 463524
38225 463524 655582 655149 423761 101945 -124160 -191434 -196902 -273254 -451882 -662844 -836456
38214 -836456 -955609 -1015739 -997436 -913562 -844553 -875574 -1003201 -1142099 -1231730 -1309498 -1464133
$$ packed form
38285H72819N0876O5284J43001K50218L09648K44995N2737j55662k22230r3333
38275A518353J09755K03193J18989n3380j90735k56707k88032l07731k98978k54374
38265C00353k01731j58620q9879N3985K59085M37113N00415M32244K79995J02344
38255A915304o3748k03675l15985l99009m36556m04275k96007j30188P5332L11994
38245E3187N51632P36132Q19294P96016O68351M20629P6204k49798m25915m38747
38235C006985l95798l85096l91579l72465l45077l41894l21330k00744J5638J94884
38225D63524J92058m33k31388l21816k26105o7274n468p6352j78628k10962j73612
38214h36456j19153o0130J8303Q3874O9009l1021j27627j38898q9631p7768j54635
$$ plain form
38203 -1464133 -1734043 -2068853 -2379677 -2600082 -2690404 -2611736 -2338345 -1909828 -1446084 -1083092
38193 -1083092 -892922 -869178 -961240 -1085099 -1113637 -918124 -461181 161985 790378 1289030
38183 1289030 1568117 1560534 1247624 716170 140132 -331550 -660211 -879902 -1001504 -989826
38173 -989826 -831957 -591805 -377043 -264828 -268635 -355627 -471341 -560224 -599739 -624945 -690916
38162 -690916 -789323 -821105 -683413 -389384 -90857 17149 -186051 -696382 -1411028 -2196336
38152 -2196336 -2956825 -3660011 -4298676 -4840160 -5229529 -5431096 -5431291 -5198288 -4689008 -3934135
38142 -3934135 -3086167 -2327114 -1721547 -1195170 -663469 -142650 284383 571384 731533
38133 731533 766667 623745 251938 -306421 -901379 -1360511 -1597610 -1653084 -1636241 -1621449
$$ packed form
38203a464133k69910l34810l10824k20405r0322P8668K73391M28517M63744L62992
38193a083092J90170K3744r2062j23859k8538J95513M56943O23166O28393M98652
38183A289030K79087p583l12910n31454n76038m71682l28661k19691j21602J1678
38173i89826J57869K40152K14762J12215l807q6992j15714q8883l9515k5206o5971
38162f90916r8407l1782J37692K94029K98527J08006k03200n10331p14646p85308
38152b196336p60489p03186o38665n41484l89369k01567j95K33003N09280P54873
38142c934135Q47968P59053O05567N26377N31701N20819M27033K87001J60149
38133G31533L5134j42922l71807n58359n94958m59132k37099n5474J6843J4792
$$ plain form
38123 -1621449 -1590761 -1473013 -1231779 -906733 -578850 -324336 -212592 -311455 -644297 -1138757
38113 -1138757 -1656704 -2092948 -2420742 -2629433 -2659075 -2444359 -2015142 -1510281 -1078257 -783152
38103 -783152 -605648 -497759 -412977 -305158 -132287 127696 463625 823127 1117626 1262225
38093 1262225 1237303 1106252 953626 804726 615439 336263 -22711 -377717 -602502 -585694
38083 -585694 -297009 178094 675003 1036246 1178088 1102415 876124 598030 350519 158308
38073 158308 -24 -136782 -228480 -246525 -182713 -24633 261959 685408 1177243 1637144
38063 1637144 2036773 2439249 2894746 3345193 3663050 3778321 3749842 3715739 3785564 3972836
38053 3972836 4209554 4407825 4503290 4456872 4253884 3928394 3567071 3246484 2964729 2668687
$$ packed form
38123a621449L0688J17748K41234L25046L27883K54514J11744r8863l32842m94460
38113a138757n17947m36244l27794k08691k9642K14716M29217N04861M32024K95105
38103g83152J77504J07889Q4782J07819J72871K59983L35929L59502K94499J44599
38093A262225k4922j31051j52626j48900j89287k79176l58974l55006k24785J6808
38083e85694K88685M75103M96909L61243J41842p5673k26291k78094k47511j92211
38073A58308j58332j36758r1698j8045O3812J58080K86592M23449M91835M59901
38063A637144L99629M02476M55497M50447L17857J15271k8479l4103O9825J87272
38053C972836K36718J98271R5465m6418k02988l25490l61323l20587k81755k96042
$$ plain form
38043 2668687 2349494 2068461 1876500 1751281 1634532 1486610 1275433 963923 564765
38034 564765 175492 -103853 -275314 -413249 -548142 -644066 -681144 -679704 -624677 -442425
38024 -442425 -99341 322932 696023 962963 1161280 1361851 1616546 1936985 2287858 2611761
38014 2611761 2871957 3041927 3047611 2784150 2239668 1562125 947367 484487 154482 -65016
38004 -65016 -179050 -245388 -366169 -568887 -751995 -793252 -684239 -527221 -422130 -386986
37994 -386986 -378855 -367780 -383806 -490962 -710757 -981098 -1206957 -1341559 -1394445 -1373921 -1266655
37983 -1266655 -1083620 -886769 -746120 -691954 -726039 -856494 -1095200 -1425762 -1785537 -2074608
37973 -2074608 -2186488 -2058537 -1714542 -1254808 -802032 -465356 -341117 -495599 -908603
$$ packed form
38043B668687l19193k81033j91961j25219j16749j47922k11177l11510l99158
38034E64765l89273k79345j71461j37935j34893r5924l7078J440N5027J82252
38024d42425L43084M22273L73091K66940J98317K00571K54695L20439L50873L23903
38014B611761K60196J69970N684k63461n44482o77543o14758m62880l30005k19498
38004f5016j14034o6338j20781k02718j83108m1257J09013J57018J05091L5144
37994c86986Q131J1075j6026j07156k19795k70341k25859j34602n2886K0524J07266
37983a266655J83035J96851J40649N4166l4085j30455k38706l30562l59775k89071
37973b074608j11880J27951L43995M59734M52776L36676J24239j54482m13004
$$ plain form
37964 -908603 -1450459 -1953444 -2320102 -2559150 -2726884 -2852976 -2925298 -2930899 -2895662 -2876116
37954 -2876116 -2912876 -2997340 -3081235 -3104150 -3012043 -2784765 -2479612 -2228182 -2139402 -2193788 -2264248
37943 -2264248 -2248355 -2147834 -2011966 -1851447 -1646653 -1419745 -1260432 -1274253 -1506282 -1891395
37933 -1891395 -2261878 -2428228 -2290270 -1884164 -1331653 -766347 -303590 -24258 61834 22513
37923 22513 -60364 -151968 -242679 -297280 -273132 -170668 -4544 278660 784539 1526908 2329355
37912 2329355 2916393 3109721 2933672 2559732 2181280 1924714 1824565 1842215 1905580 1948138
37902 1948138 1928327 1828639 1650502 1416670 1175705 993447 925271 986713 1152674 1389129
37892 1389129 1679234 2010398 2345262 2626058 2810921 2887712 2844730 2651514 2296662 1841358
$$ packed form
37964i08603n41856n02985l66658k39048j67734j26092p2322n601L5237J9546
37954b876116l6760q4464q3895k2915R2107K27278L05153K51430Q8780n4386p0460
37943b264248J5893J00521J35868J60519K04794K26908J59313j3821k32029l85113
37933a891395l70483j66350J37958M06106N52511N65306M62757K79332Q6092l9321
37923B2513q2877r1604r0711n4601K4148J02464J66124K83204N05879P42369Q02447
37912B329355N87038J93328j76049l73940l78452k56566j00149J7650O3365M2558
37902A948138j9811r9688j78137k33832k40965j82258o8176O1442J65961K36455
37892A389129K90105L31164L34864K80796J84863P6791m2982j93216l54852m55304
$$ plain form
37882 1841358 1407103 1091281 894813 732821 508922 184189 -200705 -551334 -780051
37873 -780051 -869929 -887452 -917298 -974656 -986756 -862777 -576691 -188955 192365 469344
37863 469344 602171 625821 614268 612241 600602 528570 366152 122024 -162777 -416332 -551773
37852 -551773 -518574 -343076 -104045 125175 298361 385889 382506 320197 234112 111146 -92476
37841 -92476 -375033 -667804 -905918 -1086546 -1230345 -1310525 -1257844 -1039389 -718621 -434327
37831 -434327 -313751 -383575 -548620 -657189 -588164 -286224 237919 888335 1484742 1860145
37821 1860145 1984351 1940528 1763730 1380651 771185 132928 -212101 -87674 395253 942580
37811 942580 1269027 1225665 856790 386237 83873 67294 227282 366535 395960 377882
$$ packed form
37882A841358m34255l15822j96468j61992k23899l24733l84894l50629k28717
37873g80051q9878j7523k9846n7358j2100J23979K86086L87736L81320K76979
37863D69344J32827K3650j1553k027j1639p2032j62418k44128k84801k53555j35441
37852e51773L3199J75498K39031K29220J73186Q7528l383o2309q6085j22966k03622
37841i2476k82557k92771k38114j80628j43799q0180N2681K18455L20768K84294
37831d34327J20576o9824j65045j08569O9025L01940N24143O50416N96407L75403
37821A860145J24206m3823j76798l83079o09466o38257l45029J24427M82927N47327
37811I42580L26447m3362l68875m70553l02364j6579J59988J39253K9425j8078
$$ plain form
37801 377882 409399 517872 682130 912227 1253056 1690412 2087393 2270383 2197893 2007529
37791 2007529 1861385 1769437 1608297 1297439 900677 551204 336613 284132 407592 715795
37781 715795 1184100 1743804 2284385 2648364 2663731 2247759 1497071 644589 -96298 -653623
37771 -653623 -1095119 -1548534 -2118404 -2818590 -3537342 -4087282 -4340749 -4332201 -4203112 -4030084
37761 -4030084 -3723615 -3117940 -2161116 -1007844 71853 869696 1343533 1587920 1737046
37752 1737046 1899969 2157960 2569593 3132358 3739264 4218026 4450578 4447285 4288666 4024208
37742 4024208 3674457 3314703 3076630 3023222 3061077 3025582 2842311 2576271 2343405 2214074
37732 2214074 2189069 2213528 2194484 2043013 1740600 1372477 1086310 1001364 1128688 1357682
$$ packed form
37801C77882L1517J08473J64258K30097L40829M37356L96981J82990p2490j90364
37791B007529j46144r1948j61140l10858l96762l49473k14591n2481J23460L08203
37781G15795M68305N59704N40581L63979J5367m15972p50688q52482p40887n57325
37771f53623m41496m53415n69870p00186p18752n49940k53467Q548J29089J73028
37761d030084L06469O05675R56824J153272J079697P97843M73837K44387J49126
37752A737046J62923K57991M11633N62765O06906M78762K32552l293j58619k64458
37742D024208l49751l59754k38073n3408L7855l5495j83271k66040k32866j29331
37732B214074k5005K4459j9044j51471l02413l68123k86167q4946J27324K28994
$$ plain form
37722 1357682 1533562 1576929 1531896 1487619 1470500 1442627 1389704 1355554 1371713 1395668 1354558
37711 1354558 1228208 1051524 843167 575502 238466 -84999 -242699 -138615 156847
37702 156847 428849 464502 193009 -298655 -862140 -1386203 -1818339 -2127170 -2274582 -2240395
37692 -2240395 -2074578 -1900303 -1823786 -1825213 -1768750 -1549529 -1213835 -907306 -726240 -660723
37682 -660723 -667030 -732351 -850879 -988731 -1110752 -1215209 -1311159 -1387096 -1443240 -1545236 -1800229
37671 -1800229 -2258086 -2847440 -3418176 -3845168 -4100774 -4252203 -4405030 -4637613 -4958500
37662 -4958500 -5302211 -5571050 -5710234 -5759471 -5814150 -5912184 -5962798 -5802295 -5316665 -4509173
37652 -4509173 -3488839 -2439027 -1573147 -1039701 -830111 -809775 -859037 -949798 -1071770 -1149198
$$ packed form
37722A357682J75880M3367m5033m4277j7119k7873n2923l4150J6159K3955m1110
37711A354558j26350j76684k08357k67665l37036l23465j57700J04084K95462
37702A56847K72002L5653k71493m91664n63485n24063m32136l08831j47412L4187
37692b240395J65817J74275P6517j427N6463K19221L35694L06529J81066O5517
37682f60723o307o5321j18528j37852j22021j04457r5950p5937n6144j01996k54993
37671a800229m57857n89354n70736m26992k55606j51429j52827k32583l20887
37662d958500l43711k68839j39184m9237n4679r8034n0614J60503M85630Q07492
37652d509173J020334J049812Q65880N33446K09590K0336m9262r0761j21972p7428
$$ plain form
37642 -1149198 -1094041 -910336 -671990 -395954 -3865 564858 1247924 1899041 2397603 2690037
37632 2690037 2768215 2682176 2576700 2633479 2907489 3236578 3372975 3221463 2916314 2655764
37622 2655764 2503331 2374932 2172652 1872895 1500117 1077008 615737 122979 -392715
37613 -392715 -886313 -1253232 -1389245 -1281136 -989310 -536335 111896 916653 1694214 2251685
37603 2251685 2558662 2712711 2770684 2711413 2558074 2420458 2358593 2277547 2034558 1626134
37593 1626134 1210606 950998 876680 898290 923091 945061 1039207 1272943 1612122 1911685
37583 1911685 2008238 1834156 1461997 1060352 795336 721721 729707 617377 261075 -272114
37573 -272114 -792324 -1159195 -1366290 -1468397 -1475823 -1354172 -1112666 -854597 -717037 -754979
$$ packed form
37642a149198N5157J83705K38346K76036L92089N68723O83066O51117M98562K92434
37632B690037P8178q6039j05476N6779K74010L29089J36397j51512l05149k60550
37622B655764j52433j28399k02280k99757l72778m23109m61271m92758n15694
37613c92715m93598l66919j36013J08109K91826M52975O48231Q04757P77561N57471
37603B251685L06977J54049N7973n9271j53339j37616o1865q1046k42989m08424
37593A626134m15528k59608p4318K1610K4801K1970R4146K33736L39179K99563
37583A911685R6553j74082l72159m01645k65016p3615P986j12330l56302n33189
37573b72114n20210l66871k07095j02107p426J21651K41506K58069J37560l7942
$$ plain form
37563 -754979 -886228 -957391 -873029 -661731 -416156 -183443 66291 372024 717514 1049708
37553 1049708 1332090 1544355 1635054 1512812 1108858 444456 -368100 -1182580 -1876477 -2376245
37543 -2376245 -2654034 -2706979 -2532046 -2121426 -1493824 -733422 17156 624497 1039110 1308385
37533 1308385 1519921 1735814 1974499 2229817 2477055 2656452 2683274 2513164 2206933 1911919
37523 1911919 1761003 1782980 1901781 2008840 2042208 2028139 2068943 2270285 2638811 3037768
37513 3037768 3268816 3225871 2971648 2654597 2356505 2039387 1644096 1212908 879240 730379
37503 730379 708607 673018 550875 407481 371094 507764 760502 977218 996752 758349
37493 758349 371242 61543 3490 178840 402037 479691 349485 100854 -95763 -84177
$$ packed form
37563g54979j31249p1163Q4362K11298K45575K32713K49734L05733L45490L32194
37553A049708K82382K12265R0699j22242m03954o64402q12556q14480o93897m99768
37543b376245k77789n2945J74933M10620O27602P60402P50578O07341M14613K69275
37533A308385K11536K15893K38685K55318K47238J79397K6822j70110l06231k95014
37523A911919j50916K1977J18801J07059L3368j4069M0804K01342L68526L98957
37513C037768K31048m2945k54223l17051k98092l17118l95291m31188l33668j48861
37503G30379k1772l5589j22143j43394l6387J36670K52738K16716J9534k38403
37493G58349l87107l09699n8053J75350K23197P7654j30206k48631j96617J1586
$$ plain form
37483 -84177 198671 690651 1239848 1682718 1908052 1877786 1614589 1167947 573399 -154766
37473 -154766 -976297 -1782907 -2444235 -2918247 -3297292 -3715948 -4203867 -4630237 -4791454 -4560713
37463 -4560713 -3975448 -3202797 -2427859 -1763978 -1240615 -838285 -516821 -231009 48864
37454 48864 323840 576369 777970 873738 787113 485268 44293 -382530 -673559 -803598
37444 -803598 -812635 -748261 -644956 -522695 -384570 -234036 -100510 -16175 50103 205792
37434 205792 549028 1071139 1646957 2101519 2285493 2132938 1693326 1105614 516815 21036
37424 21036 -328322 -484196 -417882 -154002 235373 671836 1093770 1450614 1693115 1763432
37414 1763432 1588925 1118345 407177 -338794 -856311 -1002955 -854099 -626280 -512061
$$ packed form
37483h4177K82848M91980N49197M42870K25334l0266k63197m46642n94548p28165
37473a54766q21531q06610o61328m74012l79045m18656m87919m26370j61217K30741
37463d560713N85265P72651P74938O63881N23363M02330L21464K85812K79873
37454D8864K74976K52529K01601R5768q6625l01845m40975m26823k91029j30039
37444h03598r037O4374J03305J22261J38125J50534J33526Q4335O6278J55689
37434B05792L43236N22111N75818M54562J83974j52555m39612n87712n88799m95779
37424B1036l49358j55874O6314K63880L89375M36463M21934L56844K42501P0317
37414A763432j74507m70580p11168p45971n17517j46644J48856K27819J14219
$$ plain form
37405 -512061 -582722 -816423 -1168546 -1581132 -1949342 -2158041 -2206075 -2256789 -2487229 -2881153
37395 -2881153 -3236668 -3396012 -3400963 -3388736 -3406381 -3392837 -3292821 -3104827 -2834802 -2479098
37385 -2479098 -2055665 -1594696 -1100779 -581691 -110061 214318 377402 460150 511696 480169
37375 480169 314425 83047 -68057 -58268 65946 187191 188952 -11923 -441741 -1046028
37365 -1046028 -1698882 -2250570 -2580063 -2631558 -2429544 -2059957 -1622706 -1195423 -830280 -555866
37355 -555866 -366772 -235457 -161789 -199271 -404558 -764275 -1196273 -1623863 -2024259 -2396285
37345 -2396285 -2704827 -2882805 -2889449 -2754236 -2556768 -2364722 -2190612 -1999801 -1748997 -1417748
37335 -1417748 -1019014 -591901 -176948 212881 590639 955223 1267057 1486944 1631138
$$ packed form
37405e12061p0661k33701l52123m12586l68210k08699m8034n0714k30440l93924
37395b881153l55515j59344m951J2227j7645J3544J00016J87994K70025L55704
37385b479098M23433M60969M93917N19088M71630L24379J63084Q2748N1546l1527
37375D80169j65744k31378j51104R789J24214J21245J761k00875m29818o04287
37365a046028o52854n51688l29493n1495K02014L69587M37251M27283L65143K74414
37355e55866J89094J31315P3668l7482k05287l59717m31998m27590m00396l72026
37345b396285l08542j77978o644J35213J97468J92046J74110J90811K50804L31249
37335a417748L98734M27113M14953L89829L77758L64584L11834K19887J44194
$$ plain form
37326 1631138 1754714 1870992 1912012 1782812 1441713 927383 336842 -211844 -632563 -924151
37316 -924151 -1157816 -1382566 -1552271 -1572922 -1408582 -1100748 -684762 -139009 550430 1301166
37306 1301166 1951404 2370789 2541169 2536946 2452573 2353922 2272847 2220847 2203436 2228550 2301963
37295 2301963 2416435 2560217 2746706 3015275 3365283 3681842 3762568 3453196 2758677 1816926
37285 1816926 789858 -191499 -1002073 -1517804 -1682964 -1567773 -1324258 -1075112 -851000
37276 -851000 -627610 -403105 -229408 -174019 -263494 -474696 -783074 -1205178 -1772062 -2453503
37266 -2453503 -3119921 -3591027 -3726958 -3486309 -2927506 -2180922 -1414947 -795533 -440640
37257 -440640 -387694 -590317 -940325 -1301046 -1550579 -1637695 -1619289 -1619267 -1707563 -1814913 -1802630
$$ packed form
37326A631138J23576J16278M1020j29200l41099n14330n90541n48686m20719k91588
37316i24151k33665k24750j69705k0651J64340L07834M15986N45753O89439P50736
37306A301166O50238M19385J70380m223q4373r8651q1075n2000j7411K5114P3413
37295B301963J14472J43782J86489K68569L50008L16559Q0726l09372o94519r41751
37285A816926j027068r81357q10574n15731j65160J15191K43515K49146K24112
37276h51000K23390K24505J73697N5389q9475k11202l08378m22104n66884o81441
37266b453503o66418m71106j35931K40649N58803P46584P65975O19414L54893
37257d40640N2946k02623l50008l60721k49533q7116J8406K2q8296j07350J2283
$$ plain form
37246 -1802630 -1627776 -1398004 -1234971 -1124740 -956515 -688415 -410086 -233540 -174710 -160992
37236 -160992 -115321 -19668 56100 -34201 -413586 -1034511 -1655239 -2020874 -2072564 -1956329
37226 -1956329 -1854198 -1854488 -1959745 -2130762 -2287981 -2334694 -2249474 -2149144 -2213349 -2528422
37216 -2528422 -3010576 -3471607 -3743336 -3756389 -3546970 -3217307 -2872402 -2554114 -2211495 -1742518
37206 -1742518 -1092654 -337224 330761 717074 765663 609331 485372 576795 895577 1285363
37196 1285363 1528952 1479859 1137722 632401 131866 -270223 -611461 -1018772 -1606814 -2406158
37186 -2406158 -3359996 -4344422 -5175382 -5642031 -5602778 -5077901 -4239936 -3316153 -2509605 -1976824
37176 -1976824 -1800291 -1937772 -2230021 -2505484 -2684097 -2772837 -2782926 -2678535 -2402703 -1944722
$$ packed form
37246a802630J74854K29772J63033J10231J68225K68100K78329J76546N8830J3718
37236a60992M5671R5653P5768r0301l79385o20925o20728l65635n1690J16235
37226a956329J02131k90j05257j71017j57219m6713Q5220J00330o4205l15073
37216b528422m82154m61031k71729j3053K09419L29663L44905L18288L42619M68977
37206a742518O49864P55430O67985L86313M8589j56332j23959R1423L18782L89786
37196A285363K43589m9093l42137n05321n00535m02089l41238m07311n88042p99344
37186b406158r53838r84426q30960m66649L9253N24877Q37965R23783Q06548N32781
37176a976824J76533j37481k92249k75463j78613q8740j0089J04391K75832M57981
$$ plain form
37166 -1944722 -1397710 -954432 -804351 -990059 -1371537 -1756179 -2051018 -2270302 -2435371
37157 -2435371 -2526572 -2517666 -2387342 -2088605 -1580856 -935762 -362115 -62643 -66822 -230148
37147 -230148 -385922 -474585 -541076 -640275 -750952 -774361 -630313 -367269 -156600 -151984 -363079
37136 -363079 -679996 -990326 -1233471 -1368311 -1362518 -1239226 -1086371 -977904 -899939 -778915
37126 -778915 -570409 -303007 -54681 84372 37257 -228912 -679300 -1237189 -1852938 -2541118
37116 -2541118 -3332496 -4186738 -4966551 -5512904 -5750620 -5721022 -5522642 -5241109 -4941960 -4700631
37106 -4700631 -4591778 -4626256 -4710932 -4692655 -4457315 -4003504 -3439476 -2911573 -2516943 -2267144
37096 -2267144 -2129150 -2089477 -2156631 -2296944 -2396088 -2315356 -1994294 -1498305 -977414 -581926
$$ packed form
37166a944722N47012M43278J50081j85708l81478l84642k94839k19284j65069
37157b435371r1201Q906J30324K98737N07749O45094N73647K99472m179j63326
37147b30148j55774q8663o6491r9199j10677k3409J44048K63044K10669M616k11095
37136c63079l16917l10330k43145j34840N793J23292J52855J08467P7965J21024
37126g78915K08506K67402K48326J39053m7115k66169m50388n57889o15749o88180
37116b541118p91378q54242p79813n46353k37716K9598J98380K81533K99149K41329
37106d700631J08853l4478q4676J8277K35340M53811N64028N27903L94630K49799
37096b267144J37994L9673o7154j40313r9144Q0732L21062M95989N20891L95488
$$ plain form
37086 -581926 -387271 -357865 -374373 -320863 -164437 52644 296944 598985 1008601 1506726
37076 1506726 1987117 2333911 2500154 2496305 2324444 1970995 1477262 967360 550625 207562
37066 207562 -174296 -648962 -1152967 -1611224 -2029182 -2422351 -2702680 -2717978 -2405244 -1852940
37056 -1852940 -1218106 -639320 -228605 -72602 -199637 -576622 -1155468 -1885031 -2664911
37047 -2664911 -3343480 -3805262 -4036386 -4083878 -3993849 -3826040 -3685213 -3675067 -3825150 -4094402
37037 -4094402 -4425523 -4756639 -5003247 -5086923 -4988827 -4746295 -4411086 -4050551 -3767625 -3647252
37027 -3647252 -3662738 -3683164 -3598001 -3402723 -3149832 -2861396 -2523350 -2137378 -1740612 -1379088
37017 -1379088 -1075036 -801527 -473437 7739 656724 1343479 1847620 1988109 1716008
$$ packed form
37086e81926J94655K9406j6508N3510J56426K17081K44300L02041M09616M98125
37076A506726M80391L46794J66243l849j71861l53449m93733n09902m16735l43063
37066B07562l81858m74666n04005m58257m17958l93169k80329j5298L12734N52304
37056a852940O34834N78786M10715J56003j27035l76985n78846p29563p79880
37047b664911o78569m61782k31124m7492R0029J67809J40827J0146j50083k69252
37037d094402l31121l31116k46608q3676R8096K42532L35209L60535K82926J20373
37027c647252j5486k0426Q5163J95278K52891K88436L38046L85972L96766L61524
37017a379088L04052K73509L28090M81176O48985O86755N04141J40489k72101
$$ plain form
37008 1716008 1114480 338212 -452530 -1130327 -1603275 -1801386 -1683110 -1269765 -666124
36999 -666124 -25235 527731 953827 1296718 1624088 1964977 2298547 2601267 2895383 3237232
36989 3237232 3654483 4102088 4484406 4721255 4797327 4751006 4609981 4337580 3859190 3155350
36979 3155350 2317877 1500012 821749 333190 36322 -107751 -189681 -312981 -509229 -711027
36969 -711027 -832629 -868840 -904288 -1039568 -1314925 -1678985 -2005084 -2151984 -2047129 -1735018
36959 -1735018 -1349683 -1038418 -897185 -946091 -1137390 -1384692 -1602432 -1735401 -1761921 -1673551
36949 -1673551 -1449881 -1054953 -474947 225436 896973 1388812 1655524 1778258 1878139 2014200
36939 2014200 2160545 2267347 2337760 2444608 2658310 2946421 3160867 3148580 2865351 2358294
$$ packed form
37008A716008o01528p76268p90742o77797m72948j98111J18276M13345O03641
36999f66124O40889N52966M26096L42891L27370L40889L33570L02720K94116L41849
36989C237232M17251M47605L82318K36849P6072m6321j41025k72401m78390p03840
36979C155350q37473q17865o78263m88559k96868j44073q1930j23300j96248k01798
36969g11027j21602l6211l5448j35280k75357l64060l26099j46900J04855L12111
36959a735018L85335L11265J41233m8906j91299k47302k17740j32969k6520Q8370
36949a673551K23670L94928N80006P00383O71537M91839K66712J22734R9881J36061
36939B014200J46345J06802P0413J06848K13702K88111K14446j2287k83229n07057
$$ plain form
36929 2358294 1658228 742072 -389572 -1638222 -2824608 -3749525 -4242185 -4219511 -3752116
36920 -3752116 -3045881 -2312167 -1661092 -1136498 -806507 -744559 -915763 -1146836 -1254258 -1188696
36910 -1188696 -1029089 -845241 -593767 -157009 529978 1401621 2296603 3043433 3509819
36901 3509819 3614194 3352424 2835248 2267386 1845531 1648179 1601995 1541654 1325636 944015
36891 944015 535520 277209 238010 345704 487439 604420 680979 694851 626290 496137
36881 496137 352164 224544 127378 90492 136726 209793 164220 -130117 -665636 -1284857
36871 -1284857 -1784160 -2026997 -1983891 -1717731 -1369549 -1137205 -1196458 -1587479 -2182293 -2790937
36861 -2790937 -3301330 -3712034 -4063681 -4379414 -4650572 -4821338 -4784056 -4448394 -3844675 -3130631
$$ packed form
36929B358294p00066r16156j131644j248650j186386r24917m92660K2674M67395
36920c752116P06235P33714O51075N24594L29991O1948j71204k31073j07422O5562
36910a188696J59607J83848K51474M36758O86987Q71643Q94982P46830M66386
36901C509819J04375k61770n17176n67862m21855j97352m6184o0341k16018l81621
36891I44015m08495k58311l9199J07694J41735J16981P6559J3872o8561j30153
36881D96137j43973j27620r7166l6886M6234P3067m5573k94337n35519o19221
36871a284857m99303k42837M3106K66160L48182K32344n9253l91021n94814o08644
36861b790937n10393m10704l51647l15733k71158j70766L7282L35662O03719P14044
$$ plain form
36851 -3130631 -2480731 -1988549 -1663650 -1463605 -1312642 -1145999 -967969 -823500 -688175
36842 -688175 -441317 7013 599438 1179112 1619248 1878372 1984212 2015459 2052655 2084931
36832 2084931 1999172 1717340 1304207 877810 467135 51917 -298044 -452052 -395954 -264629
36822 -264629 -161456 -46682 138671 326682 387438 297902 167662 107342 126155 156581
36812 156581 135994 52233 -69783 -208033 -353766 -472015 -482618 -336264 -113795 3815
36802 3815 -113730 -462388 -973463 -1595225 -2265495 -2871983 -3321825 -3631833 -3884452 -4100844
36792 -4100844 -4216230 -4182846 -4040170 -3866765 -3709825 -3586598 -3512437 -3483532 -3449676 -3348346
36782 -3348346 -3168732 -2946340 -2681050 -2297875 -1731877 -1044651 -412935 12342 205239
$$ packed form
36851c130631O49900M92182L24899K00045J50963J66643J78030J44469J35325
36842f88175K46858M48330N92425N79674M40136K59124J05840L1247L7196L2276
36832B084931q5759k81832m13133m26397m10675m15218l49961j54008N6098J31325
36822b64629J03173J14774J85353J88011O0756q9536j30240o0320J8813L0426
36812A56581k0587q3761j22016j38250j45733j18249j0603J46354K22469J17610
36802C815j17545l48658n11075o21762o70270o06488m49842l10008k52619k16392
36792d100844j15386L3384J42676J73405J56940J23227P4161K8905L3856J01330
36782c348346J79614K22392K65290L83175N65998O87226O31716M25277J92897
$$ plain form
36773 205239 217282 89629 -136633 -363892 -479055 -470131 -448187 -528623 -724941 -971354
36763 -971354 -1204872 -1402190 -1579204 -1787394 -2074191 -2406301 -2657943 -2719554 -2611267 -2461553
36753 -2461553 -2383577 -2388226 -2389520 -2264816 -1941727 -1477321 -1040671 -769731 -645620 -541785
36743 -541785 -381897 -199280 -52106 48133 106252 110733 73156 45948 45173 -1416 -151256
36732 -151256 -303459 -244455 126357 664862 1113668 1331764 1357324 1281909 1137756 924129
36722 924129 688005 528517 523904 672069 897943 1110089 1265343 1402133 1614708 1981926
36712 1981926 2507235 3110862 3663592 4038774 4175031 4120092 3998883 3908831 3842702 3719489
36702 3719489 3473222 3098456 2642583 2199156 1893647 1810895 1907253 2027602 2042438 1961920
$$ packed form
36773B05239J2043j27653k26262k27259j15163Q924K1944q0436j96318k46413
36763i71354k33518j97318j77014k08190k86797l32110k51642o1611J08287J49714
36753b461553P7976m649j294J24704L23089M64406M36650K70940J24111J03835
36743e41785J59888J82617J47174J00239N8119M481l7577k7208p75m6589j49840
36732a51256j52203N9004L70812N38505M48806K18096K5560p5415j44153k13627
36722I24129k36124j59488m613J48165K25874K12146J55254J36790K12575L67218
36712A981926N25309O03627N52730L75182J36257n4939j21209r0052o6129j23213
36702C719489k46267l74766m55873m43427l05509q2752R6358J20349J4836q0518
$$ plain form
36692 1961920 1906872 1988302 2228373 2569814 2920727 3184715 3278883 3159977 2855635 2470331
36682 2470331 2138916 1951414 1919991 2019363 2233520 2532153 2815430 2932961 2784668 2392422
36672 2392422 1872997 1367249 995797 831420 864723 1001079 1125061 1184947 1218212 1307873
36662 1307873 1525675 1905874 2445607 3103599 3783133 4328833 4589552 4533471 4297422 4080917
36652 4080917 3976388 3920648 3800202 3555133 3174777 2660886 2051756 1457015 1015387 811281
36642 811281 845261 1062989 1384713 1727765 2039134 2300067 2473294 2466294 2192703 1671363
36632 1671363 1031266 420090 -60353 -341863 -381117 -202964 74375 294142 344364 190738
36622 190738 -137231 -561102 -967968 -1246942 -1332377 -1221510 -968602 -673308 -453286 -388029
$$ packed form
36692A961920n5048Q1430K40071L41441L50913K63988R4168j18906l04342l85304
36682B470331l31415j87502l1423R9372K14157K98633K83277J17531j48293l92246
36672B392422n19425n05748l71452j64377L3303J36356J23982N9886L3265Q9661
36662A307873K17802L80199N39733O57992O79534N45700K60719n6081k36049k16505
36652D080917j04529n5740j20446k45069l80356n13891o09130n94741m41628k04106
36642H11281L3980K17728L21724L43052L11369K60933J73227p000k73591n21340
36632A671363o40097o11176m80443k81510l9254J78153K77339K19767N0222j53626
36622A90738l27969m23871m06866k78974q5435J10867K52908K95294K20022O5257
$$ plain form
36612 -388029 -465861 -586517 -625190 -509832 -263558 3788 149400 75846 -209665 -600183
36602 -600183 -959128 -1203568 -1341040 -1439340 -1554667 -1672734 -1718868 -1643942 -1507157 -1451070
36592 -1451070 -1571726 -1825359 -2088557 -2299867 -2503219 -2746654 -2982810 -3100438 -3030269 -2790805
36582 -2790805 -2453751 -2107967 -1847995 -1740911 -1771666 -1840283 -1840237 -1741674 -1591605 -1439470 -1276002
36571 -1276002 -1054186 -772506 -525297 -444298 -573887 -813486 -992588 -989764 -775240 -379237
36561 -379237 132136 659415 1103349 1424229 1653042 1833733 1965265 2000118 1885071 1610218
36551 1610218 1243616 918027 754741 786151 960086 1208424 1479770 1703045 1761330 1543373
36541 1543373 1034812 359146 -282228 -743022 -1033567 -1282186 -1582057 -1898383 -2143229
$$ packed form
36612c88029p7832j20656l8673J15358K46274K67346J45612p3554k85511l90518
36602f00183l58945k44440j37472r8300j15327j18067m6134P4926J36785N6087
36592a451070j20656k53633k63198k11310k03352k43435k36156j17628P0169K39464
36582b790805L37054L45784K59972J07084l0755o8617M6R8563J50069J52135J63468
36571a276002K21816K81680K47209Q0999j29589k39599j79102K824K14524L96003
36561c79237N11373N27279M43934L20880K28813J80691J31532L4853j15047k74853
36551A610218l66602l25589j63286L1410J73935K48338K71346K23275N8285k17957
36541A543373n08561o75666o41374m60794k90545k48619k99871l16326k44846
$$ plain form
36532 -2143229 -2295809 -2397654 -2468316 -2506537 -2561554 -2709334 -2935098 -3115775 -3153722 -3068533
36522 -3068533 -2931980 -2787601 -2680844 -2693557 -2866827 -3120322 -3313106 -3368390 -3296119 -3125421
36512 -3125421 -2871351 -2547474 -2158375 -1697199 -1201380 -790700 -585406 -581203 -649846 -666699
36502 -666699 -602631 -495478 -375297 -230230 -24297 253395 547613 764636 858909 862692
36492 862692 805290 653161 393401 145663 103706 347323 764155 1171793 1478421 1724142
36482 1724142 2019676 2459727 3041929 3632313 4036426 4139335 3978534 3681812 3350579
36473 3350579 3000177 2586221 2078962 1523244 1022353 651890 404722 237214 140777 131824
36463 131824 198056 307299 455199 646502 834589 942455 951712 912307 851778 737119
$$ packed form
36532b143229j52580j01845p0662l8221n5017j47780k25764j80677l7947Q5189
36522c068533J36553J44379J06757j2713j73270k53495j92784n5284P2271J70698
36512c125421K54070L23877L89099M61176M95819M10680K05294M203o8643j6853
36502f66699O4068J07153J20181J45067K05933K77692K94218K17023R4273L783
36492H62692n7402j52129k59760k47738m1957K43617M16832M07638L06628K45721
36482A724142K95534M40051N82202N90384M04113J02909j60801k96722l31233
36473C350579l50402m13956n07259n55718n00891l70463k47168j67508r6437q953
36463A31824O6232J09243J47900J91303J88087J07866R257l9405o0529j14659
$$ plain form
36453 737119 552122 355220 222904 178734 212480 322999 490686 634479 651264 501048
36443 501048 231744 -64965 -295730 -382049 -278998 3172 397318 796930 1086850 1195468
36433 1195468 1145100 1040744 991953 1049177 1211272 1458362 1749401 2007720 2149487 2144415
36423 2144415 2047931 1971002 2005233 2156950 2353557 2526402 2671539 2794493 2806755 2542372
36413 2542372 1918921 1063093 255849 -232859 -265094 132478 785045 1432351 1847300 1950901
36403 1950901 1841702 1728870 1812409 2156874 2630025 2987735 3070046 2925490 2735312 2638118
36393 2638118 2651106 2726903 2823014 2903421 2915673 2798677 2512543 2068211 1553925 1137490
36383 1137490 1006998 1261208 1825902 2473057 2953795 3167022 3222892 3308626 3452643 3435124
$$ packed form
36453G37119j84997j96902j32316m4170L3746J10519J67687J43793J6785j50216
36443E01048k69304k96709k30765q6319J03051K82170L94146L99612K89920J08618
36433A195468n0368j04356m8791N7224J62095K47090K91039K58319J41767n072
36423B144415r6484p6929L4231J51717J96607J72845J45137J22954J2262k64383
36413B542372o23451q55828q07244m88708l2235L97572O52567O47306M14949J03601
36403A950901j09199j12832Q3539L44465M73151L57710Q2311j44556j90178r7194
36393B638118J2988P5797R6111Q0407J2252j16996k86134m44332n14286m16435
36383A137490j30492K54210N64694O47155M80738K13227N5870Q5734J44017j7519
$$ plain form
36373 3435124 2975355 2015063 791402 -366680 -1276870 -1938533 -2397941 -2652459 -2696680
36364 -2696680 -2608339 -2527770 -2533363 -2563947 -2500571 -2324977 -2157006 -2108174 -2126835 -2036720 -1729505
36353 -1729505 -1277538 -845643 -539694 -381966 -402424 -679583 -1255509 -2032791 -2785141 -3274354
36343 -3274354 -3363822 -3055540 -2462299 -1753093 -1092099 -586582 -261653 -65215 103018 335093
36333 335093 643580 939536 1115883 1173476 1238732 1428629 1717586 1972177 2103792 2140960
36323 2140960 2146623 2114172 1978801 1706321 1334329 933592 561660 259404 64500 4146
36313 4146 76065 248904 485290 761096 1064091 1385758 1723520 2081127 2445798 2761182
36303 2761182 2944312 2948335 2805325 2600463 2411143 2270618 2163465 2033950 1821729 1534844
$$ packed form
36373C435124m59769r60292j223661j158082r10190o61663m59408k54518m4221
36364b696680Q8341Q0569n593l0584O3376J75594J67971M8832j8661R0115L07215
36353a729505M51967M31895L05949J57728k0458k77159n75926p77282p52350m89213
36343c274354q9468L08282N93241P09206O60994N05517L24929J96438J68233K32075
36333C35093L08487K95956J76347N7593O5256J89897K88957K54591J31615L7168
36323B140960N663l2451j35371k72480l71992m00737l71932l02256j94904o0354
36313D146P1919J72839K36386K75806L02995L21667L37762L57607L64671L15384
36303B761182J83130M023j43010k04862j89320j40525j07153j29515k12221k86885
$$ plain form
36293 1534844 1296464 1281845 1567959 2030544 2397241 2428721 2088892 1567724 1134042 942651
36283 942651 960771 1049122 1080856 998313 830591 703882 784542 1132671 1608901 1973892
36273 1973892 2082714 1952397 1669593 1304360 910149 520887 108655 -399785 -1023573
36264 -1023573 -1680497 -2261719 -2705793 -2970140 -2987758 -2709303 -2158148 -1402793 -516513 381552
36254 381552 1092381 1439965 1420042 1186861 883894 542461 154738 -225620 -507167 -657697
36244 -657697 -741075 -868871 -1130283 -1540010 -2018764 -2434872 -2699977 -2833088 -2917532 -2997503
36234 -2997503 -3036756 -2981522 -2837551 -2660047 -2475391 -2246454 -1938112 -1604802 -1380186 -1358724
36224 -1358724 -1487889 -1584601 -1464671 -1073037 -514488 26774 407407 592869 634297 597034
$$ packed form
36293A534844k38380j4619K86114M62585L66697L1480l39829n21168m33682j91391
36283I42651J8120Q8351L1734q2543j67722j26709Q0660L48129M76230L64991
36273A973892J08822j30317k82804l65233l94211l89262m12232n08440o23788
36264a023573o56924n81222m44074k64347j7618K78455N51155P55355Q86280Q98065
36254C81552P10829L47584j9923k33181l02967l41433l87723l80358k81547j50530
36244f57697q3378j27796k61412m09727m78754m16108k65105j33111q4444p9971
36234b997503l9253N5234J43971J77504J84656K28937L08342L33310K24616K1462
36224a358724j29165r6712J19930L91634N58549N41262L80633J85462M1428l7263
$$ plain form
36214 597034 513077 384523 211413 11030 -186680 -368800 -568417 -844712 -1212617 -1604821
36204 -1604821 -1932863 -2182124 -2416445 -2688633 -2981267 -3250481 -3506195 -3835044 -4347008
36195 -4347008 -5074069 -5873810 -6439287 -6481068 -5959476 -5127092 -4321660 -3730326 -3342062 -3046441
36185 -3046441 -2717185 -2252822 -1634318 -955901 -340924 184280 683148 1165992 1517305
36176 1517305 1612382 1477299 1284910 1196255 1240844 1350770 1459307 1520280 1452550 1144968
36166 1144968 573612 -109942 -670495 -983509 -1102652 -1137872 -1132560 -1090688 -1056830 -1097465
36156 -1097465 -1232056 -1450028 -1777745 -2251903 -2821642 -3351265 -3747494 -4024889 -4209467
36147 -4209467 -4232005 -3977226 -3422038 -2682589 -1935720 -1327530 -939222 -782724 -805402 -925283
$$ packed form
36214E97034q3957j28554j73110k00383j97710j82120j99617k76295l67905l92204
36204a604821l28042k49261k34321k72188k92634k69214k55714l28849n11964
36195d347008p27061p99741n65477m1781N21592Q32384Q05432N91334L88264K95621
36185c046441L29256M64363O18504O78417O14977N25204M98868M82844L51313
36176A517305R5077j35083j92389q8655M4589J09926J08537O0973o7730l07582
36166A144968n71356o83554n60553l13014j19143l5220N312M1872L3858m0635
36156a097465j34591k17972l27717m74158n69739n29623l96229k77395j84578
36147d209467k2538K54779N55188P39449P46869O08190L88308J56498k2678j19881
$$ plain form
36137 -925283 -1086648 -1281371 -1518344 -1786918 -2051345 -2261972 -2364826 -2320541 -2131768 -1841585
36127 -1841585 -1487599 -1065495 -559008 -2356 515369 920168 1208595 1419996 1571941
36118 1571941 1643107 1604685 1441339 1150327 757180 343051 27506 -101859 -42496 142522
36108 142522 386655 659176 952987 1240988 1451231 1507901 1415049 1277108 1199520 1180509
36098 1180509 1144477 1072810 1037624 1092113 1196286 1290555 1379170 1473837 1496880 1328736 955169
36087 955169 502093 108050 -191580 -442502 -686693 -935191 -1200569 -1521177 -1944217 -2477145
36077 -2477145 -3039057 -3466276 -3599777 -3391554 -2931463 -2382782 -1899196 -1568198 -1376536
36068 -1376536 -1219098 -981032 -632240 -222818 212915 703303 1266953 1829134 2251031
$$ packed form
36137i25283j61365j94723k36973k68574k64427k10627j02854M4285J88773K90183
36127a841585L53986M22104N06487N56652N17725M04799K88427K11401J51945
36118A571941P1166l8422j63346k91012l93147m14129l15545j29365N9363J85018
36108A42522K44133K72521K93811K88001K10243N6670r2852j37941p7588j9011
36098A180509l6032p1667l5186N4489J04173R4269Q8615R4667K3043j68144l73567
36087I55169m53076l94043k99630k50922k44191k48498k65378l20608m23040n32928
36077b477145n61912m27219j33501K08223M60091N48681M83586L30998J91662
36068a376536J57438K38066L48792M09422M35733M90388N63650N62181M21897
$$ plain form
36059 2251031 2434434 2370807 2091660 1597332 849639 -159199 -1319160 -2384773 -3076080
36050 -3076080 -3236562 -2911966 -2284830 -1545364 -819781 -179332 333846 708082 974427
36041 974427 1198956 1446680 1732879 1998144 2141442 2095457 1875314 1555590 1211962 892893
36031 892893 630220 447834 350662 318432 323759 361898 466942 695078 1070503 1526419
36021 1526419 1906167 2050599 1901142 1519463 1021244 514943 93552 -172608 -281113
36012 -281113 -319078 -396787 -550885 -726044 -832033 -778326 -465747 178847 1106482 2113065
36002 2113065 2956464 3514624 3811427 3906092 3800611 3461823 2898360 2192712 1466870 822845
35992 822845 303900 -93206 -359892 -429707 -209052 326335 1056367 1741592 2151318 2217265
$$ packed form
36059B251031J83403o3627k79147m94328p47693j008838j159961j065613o91307
36050c076080j60482L24596O27136P39466P25583O40449N13178L74236K66345
36041I74427K24529K47724K86199K65265J43298m5985k20143l19724l43628l19069
36031H92893k62673j82386r7172l2230N327L8139J05044K28136L75425M55916
36021A526419L79748J44432j49457l81679m98219n06301m21391k66160j08505
36012b81113l7965p7709j54098j75159j05989N3707L12579O44594R27635J006583
36002B113065Q43399N58160K96803R4665j05481l38788n63463p05648p25842o44025
35992H22845n18945l97106k66686o9815K20655N35387P30032O85225M09726O5947
$$ plain form
35982 2217265 2088953 2011705 2107841 2272389 2296266 2073480 1662461 1176637 683639 225069
35972 225069 -124963 -272034 -166660 155884 586067 983043 1233066 1291136 1170085 900299
35962 900299 522859 114475 -223681 -424565 -485630 -432404 -272663 6097 414947 940597
35952 940597 1512219 1985159 2201820 2101649 1754733 1270871 697510 21707 -757867 -1590878
35942 -1590878 -2391445 -3069588 -3557525 -3830135 -3907006 -3836310 -3679283 -3487842 -3259512 -2917645
35932 -2917645 -2381665 -1673351 -923136 -264602 239304 564434 690327 645432 547303 537811
35922 537811 675867 912195 1151197 1315360 1369240 1309701 1134725 830949 425675 50409
35912 50409 -105189 59076 475803 993974 1505865 1982351 2444918 2944340 3520034 4129741
$$ packed form
35982B217265j28312p7248R6136J64548K3877k22786m11019m85824m92998m58570
35972B25069l50032j47071J05374L22544M30183L96976K50023N8070j21051k69786
35962I00299l77440m08384l38156k00884o1065N3226J59741K78760M08850N25650
35952I40597N71622M72940K16661j00171l46916m83862n73361o75803p79574q33011
35942a590878q00567o78143m87937k72610p6871P0696J57027J91441K28330L41867
35932b917645N35980P08314P50215O58534N03906L25130J25893m4895r8129r492
35922E37811J38056K36328K39002J64163N3880n9539j74976l03776m05274l75266
35912E0409j55598J64265M16727N18171N11891M76486M62567M99422N75694O09707
$$ plain form
35902 4129741 4646993 4965514 5076891 5017250 4785241 4360701 3767581 3071520 2349806 1705729
35892 1705729 1262955 1078381 1087497 1192258 1373181 1660336 2036353 2444876 2865385 3293379
35882 3293379 3657928 3843807 3803280 3584229 3255940 2878251 2531299 2274681 2047227 1688667
35872 1688667 1112269 414859 -210759 -627368 -798186 -746122 -528732 -230865 72753 363885
35862 363885 679197 1056192 1474408 1847436 2088382 2192257 2231080 2256149 2246000 2182611
35852 2182611 2130200 2173085 2300567 2428418 2535169 2710078 3047078 3534614 4060732 4488085
35842 4488085 4719828 4740569 4621723 4474434 4389040 4412937 4544708 4714369 4805218 4750199
35832 4750199 4592748 4414395 4235262 4038578 3852260 3725380 3646956 3580013 3571660 3730512
$$ packed form
35902D129741N17252L18521J11377n9641k32009m24540n93120o96061p21714o44077
35892A705729m42774j84574R116J04761J80923K87155L76017M08523M20509M27994
35882C293379L64549J85879m0527k19051l28289l77689l46952k56618k27454l58560
35872A688667n76398o97410o25618m16609j70818N2064K17390K97867L03618K91132
35862C63885L15312L76995M18216L73028K40946J03875L8823K5069j0149o3389
35852B182611n2411M2885J27482J27851J06751J74909L37000M87536N26118M27353
35842D488085K31743K0741j18846j47289q5394K3897J31771J69661R0849n5019
35832D750199j57451j78353j79133j96684j86318j26880p8424o6943q353J58852
$$ plain form
35822 3730512 4068956 4445954 4698541 4769794 4689302 4508823 4307594 4194883 4222008 4290024
35812 4290024 4190187 3764411 3044593 2251459 1646664 1359363 1350156 1532634 1878994 2380194
35802 2380194 2971515 3581349 4228054 4983902 5840380 6671178 7327823 7720076 7818307 7644373
35792 7644373 7255405 6678150 5878701 4873633 3856698 3117518 2808302 2848310 3056394
35783 3056394 3303002 3530872 3723114 3899560 4098312 4333837 4600591 4908685 5267493
35774 5267493 5646380 6008674 6371366 6770448 7182780 7542911 7808796 7938762 7846216 7485951
35764 7485951 6968612 6477040 6066686 5647445 5154931 4624466 4091825 3548770 3035744
35755 3035744 2679056 2592081 2800803 3266019 3893610 4528557 5047263 5478791 5955819 6543417
$$ packed form
35822C730512L38444L76998K52587P1253q0492j80479k01229j12711K7125O8016
35812D290024r9837m25776p19818p93134o04795k87301r207J82478L46360N01200
35802B380194N91321O09834O46705P55848Q56478Q30798O56645L92253R8231j73934
35792G644373l88968n77255p99449j005068j016935p39180l09216M0008K08084
35783C056394K46608K27870J92242J76446J98752K35525K66754L08094L58808
35774E267493L78887L62294L62692L99082M12332L60131K65885J29966r2546l60265
35764G485951n17339m91572m10354m19241m92514n30465n32641n43055n13026
35755C035744l56688q6975K08722M65216O27591O34947N18706M31528M77028N87598
$$ plain form
35745 6543417 7189469 7814073 8347162 8715729 8926045 9140281 9538123 10113620 10730970
35736 10730970 11343588 12010585 12742854 13515700 14402769 15493874 16689453 17781638 18739717
35727 18739717 19722129 20839494 22143780 23816417 26063763 28795249 31691559 34630800
35719 34630800 37765172 41167753 44762405 48675938 53297656 58877068 65391816 72889679
35711 72889679 81591159 91597237 102954932 116123433 131896584 150773493 172979541
35704 172979541 199190566 230491736 267483368 310275042 359047160 412076544 461380087
35697 461380087 492344675 491811194 458440916 404205394 345135161 291362233 245396149
35690 245396149 206564248 174272782 147868108 126160985 108172193 93510665 81689732
$$ packed form
35745F543417O46052O24604N33089L68567K10316K14236L97842N75497O17350
35736A0730970O12618O66997P32269P72846Q87069J091105J195579J092185R58079
35727A8739717R82412J117365J304286J672637K247346K731486K896310K939241
35719C4630800L134372L402581L594652L913533M621718N579412O514748P497863
35711G2889679Q701480J0006078J1357695J3168501J5773151J8876909K2206048
35704A72979541K6211025L1301170L6991632M2791674M8772118N3029384M9303543
35697D61380087L0964588n33481l3370278n4235522n9070233n3772928m5966084
35690B45396149l8831901l2291466k6404674k1707123j7988792j4661528j1820933
$$ plain form
35683 81689732 71806658 63165312 55640740 49232978 43754322 39105425 35374585 32446849
35675 32446849 29869520 27280715 24695393 22267085 20048458 18072837 16387605 14900294
35667 14900294 13430742 11992447 10786134 9848781 8953244 7937698 6908391 6036040
35659 6036040 5371888 4946532 4821904 4928377 5043929 5056677 5090189 5272489 5547439 5820794
35649 5820794 6128352 6523539 6919686 7170219 7214764 7048984 6647818 6025014 5296060 4591591
35639 4591591 3965172 3444835 3094322 2948587 2954830 3044079 3201113 3408989 3593532 3686385
35629 3686385 3684473 3588431 3340487 2889653 2278993 1612602 962797 342132 -270714 -905500
35619 -905500 -1556824 -2137847 -2524130 -2676048 -2678895 -2636709 -2566065 -2413444 -2130170 -1706973
$$ packed form
35683H1689732r883074q641346p524572o407762n478656m648897l730840k927736
35675C2446849k577329k588805k585322k428308k218627j975621j685232j487311
35667A4900294j469552j438295j206313r37353q95537j015546j029307q72351
35659F036040o64152m25356j24628J06473J15552J2748L3512J82300K74950K73355
35649E820794L07558L95187L96147K50533M4545j65780m01166o22804p28954p04469
35639D591591o26419n20337l50513j45735O243Q9249J57034K07876J84543R2853
35629C686385j912r6042k47944m50834o10660o66391o49805o20665o12846o34786
35619i05500o51324n81023l86283j51918k847M2186P0644J52621K83274M23197
$$ plain form
35609 -1706973 -1182950 -651472 -217811 84300 318766 580979 919659 1299884 1594013
35600 1594013 1630948 1337176 848595 422654 218715 204133 259682 293409 246310 98752
35590 98752 -61386 -47102 269801 825389 1422846 1890491 2145332 2146921 1864471 1308442
35580 1308442 570382 -187054 -800038 -1194883 -1420036 -1575198 -1715345 -1838515 -1932026 -1968269
35570 -1968269 -1860666 -1499333 -869307 -97791 645859 1277867 1817506 2308653 2750496
35561 2750496 3101223 3342962 3536482 3783818 4118831 4469411 4763372 5032028 5345306
35552 5345306 5664171 5830905 5710999 5285818 4601279 3696045 2619785 1490049 493707
35543 493707 -186596 -485168 -523706 -533632 -652976 -813387 -863281 -760133 -582075 -403189
$$ packed form
35609a706973N24023N31478M33661L02111K34466K62213L38680L80225K94129
35600A594013L6935k93772m88581m25941k03939j4582N5549L3727m7099j47558
35590I8752j60138J4284L16903N55588N97457M67645K54841J589k82450n56029
35580A308442p38060p57436o12984l94845k25153j55162j40147j23170r3511l6243
35570a968269J07603L61333O30026P71516P43650O32008N39639M91147M41843
35561B750496L50727K41739J93520K47336L35013L50580K93961K68656L13278
35552E345306L18865J66734j19906m25181o84539r05234j076260j129736r96342
35543D93707o80303k98572l8538r926j19344j60411m9894J03148J78058J78886
$$ plain form
35533 -403189 -257131 -191739 -231035 -268353 -114859 297331 837446 1328622 1693433 1917869
35523 1917869 1974083 1854194 1620448 1352788 1080547 809077 572787 416890 355340 373734
35513 373734 439142 491706 478609 422717 411369 500310 683667 965281 1366384 1815973 2122483
35502 2122483 2138848 1913789 1620091 1381683 1234192 1197235 1279983 1413826 1454598 1277908
35492 1277908 852404 233862 -477771 -1184936 -1828763 -2383714 -2821868 -3118072 -3296206
35483 -3296206 -3416279 -3489601 -3460176 -3304270 -3090341 -2890761 -2688615 -2436234 -2163637 -1955094
35473 -1955094 -1839768 -1770012 -1693206 -1590659 -1465922 -1352953 -1315851 -1373336 -1430500 -1349922
35463 -1349922 -1096625 -765943 -473559 -268547 -144094 -64345 34784 214856 476773 761117
$$ packed form
35533d03189J46058O5392l9296l7318J53494M12190N40115M91176L64811K24436
35523A917869N6214j19889k33746k67660k72241k71470k36290j55897o1550J8394
35513C73734O5408N2564j3097n5892j1348Q8941J83357K81614M01103M49589L06510
35502B122483J6365k25059k93698k38408j47491l6957Q2748J33843M0772j76690
35492A277908m25504o18542p11633p07165o43827n54951m38154k96204j78134
35483c296206j20073p3322K9425J55906K13929J99580K02146K52381K72597K08543
35473a955094J15326O9756P6806J02547J24737J12969L7102n7485n7164Q0578
35463a349922K53297L30682K92384K05012J24453P9749R9129J80072K61917K84344
$$ plain form
35453 761117 1011642 1205986 1330597 1378954 1383722 1396655 1416778 1389440 1303905 1236813 1244712
35442 1244712 1245615 1075509 670445 147425 -311243 -617002 -791958 -861217 -792714 -569520
35432 -569520 -285881 -123246 -221678 -586081 -1100922 -1601379 -1941557 -2057247 -2002679 -1904123
35422 -1904123 -1849482 -1831744 -1800774 -1728460 -1599004 -1382844 -1079180 -772957 -598032 -631613
35412 -631613 -844805 -1147028 -1446352 -1670966 -1774538 -1747293 -1620133 -1457483 -1342582 -1336952
35402 -1336952 -1417744 -1464071 -1345660 -1042150 -666335 -375624 -275115 -388478 -678966 -1083305
35392 -1083305 -1549331 -2057796 -2595978 -3101671 -3450773 -3526015 -3312289 -2927033 -2548319 -2293261
35382 -2293261 -2148343 -2011579 -1798372 -1503043 -1174439 -867552 -631819 -514092 -532915 -643131
$$ packed form
35453G61117K50525J94344J24611M8357M768J2933K0123k7338q5535o7092P899
35442A244712R03j70106m05064n23020m58668l05759j74956o9259O8503K23194
35432e69520K83639J62635r8432l64403n14841n00457l40178j15690N4568R8556
35422a904123N4641J7738L0970P2314J29456K16160L03664L06223J74925l3581
35412f31613k13192l02223k99324k24614j03572K7245J27160J62650J14901N630
35402a336952q0792m6327J18411L03510L75815K90711J00509j13363k90488m04339
35392a083305m66026n08465n38182n05693l49102p5242K13726L85256L78714K55058
35382b293261J44918J36764K13207K95329L28604L06887K35733J17727j8823j10216
$$ plain form
35372 -643131 -740491 -714451 -518626 -220784 17064 55139 -89900 -242892 -232477 -51608
35362 -51608 154177 233154 136745 -87547 -358320 -607845 -802192 -930414 -964185 -834861
35352 -834861 -476539 100356 792174 1463214 2019946 2435566 2718575 2858840 2806644 2528462
35342 2528462 2096249 1686278 1443440 1351129 1270190 1102914 881448 694495 573658 473960
35332 473960 332645 116902 -166485 -474729 -742527 -912777 -960749 -887984 -708003 -454396
35322 -454396 -190280 21038 161620 250200 274012 159303 -147627 -573774 -943104 -1134999
35312 -1134999 -1192269 -1243769 -1346696 -1446853 -1476912 -1437777 -1375023 -1321814 -1285237 -1257184 -1221864
35301 -1221864 -1178483 -1166183 -1238520 -1410591 -1670769 -2043959 -2573819 -3206401 -3753564 -4036378
$$ packed form
35372f43131r7360K6040J95825K97842K37848L8075j45039j52992J0415J80869
35362e1608K05785P8977r6409k24292k70773k49525j94347j28222l3771J29324
35352h34861L58322N76895O91818O71040N56732M15620K83009J40265n2196k78182
35342B528462m32213m09971k42838r2311q0939j67276k21466j86953j20837r9698
35332D73960j41315k15743k83387l08244k67798j70250m7972P2765J79981K53607
35322d54396K64116K11318J40582Q8580K3812j14709l06930m26147l69330j91895
35312a134999n7270n1500j02927j00157l0059L9135O2754N3209L6577K8053L5320
35301a221864M3381J2300p2337j72071k60178l73190n29860o32582n47163k82814
$$ plain form
35291 -4036378 -4036578 -3855228 -3555279 -3113815 -2516848 -1830251 -1166402 -635252 -340599 -364246
35281 -364246 -704681 -1242395 -1796659 -2235254 -2547201 -2820004 -3128616 -3424882 -3549004 -3374060
35271 -3374060 -2931051 -2376911 -1862537 -1454427 -1147371 -898744 -662738 -442327 -303427
35262 -303427 -290584 -331435 -272216 -8967 457224 1077679 1791961 2488123 2996596 3173685
35252 3173685 2974266 2442614 1686779 878516 207999 -222638 -443037 -531942 -533250 -483127
35242 -483127 -462367 -551041 -742578 -949469 -1088344 -1134644 -1122676 -1133276 -1253993 -1496582
35232 -1496582 -1765461 -1955481 -2065043 -2155671 -2214181 -2134503 -1853677 -1433217 -966118 -462498
35222 -462498 113988 731534 1278840 1665203 1882659 1963329 1919433 1748624 1474592 1155141
$$ packed form
35291d036378k00J81350K99949M41464N96967O86597O63849N31150K94653k3647
35281c64246l40435n37714n54264m38595l11947k72803l08612k96266j24122J74944
35271c374060M43009N54140N14374M08110L07056K48627K36006K20411J38900
35262c03427J2843m0851N9219K63249M66191O20455P14282O96162N08473J77089
35252C173685j99419n31652p55835q08263o70517m30637k20399q8905j308N0123
35242d83127K0760q8674j91537k06891j38875m6300J1968j0600j20717k42589
35232a496582k68879j90020j09562r0628n8510P9678K80826M20460M67099N03620
35222d62498N76486O17546N47306L86363K17456Q0670m3896j70809k74032l19451
$$ plain form
35212 1155141 850008 590403 382255 237381 194149 289754 502185 739793 919134 1051383
35202 1051383 1219165 1454145 1662329 1692218 1464539 1021945 478041 -43940 -432517 -605709
35192 -605709 -547844 -321869 -26200 262414 508308 704885 859630 974105 1020202 954192
35182 954192 784744 617795 590270 736657 939341 1030515 937891 727869 534369 476750
35172 476750 631053 1018010 1566510 2094874 2378636 2279937 1820980 1132404 349096 -428244
35162 -428244 -1101995 -1578655 -1837478 -1964281 -2065193 -2144911 -2105477 -1872324 -1490080 -1082487
35152 -1082487 -751152 -536399 -441840 -444329 -480990 -476762 -413764 -354606 -378904 -514764 -751122
35141 -751122 -1092510 -1559080 -2128294 -2706154 -3166705 -3403575 -3347903 -2977590 -2335168 -1513749
$$ packed form
35212A155141l05133k59605k08148j44874m3232R5605K12431K37608J79341J32249
35202A051383J67782K34980K08184K9889k27679m42594n43904n21981l88577j73192
35192f05709N7865K25975K95669K88614K45894J96577J54745J14475M6097o6010
35182I54192j69448j66949k7525J46387K02684R1174r2624k10022j93500n7619
35172D76750J54303L86957N48500N28364K83762r8699m58957o88576p83308p77340
35162d28244o73751m76660k58823j26803j00912p9718L9434K33153L82244M07593
35152a082487L31335K14753R4559k489l6661M228O2998N9158k4298j35860k36358
35141g51122l41388m66570n69214n77860m60551k36870N5672L70313O42422Q21419
$$ plain form
35131 -1513749 -597486 373426 1363039 2291306 3062343 3630365 3999701 4162631 4081688 3752260
35121 3752260 3255829 2730387 2297070 2014437 1873538 1815558 1766639 1674932 1521665 1312505
35111 1312505 1082601 904577 854953 956978 1175447 1468229 1805706 2125321 2311468 2265284
35101 2265284 1985932 1559845 1084294 624448 224932 -79414 -275301 -374894 -398216 -355368
35091 -355368 -249704 -107321 -11909 -87416 -399402 -863993 -1295535 -1564903 -1679690 -1699392
35081 -1699392 -1628433 -1430073 -1093475 -629822 -41901 630819 1256971 1680312 1851014 1840076
35071 1840076 1727480 1533173 1254510 899009 461676 -61816 -602701 -1010425 -1158586
35062 -1158586 -1034283 -709306 -273861 173387 530831 750558 858593 865224 685968 222290
$$ packed form
35131a513749R16263R70912R89613R28267P71037N68022L69336J62930q0943l29428
35121C752260m96431n25442m33317k82633j40899n7980m8919r1707j53267k09160
35111A312505k29904j78024m9624J02025K18469K92782L37477L19615J86147m6184
35101B265284k79352m26087m75551m59846l99516l04346j95887r9593k3322M2848
35091c55368J05664J42383R5412p5507l11986m64591m31542k69368j14787j9702
35081a699392P0959J98360L36598M63653N87921O72720O26152M23341J70702j0938
35071A840076j12596j94307k78663l55501m37333n23492n40885m07724j48161
35062a158586J24303L24977M35445M47248L57444K19727J08035O631j79256m63678
$$ plain form
35052 222290 -482853 -1233360 -1836637 -2223438 -2399995 -2342298 -1992252 -1344399 -492983 422055
35042 422055 1308836 2165140 3031915 3897014 4635890 5059396 5045933 4643197 4042109 3447444
35032 3447444 2964166 2585945 2264983 1983827 1779038 1717711 1847192 2144795 2507107 2802388
35022 2802388 2949509 2951089 2857291 2712027 2536312 2343303 2148751 1963606 1778592 1554499
35012 1554499 1239232 821649 376817 29552 -154782 -235936 -338030 -531326 -789436 -1048868
35002 -1048868 -1279489 -1490348 -1688168 -1847937 -1925522 -1895864 -1776807 -1618384 -1483844 -1451651
34992 -1451651 -1608167 -1987975 -2513234 -3033935 -3445557 -3732527 -3889361 -3864336 -3624697 -3222774
34982 -3222774 -2733672 -2166640 -1514550 -870486 -410427 -250408 -379753 -729199 -1222008
$$ packed form
35052B22290p05143p50507o03277l86801j76557N7697L50046O47853Q51416R15038
35042D22055Q86781Q56304Q66775Q65099P38876M23506j3463m02736o01088n94665
35032C447444m83278l78221l20962k81156k04789o1327J29481K97603L62312K95281
35022B802388J47121J580r3798j45264j75715j93009j94552j85145j85014k24093
35012A554499l15267m17583m44832l47265j84334q1154j02094j93296k58110k59432
35002a048868k30621k10859j97820j59769p7585K9658J19057J58423J34540L2193
34992a451651j56516l79808n25259n20701m11622k86970j56834K5025K39639M01923
34982c222774M89102N67032O52090O44064M60059J60019j29345l49446m92809
$$ plain form
34973 -1222008 -1736766 -2104343 -2210693 -2087479 -1882254 -1765457 -1861567 -2197394 -2667628 -3086044
34963 -3086044 -3315398 -3338333 -3197514 -2915643 -2504510 -2006574 -1478484 -954623 -460942 -39964
34953 -39964 273553 479754 583789 566887 433068 267237 190923 246843 356297 402462
34943 402462 341362 225254 124944 36235 -124621 -420943 -810486 -1195034 -1539719 -1882619
34933 -1882619 -2219674 -2456464 -2518403 -2449546 -2342731 -2214268 -2013428 -1727516 -1409258 -1114429
34923 -1114429 -875676 -727523 -686636 -695652 -640164 -436754 -69397 454173 1124884 1900200
34913 1900200 2702053 3465533 4143375 4640826 4799008 4499128 3784444 2863572 1997921
34904 1997921 1377534 1063557 1011831 1143341 1392325 1692589 1957615 2128721 2246668 2428514
$$ packed form
34973a222008n14758l67577j06350J23214K05225J16797r6110l35827m70234m18416
34963c086044k29354k2935J40819K81871M11133M97936N28090N23861M93681M20978
34953c9964L13517K06201J04035j6902j33819j65831p6314N5920J09454M6165
34943D02462o1100j16108j00310q8709j60856k96322l89543l84548l44685l42900
34933a882619l37055k36790o1939O8857J06815J28463K00840K85912L18258K94829
34923a114429K38753J48153M0887r016N5488K03410L67357N23570O70711P75316
34913A900200Q01853P63480O77842M97451J58182k99880p14684r20872q65651
34904A997921o20387l13977n1726J31510K48984L00264K65026J71106J17947J81846
$$ plain form
34894 2428514 2748002 3156371 3524085 3731309 3719209 3507316 3195175 2912920 2723586 2573714
34884 2573714 2358203 2028644 1633078 1272606 1036379 955700 988278 1045234 1048241 961969
34874 961969 770307 436651 -94863 -851921 -1777316 -2707842 -3426450 -3776244 -3744225 -3430445
34864 -3430445 -2952068 -2408445 -1919388 -1622828 -1594386 -1796713 -2123148 -2452866 -2656914 -2631429
34854 -2631429 -2394115 -2107060 -1931069 -1873226 -1834679 -1779282 -1772955 -1866308 -2033823 -2249399
34844 -2249399 -2526910 -2830770 -3021858 -2977194 -2734850 -2449965 -2219836 -2013432 -1766018 -1474520
34834 -1474520 -1178790 -898119 -617710 -312222 38478 435110 843214 1216661 1562643
34825 1562643 1962217 2482350 3054365 3465426 3505749 3149502 2601639 2159140 2002135 2095187
$$ packed form
34894B428514L19488M08369L67714K07224j2100k11893l12141k82255j89334j49872
34884B573714k15511l29559l95566l60472k36227q0679L2578N6956L007q6272
34874I61969j91662l33656n31514p57058r25395r30526p18608l49794L2019L13780
34864c430445M78377N43623M89057K96560K8442k02327l26435l29718k04048K5485
34854b631429K37314K87055J75991N7843L8547N5397O327r3353j67515k15576
34844b249399k77511l03860j91088M4664K42344K84885K30129K06404K47414K91498
34834a474520K95730K80671K80409L05488L50700L96632M08104L73447L45982
34825A562643L99574N20133N72015M11061M0323l56247n47863m42499j57005R3052
$$ plain form
34815 2095187 2273634 2410797 2498270 2591750 2723948 2883788 3044190 3169880 3200881 3058346
34805 3058346 2680537 2051966 1212844 267739 -616836 -1266840 -1597656 -1666960 -1615269 -1540483
34795 -1540483 -1427960 -1201275 -833203 -397569 -9957 274656 495934 723878 977540
34786 977540 1216699 1397592 1509372 1551082 1501350 1344070 1127505 968021 960567 1077691
34776 1077691 1179691 1147370 1000781 871652 867473 989040 1176835 1391430 1617973 1822275
34766 1822275 1950467 1973188 1901637 1765460 1611928 1531626 1639706 1992025 2520183 3060746
34756 3060746 3447925 3589784 3493337 3247645 2976295 2777697 2686204 2670113 2655679 2571738
34746 2571738 2408926 2243618 2170829 2192885 2198113 2074186 1826836 1565906 1394707 1341905
$$ packed form
34815B095187J78447J37163Q7473R3480J32198J59840J60402J25690L1001j42535
34805C058346l77809o28571q39122r45105q84575o50004l30816o9304N1691P4786
34795a540483J12523K26685L68072M35634L87612K84613K21278K27944K53662
34786I77540K39159J80893J11780M1710m9732j57280k16565j59484p454J17124
34776A077691J02000l2321j46589j29129m179J21567J87795K14595K26543K04302
34766A822275J28192K2721p1551j36177j53532q0302J08080L52319N28158N40563
34756C060746L87179J41859r6447k45692k71350j98598r1493j6091j4434q3941
34746B571738j62812j65308p2789K2056N228j23927k47350k60930j71199n2802
$$ plain form
34736 1341905 1378649 1446584 1458288 1320235 998290 550967 70484 -407635 -916683 -1480347
34726 -1480347 -2042501 -2485632 -2707324 -2667960 -2380166 -1888365 -1278131 -684344 -248940 -46412
34716 -46412 -50455 -176631 -356022 -573610 -851098 -1200230 -1585065 -1921561 -2118370 -2131307
34706 -2131307 -1992730 -1795250 -1632095 -1518695 -1354935 -989370 -353833 469857 1334684
34697 1334684 2155100 2903706 3497011 3766678 3597535 3062353 2368419 1676067 1005849
34688 1005849 321096 -343559 -869401 -1164375 -1261587 -1286415 -1330365 -1391918 -1462013 -1621962
34678 -1621962 -1981845 -2516570 -3034923 -3351552 -3446888 -3423302 -3354073 -3233270 -3041980 -2795284
34668 -2795284 -2529506 -2298451 -2180373 -2232027 -2421114 -2643587 -2819047 -2936520 -3005682 -3013551
$$ packed form
34736A341905L6744O7935J1704j38053l21945m47323m80483m78119n09048n63664
34726a480347n62154m43131k21692L9364K87794M91801O10234N93787M35404K02528
34716d6412m043j26176j79391k17588k77488l49132l84835l36496j96809j2937
34706b131307J38577J97480J63155J13400J63760L65565O35537Q23690Q64827
34697A334684Q20416P48606N93305K69667j69143n35182o93934o92352o70218
34688A005849o84753o64655n25842k94974r7212k4828m3950o1553p0095j59949
34678a621962l59883n34725n18353l16629r5336K3586O9229J20803J91290K46696
34668b795284K65778K31055J18078n1654j89087k22473j75460j17473o9162p869
$$ plain form
34658 -3013551 -2954843 -2871977 -2834923 -2893205 -3057850 -3309524 -3609623 -3916994 -4200167 -4418883
34648 -4418883 -4501579 -4382967 -4083596 -3722310 -3423422 -3227358 -3107920 -3048270 -3063582 -3160708
34638 -3160708 -3314340 -3488725 -3652784 -3758276 -3725376 -3481342 -3022594 -2427877 -1801598 -1207876
34628 -1207876 -662403 -172830 235291 530290 688337 694906 565122 375897 239342 209146
34618 209146 237645 262885 311207 453442 663730 789304 689725 365858 -71262 -510420
34608 -510420 -871622 -1061294 -976654 -599131 -69592 369271 544434 488364 397334 437760
34598 437760 598734 747690 804572 812562 841477 883989 878182 791083 645181 498329 440177
34587 440177 575179 939286 1420385 1802335 1908273 1690124 1193808 490047 -334171 -1151534
$$ packed form
34658c013551N8708Q2866L7054n8282j64645k51674l00099l07371k83173k18716
34648d418883q2696J18612K99371L61286K98888J96064J19438N9650j5312r7126
34638c160708j53632j74385j64059j05492L2900K44034M58748N94717O26279N93722
34628a207876N45473M89573M08121K94999J58047O569j29784j89225j36555l0196
34618B09146K8499K5240M8322J42235K10288J25574r9579l23867m37120m39158
34608e10420l61202j89672Q4640L77523N29539M38863J75163n6070r1030M0426
34598D37760J60974J48956N6882P990K8915M2512n807q7099j45902j46852n8152
34587D40177J35002L64107M81099L81950J05938k18149m96316p03761q24218q17363
$$ plain form
34577 -1151534 -1816086 -2232828 -2404844 -2410344 -2333933 -2214841 -2052934 -1857268 -1682503 -1613004
34567 -1613004 -1705872 -1939102 -2205385 -2362889 -2317131 -2076758 -1737457 -1412484 -1177222 -1062484
34557 -1062484 -1066054 -1152222 -1260336 -1343398 -1398693 -1442493 -1456098 -1379036 -1164671 -828462 -433328
34546 -433328 -44029 286943 502552 547030 409497 153297 -109700 -268292 -236816 29954
34536 29954 495957 1016283 1401916 1550771 1506262 1380908 1259151 1198871 1272551 1519978
34526 1519978 1847177 2035886 1901254 1437729 814085 259482 -45798 -39162 188759 426531
34516 426531 466309 244410 -123395 -443023 -587631 -566552 -472769 -373808 -262133 -112861
34506 -112861 32741 71365 -73610 -388342 -792559 -1201104 -1555220 -1821701 -1988196 -2064218
$$ packed form
34577a151534o64552m16742j72016n500P6411J19092J61907J95666J74765O9499
34567a613004r2868k33230k66283j57504M5758K40373L39301L24973K35262J14738
34557a062484l570q6168j08114q3062n5295m3800j3605P7062K14365L36209L95134
34546d33328L89299L30972K15609M4478j37533k56200k62997j58592L1476K66770
34536B9954M66003N20326L85633J48855m4509j25354j21757o0280P3680K47427
34526A519978L27199J88709j34632m63525o23644n54603l05280O636K27921K37772
34516D26531L9778k21899l67805l19628j44608K1079R3783R8961J11675J49272
34506a12861J45602L8624j44975l14732m04217m08545l54116k66481j66495p6022
$$ plain form
34496 -2064218 -2088803 -2136805 -2291339 -2575189 -2911634 -3176672 -3277815 -3154522 -2741134 -2018583
34486 -2018583 -1116741 -278178 336130 757375 1084567 1310083 1337199 1129703 760159 318170
34476 318170 -156069 -637318 -1070480 -1376340 -1469802 -1282090 -821086 -220360 321533 674667
34466 674667 828075 815436 650705 365904 70686 -70894 71002 510998 1110078 1609502
34456 1609502 1765041 1508212 975308 364162 -216516 -748941 -1215768 -1570351 -1782654
34447 -1782654 -1853832 -1770836 -1490608 -1000526 -379034 227042 687653 955438 1070469 1120827
34437 1120827 1190823 1319331 1485459 1629861 1698048 1674253 1582853 1463929 1348223 1244211
34427 1244211 1130770 959082 686235 335398 19229 -129566 -74888 80625 182657 152787
$$ packed form
34496b064218k4585m8002j54534k83850l36445k65038j01143J23293M13388P22551
34486b018583R01842Q38563O14308M21245L27192K25516K7116k07496l69544m41989
34476C18170m74239m81249m33162l05860r3462J87712M61004O00726N41893L53134
34466F74667J53408j2639j64731k84801k95218j41580J41896M39996N99080M99424
34456A609502J55539k56829n32904o11146n80678n32425m66827l54583k12303
34447a782654p1178Q2996K80228M90082O21492O06076M60611K67785J15031N0358
34437A120827O9996J28508J66128J44402O8187k3795r1400j18924j15706j04012
34427A244211j13441j71688k72847l50837l16169j48795N4678J55513J02032k9870
$$ plain form
34417 152787 27226 -111877 -214136 -266753 -256563 -164373 -1823 172465 294556 347699
34407 347699 362581 374776 399274 442180 515342 633728 813006 1070128 1401774 1749237
34397 1749237 2007172 2097769 2044420 1967040 2001538 2208739 2529301 2809246 2890182 2710271
34387 2710271 2336799 1910837 1570659 1414569 1488091 1766189 2156236 2549567 2882339 3150266
34377 3150266 3383850 3619454 3868704 4090742 4209795 4181062 4019041 3737807 3298232 2668450
34367 2668450 1923692 1222533 667145 230920 -159519 -518403 -811205 -1035663 -1239702
34358 -1239702 -1455215 -1646799 -1746458 -1736161 -1686510 -1705908 -1850422 -2090897 -2366346 -2646055
34348 -2646055 -2925068 -3181614 -3362862 -3394387 -3186080 -2677581 -1947797 -1262646 -921853 -1013952
$$ packed form
34417A52787j25561j39103j02259n2617J0190R2190J62550J74288J22091N3143
34407C47699J4882J2195K4498M2906P3162J18386J79278K57122L31646L47463
34397A749237K57935R0597n3349p7380L4498K07201L20562K79945Q0936j79911
34387B710271l73472m25962l40178j56090P3522K78098L90047L93331L32772K67927
34377C150266K33584K35604K49250K22038J19053k8733j62021k81234m39575o29782
34367B668450p44758p01159n55388m36225l90439l58884k92802k24458k04039
34358a239702k15513j91584r9659J0297M9651j9398j44514k40475k75449k79709
34348b646055k79013k56546j81248l1525K08307N08499P29784O85151L40793r2099
$$ plain form
34338 -1013952 -1359148 -1705147 -1920742 -1979823 -1853017 -1515714 -1036680 -563989 -201689 48414
34328 48414 212337 267028 171189 -54465 -308086 -464736 -453404 -299406 -99940 65916
34318 65916 222163 479262 917011 1490644 2060621 2497655 2740416 2773988 2605787 2284360
34308 2284360 1902845 1536522 1186139 830174 535646 451640 641145 950861 1113266 987053
34298 987053 663328 345003 178955 213621 440153 798805 1160051 1368192 1342739 1138109
34288 1138109 905638 799291 895757 1167082 1504486 1764670 1811499 1557434 1013395 309932
34278 309932 -354962 -807954 -953758 -785642 -405351 -20846 168645 143604 81497 159815
34268 159815 377819 616239 824324 1067719 1402135 1774622 2066458 2187656 2124930 1949284
$$ packed form
34338a013952l45196l45999k15595n9081J26806L37303M79034M72691L62300K50103
34328D8414J63923N4691r5839k25654k53621j56650J1332J53998J99466J65856
34318F5916J56247K57099M37749N73633N69977M37034K42761L3572j68201l21427
34308B284360l81515l66323l50383l55965k94528q4006J89505L09716J62405j26213
34298I87053l23725l18325j66048L4666K26532L58652L61246K08141k5453k04630
34288A138109k32471j06347R6466K71325L37404K60184M6829k54065n44039p03463
34278C09932o64894m52992j45804J68116L80291L84505J89491k5041o2107P8318
34268A59815K18004K38420K08085K43395L34416L72487K91836J21198o2726j75646
$$ plain form
34258 1949284 1793362 1778799 1941734 2244426 2643693 3096535 3505302 3740406 3764199 3685151
34248 3685151 3639344 3642429 3593395 3397200 3048669 2627230 2256630 2045062 2001402 2006150 1915895
34237 1915895 1715610 1541766 1551365 1795319 2207885 2654411 2961155 2965678 2628841 2111498
34227 2111498 1687042 1539028 1646770 1863977 2070866 2223900 2289522 2190055 1839973 1218466
34217 1218466 396432 -490721 -1291084 -1890764 -2260398 -2451213 -2526307 -2493706 -2320060 -2007656
34207 -2007656 -1639884 -1343292 -1205375 -1212407 -1240853 -1112628 -699703 -15439 783019 1486076
34197 1486076 1940030 2101574 2034071 1873791 1778921 1864594 2139490 2474398 2642043 2444473
34187 2444473 1857921 1052390 232252 -545824 -1366982 -2280486 -3189119 -3943998 -4500315
$$ packed form
34258A949284j55922j4563J62935L02692L99267M52842M08767K35104K3793p9048
34248C685151m5807L085m9034j96195l48531m21439l70600k11568m3660M748r0255
34237A915895k00285j73844R599K43954M12566M46526L06744M523l36837n17343
34227B111498m24456j48014J07742K17207K06889J53034O5622r9467l50082o21507
34217A218466q22034q87153q00363n99680l69634j90815p5094L2601J73646L12404
34207b007656L67772K96592J37917p032k8446J28225M12925O84264P98458P03057
34197A486076M53954J61544o7503j60280r4870Q5673K74896L34908J67645j97570
34187B444473n86552q05531q20138p78076q21158r13504r08633p54879n56317
$$ plain form
34178 -4500315 -4929817 -5307023 -5639415 -5902129 -6082532 -6167170 -6116592 -5883573 -5461090 -4918904
34168 -4918904 -4398972 -4046773 -3901402 -3849085 -3721787 -3453158 -3107481 -2750741 -2346463 -1820153
34158 -1820153 -1194721 -605515 -180677 50400 119379 28956 -267706 -803434 -1525523 -2283205
34148 -2283205 -2887608 -3210800 -3255820 -3137258 -2987058 -2874568 -2804637 -2760821 -2725657 -2674488
34138 -2674488 -2588086 -2484137 -2415644 -2425997 -2520887 -2691624 -2938010 -3239685 -3520046 -3676589
34128 -3676589 -3654623 -3470484 -3164818 -2765828 -2304773 -1822925 -1326461 -759159 -68393 697819
34118 697819 1392901 1881008 2124449 2165335 2062293 1871639 1662721 1505753 1434509 1439723
34108 1439723 1503347 1620790 1777584 1911715 1909798 1647096 1046548 124134 -1006026 -2172300
$$ packed form
34178d500315m29502l77206l32392k62714j80403q4638N0578K33019M22483N42186
34168d918904N19932L52199J45371N2317J27298K68629L45677L56740M04278N26310
34158a820153O25432N89206M24838K31077O8979r0423k96662n35728p22089p57682
34148b283205o04403l23192m5020J18562J50200J12490O9931M3816L5164N1169
34138b674488Q6402J03949O8493j0353r4890j70737k46386l01675k80361j56543
34128c676589K1966J84139L05666L98990M61055M81848M96464N67302O90766P66212
34118F97819O95082M88107K43441M0886j03042j90654k08918j56968p1244N214
34108A439723O3624J17443J56794J34131j917k62702o00548r22414j130160j166274
$$ plain form
34098 -2172300 -3201361 -3948836 -4307291 -4233990 -3803574 -3215307 -2694763 -2348979 -2113960
34089 -2113960 -1846575 -1452700 -918795 -257067 517283 1335015 2044844 2489801 2617131
34080 2617131 2491171 2204604 1811174 1351198 901349 560747 393397 403259 553724 784852
34070 784852 1017009 1172225 1210161 1134417 963525 715669 427790 167568 10549 12571
34060 12571 199456 546087 943674 1224916 1276191 1130301 919997 743047 602554 466859
34050 466859 328681 184243 6312 -216906 -443014 -616692 -726604 -772218 -690765 -390515
34040 -390515 110633 619335 880583 754509 275712 -427821 -1234393 -2053770 -2797666 -3365194
34030 -3365194 -3674947 -3710770 -3520924 -3157356 -2624029 -1908454 -1063239 -223349 479619 1008959
$$ packed form
34098b172300j029061p47475l58455P3301M30416N88267N20544L45784K35019
34089b113960K67385L93875N33905O61728P74350Q17732P09829M44957J27330
34080B617131j25960k86567l93430m59976m49849l40602j67350R862J50465K31128
34070G84852K32157J55216L7936p5744j70892k47856k87879k60222j57019K022
34060A2571J86885L46631L97587K81242N1275j45890k10304j76950j40493j35695
34050D66859j38178j44438j77931k23218k26108j73678j09912m5614Q1453L00250
34040c90515N01148N08702K61248j26074m78797p03533q06572q19377p43896n67528
34030c365194l09753l5823J89846L63568N33327P15575Q45215Q39890P02968N29340
$$ plain form
34020 1008959 1420783 1790623 2149732 2456034 2591518 2415570 1883494 1130056 401155
34011 401155 -119825 -411627 -561694 -670074 -824629 -1107553 -1549554 -2073479 -2530423 -2809029
34001 -2809029 -2889121 -2793965 -2536924 -2138055 -1655975 -1160154 -678728 -201566 273125 726027
33991 726027 1148514 1555862 1963066 2374249 2798526 3235991 3626787 3853318 3836602 3612627
33981 3612627 3269301 2819276 2194397 1386135 545888 -95299 -397422 -388147 -195312 67611
33971 67611 364363 718668 1133760 1507212 1636289 1352047 676341 -160823 -874349 -1306091
33961 -1306091 -1483791 -1542028 -1600618 -1690178 -1751168 -1684846 -1415096 -923561 -245961 553472
33951 553472 1403395 2228726 2943872 3461236 3730338 3778046 3694526 3560204 3388750 3154083
$$ packed form
34020A008959M11824L69840L59109L06302J35484j75948n32076p53438p28901
34011D01155n20980k91802j50067j08380j54555k82924m42001n23925m56944k78606
34001b809029q0092R5156K57041L98869M82080M95821M81426M77162M74691M52902
33991G26027M22487M07348M07204M11183M24277M37465L90796K26531j6716k23975
33981C612627l43326m50025o24879q08262q40247o41187l02123R275J92835K62923
33971F7611K96752L54305M15092L73452J29077k84242o75706q37164p13526m31742
33961a306091j77700n8237n8590q9560o0990O6322K69750M91535O77600P99433
33951E53472Q49923Q25331P15146N17364K69102M7708q3520j34322j71454k34667
$$ plain form
33941 3154083 2867675 2607718 2459451 2427216 2408553 2268220 1967116 1632790 1472086 1571991
33931 1571991 1791939 1892316 1773428 1549041 1376122 1261232 1065972 663713 47836
33922 47836 -678794 -1349495 -1770912 -1799294 -1446351 -898701 -393505 -65357 82282 83026
33912 83026 -71842 -412730 -927789 -1552535 -2220174 -2898255 -3563409 -4149626 -4537725 -4607758
33902 -4607758 -4315250 -3733734 -3028341 -2369204 -1845625 -1458039 -1194289 -1090753 -1182284 -1392079
33892 -1392079 -1521096 -1394675 -1022975 -598241 -334510 -317220 -486952 -726659 -946984 -1108021
33882 -1108021 -1187922 -1147536 -937756 -551433 -64688 387105 684219 781057 707589 529625
33872 529625 302724 46077 -243653 -545012 -782936 -864999 -751618 -483200 -146975 160155
$$ packed form
33941C154083k86408k59957j48267l2235j8663j40333l01104l34326j60704R9905
33931A571991K19948J00377j18888k24387j72919j14890j95260m02259o15877
33922D7836p26630o70701m21417k8382L52943N47650N05196L28148J47639P44
33912H3026j54868l40888n15059o24746o67639o78081o65154n86217l88099p0033
33902d607758K92508N81516P05393O59137N23579L87586K63750J03536r1531k09795
33892a392079j29017J26421L71700M24734K63731J7290j69732k39707k20325j61037
33882a108021p9901M0386K09780L86323M86745M51793K97114R6838p3468j77964
33872E29625k26901k56647k89730l01359k37924q2063J13381K68418L36225L07130
$$ plain form
33862 160155 343115 330522 118830 -222656 -620478 -1061212 -1557991 -2059844 -2435934 -2569990
33852 -2569990 -2448532 -2138898 -1708306 -1205112 -711292 -352573 -207116 -213799 -213836 -102308
33842 -102308 74099 170868 70365 -254210 -751218 -1306724 -1749479 -1905035 -1705594 -1257241
33832 -1257241 -781643 -477578 -421524 -568454 -817675 -1076716 -1286180 -1409812 -1418496 -1292294
33822 -1292294 -1036065 -687123 -309286 17753 218833 262130 188751 89707 43003 78355
33812 78355 197098 397396 662087 937593 1143731 1203537 1074568 794626 519804 468204
33802 468204 751116 1245629 1675968 1842606 1757715 1566927 1387254 1236357 1065831 810763
33792 810763 423829 -88793 -653976 -1177384 -1609158 -1954262 -2232590 -2462626 -2682740 -2938497
$$ packed form
33862A60155J82960j2593k11692l41486l97822m40734m96779n01853l76090j34056
33852b569990J21458L09634M30592N03194M93820L58719J45457o683l7J11528
33842a02308J76407R6769j00503l24575m97008n55506m42755j55556J99441M48353
33832a257241M75598L04065N6054j46930k49221k59041k09464j23632q684J26202
33822a292294K56229L48942L77837L27039K01080M3297p3379r9044m6704L5352
33812G8355J18743K00298K64691K75506K06138N9806j28969k79942k74822n1600
33802D68204K82912M94513M30339J66638q4891j90788j79673j50897j70526k55068
33792H10763l86934n12622n65183n23408m31774l45104k78328k30036k20114k55757
$$ plain form
33782 -2938497 -3207464 -3352490 -3200343 -2698137 -1987004 -1306188 -820825 -538540 -365915
33773 -365915 -209338 -22323 191888 375447 429585 286505 -19413 -386591 -761024 -1173258
33763 -1173258 -1638772 -2069382 -2334404 -2387203 -2282130 -2084720 -1827835 -1557033 -1349703 -1256919
33753 -1256919 -1269625 -1367348 -1549079 -1772959 -1914096 -1858572 -1637086 -1408296 -1299039 -1300352
33743 -1300352 -1323402 -1306110 -1243564 -1162161 -1110087 -1152057 -1322308 -1568426 -1762255 -1781652 -1586363
33732 -1586363 -1228224 -807291 -421093 -136306 21072 72988 88537 148682 280708 423835
33722 423835 474697 370786 130590 -159337 -364527 -336174 2328 571432 1176052 1656957
33712 1656957 1973306 2126191 2069706 1764716 1290771 832071 546539 486321 628499 924477
$$ packed form
33782b938497k68967j45026J52147N02206P11133O80816M85363K82285J72625
33773c65915J56577J87015K14211J83559N4138j43080l05918l67178l74433m12234
33763a173258m65514m30610k65022n2799J05073J97410K56885K70802K07330R2784
33753a256919j2706r7723j81731k23880j41137N5524K21486K28790J09257j313
33743a300352k3050J7292O2546Q1403N2074m1970j70251k46118j93829j9397J95289
33732a586363L58139M20933L86198K84787J57378N1916J5549O0145J32026J43127
33722D23835N0862j03911k40196k89927k05190K8353L38502N69104O04620M80905
33712A656957L16349J52885n6485l04990m73945m58700k85532o0218J42178K95978
$$ plain form
33702 924477 1323184 1804958 2391717 3058128 3634579 3898508 3816717 3628470 3620141 3857743
33692 3857743 4193870 4477853 4665941 4755652 4730352 4600830 4418262 4192064 3840757 3274716
33682 3274716 2508109 1656929 842511 120974 -508482 -1050728 -1466210 -1670909 -1608124 -1333757
33672 -1333757 -1002527 -743005 -563816 -407423 -271554 -228246 -317048 -462300 -529888 -456815
33662 -456815 -296385 -125292 71619 386445 844483 1309634 1581748 1589523 1445199 1301352
33652 1301352 1209923 1157114 1177306 1345899 1662599 2017817 2300391 2481087 2554862 2459250
33642 2459250 2124703 1595605 1034437 582590 252223 -27416 -295039 -523356 -675535
33633 -675535 -745699 -736991 -643375 -489243 -374203 -440282 -776419 -1360903 -2093315 -2855531
$$ packed form
33702I24477L98707M81774N86759O66411N76451K63929q1791j88247q329K37602
33692C857743L36127K83983J88088Q9711k5300j29522j82568k26198l51307n66041
33682C274716p66607q51180q14418p21537o29456n42246m15482k04699O2785K74367
33672a333757L31230K59522J79189J56393J35869M3308q8802j45252o7588P3073
33662d56815J60430J71093J96911L14826M58038M65151K72114P775j44324j43847
33652A301352r1429n2809K0192J68593L16700L55218K82574J80696P3775r5612
33642B459250l34547n29098n61168m51847l30367k79639k67623k28317j52179
33633f75535p0164Q708R3616J54132J15040o6079l36137n84484p32412p62216
$$ plain form
33623 -2855531 -3527285 -3977651 -4103391 -3903702 -3494902 -3026288 -2589110 -2217589 -1948302
33614 -1948302 -1831469 -1879257 -2037819 -2222409 -2354428 -2361460 -2192520 -1875561 -1533001 -1290613
33604 -1290613 -1175545 -1139239 -1163319 -1281484 -1489069 -1697408 -1819583 -1862959 -1896318 -1957698
33594 -1957698 -2044063 -2173204 -2399519 -2758985 -3226164 -3721188 -4132153 -4347818 -4318560 -4092993
33584 -4092993 -3760878 -3359820 -2872132 -2300111 -1682968 -1035668 -349725 305616 752581
33575 752581 850850 656139 386153 248509 334244 623921 1004880 1287357 1298319 1009685
33565 1009685 547503 71027 -311515 -515337 -465450 -181053 166909 356286 284184 23933
33555 23933 -258787 -415054 -376172 -178101 67592 272722 462457 742208 1159999 1614327
$$ packed form
33623b855531o71754m50366j25740J99689M08800M68614M37178L71521K69287
33614a948302J16833m7788j58562j84590j32019p032J68940L16959L42560K42388
33604a290613J15068L6306k4080j18165k07585k08339j22175m3376l3359o1380
33594a957698q6365j29141k26315l59466m67179m95024m10965k15665K9258K25567
33584d092993L32115M01058M87688N72021O17143O47300O85943O55341M46965
33575G52581R8269j94711k69986j37644Q5735K89677L80959K82477J0962k88634
33565A009685m62182m76476l82542k03822M9887K84397L47962J89377p2102k60251
33555B3933k82720j56267L8882J98071K45693K05130J89735K79751M17791M54328
$$ plain form
33545 1614327 1903176 1857334 1444373 783478 72852 -524301 -952477 -1239882 -1423383 -1514581
33535 -1514581 -1517194 -1429937 -1226897 -884423 -456188 -83488 118034 177471 242454 431537
33525 431537 729276 1015825 1164759 1104007 816993 328783 -289261 -912881 -1399695 -1672607
33515 -1672607 -1780553 -1847797 -1934394 -1954238 -1748718 -1231234 -446965 476727 1387924 2126311
33505 2126311 2551466 2606421 2348251 1902664 1400605 956081 656298 525486 504172 494430
33495 494430 428417 283906 58364 -230026 -515878 -705045 -749415 -693300 -626907 -593168
33485 -593168 -548396 -418554 -195694 24851 116523 40689 -113275 -214839 -208201 -133561 -59220
33474 -59220 -27839 -60479 -165966 -323613 -478770 -572203 -560204 -406031 -93753 316242
$$ packed form
33545A614327K88849m5842m12961o60895p10626n97153m28176k87405j83501r1198
33535a514581k613Q7257K03040L42474M28235L72700K01522N9437O4983J89083
33525D31537K97739K86549J48934o0752k87014m88210o18044o23620m86814k72912
33515a672607j07946o7244q6597j9844K05520N17484P84269R23692R11197P38387
33505B126311M25155N4955k58170m45587n02059m44524k99783j30812k1314r742
33495D94430o6013j44511k25542k88390k85852j89167m4370N6115O6393L3739
33485e93168M4772J29842K22860K20545R1672p5834j53964j01564O638P4640P4341
33474e9220L1381l2640j05487j57647j55157r3433J1999J54173L12278M09995
$$ plain form
33464 316242 673175 831455 775397 626533 519219 485933 466380 397312 263418 67838
33454 67838 -208842 -584375 -1001188 -1300050 -1305902 -964606 -390693 233487 804236 1335707
33444 1335707 1866830 2357733 2690710 2760216 2551008 2143590 1671357 1277996 1084197 1146023
33434 1146023 1415633 1750931 1993052 2054731 1939455 1689032 1340679 946059 602516 420385
33424 420385 439345 581646 690154 613351 278915 -270334 -893514 -1434566 -1831655 -2156894
33414 -2156894 -2536611 -3030826 -3597345 -4156545 -4651094 -5026553 -5190282 -5041989 -4559539
33405 -4559539 -3833232 -3002651 -2170498 -1378548 -636006 59247 714889 1320007 1813513
33396 1813513 2103767 2147419 2004497 1792851 1577436 1312734 909235 366735 -161810 -458848
$$ packed form
33464C16242L56933J58280n6058j48864j07314l3286j9553o9068j33894j95580
33454F7838k76680l75533m16813k98862n852L41296N73913O24180N70749N31471
33444A335707N31123M90903L32977O9506k09208m07418m72233l93361j93799O1826
33434A146023K69610L35298K42121O1679j15276k50423l48353l94620l43543j82131
33424D20385J8960J42301J08508p6803l34436n49249o23180n41052l97089l25239
33414b156894l79717m94215n66519n59200m94549l75459j63729J48293M82450
33405d559539P26307Q30581Q32153P91950P42542O95253O55642O05118M93506
33396A813513K90254M3652j42922k11646k15415k64702m03499n42500n28545k97038
$$ plain form
33386 -458848 -416511 -126984 208455 454692 613999 742136 849554 914121 944022 957689
33376 957689 902329 665256 214814 -299866 -640367 -671386 -436727 -57985 392138 897486
33366 897486 1419009 1852268 2071461 2010862 1719914 1356168 1105465 1067904 1203065 1393130
33356 1393130 1558531 1704967 1880197 2130456 2506018 3055057 3758606 4478899 5014298
33347 5014298 5225785 5109788 4763123 4300875 3800779 3291733 2776579 2273401 1837756
33338 1837756 1532579 1371659 1298369 1214193 1017152 629671 32082 -706364 -1440209 -2009367
33328 -2009367 -2301963 -2286303 -2020416 -1637366 -1290578 -1089914 -1088552 -1309839 -1737971 -2269514
33318 -2269514 -2728302 -2987229 -3079567 -3168956 -3410058 -3837729 -4354619 -4789231 -4984682 -4883705
$$ packed form
33386d58848M2337K89527L35439K46237J59307J28137J07418O4567K9901J3667
33376I57689n5360k37073m50442n14680l40501l1019K34659L78742M50123N05348
33366H97486N21523M33259K19193o0599k90948l63746k50703l7561J35161J90065
33356A393130J65401J46436J75230K50259L75562N49039P03549P20293N35399
33347E014298K11487j15997l46665m62248n00096n09046n15154n03178m35645
33338A837756l05177j60920p3290q4176j97041l87481n97589p38446p33845n69158
33328b009367k92596J5660K65887L83050L46788K00664J362k21287m28132n31543
33318b269514m58788k58927r2338q9389k41102m27671n16890m34612j95451J00977
$$ plain form
33308 -4883705 -4551825 -4112139 -3658959 -3234457 -2855136 -2522075 -2217301 -1934172 -1718756
33299 -1718756 -1650600 -1775635 -2083148 -2547305 -3148619 -3832484 -4477593 -4939803 -5122126 -4987550
33289 -4987550 -4522383 -3725136 -2649458 -1450053 -367474 359240 600890 394031 -91380
33280 -91380 -645051 -1114805 -1468682 -1787895 -2172838 -2617360 -2978041 -3095324 -2946715 -2663586
33270 -2663586 -2408464 -2262189 -2212164 -2195074 -2138450 -2008651 -1848602 -1742387 -1721192 -1725762
33260 -1725762 -1669604 -1499090 -1175177 -659208 16940 691613 1155815 1309262 1202262 935040
33250 935040 572104 160448 -239719 -595151 -939774 -1320743 -1701716 -1950641 -1933292 -1612596
33240 -1612596 -1073498 -485315 -42542 105009 -77623 -486721 -943352 -1309526 -1559755
$$ packed form
33308d883705L31880M39686M53180M24502L79321L33061L04774K83129K15416
33299a718756O8156j25035l07513m64157o01314o83865o45109m62210j82323J34576
33289d987550M65167P97247J075678J199405J082579P26714K41650k06859m85411
33280i1380n53671m69754l53877l19213l84943m44522l60681j17283J48609K83129
33270b663586K55122J46275N0025J7090N6624J29799J60049J06215K1195m570
33260a725762N6158J70514L23913N15969O76148O74673M64202J53447j07000k67222
33250I35040l62936m11656m00167l55432l44623l80969l80973k48925J7349L20696
33240a612596N39098N88183M42773J47551j82632m09098m56631l66174k50229
$$ plain form
33231 -1559755 -1751254 -1944335 -2166353 -2432882 -2754316 -3093566 -3343787 -3394897 -3235172 -2966182
33221 -2966182 -2705888 -2489376 -2270058 -1996681 -1665720 -1304020 -929877 -555963 -232198
33212 -232198 -65689 -167957 -555470 -1090856 -1530275 -1653988 -1388591 -840193 -225307 249856
33202 249856 486392 512313 427058 325133 256607 237496 278616 396140 594141 841308
33192 841308 1074524 1235655 1304558 1290286 1200657 1047138 885123 813757 897555 1093359
33182 1093359 1286441 1403189 1461509 1504636 1522563 1472107 1361253 1278756 1331076 1561505
33172 1561505 1922791 2297142 2531114 2485100 2099419 1436415 651696 -89938 -686464 -1117533
33162 -1117533 -1427049 -1694624 -1994444 -2347514 -2707046 -3001249 -3191428 -3282600 -3288156 -3206454
$$ packed form
33231a559755j91499j93081k22018k66529l21434l39250k50221n1110J59725K68990
33221b966182K60294K16512K19318K73377L30961L61700L74143L73914L23765
33212b32198J66509j02268l87513n35386m39419j23713K65397N48398O14886M75163
33202B49856K36536K5921q5255j01925o8526j9111M1120J17524J98001K47167
33192H41308K33216J61131O8903j4272q9629j53519j62015p1366Q3798J95804
33182A093359J93082J16748N8320M3127J7927n0456j10854q2497N2320K30429
33172A561505L61286L74351K33972m6014l85681o63004p84719p41634n96526m31069
33162a117533l09516k67575k99820l53070l59532k94203j90179r1172n556Q1702
$$ plain form
33152 -3206454 -3034653 -2783756 -2467270 -2089477 -1661709 -1224536 -837889 -544596 -344674
33143 -344674 -197707 -42315 177988 487934 867264 1264973 1630155 1931753 2154591 2285619
33133 2285619 2311665 2234680 2088109 1930692 1816240 1768903 1787073 1859168 1965340 2078669
33123 2078669 2191207 2337301 2562163 2857147 3148985 3364411 3482363 3509871 3438047 3252281
33113 3252281 2964313 2594883 2130371 1532960 801709 5038 -745712 -1340831 -1712858
33104 -1712858 -1878096 -1939467 -2005465 -2089912 -2118166 -2034134 -1857019 -1617419 -1292309 -853284
33094 -853284 -356027 63343 273879 206773 -141706 -703470 -1332298 -1860406 -2195993 -2356578
33084 -2356578 -2412217 -2430630 -2478637 -2620635 -2869809 -3156996 -3382053 -3495544 -3518740 -3501799
$$ packed form
33152c206454J71801K50897L16486L77793M27768M37173L86647K93293J99922
33143c44674J46967J55392K20303L09946L79330L97709L65182L01598K22838J31028
33133B285619K6046p6985j46571j57417j14452m7337J8170P2095J06172J13329
33123B078669J12538J46094K24862K94984K91838K15426J17952K7508p1824j85766
33113C252281k87968l69430m64512n97411p31251p96671p50750n95119l72027
33104a712858j65238o1371o5998q4447k8254Q4032J77115K39600L25110M39025
33094h53284M97257M19370K10536o7106l48479n61764o28828n28108l35587j60585
33084b356578n5639j8413m8007j41998k49174k87187k25057j13491k3196J6941
$$ plain form
33074 -3501799 -3484636 -3482509 -3479462 -3439764 -3346827 -3219584 -3063196 -2819358 -2414947 -1870770 -1320290
33063 -1320290 -895509 -618079 -416148 -210372 46874 378638 771499 1163024 1490100
33054 1490100 1753886 1992826 2183335 2219496 2024799 1650655 1224458 817983 406737 -46593
33044 -46593 -508001 -883720 -1096095 -1139480 -1072597 -960261 -820159 -639993 -460879 -419683
33034 -419683 -659453 -1180626 -1806722 -2311902 -2561647 -2524401 -2200974 -1608097 -828390 -13721
33024 -13721 702096 1278643 1736097 2066336 2208382 2108342 1775501 1278555 720318 229774
33014 229774 -61342 -87070 98600 360871 586311 734759 801140 766841 609265 334653
33004 334653 -22267 -412780 -763472 -973109 -969639 -786052 -554025 -401794 -360538 -368317
$$ packed form
33074c501799J7163K127L047L9698R2937J27243J56388K43838M04411N44177N50480
33063a320290M24781K77430K01931K05776K57246L31764L92861L91525L27076
33054A490100K63786K38940J90509L6161j94697l74144m26197m06475m11246m53330
33044d6593m61408l75719k12375m3385O6883J12336J40102J80166J79114M1196
33034d19683k39770n21173o26096n05180k49745L7246L23427N92877P79707Q14669
33024a3721P15817N76547M57454L30239J42046j00040l32841m96946n58237m90544
33014B29774k91116k5728J85670K62271K25440J48448O6381l4299j57576k74612
33004C34653l56920l90513l50692k09637L470J83587K32027J52231M1256p779
$$ plain form
32994 -368317 -348572 -283141 -232106 -294584 -527270 -873633 -1178308 -1300623 -1232412 -1100862
32984 -1100862 -1048344 -1109836 -1205337 -1233267 -1147340 -946544 -635167 -236911 163532 448025
32974 448025 559025 537517 450546 319838 152946 -1711 -98589 -178236 -333988 -586046
32964 -586046 -856690 -1097747 -1377981 -1790139 -2307527 -2785647 -3087819 -3169754 -3065831 -2846133
32954 -2846133 -2578573 -2282030 -1914463 -1451858 -983876 -683173 -654898 -838759 -1067878 -1195522
32944 -1195522 -1158232 -961979 -651410 -289023 59702 333621 488173 531667 548727 640830
32934 640830 810810 931671 867960 621496 329327 124070 25553 -32416 -107673 -207383
32924 -207383 -323165 -473402 -687644 -947206 -1157577 -1202185 -1035625 -727229 -425078 -289242
$$ packed form
32994c68317J9745O5431N1035o2478k32686l46363l04675j22315O8211J31550
32984a100862N2518o1492r5501k7930Q5927K00796L11377L98256M00443K84493
32974D48025J11000k1508q6971j30708j66892j54657r6878p9647j55752k52058
32964e86046k70644k41057k80234m12158n17388m78120l02172q1935J03923K19698
32954b846133K67560K96543L67567M62605M67982L00703K8275j83861k29119j27644
32944a195522L7290J96253L10569L62387L48725K73919J54552M3494J7060R2103
32934F40830J69980J20861o3711k46464k92169k05257r8517n7969p5257r9710
32924b07383j15782j50237k14242k59562k10371m4608J66560L08396L02151J35836
$$ plain form
32914 -289242 -433279 -865345 -1448640 -1954502 -2213360 -2226271 -2107717 -1925174 -1624225 -1107174
32904 -1107174 -347589 578452 1529089 2333573 2825134 2895647 2547003 1889008 1083005 274704
32894 274704 -449632 -1069363 -1593049 -2005752 -2257500 -2311626 -2189857 -1948906 -1621128 -1205831
32884 -1205831 -718016 -207478 293517 811580 1373542 1903303 2224048 2204799 1900326 1518835
32874 1518835 1246018 1113510 1028910 894793 681590 422002 180376 20916 -38779 -60217
32864 -60217 -145459 -346258 -619308 -874622 -1047919 -1115715 -1065464 -883223 -574757 -188081
$$ packed form
32914b89242j44037m32066n83295n05862k58858j2911J18554J82543L00949N17051
32904a107174P59585R26041R50637Q04484M91561P0513l48644o57995q06003q08301
32894B74704p24336o19731n23686m12703k51748n4126J21769K40951L27778M15297
32884a205831M87815N10538N00995N18063N61962N29761L20745j9249l04473l81491
32874A518835k72817j32508q4600j34117k13203k59588k41626j59460n9695k1438
32864f0217q5242k00799k73050k55314j73297o7796N0251J82241L08466L86676
$$ [...]
##END NTUPLES=NMR SPECTRUM
##END=
