##TITLE=31Pdec_67-2022
 CDCl3, 24 sc
 25.8.2022
##JCAMPDX= 6.0         $$ Bruker NMR JCAMP-DX V2.0
##DATA TYPE= NMR SPECTRUM
##DATA CLASS= NTUPLES
##ORIGIN= UXNMR, Bruker Analytische Messtechnik GmbH
##OWNER= root
$$ XWIN-NMR		Version 3.5
$$ Thu Aug 25 10:11:47 2022 Russian Standard Time (UT+4h)  she@DPX200
##.OBSERVE FREQUENCY= 81.013821
##.OBSERVE NUCLEUS= ^31P
##.ACQUISITION MODE= SIMULTANEOUS
##.ACQUISITION SCHEME= undefined
##.AVERAGES= 24
##.DIGITISER RES= 16
##SPECTROMETER/DATA SYSTEM= spect
##.PULSE SEQUENCE= zgpg30
##.SOLVENT NAME= DMSO
##.SHIFT REFERENCE= (INTERNAL, DMSO, 0, 248.564)
##AUDIT TRAIL= $$ (NUMBER, WHEN, WHO, WHERE, WHAT)
$$ ##TITLE= Audit trail, XWIN-NMR		Version 3.5
$$ ##JCAMPDX= 5.01
$$ ##ORIGIN= Bruker BioSpin GmbH
$$ ##OWNER= she
$$ F:/spectra/data/she/nmr/P31/1/pdata/1/auditp.txt
$$ ##AUDIT TRAIL=  $$ (NUMBER, WHEN, WHO, WHERE, WHAT)
(   1,<2022-08-25 10:10:26.68 +0400>,<she>,<DPX200>,
      <created by zg, POWCHK disabled, PULCHK disabled
       configuration hash MD5:
       00 E9 B6 7A A2 85 ED C7 34 08 36 98 17 FE 4E 26
       data hash MD5: 32K
       7C 96 89 4B 16 3A 5F 20 0B 82 17 5D FA 84 EA B5>)
(   2,<2022-08-25 10:10:31.75 +0400>,<she>,<DPX200>,
      <Start of raw data processing
       efp BC_mod = 2 LB = 1 FT_mod = 6 PKNL = 1 PHC0 = -10266.03 PHC1 = 88.85633 SI = 64K 
       data hash MD5: 64K
       BD 3F 88 01 24 D0 5D AD 15 44 AF 14 7D B1 5F 86>)
(   3,<2022-08-25 10:10:50.57 +0400>,<she>,<DPX200>,
      <pk PHC0 = 0.5235583 PHC1 = 0 
       data hash MD5: 64K
       8D B5 C5 C3 05 78 D3 B3 0D A0 A4 9E EA 14 5D 29>)
(   4,<2022-08-25 10:11:03.62 +0400>,<she>,<DPX200>,
      <abs ABSG = 5 
       data hash MD5: 64K
       3D E7 00 76 A2 64 A1 1D F4 77 12 BE 50 B1 74 E4>)
$$ ##END=
$$ 
$$ hash MD5
$$ B2 1D 5C 36 53 BC 4C FC F9 E6 0A 93 6A C8 AF 43
##$RELAX= 
##$RELAX= 
##$RELAX= 
##$RELAX= 
##$RELAX= 
##$RELAX= 
##$RELAX= 
##$RELAX= 
$$ Bruker specific parameters
$$ --------------------------
##$DU= <F:/spectra>
##$EXPNO= 1
##$NAME= <P31>
##$PROCNO= 1
##$TYPE= <nmr>
##$USER= <she>
##$AMP= (0..31)
100 100 100 100 100 100 100 100 100 100 100 100 100 100 100 100 100 100 
100 100 100 100 100 100 100 100 100 100 100 100 100 100 
##$AQSEQ= 0
##$AQ_mod= 1
##$AUNM= <au_zg>
##$AUTOPOS= <>
##$BF1= 81.014009
##$BF2= 200.13
##$BF3= 200.13
##$BF4= 200.13
##$BF5= 200.13
##$BF6= 200.13
##$BF7= 200.13
##$BF8= 200.13
##$BYTORDA= 1
##$CFDGTYP= 0
##$CFRGTYP= 5
##$CHEMSTR= <none>
##$CNST= (0..31)
1 1 145 1 1 1 1 1 1 1 1 1 1 1 1 1 1 1 1 1 1 1 1 1 1 1 1 1 1 1 1 1 
##$CPDPRG= <waltz16>
##$CPDPRG1= <>
##$CPDPRG2= <waltz16>
##$CPDPRG3= <>
##$CPDPRG4= <mlev>
##$CPDPRG5= <mlev>
##$CPDPRG6= <mlev>
##$CPDPRG7= <mlev>
##$CPDPRG8= <mlev>
##$CPDPRGB= <>
##$CPDPRGT= <>
##$D= (0..31)
0 1 0 0 0 0 0 0 0 0 0 0.03 2e-05 3e-06 0 0 0 0 0 0 0 0 0 0 0 0 0 0 0 0 
0 0 
##$DATE= 1661407826
##$DBL= (0..7)
120 120 120 11 120 120 24 19 
##$DBP= (0..7)
150 150 150 150 150 150 150 150 
##$DBP07= 0
##$DBPNAM0= <>
##$DBPNAM1= <>
##$DBPNAM2= <>
$$ [...]
##$SUBNAM3= <"">
##$SUBNAM4= <"">
##$SUBNAM5= <"">
##$SUBNAM6= <"">
##$SUBNAM7= <"">
##$SUBNAM8= <"">
##$SUBNAM9= <"">
##$SW= 501.771253377433
##$SWIBOX= (0..15)
0 1 3 0 0 0 0 0 0 0 0 0 0 0 0 0 
##$SW_h= 40650.406504065
##$TD= 32768
##$TD0= 1
##$TE= 0
##$TE2= 300
##$TE3= 300
##$TEG= 300
##$TL= (0..7)
0 120 53 12 22 120 120 120 
##$TP= (0..7)
150 150 150 150 150 150 150 150 
##$TP07= 0
##$TPNAME0= <>
##$TPNAME1= <>
##$TPNAME2= <>
##$TPNAME3= <>
##$TPNAME4= <>
##$TPNAME5= <>
##$TPNAME6= <>
##$TPNAME7= <>
##$TPOAL= (0..7)
0.5 0.5 0.5 0.5 0.5 0.5 0.5 0.5 
##$TPOFFS= (0..7)
0 0 0 0 0 0 0 0 
##$TUNHIN= 0
##$TUNHOUT= 0
##$TUNXOUT= 0
##$USERA1= <user>
##$USERA2= <user>
##$USERA3= <user>
##$USERA4= <user>
##$USERA5= <user>
##$V9= 5
##$VALIST= <valist>
##$VCLIST= <CCCCCCCCCCCCCCC>
##$VD= 0
##$VDLIST= <DDDDDDDDDDDDDDD>
##$VPLIST= <PPPPPPPPPPPPPPP>
##$VTLIST= <TTTTTTTTTTTTTTT>
##$WBST= 1024
##$WBSW= 4
##$XGAIN= (0..3)
0 0 0 0 
##$XL= 0
##$YL= 0
##$YMAX_a= 3510
##$YMIN_a= -3497
##$ZGOPTNS= <>
##$ZL1= 120
##$ZL2= 120
##$ZL3= 120
##$ZL4= 120
##$ABSF1= 248.5645
##$ABSF2= -253.2056
##$ABSG= 5
##$ABSL= 3
##$ALPHA= 0
##$AQORDER= 0
##$ASSFAC= 0
##$ASSFACI= 0
##$ASSFACX= 0
##$ASSWID= 0
##$AUNMP= <proc_1d>
##$AZFE= 0.1
##$AZFW= 0.5
##$BCFW= 0
##$BC_mod= 2
##$BYTORDP= 0
##$COROFFS= 0
##$CY= -3
##$DATMOD= 1
##$DC= 0
##$DFILT= <>
##$DTYPP= 0
##$F1P= 0
##$F2P= 0
##$FCOR= 1
##$FTSIZE= 65536
##$FT_mod= 6
##$GAMMA= 0
##$GB= 0
##$INTBC= 1
##$INTSCL= 5.30512e-09
##$ISEN= 30
##$LB= 1
##$LEV0= 0
##$LPBIN= 0
##$MAXI= 10000
##$MC2= 0
##$MEAN= 0
##$ME_mod= 0
##$MI= 50
##$NCOEF= 0
##$NC_proc= -5
##$NLEV= 6
##$NOISF1= 182.463
##$NOISF2= 159.3651
##$NSP= 0
##$NTH_PI= 0
##$NZP= 0
##$OFFSET= 248.5645
##$PC= 4
##$PHC0= -10265.51
##$PHC1= 88.85633
##$PH_mod= 1
##$PKNL= yes
##$PPARMOD= 0
##$PSCAL= 0
##$PSIGN= 0
##$REVERSE= no
##$SF= 81.0140089999908
##$SI= 65536
##$SIGF1= 159.3651
##$SIGF2= -187.1042
##$SINO= 113.3802
##$SIOLD= 16384
##$SREGLST= <1H.CDCl3>
##$SSB= 0
##$STSI= 65536
##$STSR= 0
##$SW_p= 40650.406504065
##$SYMM= 0
##$S_DEV= 0
##$TDeff= 32768
##$TDoff= 0
##$TI= <>
##$TILT= no
##$TM1= 0
##$TM2= 0
##$TOPLEV= 0
##$USERP1= <user>
##$USERP2= <user>
##$USERP3= <user>
##$USERP4= <user>
##$USERP5= <user>
##$WDW= 1
##$XDIM= 65536
##$YMAX_p= 368093909
##$YMIN_p= -16040224
$$ End of Bruker specific parameters
$$ ---------------------------------
##NTUPLES= NMR SPECTRUM
##VAR_NAME=  FREQUENCY,     SPECTRUM/REAL,   SPECTRUM/IMAG
##SYMBOL=    X,             R,               I
##VAR_TYPE=  INDEPENDENT,   DEPENDENT,       DEPENDENT
##VAR_FORM=  AFFN,          ASDF,            ASDF
##VAR_DIM=   65536,         65536,           65536
##UNITS=     HZ,            ARBITRARY UNITS, ARBITRARY UNITS
##FACTOR=    0.620285442955139, 1,           1
##FIRST=     20137.2065510736, 0,            0
##LAST=      -20513.1999529914, 0,           0
##MIN=       -20513.1999529914, -16040224,   0
##MAX=       20137.2065510736, 368093909,    0
$$ Real data points
##PAGE= N=1
##DATA TABLE= (X++(R..R)), XYDATA
$$ [...]
##PAGE= N=2
##DATA TABLE= (X++(I..I)), XYDATA
39830F93963q43034j3975Q38173M50841n79158p31076O2014N09585J25970k86274
39820B27029k43288j29783n9998L12720O71693K34260o47841o52016L17661P26470
39810G56907j29698r03776m11160M80882M54159r9427l9224M31356L07187k61374
39800E85832k57520K97111L57648k87811o78435l43049N0915J4037j5729L05078
39790B8077N06749K00137j47700J0119L61211K37320l34741o94206m66513M9110
39780b50437L35858J84044k00729m18384k45631J17678K58953N3166j96410j79973
39770e41865L3039J56513J02782M6685Q6231L4471k77075n65756l03211M76428
39760g51758R35340M45914m02062m72985K88939P26133J77371n50662m55725J82522
$$ y = [693963, -149071, -163046, 675127, 1125968, 546810, -184266, -122252, 387333, 513303, 227029, -16259, -146042, -206040, 106680, 778373, 1012633, 364792, -287224, 30437, 756907, 627209, -276567, -687727, -206845, 247314, 147887, 108663, 540019, 847206, 585832, 328312, 625423, 983071, 695260, 16825, -326224, -275309, -261272, -277001, 28077, 534826, 734963, 587263, 597382, 958593, 1195913, 861172, 166966, -299547, -250437, 85421, 269465, 68736, -349648, -595279, -477601, -218648, -165482, -361892, -541865, -508826, -352313, -249531, -202846, -116615, -82144, -359219, -924975, -1228186, -751758, 183582, 629496, 227434, -245551, 43388, 769521, 946892, 396230, -59495, 123027]
39750A23027L90044K0211k37001q0459R8834O9668O2234J41664K3588l21739m98112
39739b08041k92774N0528K82946L86808K93643r7369n18514m98053p1444J91791
39729d80479K4490j97814j24192R6771K21398K73434K72061J09201o8927R2019
39719B17962M61006L95474k13680n31031K8575P92570P51472K8401m28405l32349
39709A169995k73507m97719m81619N800L18893m7209n27726k79381N07754Q57026
39699G52307M14429j48484k28041p6234j67177l54959k06846J67110K46836m9136
39689C49805k58346j55074m4033j09458n7085K71817M59418J54058k63309k16778
39679A31015J58166K60954n897j66334r713J48798J06175O4624J43939J44801
$$ y = [123027, 513071, 533282, 296281, 215822, 314656, 384324, 446558, 588222, 611810, 290071, -208041, -500815, -450287, -167341, 219467, 513110, 415741, -102773, -600826, -672270, -480479, -455989, -653803, -777995, -681224, -459826, -186392, 85669, 194870, 125943, 217962, 678968, 1074442, 860762, 329731, 358306, 1150876, 1902348, 1930749, 1502344, 1169995, 896488, 398769, -82850, -77050, 241843, 194634, -333092, -612473, -104719, 752307, 1166736, 1018252, 790211, 713977, 546800, 191841, -15005, 152105, 398941, 349805, 91459, -63615, -107648, -217106, -274191, -2374, 457044, 611102, 347793, 131015, 289181, 550135, 544238, 377904, 368191, 516989, 623164, 687788, 831727, 976528]
39669I76528j7603j37845j63378l14481n48568m36293J18390N39667L60414r5465
39659B81366k57726j45874j44170k57653j85425M4828J17404M5666J70690M93936
39649A63042N57508J61730k66478k86645m9313N2812N1348K63354N89781M82134
39639A719273k06773p74151m97643L06502O20094J40113k77818Q5177O63984M02827
39629B181585o52567j367667j075228l15061J47099K74948L66691L66908J26202
39620E2910r6299K4768K93438K61642q0132l23983k32283P1907L77415N09536
39610H58919L22540j01704l84902k85363l5787L6408j2692Q212k3199k83583n18681
39599d19832l40898J24738M05247L82253L16304K79777J29813k8071M0850J47515
$$ y = [976528, 958925, 821080, 657702, 343221, -205347, -641640, -523250, 16417, 376831, 281366, 23640, -122234, -266404, -524057, -709482, -664654, -547250, -501584, -330894, 163042, 720550, 882280, 615802, 329157, 279844, 332656, 384004, 647358, 1237139, 1719273, 1512500, 738349, 240706, 547208, 1167302, 1307415, 1029597, 1114774, 1778758, 2181585, 1529018, 161351, -913877, -1228938, -1081839, -806891, -440200, -73292, 52910, -43389, -18621, 274817, 536459, 456327, 132344, -99939, -28032, 349383, 858919, 1181459, 1079755, 694853, 409490, 373703, 410111, 397419, 405631, 382432, 98849, -419832, -760730, -635992, -230745, 151508, 467812, 747589, 877402, 849331, 890181, 1037696]
39589A037696r9572m97704m03307J79771M32189n9317o31561n29565O0911M70523
39579c9936M99550L56196R5866k72698m62875k77324k2792k5764n4549J90530
39569a3796L67962J9474m71888l34118K93086M80130J5824k28343K18005N74175
39559I20511Q8302o50314n70948K12602N77844O2167n64491m94953R9902N15529
39549A96151M27699M6641k81311l42291j51254L0838m4832k55179k39213M7174
39539e65577K26005P4265j30786n7359J91738L10198K59652J96417J19933n7940
39529E66546k08645j06585J77165L14346J71909l8117r6412l4111k678p5695k26310
39518D41413l50001k96307k5691K80448M25136M61304N44106N77703L07294k15866
$$ y = [1037696, 938124, 440420, 37113, 216884, 649073, 589756, -41805, -571370, -510459, -39936, 459614, 815810, 911676, 638978, 176103, -101221, -124013, -149777, -204326, -13796, 354166, 373640, -98248, -432366, -139280, 340850, 356674, 128331, 346336, 920511, 1008813, 358499, -212449, 153, 577997, 640164, 75673, -419280, -319378, 196151, 623850, 670491, 389180, 46889, -104365, -73527, -118359, -373538, -612751, -565577, -339572, -265307, -396093, -453452, -261714, 48484, 308136, 504553, 624486, 566546, 357901, 251316, 428481, 742827, 914736, 876619, 780207, 746096, 743418, 667723, 441413, 91412, -204895, -230586, 49862, 474998, 936302, 1480408, 2058111, 2365405, 2149539]
39508B149539n85603n71431m07847l81890l90785j60427K57154M80192K70500
39499F59402j61675l52484n1143M59223N44440r4002r18163j039962l22834L59760
39489i17438K47288k65095j92370O08148J191591Q13275j11474o55883n51679
39480A66363k42506m3772J59361L98052L90066M9648k14271n6526K50499K27119
39470A084033n0042p3064K64210M64136J74782k94400m34469j86688J20120K22626
39460A291244P3613k23330l98238j83927K55661L58864o4086m21535j34549M50654
39450A004371N15276l5055m71829l34890J9289J01141n1906j43784r0722M7337
39440E59228K46268L82550K28584j93002n17428m81335k12019M2433J85745J81245
$$ y = [2149539, 1563936, 992505, 584658, 202768, -188017, -348444, -91290, 388902, 659402, 497727, 145243, 94100, 553323, 1097763, 1003761, 85598, -954364, -1277198, -917438, -670150, -935245, -1127615, -519467, 672124, 1485399, 1373925, 718042, 166363, -76143, -119915, 39446, 437498, 827564, 877212, 662941, 606415, 856914, 1084033, 1033991, 960927, 1225137, 1689273, 1864055, 1569655, 1135186, 948498, 1068618, 1291244, 1364857, 1141527, 743289, 559362, 815023, 1173887, 1109801, 688266, 553717, 1004371, 1519647, 1484592, 1012763, 677873, 697162, 798303, 746397, 602613, 511891, 559228, 805496, 1188046, 1416630, 1223628, 706200, 224865, 12846, 55279, 241024, 422269]
39430D22269J3999j53233j18589K527o0140k01614p9834J84420R4995k99547l29545
39419e24292J75420N11347K86330J20925N12469Q35599L58299m51295o76276m47225
39409G01301n16938p51142l64380N00584Q05557L25574j3916J97443J75860n23202
39399E36741j029388n45034K88202M00453n7079j35783K98494M56570j8788n35487
39389c41099m87378j0778L74002M11383K31682R3589R6488N4692k36035n49152
39379c62606l72119L02243P40419L95469k92344m89550p8427L42856L62298J24459
39369F72698q6692j52999p9798l5339k87590p28179p30270J1658P99363P64764
39359A47616J55397l9844L54161M86800m3003n05512k49231K86855L65187N3643
$$ y = [422269, 436268, 283035, 164446, 166973, 106833, -94781, -174615, 9805, 104800, -194747, -524292, -348872, 162475, 448805, 569730, 1082199, 1917798, 2276097, 1824802, 1148526, 701301, 184363, -566779, -931159, -430575, 374982, 700556, 686640, 884083, 1059943, 536741, -492647, -1037681, -749479, -349026, -406105, -541888, -243394, 213176, 194388, -341099, -828477, -839255, -465253, -53870, 177812, 271401, 367889, 422581, 186546, -362606, -734725, -432482, 307937, 703406, 411062, -78488, -156915, 185941, 548239, 672698, 586006, 433007, 353209, 317870, 30280, -697899, -1428169, -1416511, -617148, 147616, 303013, 263169, 617330, 1104130, 1061127, 555615, 306384, 593239, 958426, 1012069]
39349A012069j29866j19621j47867j28109R8952K55637O1988j45613L4691K25977
39339A018238j51249o99481m75741M28231Q51872L27752k40279j18162J31959
39330A073140j86340n85792k84784K92483J49048n30042n83399K10211P41708
39321B96233L76766q9593J26640M79427R4286o92154q34708j85073M31787N49928
39311E53539M84267M29982J12424m29316n67644l4429N10526L77998j69593l88599
39301H79155j48985M2930p3080k10079j16210N1079O1848m1582r8689p7214j7879
39290B51294Q5095K18828K92470K37949Q1233j26013l37087m47356l37010l6974
39280a17571K49973L43103K25513j057j90704k04047m4089O8442m5885j92378
$$ y = [1012069, 882203, 762582, 614715, 486606, 585558, 841195, 903183, 757570, 792261, 1018238, 866989, 167508, -308233, 119998, 971870, 1299622, 1059343, 941181, 1073140, 886800, 301008, 16224, 308707, 457755, -72287, -655686, -445475, 296233, 672999, 583406, 710046, 1189473, 1283759, 591605, -243103, -428176, 3611, 553539, 1037806, 1467788, 1580212, 1150896, 583252, 548823, 1059349, 1437347, 1267754, 879155, 730170, 773100, 700020, 489941, 373731, 424810, 486658, 445076, 346387, 269173, 251294, 336389, 555217, 847687, 1085636, 1166869, 1040856, 703769, 256413, -80597, -117571, 132402, 475505, 701018, 699961, 509257, 305210, 261121, 329563, 283678, 91300]
39270I1300m681M50276O07956J58503m41955n40678j48146J68725J21214k6392
39260D36122n362R4086J21802J28840J50751P2620r0964j09084M5910L8028k65844
39249F16905m13088P268O01398N81278j36704p83214p45374k33559K09865M06130
39239A10905M65852L79891P4852k76816l51659q3272K33749K75994J7521k75545
39229E71472l04114l719L88528N28256K48824l01761p34823o66699q6544M65533
39219A04953L64440k79286n96580r3955N43860L53388m59622p60396j51502N01891
39209d72809M71670J83743K80729M68898J34859m36393m42943Q5816L04331r3971
39199D83930m49132k37686K07551L86875L37362K45637k7617n24659p76195m00777
$$ y = [91300, 86619, 536895, 1144851, 1303354, 861399, 320721, 172575, 341300, 462514, 436122, 430760, 524846, 646648, 775488, 926239, 998859, 907895, 798811, 844721, 882749, 616905, 203817, 211085, 812483, 1393761, 1257057, 473843, -271531, -505090, -295225, 110905, 576757, 956648, 1031500, 754684, 403025, 319753, 553502, 829496, 847017, 571472, 267358, 263639, 652167, 1180423, 1429247, 1127486, 392663, -274036, -360580, 104953, 469393, 190107, -406473, -500428, 43432, 396820, -62802, -823198, -974700, -472809, -1139, 182604, 463333, 932231, 1067090, 630697, 187754, 273570, 577901, 483930, 34798, -202888, 4663, 391538, 728900, 974537, 946920, 422261, -353934, -754711]
39189g54711J98981L38422N6632O052L90530O39360K93074l05582n06322j90295
39179A66141K22777L91005L27183J62395k7875j49805j19315k6563n4071j72785
39169G19087j45045R1538K93465K85473J87655Q8985j78126o25755p95457l32091
39159d10271L43014N02139J44070q0142N0029O8717k01136k44717J77181M45726
39149G94610Q7422l22238o6217M40266K71796m24634n82299O6335N47212K09916
39139A022169k90690j42875L16446K17805m43983q58939o14155j03994K22292
39130f75924L55294L76062J94040j36855k82683r7590J01480K8179r9867L5524
39120b02340K16592j3561m96430n35606J6697M08618J27558k30784Q6887O64464
$$ y = [-754711, -555730, -217308, -160676, -154624, 235906, 875266, 1168340, 862758, 356436, 166141, 388918, 779923, 1107106, 1269501, 1241626, 1091821, 972506, 945943, 891872, 719087, 574042, 665580, 959045, 1244518, 1432173, 1521158, 1343032, 717277, -78180, -410271, -67257, 434882, 578952, 498810, 548839, 617556, 416420, 171703, 348884, 794610, 882032, 559794, 493577, 933843, 1205639, 781005, 198706, 265041, 812253, 1022169, 731479, 588604, 905050, 1122855, 678872, -180067, -794222, -898216, -675924, -320630, 55432, 249472, 112617, -170066, -267656, -166176, -137997, -237864, -202340, 14252, 691, -495739, -1031345, -1014648, -606030, -478472, -709256, -622369, 42095]
39110D2095N13695k13124k88495O09077J175563L78601r21822j185156l29579
39101b19145M09326L54488J0376p1024l70N36J500m102j87677m18403l21981M0045
39089d06431J64188n7568j26051K14727N32583M15420P4368j03466j24424j44759
39079D38587o7299K24288N07907M42598N76m87385n85600q6212O45455Q04324
39069A837239Q5199o71056m37686M82709P77042M1462o47167m45362L1639j14970
39059I39049n94030n67563r6883J03958m4719J1706L60957M82740J81115j66895
39049F09435l15031l64196k64167J57547O03892M98189o7785k92174J66492O39170
39039A371372M39246j58637m05391j35659J76707J95233O1346J744j9755j60081
$$ y = [42095, 555790, 342666, 54171, 663248, 1838811, 2217412, 1295590, 110434, -219145, 190181, 544669, 555045, 484021, 483651, 484187, 485687, 481585, 293908, -124495, -446476, -406431, -242243, -299811, -425862, -211135, 321448, 736868, 811236, 707770, 583346, 438587, 371288, 595576, 1103483, 1546081, 1546657, 1059272, 473672, 387460, 1032915, 1837239, 1922438, 1251382, 813696, 1296405, 2073447, 2114909, 1467742, 1022380, 1054019, 939049, 345019, -222544, -319427, -215469, -260188, -248482, 112475, 595215, 776330, 609435, 294404, -69792, -333959, -176412, 427480, 925669, 857884, 565710, 732202, 1371372, 1810618, 1651981, 1246590, 1110931, 1287638, 1482871, 1544217, 1545961, 1526206, 1366125]
39029A366125m02008n18315l15176J06591L84710K73413m7367j72793K2361K35845
39019I33386J41714j90040l74762j72385K04948K88710j09480o07912o34481j02246
39009f22548M75407O08274L57180J04502J6059k9995j12284j42715o5703J9502
38999F07679j8394j79805k99769j76411J78893M38149K84786j39981l61102j93671
38989A40374N4088J07779R9917K06783K74869J31633l2476K6746J54925O7487
38979A232125j19233p8597J16706N5344l33794n95665l59069J67846M45573J86324
38969G17560l66721o63374m05346O9765J59167j68190k66428K12270O81219M43224
38959D13146k14392m20442j8784K99157J53899k6307J27423L01465J36593j11963
$$ y = [1366125, 964117, 445802, 130626, 237217, 621927, 895340, 847973, 675180, 697541, 933386, 1075100, 885060, 510298, 337913, 542861, 831571, 722091, 114179, -520302, -622548, -147141, 461133, 818313, 922815, 938874, 908879, 796595, 653880, 588177, 607679, 589285, 409480, 109711, -66700, 112193, 550342, 835128, 695147, 334045, 140374, 194462, 302241, 402158, 608941, 883810, 1015443, 982967, 1009713, 1164638, 1232125, 1112892, 1034295, 1151001, 1206345, 872551, 276886, -82183, 85663, 531236, 717560, 350839, -312535, -717881, -648116, -488949, -657139, -923567, -711297, -30078, 413146, 198754, -221688, -240472, 58685, 212584, 186277, 313700, 615165, 751758, 639795]
38949F39795n8118J11504j8527l22136k86720J59863N03798L78287K5951j13455
38939A020242J4337R8159q3348l92687m94957k23530K15191M23017K37520p2145
38929G41799j34947M1230R8458j18170k68270j668M14767L48729k52844o07920
38919B61164j13308P18636Q57601J44296n41107n58920k83100k83653l66597k4282
38909a89270N53875O52122J15090l99590l49816N2753L14401L06739J72507n1036
38899A177775l59692n41627l70742J7917K40402J67869O8855J67639K87493J28896
38889I84785k29638l83928j63543J40087K18830J53172J59014J72387Q719k27240
38879H32645k63093r8527N0636J62010L41030M32059K11333o7582O2561M20337
$$ y = [639795, 581677, 693181, 674654, 352518, 65798, 225661, 729459, 1107746, 1133697, 1020242, 1034579, 1132738, 1049390, 656703, 161746, -61784, 153407, 576424, 813944, 741799, 606852, 648082, 746540, 628370, 360100, 358432, 773199, 1121928, 869084, 261164, 147856, 866492, 1724093, 1868389, 1327282, 768362, 485262, 201609, -164988, -189270, 364605, 1016727, 1131817, 732227, 382411, 435164, 749565, 1056304, 1228811, 1177775, 818083, 276456, -94286, -76369, 164033, 331902, 400757, 568396, 855889, 984785, 755147, 371219, 207676, 347763, 566593, 719765, 878779, 1051166, 1059885, 832645, 569552, 471025, 521661, 683671, 1024701, 1456760, 1668093, 1600511, 1663072, 2083409]
38869B083409K91864l87192p39649k46107M00879L41335j82401l48625p7902J8001
38859A153612k46248m08306k08683O1912J25700M7224o5611j94816j99990O8294
38849A33088L88866L26470j50482n56696m74542M833M54872N38176K85865O4020
38839A014470J31742K09899j59539p59933p93412r4005M53976K12912k10406L033
38829H737N15991M55098j02505l51764j52190o4177j63261K0628M00142L18080
38819H84779k42380n17126k21923P0366L0349L2926K49111K78153J1086r3715
38809D81626Q0401P9283j40717l3234L92495L67571k41515n06533J0271M74255
38799I63903K63027M394K37058K69896m75513j109135o27835K97296L79645j78990
$$ y = [2083409, 2375273, 1988081, 1248432, 1002325, 1403204, 1744539, 1562138, 1213513, 1135611, 1153612, 907364, 499058, 290375, 352287, 477987, 525211, 459600, 264784, 64794, 133088, 521954, 848424, 697942, 141246, -333296, -328463, 126409, 664585, 950450, 1014470, 1146212, 1356111, 1196572, 436639, -356773, -450778, 3198, 216110, 5704, 8737, 524728, 979826, 877321, 525557, 373367, 309190, 145929, 166557, 566699, 884779, 642399, 125273, -96650, -26284, 4065, 36991, 286102, 564255, 575341, 481626, 562027, 641310, 500593, 467359, 859854, 1227425, 985910, 479377, 489648, 963903, 1226930, 1231324, 1468382, 1738278, 1262765, 153630, -474205, -176909, 202736, 23746]
38789B3746k38078J88972J16071m29562l78998L87278P19317J70252k71573O6263
38779C53688M55819J35634m11547l69292J19817L78091K36363m7217l42188n05523
38769C645k26985L93108O23784P2486n82247m68491K38732O19684L04991j84682
38759G94025k94759n5512J90542K48236J44589j2220j44116k22428j73023J35787
38749F11121O02106P19643J32007o66479p60016p3967M33821J36150l90295l53664
38739C90427L0597L3447l33317m18326o6272K06513J44612P3622J91449K46922
38729D99674J05260J2386Q0290P1658p5426n6338K01811K82999n7289m60858n28280
38718G5887l37835p3503L23361P09435N45924k41408p50620k29659P01810Q46027
$$ y = [23746, -214332, -25360, 90711, -338851, -717849, -330571, 388746, 558998, 287425, 353688, 809507, 945141, 533594, 164302, 284119, 662210, 898573, 851356, 509168, 3645, -223340, 169768, 793552, 866038, 283791, -184700, 54032, 673716, 978707, 794025, 499266, 443754, 634296, 882532, 1027121, 1014901, 870785, 648357, 475334, 611121, 1213227, 1932870, 2064877, 1398398, 638382, 564415, 998236, 1134386, 744091, 390427, 421024, 454471, 121154, -297172, -363444, -156931, -12319, 61303, 252752, 499674, 604934, 617320, 697610, 769268, 693842, 637504, 839315, 1122314, 1065025, 604167, 75887, -261948, -335451, -12090, 697345, 1243269, 1001861, 251241, 21582, 723392, 1569419]
38708A569419J53417l45338k02609l3266k14009k50890J40663L60472l2088m45271
38698G00500j87053L88361M77006P4547j86653r3327M1054O5525N5491r3504m32366
38687H09581n34644l2926O10861O31709J08556k06114q7634j5033j81377k31363
38677H71616p4608q2107l07253l50647j78615k12203m02584j69908M41274N77330
38667A12295o76l70555M0763M68115J81680j79787K18173P69754L68022n90357
38657A017427p00511J57118O10023L3893n29321k02761L38540J51212l73429k60132
38647B42059L75236N46028R946m02679j31710L25658K75804j55149l18869k0044
38637G46280K76613J49542k37798m20942k55356m1088n4084j61974m2158L18350
$$ y = [1569419, 1722836, 1377498, 1174889, 1141623, 927614, 676724, 817387, 1177859, 1145771, 700500, 513447, 901808, 1378814, 1453361, 1266708, 1173381, 1214435, 1279960, 1335451, 1241947, 809581, 274937, 242011, 852872, 1484581, 1593137, 1387023, 1299389, 1284356, 1102979, 871616, 797008, 714901, 407648, 57001, -121614, -333817, -736401, -906309, -465035, 112295, 111619, -258936, -218173, 249942, 431622, 251835, 470008, 1239762, 1607784, 1017427, 316916, 474034, 1084057, 1117950, 588629, 385868, 724408, 875620, 502191, 242059, 617295, 1163323, 1173269, 770590, 638880, 964538, 1240342, 1085193, 766324, 746280, 1022893, 1172435, 934637, 513695, 258339, 217251, 163167, 1193, -40965, 277385]
38627B77385N42889L28637j51437m24162k48437J40087L48830L03341K72845M12445
38617A802423M67738J20748m70636p64319n11658p5279O7438r3320k14652j11536
38607B16947J02523K71154L24412K10693l3969j69008J3118K97951K12181k83700
38597A162302n75719j67317N36326O48634o45n71581l55630K16883K03194m51591
38587F44856q11053l17728M09867N12131P4001j79172j0541J58437M9169j57863
38577C72104l04234m44565m70465j19625M62816O95427L39641j35855k24085j564
38567A69595J84132K36752J99010o698l48175m94977k43496J13532K05422J32388
38557A47485K04743L50685K41279j09056l23784k30920m4210O0649J78857L72915
$$ y = [277385, 820274, 1148911, 997474, 573312, 324875, 464962, 813792, 1117133, 1389978, 1802423, 2270161, 2390909, 1920273, 1155954, 644296, 569017, 636455, 543135, 328483, 216947, 319470, 590624, 915036, 1125729, 1091760, 922752, 935870, 1233821, 1446002, 1162302, 586583, 419266, 955592, 1604226, 1603581, 1032000, 676370, 893253, 1096447, 644856, -166197, -483925, -74058, 438073, 512074, 332902, 322361, 480798, 529967, 372104, 67870, -376695, -847160, -966785, -503969, 191458, 531099, 395244, 171159, 169595, 353727, 590479, 789489, 782791, 434616, -60361, -303857, -190325, 15097, 147485, 352228, 702913, 944192, 835136, 511352, 280432, 236222, 296871, 475728, 848643]
38547H48643M46023K11133j90640m25878l53649j41028r651K5659J07563K73981
38537G92156L61866K28589k5872j71371j32968n0921q3184k33412l40271k05962
38527A38650J53239L77733J32201l30965l47962K21564O87378N10205R4551N0625
38517A687219J52175j79277p10929o96804j83600M0012j71258r6018M66943P17441
38507A025904K11561l47542k90097k616m2148j02650K52703N60730J67688n46490
38497H87043o71571j64137K22173J86406J27960K38537K29111J1426j03112l111
38487I60725M2132p8177j22835K6208J29734k1819k84701l35081k9764L84695
38477F71117M06688j38090o46537l51006N12605Q38838K56412k45432J09531N76705
$$ y = [848643, 1294666, 1505799, 1315159, 889281, 535632, 394604, 384953, 410612, 518175, 792156, 1154022, 1382611, 1356739, 1185368, 1052400, 1001479, 918295, 684883, 344612, 138650, 291889, 669622, 801823, 470858, 122896, 344460, 1031838, 1542043, 1636594, 1687219, 1839394, 1660117, 949188, 252384, 68784, 108796, -62462, -158480, 308463, 1025904, 1237465, 889923, 599826, 597210, 555062, 452412, 705115, 1265845, 1433533, 887043, 215472, 51335, 273508, 459914, 587874, 826411, 1055522, 1066948, 963836, 960725, 1002857, 924680, 801845, 828053, 957787, 935968, 651267, 316186, 286422, 671117, 1077805, 939715, 293178, -57828, 454777, 1293615, 1550027, 1304595, 1414126, 1990831]
38467A990831J32530p12505o53338K45958N96871q0275o19929j45738N25709K16674
38457A496788p66837j105562l56156N56047O93760K26834m8742J47790L61134
38448A205056K22720J6853J52339M06329K28104l17730n65310k86590j0104o2466
38438I89201m9141K87905M56949O9016l83035l19620l4301o8175k14550m4006
38428F90243J26907j83547n37136k09548M32883M12285k06554m15604L3975L26777
38418D70681Q5608j10086L3722J7778l10497k99394K74742O08579J79476l11960
38408F38649q4571M48374M08302j49225m45676k18485N8967L6382q2389L3462
38398F43790L79232O06243L50236l15828p74837n17640J28707L72322N5319j91592
$$ y = [1990831, 2123361, 1410856, 757518, 1003476, 1600347, 1520072, 900143, 754405, 1280114, 1496788, 729951, -375611, -731767, -175720, 518040, 744874, 696132, 843922, 1205056, 1427776, 1444629, 1596968, 2003297, 2231401, 1913671, 1348361, 1061771, 1051667, 989201, 940060, 1227965, 1684914, 1753930, 1370895, 1051275, 1016974, 948799, 734249, 690243, 817150, 633603, 96467, -113081, 319802, 732087, 525533, 109929, 143904, 470681, 556289, 446203, 479925, 497703, 187206, -112188, 162554, 771133, 950609, 638649, 554078, 1002452, 1410754, 1261529, 815853, 597368, 656335, 692717, 610328, 643790, 1023022, 1629265, 1979501, 1663673, 888836, 371196, 499903, 872225, 927544, 735952]
38388G35952J5895K78514J58473j42878k01925J0465K50149L29037R0141m93800
38378A030023r82455p50994J06531O78462L88481k32302l20285J91941O55633
38369G65035O07265J75991k29700l34203j91543j03247k22662k90476k4474L61432
38359E13418M59433L52481M04594M57280P993p36514q61438j10212N78468L94344
38349A459847k03995l04534Q2799K28332q2233l12175j27964Q7512j11882m94921
38339B20786m35287J53404N47360J48253n48760m97806L53465Q38204K77754m25853
38329F31520j84813N30724M79917l02596o06069m8408M15964J63763k18570j06316
38319G55116K34651L52272K89555J43573j78153m20770j07978M88704M80101k20043
$$ y = [735952, 751847, 1030361, 1188834, 1045956, 844031, 854496, 1104645, 1433682, 1523823, 1030023, 47568, -703426, -596895, 81567, 470048, 237746, -82539, 109402, 765035, 1372300, 1548291, 1318591, 984388, 792845, 689598, 466936, 176460, 151986, 513418, 972851, 1325332, 1729926, 2187206, 2195199, 1458685, 597247, 487035, 1065503, 1459847, 1255852, 951318, 1034117, 1262449, 1180216, 868041, 740077, 827589, 715707, 220786, -214501, -61097, 486263, 634516, 85756, -412050, -58585, 779619, 1057373, 631520, 446707, 977431, 1457348, 1154752, 548683, 500275, 916239, 1080002, 861432, 755116, 989767, 1342039, 1631594, 1775167, 1597014, 1176244, 1068266, 1556970, 2037071, 1817028]
38309A817028o51956l53332j2654j17759j57572K06132L73576j5189k77782O9768
38299H80260L58085m222l97016j34647K49418J7696l83271j99414J79446q943
38289E57392l60628J8553P83488P68706j10467p54482n92955j53381Q9090K82868
38279E28184N02496M57747Q1650l12768n17618m97677j41590M33814O24205J02673
38269A261116m83535l67582J49951K53477k0133O83L07791K47850k21466m13814
38259G14338r8356K01708J82216J00750N9860j45366l56504j23660M02416N13127
38249A450529O2096k85014j36010R5014J1093j63901j46046j10106k69885m33696
38239G4074l16157N1432M27929N98105M42677O6666j83571j37005p3839k31402
$$ y = [1817028, 1165072, 811740, 799086, 681327, 523755, 729887, 1103463, 1088274, 810492, 880260, 1238345, 1234123, 837107, 702460, 951878, 969574, 586303, 386889, 566335, 557392, 196764, 215317, 998805, 1767511, 1657044, 902562, 309607, 156226, 245316, 528184, 1030680, 1488427, 1570077, 1257309, 739691, 242014, 100424, 534238, 1158443, 1261116, 777581, 409999, 559950, 813427, 793294, 793977, 1101768, 1349618, 1128152, 714338, 615982, 817690, 999906, 1100656, 1160516, 1015150, 658646, 534986, 937402, 1450529, 1512625, 1227611, 1091601, 1186615, 1197708, 1033807, 887761, 777655, 507770, 74074, -242083, -190651, 237278, 835383, 1278060, 1344726, 1161155, 1024150, 950311, 718909]
38229G18909l24679n7432K27881P4106k19864m8070M01019L87405j18846l42553
38219F97876O7764N75200O48300L35427j72459p60584j025067n10120M38400Q17568
38209A112305K78581l80581l53117J72730M99491L60379k414k82074l18868j75274
38199I11158j54552m29610o47475l46849K52451M50713J09437j40102J14039M81889
38189F01099M34954L3259k94340k93449J0795L96093M89438R9133m00263m08690
38179F68029Q3963M36042K15707k76621m78057k09254K66647N51077M08387k9583
38169A636337l78745m67085m82965m93148k31682K88347M83212P8452k55419J10923
38159B88227O51020M79203j66864l38485J3385O4785l36412m33549J4004L15605
$$ y = [718909, 394230, 336798, 564679, 638785, 418921, 370851, 771870, 1159275, 1040429, 697876, 765640, 1340840, 1989140, 2324567, 2152108, 1391524, 366457, -143663, 294737, 1112305, 1390886, 1010305, 657188, 829918, 1329409, 1689788, 1687374, 1405300, 1086432, 911158, 756606, 326996, -320479, -667328, -414877, 35836, 145273, 5171, 119210, 601099, 1036053, 1069312, 774972, 481523, 492318, 888411, 1377849, 1476982, 1076719, 668029, 751992, 1188034, 1403741, 1127120, 649063, 439809, 706456, 1257533, 1665920, 1636337, 1257592, 790507, 307542, -185606, -417288, -128941, 354271, 432723, 177304, 288227, 939247, 1418450, 1251586, 913101, 926486, 991271, 654859, 221310, 235314, 550919]
38149E50919J38239M0569L32350M94855K10122m1289P3693J37778j37361l33657
38139A466218j96620j90504n42301n96650J03955Q39913O78968j26531n53157
38130H83291k48741K01051K25482j32525m46956l32023K10783O49155M16903l03459
38120A122961p29340n26978j27662J46382M98554Q87210P01458k17548r73078
38111G81959p41051N9279M25555J42496j98536j81160R2296L68402M05805L1952
38101A186997n14454o24026j19137L81637L37897N8704Q4928K93852K59363Q3992
38091A429753J49107L26848J66642k96530n76494m86635k88936j61533k0407J64552
38081D06367K81226K65030J11491j45786k70287L0983N31455N21709j63690o69486
$$ y = [550919, 689158, 729727, 1062077, 1556932, 1767054, 1725765, 1799458, 1937236, 1799875, 1466218, 1269598, 1079094, 536793, -59857, 44098, 884011, 1562979, 1436448, 883291, 634550, 835601, 1061083, 928558, 481602, 149579, 360362, 1009517, 1426420, 1122961, 393621, -133357, -261019, -114637, 383917, 1271127, 1972585, 1755037, 781959, 40908, 100187, 525742, 668238, 469702, 288542, 380838, 749240, 1155045, 1186997, 672543, 48517, -70620, 311017, 648914, 707618, 792546, 1086398, 1345761, 1429753, 1578860, 1905708, 2072350, 1775820, 1199326, 712691, 423755, 262222, 241815, 406367, 687593, 952623, 1064114, 918328, 648041, 679024, 1210479, 1732188, 1568498, 899012]
38071H99012k66247M93053N36527j26366m65114o120N50532M72808j265j79725
38061A907095O8636K59810M6527l29401l73702M388L23881J45958k80010l43282
38051A429900j4312R1902k41629l99922K5112M26297J12741m80553m24993J74696
38041F99239L29656j94863m66699J12178Q51334Q42130K38090j81413j85051j14450
38031A930151r4225K4465R3305j98493n97340m39046K61696N92723M7310n85166
38021A035380l12638N11696O26345k77847j096950r17329j80960K14897J99794
38012a97612K25457K78573M7307k64099j50237K90622M42222J37503j55137j24191
38002E30408O0606K43285M56662N53315L04432n8993m8321K50271K17958k88611
$$ y = [899012, 632765, 1125818, 1662345, 1535979, 1070865, 1064745, 1615277, 2088085, 2086820, 1907095, 1975731, 2235541, 2282068, 1952667, 1578965, 1583353, 1907234, 2053192, 1773182, 1429900, 1415588, 1507490, 1265861, 865939, 891051, 1317348, 1430089, 949536, 524543, 699239, 1028895, 834032, 367333, 479511, 1330845, 2172975, 2411065, 2229652, 2044601, 1930151, 1835926, 1860391, 1953696, 1755203, 1157863, 718817, 980513, 1573236, 1620546, 1035380, 722742, 1234438, 1860783, 1582936, 485986, -431343, -612303, -397406, -197612, 27845, 306418, 353725, 89626, -60611, 230011, 672233, 809736, 654599, 530408, 591014, 834299, 1290961, 1844276, 2148708, 2089715, 2041394, 2291665, 2509623, 2221012]
37992B221012o68952n28875k15088j19388r6004P9961K47078K26181J75078K39384
37982A560387K70982J56658R364j48321m12117n78938k98901J97847K37763j75577
37972H19147j78365N73915J136352N55433o85216j271225p45717J31482N28014
37963H63820M08730K55624L38102L91327k0041p83461j111511n15170L42320M40082
37953F09822j04113k43050K84448N64064J21322k65987K5309L62308K1779m93137
37943H82765l32253K40180L58751j961j84077n9387l0567q4155J38268M71174
37933A398738L80454p7062l19635k31541k54057m77563m64909q8852K07931J82618
37923B56122J70205M33835O59751M10381k42016p81704p88756l07030K28978M34607
$$ y = [2221012, 1552060, 1023185, 808097, 688709, 592705, 672666, 919744, 1145925, 1321003, 1560387, 1831369, 1988027, 1997391, 1849070, 1436953, 858015, 559114, 756961, 994724, 819147, 640782, 1214697, 2351049, 2906482, 2221266, 950041, 204324, 335806, 863820, 1272550, 1528174, 1866276, 2257603, 2237562, 1454101, 342590, -172580, 169740, 609822, 505709, 262659, 547107, 1111171, 1232493, 966506, 991815, 1354123, 1375902, 882765, 550512, 790692, 1149443, 1147482, 963405, 904018, 873451, 789296, 927564, 1398738, 1779192, 1702130, 1382495, 1150954, 896897, 419334, -45575, -134427, 73504, 256122, 426327, 860162, 1519913, 1930294, 1688278, 906574, 117818, -189212, 39766, 474373]
37913D74373L68339L40060L46998Q0343m00919n28048p4422L57077J73280l06683
37903H30398l59715M3518K82157P8451j56895l685L91861N49107K45846k12512
37893A688531l18435m718K04265n5005l41122n7579M81299M45831j31218l80245
37883A531604j00420p9088n66162o81408K0166O08858K94216k28981k6385M61572
37873A233972K97252k58877k89033J27677J86923j07944n0295L60172M21914N6453
37863A978214r0025J25129J31391k62532n61981m61160j67903J48756M32234L73807
37853A645930j67219n49806j11548O24408N64792k34432o29680k05557J93431
37844A130319j8293l02617j02972K12357J13167j72961j42020J21974J42882j91281
$$ y = [474373, 842712, 1182772, 1529770, 1610113, 1209194, 681146, 606724, 963801, 1137081, 830398, 470683, 514201, 796358, 874809, 717914, 714229, 1106090, 1655197, 1901043, 1688531, 1370096, 1365378, 1569643, 1514638, 1173516, 1115937, 1597236, 2043067, 1911849, 1531604, 1431184, 1352096, 785934, 104526, 124692, 733550, 1027766, 798785, 772400, 1233972, 1531224, 1272347, 983314, 1110991, 1297914, 1189970, 1139675, 1499847, 1921761, 1978214, 1888189, 2013318, 2144709, 1882177, 1320196, 859036, 691133, 839889, 1272123, 1645930, 1478711, 928905, 817357, 1441765, 2006557, 1772125, 1142445, 936888, 1130319, 1112026, 809409, 706437, 918794, 1031961, 859000, 716980, 838954, 981836, 790555]
37834G90555m93452l72133J31118N45233M64316R8765L5419L13434K89713k45707
37824A557261n52976j44051K95993O8977k46794J57935O84938K20080p80940p87911
37814D72512L19464R88963M41421k81995k15062J24096l3731l70496k83606k1264
37804A140302j00936l42542k98255n6178P7984J81951L97639M89363K60946j8453
37794A731821p1903p6558k46225l70814j97999Q0300J21437n3556j56329m8361
37784G11813J41994J79321n0084l35390l01903K5367J27263k01025l81813P0206
37774a4251O77783P21269L70660K33068K08624j64129n77179l47290K78533M39220
37764A826308J37508J13707L33323J8856p40897q92084j82714L99196L05899J45049
$$ y = [790555, 297103, -75030, 56088, 601321, 1065637, 1164402, 1199821, 1513255, 1802968, 1557261, 1004285, 860234, 1156227, 1225204, 978410, 1136345, 1821283, 2041363, 1260423, 472512, 791976, 1780939, 2222360, 1940365, 1725303, 1849399, 1815668, 1445172, 1161566, 1140302, 1039366, 696824, 398569, 342391, 420375, 602326, 999965, 1489328, 1750274, 1731821, 1659918, 1583360, 1337135, 966321, 768322, 848622, 970059, 916503, 760174, 711813, 853807, 1033128, 983044, 647654, 345751, 371118, 498381, 297356, -84457, -14251, 663532, 1384801, 1755461, 1988529, 2197153, 2033024, 1455845, 1108555, 1387088, 1826308, 1963816, 2077523, 2410846, 2429702, 1688805, 796721, 614007, 1013203, 1319102, 1464151]
37754A464151K91719K09868k83307m60927n7401J31270k53724l56064L16725Q13158
37744A815468K76988n41920m70458K62832N40213O4838m83913n69768k39093K12778
37734H67965M29469K20176p2186L5708K77589j5585n78304m08553M21871N86444
37724A764594l03540q56075j29904P80207N52649l04623n60057k71774k24173
37715D47304k93862R7304O07217N08134M2203p3098M8321j02415k62912O1204
37705A079400M52507K59652j31379l581K82517l0423n51349l72680K03442J58513
37695A346619l41325j99908N78732P84754L4538o36597m69768R4762M70769O50600
37685B313176N94680P8843n44519n27523M6652K58674j80825n16163k67849R3596
$$ y = [1464151, 1755870, 1965738, 1682431, 1221504, 1164103, 1295373, 1041649, 685585, 1002310, 1815468, 2092456, 1550536, 1080078, 1342910, 1883123, 1947961, 1464048, 894280, 655187, 867965, 1297434, 1517610, 1445424, 1481132, 1758721, 1743136, 1164832, 756279, 1178150, 1764594, 1461054, 604979, 475075, 1255282, 1807931, 1503308, 943251, 671477, 447304, 153442, 250746, 857963, 1366097, 1408300, 1335202, 1383523, 1281108, 1018196, 1079400, 1531907, 1791559, 1660180, 1656599, 1939116, 1908693, 1357344, 984664, 1188106, 1346619, 1005294, 805386, 1384118, 2168872, 2203410, 1566813, 1097045, 1191807, 1662576, 2313176, 2907856, 2986699, 2442180, 1914657, 1961309, 2219983, 2039158, 1522995, 1255146, 1348742]
37675A348742J37691J22201K43697J72591k10409m21933j51895K57807M42630
37666A941122M66846M05572J62319r1503o247K37666N9674n08083p37842l54992
37656A574532M6301R881j58543r4802M7725O4228N6971L7381j60625l44519p1388
37645A007142M86663N80951M8321l98656l28881j39814j01327J52498O65689O99823
37635B672409o6413p78895o54528j71234j24288k60837Q4546N99004M39355k62664
37625A476455n37081j18366K56210J50460M14J64423L22715J79365j903K0997
37615A913689o142k70682m04032p7165L43535L06893m7323j13870K29841M89993
37605B364737L59927J02953P054o0262l11761o13287o70158l98303R4966O37055
$$ y = [1348742, 1486433, 1608634, 1852331, 2024922, 1814513, 1392580, 1240685, 1498492, 1941122, 2407968, 2813540, 2975859, 2884356, 2878109, 3115775, 3175449, 2667366, 1929524, 1574532, 1620833, 1630714, 1472171, 1377369, 1425094, 1489322, 1546293, 1583674, 1423049, 1078530, 1007142, 1493805, 2074756, 2123077, 1724421, 1395540, 1255726, 1154399, 1306897, 1972586, 2672409, 2605996, 1827101, 1172573, 1001339, 877051, 616214, 700760, 1299764, 1739119, 1476455, 939374, 821008, 1077218, 1227678, 1228092, 1392515, 1715230, 1894595, 1892692, 1913689, 1907547, 1636865, 1232833, 1155668, 1499203, 1806096, 1758773, 1644903, 1874744, 2364737, 2724664, 2827617, 2834671, 2774409, 2462648, 1849361, 1179203, 780900, 875866, 1512921]
37595A512921R04480N64049j90300n93563k22646L64305M06358L8735n6058J48208
37585B876489L2380m76894o67620k21414K50885K39848Q2567J58237J13078m06526
37575A981030q67721n35836L26992P55714L95004j68363k95150M7673M62128N22156
37565B623627R0302m54653n04214L065M29250L42364Q3464M2950j3723l10445
37555B331987l86542J35834O49928L86594k72435l60447Q3145J58691k61758l10460
37545B154537K91237O42943J24640n76743n45277J9521K39068j55446o15989n94040
37535I84451q2979M98004O59178K39322l59578n24283j34717L14256L80736J86111
37525B160501J33056L55790N94009M86051m7752o27539p27113k96544J35221J67836
$$ y = [1512921, 2417401, 2981450, 2791150, 2197587, 1974941, 2339246, 2745604, 2784339, 2728281, 2876489, 2908869, 2431975, 1764355, 1542941, 1793826, 2033674, 2116241, 2274478, 2387556, 1981030, 1113309, 577473, 904465, 1660179, 2055183, 1886820, 1591670, 1639343, 2101471, 2623627, 2713929, 2259276, 1755062, 1758127, 2187377, 2529741, 2613205, 2656155, 2642432, 2331987, 1945445, 2081279, 2731207, 3117801, 2845366, 2484919, 2568064, 2726755, 2464997, 2154537, 2445774, 3088717, 3213357, 2636614, 2091337, 2110858, 2349926, 2194480, 1578491, 984451, 901472, 1399476, 2058654, 2297976, 1938398, 1414115, 1279398, 1593654, 1974390, 2160501, 2293557, 2649347, 3243356, 3729407, 3681655, 3054116, 2327003, 2030459, 2165680, 2333516]
37515B333516K8688P0749J56472O47k26203k03066p0950j29018k01510J4208K39071
37504B012604K4359l53296k69648J32507J50343k23916k75230J43402L51011P9774
37494A771910p5782K00251L68472P4084j84186m232J74556n0274k17426J61953
37484B219326O07371L76912l11514o32979l97139j08445o553J41847L64900L38827
37474B592553o793l12338l25409j76630m4007O9521J39013L8095k21414m09984
37464A342607l46534r0652J77328L31255L25330J76797j3805r5187k56J28532
37454A935415J3966m26430q27092o79383j3944M87326L20186j48185j92297K57314
37444G26876O00734M92161K36894J92348K64490J83474q6452l84984n24206l32611
$$ y = [2333516, 2362204, 2432953, 2589425, 2590072, 2363869, 2160803, 2089853, 1960835, 1759325, 1773533, 2012604, 2036963, 1683667, 1414019, 1546526, 1696869, 1472953, 1197723, 1341125, 1692136, 1771910, 1696128, 1896379, 2264851, 2338935, 2154749, 2150517, 2325073, 2274799, 2057373, 2219326, 2826697, 3203609, 2892095, 2259116, 1861977, 1753532, 1746979, 1888826, 2253726, 2592553, 2585760, 2273422, 1948013, 1771383, 1727376, 1796897, 1935910, 1974005, 1752591, 1342607, 996073, 905421, 1082749, 1414004, 1739334, 1916131, 1902326, 1807139, 1806883, 1935415, 1949381, 1522951, 695859, 16476, 2532, 489858, 810044, 661859, 469562, 726876, 1327610, 1819771, 2056665, 2249013, 2513503, 2696977, 2610525, 2225541, 1701335, 1368724]
37434A368724J69014N84343M83389K368k61747n2677K28793J53533j61339l22142
37424B192259k15777o0731o7038k12908k83158j00546K05650K74838J9522j43487
37414A608624J46907O04845O49463J92725l36474o06170n76333k48660K57899
37405A692826N13857K24702k21266k12260J90807M20859L25009K10590R2898k67187
37395B970835n97719l15902L78635N49925p2109o37865m84616l1611Q3390m3978
37385A798985l9956L2375j8046n5898K5558K6152o7345J00352N28303O16534J30298
37374C077312k79341q3671K73204J81307j25398j11354P5238k5419k71446j99275
37364B511157J08780J98988K8238j05388j47137j77161l0631L51281N42226K41596
$$ y = [1368724, 1537738, 2122081, 2605470, 2607838, 2346091, 2293414, 2522207, 2675740, 2514401, 2192259, 1976482, 1915751, 1848713, 1635805, 1352647, 1252101, 1457751, 1732589, 1752111, 1608624, 1755531, 2360376, 3009839, 3202564, 2866090, 2259920, 1683587, 1434927, 1692826, 2206683, 2431385, 2210119, 1997859, 2188666, 2609525, 2934534, 3145124, 3238022, 2970835, 2373116, 2057214, 2435849, 2985774, 2913665, 2275800, 1791184, 1759573, 1842963, 1798985, 1759029, 1791404, 1773358, 1717460, 1743018, 1769170, 1701825, 1802177, 2330480, 2947014, 3077312, 2797971, 2714300, 2987504, 3168811, 3043413, 2932059, 3007297, 2981878, 2710432, 2511157, 2619937, 2818925, 2847163, 2741775, 2594638, 2417477, 2386846, 2738127, 3280353, 3521949]
37354C521949j32611j33760q2579l69401n01474J04447Q12465N17331m91337p80923
37344B464107L4484P29111M26273j91327k34013M782j42503m38801k66892J70524
37334B555745J63177l24388o51443n06035j66167J35824M27415O03685M42612
37325B680425P2053r3789L2734J03980p6599k70162k20485j83J89299K61520J80233
37314B859026n8345k71081k03637Q5543K44773J41115J9634Q148j26367m46997
37304B251812m88199J03538Q47343R10897K20487m55569n45690k70109q5600m1744
37294B447166O1712K59829M49245N69506N41115K68399j14977k73973j33759k5163
37284D049100j61509k87405j22886J43795J50358q2833k47029k31045j72053j35361
$$ y = [3521949, 3389338, 3255578, 3172999, 2803598, 2302124, 2406571, 3219036, 3736367, 3245030, 2464107, 2498591, 3227702, 3653975, 3462648, 3228635, 3233417, 3090914, 2652113, 2385221, 2555745, 2718922, 2394534, 1743091, 1237056, 1070889, 1206713, 1634128, 2237813, 2680425, 2752478, 2658689, 2691423, 2795403, 2718804, 2448642, 2228157, 2227974, 2417273, 2678793, 2859026, 2800681, 2529600, 2325963, 2411506, 2656279, 2797394, 2817028, 2825176, 2698809, 2251812, 1763613, 1867151, 2714494, 3625391, 3845878, 3390309, 2844619, 2574510, 2488910, 2447166, 2508878, 2768707, 3217952, 3787458, 4328573, 4596972, 4481995, 4208022, 4074263, 4049100, 3887591, 3600186, 3477300, 3621095, 3771453, 3688620, 3441591, 3210546, 3038493, 2903132]
37274B903132n4725P3090J76938K36711K55592K06655J24306R7706R1144j3160
37264D097389j37410p8299Q3046L4798k08547k75293r2541j2205r6507N5659M73707
37253C843797N49817M8222l78382k38460L171j51837l18410o1189J46872j93761
37243C249840m92976p869P17277O47990Q779j68496J18623k0804n85923o38682
37233B827759p9298J31774k46488k96869L18132O82659K53955k27929j20631J14879
37223C357943J0905k7655K61732K73394k74242n08336K05962R85635O75647l53091
37213D607894p96712k98380L39148M84380K57911k9515k28180k34069p7985M212
37203D028704o1389m2959J11999J13286p6237o9675K07199K95831P9508P4694
$$ y = [2903132, 2848407, 2921497, 3098435, 3335146, 3590738, 3797393, 3921699, 4019405, 4110549, 4097389, 3959979, 3881680, 3964726, 3999524, 3790977, 3515684, 3423143, 3410938, 3314431, 3370090, 3843797, 4393614, 4441836, 4063454, 3824994, 3828165, 3676328, 3357918, 3296729, 3443601, 3249840, 2756864, 2748995, 3466272, 4114262, 4123041, 3954545, 4073168, 4052364, 3466441, 2827759, 2748461, 2880235, 2633747, 2336878, 2655010, 3337669, 3591624, 3363695, 3243064, 3357943, 3368848, 3341193, 3602925, 3876319, 3602077, 3093741, 3299703, 4285338, 4960985, 4607894, 3811182, 3512802, 3851950, 4336330, 4594241, 4564726, 4336546, 4102477, 4024492, 4028704, 3967315, 3924356, 4036355, 4149641, 4073404, 4003729, 4210928, 4506759, 4586267, 4660961]
37193D660961L93618L35329l44866p17937j15697N98052K97877n51388n81037
37184C974912L35573R09421L47661o66557j054440n68626K49924P45410O29842
37175D903120J78724l5296J71670L87526K94922J30132J06875o2671n42329q14101
37165D718572m19837J95231L08827J0683q0638J42778K95865K93153L47449L70665
37155F182748J19689k13148k53726j26684j91016k86977j0119M06110L19622k19479
37145E727020m33096j5895L93614K08988k72491l91035k6208L84102M53275J82356
37135F210630j62469l02405j39554J81016L89977K94613o9527l90627k81567K47397
37125E977484O06650K69278m40578o55776j18078M88181N10286J11527j72630
$$ y = [4660961, 5054579, 5389908, 5045042, 4327105, 4211408, 4809460, 5107337, 4555949, 3974912, 4310485, 5219906, 5567567, 4901010, 3846570, 3277944, 3527868, 4273278, 4903120, 5081844, 5046548, 5218218, 5605744, 5900666, 6030798, 6137673, 6075002, 5532673, 4718572, 4298735, 4493966, 4802793, 4813476, 4732838, 4875616, 5171481, 5464634, 5812083, 6182748, 6302437, 6089289, 5835563, 5708879, 5517863, 5230886, 5220767, 5626877, 5946499, 5727020, 5293924, 5278029, 5671643, 5880631, 5608140, 5217105, 5190897, 5574999, 6028274, 6210630, 6048161, 5745756, 5606202, 5787218, 6177195, 6471808, 6402281, 6011654, 5730087, 5977484, 6584134, 6853412, 6412834, 5757058, 5638980, 6127161, 6637447, 6748974, 6576344]
37116F576344j70105k2380K02003M72826O32021N36398K06167k33577n30377l39465
37106G329855K88677O22960R6494o86054o14818K62744P25469J97603m61702l77376
37096G383852J26737K90352M8446k02074k71914j03600L12012N55929R5197o60015
37086G574922n69053M77154J077846L34265p06349n92657M15592R08823M07152
37077I327695k73645m30695k26573r4691j43604k02244n1715L41347O69596O02125
37067I517596K80099Q6567O704j79247k34208J53560M97395J14191n12123k85816
37057I444718N90654P95096J32941j03332N91504J098996P22610K51008J97575
37048A3721770j69680j063165j289621l13758N43500K62351k14474J46096O22726
$$ y = [6576344, 6406239, 6383859, 6585862, 7058688, 7690709, 8227107, 8433274, 8199697, 7669320, 7329855, 7618532, 8241492, 8337986, 7651932, 7037114, 7299858, 8025327, 8222930, 7761228, 7383852, 7510589, 7800941, 7849387, 7647313, 7375399, 7271799, 7583811, 8139740, 8234937, 7574922, 7005869, 7483023, 8560869, 8895134, 8188785, 7596128, 8011720, 8920543, 9327695, 9054050, 8623355, 8396782, 8302091, 8158487, 7956243, 7904528, 8245875, 8915471, 9517596, 9797695, 9884262, 9890966, 9711719, 9477511, 9631071, 10128466, 10242657, 9730534, 9444718, 10035372, 10830468, 10963409, 10860077, 11451581, 12550577, 13273187, 13524195, 13721770, 13552090, 12488925, 11199304, 10885546, 11429046, 11691397, 11476923, 11623019, 12245745]
37039A2245745K98067j45485J60222N41999J66161k47977J88734P66299N14470
37030A4488235L2235K59187O73889M38323R7316M22957Q10339N14342J89084N14239
37020A8440146O79694l0735o20005j35156N07383K99618O6437O44133R44772L3220
37010B0829507o96600J69689J360231J069496J04264K34712J056965J182667R23446
37001B6234377J126073J055973J13396k40522R81711J953083J104958J60361R85986
36992C3475396K062271J544107R77851K133649L175158K194646J311594K663446
36984D9538118L903339K770683K094216M444675O367704M690984L398796O142485
36976H3351000P798392L621536M62186N995821J3276244J2588641J2150958K3365177
$$ y = [12245745, 12543812, 12398327, 12558549, 13100548, 13266709, 13018732, 13207466, 13973765, 14488235, 14520470, 14779657, 15453546, 15891869, 15989185, 16412142, 17222481, 17736823, 17925907, 18440146, 19119840, 19089105, 18469100, 18333944, 18841327, 19140945, 19207382, 19851515, 20796287, 20829507, 20132907, 20302596, 21662827, 22732323, 22836587, 23071299, 24128264, 25310931, 26234377, 27360450, 28416423, 28529819, 28289297, 29271008, 31224091, 32329049, 32489410, 33475396, 35537667, 37081774, 38059625, 40193274, 43368432, 45563078, 46874672, 49538118, 53441457, 56212140, 58306356, 62751031, 69118735, 73809719, 77208515, 83351000, 91149392, 94770928, 95233114, 101228935, 114505179, 127093820, 139244778, 162609955]
36968A62609955K7554950j0778578q6100266j37180876j14015793m0064493J8068002
36961a79907099K9231182J7582424J2690759J3976566R934063L540053L345325
36954h9606727O648854O227695L545532L842687N687605M872394K739202K699136
36946e3343622L442746K336240J101650K183911L559012K508617P60494R88573
36938c6462379J833712J017839m9102P77548K032115J495442M18082Q61208J660394
36929b6415141R37446p3997M80267J344573O52628l10277M29033J621905J094163
36920b0239400j56200J06466J190437R36467k56842m29093K95543M20797J61380
36911a7970445N96411R83674R7129r26038k60079J145366R86115l90760o35769
$$ y = [162609955, 190164905, 179386327, 93286061, -43894815, -157910608, -197975101, -179907099, -150675917, -133093493, -120402734, -106426168, -96492105, -92952052, -89606727, -82957873, -76730178, -73184646, -69341959, -63654354, -58781960, -56042758, -53343622, -49900876, -47564636, -46462986, -44279075, -40720063, -38211446, -37450952, -36462379, -34628667, -33610828, -33659930, -32882382, -30850267, -29354825, -28936743, -28075535, -26415141, -25477695, -25551692, -25071425, -23726852, -23074224, -23384501, -22955468, -21333563, -20239400, -20395600, -20289134, -19098697, -18162230, -18419072, -18848165, -18552622, -18131825, -17970445, -17374034, -16390360, -16293231, -17219269, -17479348, -16333982, -15347867, -15738627, -16374396]
36902a6374396N51601J182066M98164j97695j63635k6048M2049N61558J129800
36893a2796536P28943l19094o56265q6503L52326L52918N69598J023497R92187
36884i838929L91936k30511q19901j490981j556283m45526Q71505J005314K55018
36875a1858358j2272L88498N22280K15090J21841K25470k8464l54615k9718N85383
36865a0224865N45041O5693J25225N80672M11446l13320m57856J84851N69087
36856h514026J76585l59243n01610l39249J18471Q62947J212788N59758l84232
36847g167811m64355N9659M8126m35544l28446L20277L67209k39167k78662M40158
36837g678556N96521k68196q16618j78971N94402L66115l09674l78546m507P6267
$$ y = [-16374396, -15822795, -14640729, -14142565, -14340260, -14503895, -14529943, -14487894, -13926336, -12796536, -12067593, -12386687, -13042952, -13129455, -12777129, -12424211, -11854613, -10831116, -9838929, -9446993, -9677504, -10497405, -11988386, -13544669, -13990195, -13118690, -12113376, -11858358, -11870630, -11482132, -10959852, -10744762, -10622921, -10397451, -10425915, -10780530, -10810248, -10224865, -9679824, -9614131, -9488906, -8908234, -8496788, -8810108, -9267964, -9083113, -8514026, -8337441, -8696684, -9198294, -9537543, -9419072, -8556125, -7343337, -6783579, -7167811, -7632166, -7572507, -7524381, -7959925, -8288371, -7968094, -7600885, -7840052, -8118714, -7678556, -7082035, -7350231, -8166849, -8345820, -7751418, -7385303, -7694977, -8073523, -8078030, -8001763]
36827h001763p9377k9804P7139l2157M00N01408R32762O28002j16945n06553l78630
36816g005518j30202Q9425L72744N54572M08827J23861R651l4683k31870l65924
36806f209117q8275L90124M82251M2836m69208o23448m12396l3861L26291M48356
36796f146447J78537k82505m56332j47342K43316J99331j98124l43695L8869M58742
36786f455650L52566o2394j08705K97926N19577K06143j95630k19635p7334j41354
36776e884490k32369J4915M20690M93679J99055n1036n4190J8088K7462O491m6453
36765e088158j32832r2478J73070M08360K83458j09954l61632k73426n563K28484
36755d970671L54006L84559L70782L26586J30990k98590o89944o19800j52797
$$ y = [-8001763, -8081140, -8110944, -8033805, -8065962, -8065562, -7564154, -6631392, -6003390, -6120335, -6626888, -7005518, -7135720, -7046295, -6673551, -6118979, -5710152, -5586291, -5576640, -5611323, -5843193, -6209117, -6297392, -5907268, -5425017, -5382181, -5851389, -6474837, -6887233, -6921094, -6594803, -6146447, -5967910, -6250415, -6706747, -6854089, -6610773, -6411442, -6609566, -6953261, -6914392, -6455650, -6103084, -6165478, -6274183, -5976257, -5456680, -5250537, -5446167, -5665802, -5743136, -5884490, -6116859, -6101944, -5681254, -5187575, -4988520, -5039556, -5093746, -5075658, -5048196, -5041705, -5088158, -5220990, -5313468, -5140398, -4732038, -4448580, -4558534, -4920166, -5193592, -5199155, -4970671, -4616665, -4232106, -3861324, -3534738, -3403748, -3702338, -4392282, -5012082, -5164879]
36746e164879J40289n409j76974Q574L00215K75809j1605k31751k55169r7405
36736e218305K34563N35525M61048P6516j27259j8205k3864k64537k39046J91779
36726d391785L37742j84539o51726l32370L48832N79989L93445K27125l3720n38737
36716d245744o66357O9179Q48249N69788l71137o69664j55951J72309j8611m5741
36706d513680K76648K75813j75318k97856J60327M25601R8019j67433Q1888L08674
36696c527317P5561j47112N1071K35881N1254m767M46384P57834K54379n50495
36686b357327p03177k48048M2223k9736j6750J88731K29825N5515k082Q4744n432
36675b761514k66065l10316r0885m6301l41109n10534j54897M21245O05468K71511
$$ y = [-5164879, -5024590, -5029999, -5206973, -5198399, -4898184, -4622375, -4633980, -4865731, -5120900, -5218305, -4983742, -4448217, -3987169, -3910653, -4037912, -4056117, -4079981, -4344518, -4583564, -4391785, -4054043, -4238582, -4890308, -5222678, -4873846, -4293857, -3900412, -3673287, -3707007, -4245744, -4912101, -4842922, -3994673, -3424885, -3796022, -4465686, -4621637, -4449328, -4467939, -4513680, -4237032, -3961219, -4136537, -4434393, -4274066, -3848465, -3750446, -3917879, -3835991, -3527317, -3451756, -3598868, -3547797, -3311916, -3260662, -3265429, -2819045, -2061211, -1806832, -2357327, -3060504, -3308552, -3266329, -3296065, -3312815, -3124084, -2894259, -2838744, -2840826, -2756082, -2761514, -3027579, -3337895, -3428780, -3475081, -3816190, -4326724, -4481621, -4060376, -3454908, -3183397]
36665c183397j30267j58764J76902N05407M48372o7566o88786q50362l11686M73899
36655c786248P30417K42741l20313k11584M17066P20043L05817k91202m33250
36646b626513k07734j10748k66684l87623k94931o8148K00432M31715M33593R5669
36636b800972l34512m57853j81371K24595M38339L04779q2239l52692j58404L19716
36626c080614M80153J36729j68807j4956K23527M8996k62333j09776L93273N69740
36616a784068K23658j63653k32234j08237J7553J08646Q7428p7432j47194M3717
36606b031816J67310j31083n33136m58240q679K17187J27481J47328K88944J05117
36596b109587l51163m30127L1567L81659K08617p0963m7661J9148j62159k87346
$$ y = [-3183397, -3313664, -3472428, -3295526, -2790119, -2341747, -2409313, -3098099, -3948461, -4260147, -3786248, -3055831, -2813090, -3133403, -3344987, -2927921, -2207878, -1902061, -2193263, -2626513, -2834247, -2944995, -3211679, -3599302, -3894233, -3962381, -3761949, -3330234, -2896641, -2800972, -3135484, -3593337, -3774708, -3550113, -3111774, -2806995, -2889234, -3241926, -3400330, -3080614, -2600461, -2463732, -2632539, -2647495, -2423968, -2374972, -2637305, -2747081, -2353808, -1784068, -1560410, -1724063, -1956297, -2064534, -2046981, -1938335, -1850907, -1928339, -2075533, -2031816, -1864506, -1995589, -2528725, -2986965, -2995644, -2778457, -2650976, -2503648, -2214704, -2109587, -2460750, -2890877, -2859310, -2477651, -2269034, -2339997, -2387658, -2368510, -2530669, -2818015]
36586b818015o937M03992M44044Q1327l50366n99475n23469o3236M88223N82609
36576b361303J06901l78709l76014n5126J39835J06479J9444n012P2494K20443
36566b510568K15224j01887l69475m8706O44375Q11462J51400n21067m43166O7707
36556b104701K66396N5907j90469l55702m62182k67728L09311O99302L54139l11671
36546b007398l86426K30250O74256L06369n15311r64426o53058P1646M91127K08150
36536b544821l65770m29051J26006M68669L7143n24844k97247M58252O62786R1430
36526b317447l03510J07197P21419P07998J85473j66133j60320j40243k43222
36517a608788k41421m7941J15493J09969P1747J14998J19796m2723k55629k85231
$$ y = [-2818015, -2824952, -2420960, -1976916, -1895589, -2245955, -2845430, -3368899, -3432135, -2943912, -2361303, -2254402, -2633111, -3009125, -3064251, -2924416, -2817937, -2798493, -2803505, -2731011, -2510568, -2295344, -2397231, -2766706, -2815412, -2171037, -1359575, -1208175, -1729242, -2172408, -2104701, -1838305, -1782398, -1972867, -2328569, -2790751, -3058479, -2749168, -2049866, -1695727, -2007398, -2393824, -2163574, -1489318, -1182949, -1698260, -2662686, -3315744, -3244098, -2752971, -2544821, -2910591, -3339642, -3213636, -2744967, -2707824, -3232668, -3529915, -3071663, -2408877, -2317447, -2620957, -2513760, -1792341, -1084343, -898870, -1065003, -1225323, -1365566, -1608788, -1850209, -1898150, -1782657, -1672688, -1600941, -1485943, -1366147, -1408870, -1664499, -1949730]
36507a949730q7666J36859J83708O3191l6406K5423J82324K48845J58433M7850
36497a027169M8564O6170q1845l14890l02823L9115K97071Q0556l57485m23888
36487a976624o7733J40167o7179k06161J28931M97956K47838m14375o61695k38991
36477b617866K58586L20976R8760q1877j78540j88909J1066L08791L16365j4169
36467a766817k02166J0706K09649K2811k03369j4000K80364O6954m61376m78094
36457b535338J80565O77773L73742l07262n95303m20111k24413j14754J73992
36448b791109N99533P05499K89335k73208n31790m47639k22366K4198J95351J44353
36438b307843p2391j30555Q6733K19621j0691k62186p2866L36291L78852R2807
$$ y = [-1949730, -2037396, -1900537, -1716829, -1653638, -1690044, -1664621, -1482297, -1233452, -1075019, -1027169, -978605, -912435, -994280, -1309170, -1611993, -1572878, -1275807, -1195251, -1552736, -1976624, -2044357, -1904190, -1971369, -2177530, -2048599, -1550643, -1302805, -1717180, -2378875, -2617866, -2359280, -2038304, -1939544, -2021421, -2199961, -2388870, -2377804, -2069013, -1752648, -1766817, -1968983, -1958277, -1748628, -1725817, -1929186, -1943186, -1662822, -1595868, -2057244, -2535338, -2354773, -1677000, -1303258, -1610520, -2205823, -2625934, -2850347, -2965101, -2791109, -2191576, -1486077, -1196742, -1469950, -2001740, -2449379, -2671745, -2647547, -2452196, -2307843, -2380234, -2510789, -2424056, -2204435, -2215126, -2477312, -2550178, -2213887, -1835035, -1742228]
36428a742228P2340L76034L29368l10812p89838m47428K71100M98324J43156k22043
36418a822027k81564j53164M5165J99976M8586l97461n64418n9716N98683O64184
36408a721756K73191J14515K47209J28222l05880n09155l03341j09051r7667N2454
36398b231259L96096N17728K86234O8378J4328j12960k44921P821M62547L72093
36388d63915l44417q05989n31505j52603k23729k87870J37949N42342K93173k09095
36378b045659k39653M704p5352k30574J85712Q32891P14804j48023o03859j28567
36368a733576M20333K21343l06881l30835R5199K83549M4805j55052k0077J98509
36358a282683K04864R4822R8666J45774l9431m45358o43190l17108K35977M26529
$$ y = [-1742228, -1669888, -1293854, -964486, -1275298, -2065136, -2512564, -2241464, -1743140, -1599984, -1822027, -2103591, -2256755, -2211590, -2011614, -1963028, -2360489, -2924907, -2984623, -2385940, -1721756, -1448565, -1334050, -1086841, -958619, -1264499, -1773654, -2076995, -2186046, -2283713, -2231259, -1835163, -1317435, -1031201, -962823, -948495, -1061455, -1306376, -1298555, -836008, -463915, -808332, -1614321, -2145826, -2298429, -2522158, -2810028, -2672079, -2129737, -1836564, -2045659, -2285312, -2280608, -2355960, -2586534, -2400822, -1567931, -853127, -1001150, -1605009, -1733576, -1313243, -1091900, -1398781, -1729616, -1634417, -1350868, -1306063, -1461115, -1481192, -1282683, -1077819, -982997, -884331, -738557, -777988, -1223346, -1866536, -2183644, -1947667, -1521138]
36348a521138J50488j11974m6602O5663r7244l15941j95245J70018L54172K59193
36338a288610J50420J27744L7989r8997o1156R6615k87m20786o71570l63554J68471
36327b323721K83634q6861l67879j37636L54129N87843M24196J36785l4099q3677
36317a247286o0067K0546L3137j91569n34493n85026j66416L52203M88519K02757
36307a687695j93210m57606m82118j77066L46114O64386N00225J34417j1750M568
36297a359735r5390j77203O2113L61385J50721m36898n80715l37N44182L25289
36287a206588l62300o93659l63612K38144N83692M31501n6828m20609l37079r576
36277b196914J52204J42210J97456J76165k18582o43872m00689L59784O38453
$$ y = [-1521138, -1370650, -1482624, -1529226, -1463563, -1560807, -1876748, -2071993, -1901975, -1547803, -1288610, -1138190, -1010446, -972457, -1071454, -1132610, -1035995, -1036282, -1457068, -2128638, -2492192, -2323721, -2040087, -2126948, -2494827, -2632463, -2278334, -1690491, -1266295, -1129510, -1163609, -1247286, -1307353, -1286807, -1253670, -1445239, -1979732, -2564758, -2731174, -2378971, -1890452, -1687695, -1880905, -2338511, -2820629, -2997695, -2651581, -1987195, -1486970, -1352553, -1364303, -1359735, -1455125, -1632328, -1570215, -1208830, -1058109, -1495007, -2075722, -2076059, -1531877, -1206588, -1568888, -2262547, -2626159, -2388015, -1804323, -1372822, -1429650, -1850259, -2187338, -2196914, -2044710, -1902500, -1705044, -1528879, -1747461, -2391333, -2792022, -2432238, -1793785]
36268a793785R9506l62807m5924M85850M06842q9804k99611j52606l4071L4764
36258a751646K28805L23550L2584l57270l66451q1529M1748j37785m32047o38383
36248c138424m76570K62444J084821J024363P0307m75646J55648R08712N10613
36239g3732m96085o83583l0881K81840l5081j69862M2296j28839o63995n73249
36229b531171K85147P30533J87049l73463j55846J68247j53908n08670l7875P31321
36219a658636O75692j08434n40819k70780K4263o0174j28352J26283L73835K59790
36209a307332l5784j33248K8600K23484K55648J11002q6948k20958l05635l90956
36199a862127l54923k8025M24108N61764K58694r8269j85918j67045k72407l19962
$$ y = [-1793785, -1694279, -2057086, -2103010, -1617160, -1210318, -1300122, -1599733, -1752339, -1786410, -1751646, -1522841, -1199291, -1166707, -1523977, -1890428, -1971957, -1930209, -2067994, -2500041, -3138424, -3614994, -3352550, -2267729, -1243366, -1173059, -1648705, -1493057, -584345, -73732, -569817, -1253400, -1284281, -1002441, -1037522, -1207384, -1165088, -1293927, -1957922, -2531171, -2246024, -1515491, -1328442, -1701905, -1857751, -1689504, -1843412, -2352082, -2389957, -1658636, -982944, -1091378, -1632197, -1902977, -1878714, -1938888, -2067240, -1940957, -1567122, -1307332, -1343116, -1476364, -1447764, -1224280, -968632, -857630, -944578, -1165536, -1471171, -1862127, -2217050, -2245075, -1820967, -1259203, -1000509, -1098778, -1284696, -1451741, -1724148, -2044110]
36189b044110l8093L81563M78667J60135k05640k73560m3242K34702K71900k9506
36179a107184l81979l09868K46419P14609N54712k7904l62368j91204J04682J38153
36169f21932j7255j08889j33978k53667m40522m58797j85692K12029M65021M63369
36159a080313K81962M0726j58416k13025p8943J42881K82508K61176Q3925k46692
36149f84211o14030o70493j72118N48969Q27283M89292M7184p3697l4034o9173
36139d05028j6624K33671L25619K0902k53208q4357J15178k33111p46283n67466
36129a610707J75927M53108o2528n22484l13880P3780O6656l1148K39725N57873
36119i73678L98100O654k6887J79482J1184n39421p71686l20655L48905O42657
$$ y = [-2044110, -2082203, -1700640, -1221973, -1061838, -1267478, -1541038, -1584280, -1349578, -1077678, -1107184, -1489163, -1799031, -1552612, -838003, -283291, -311195, -673563, -864767, -760085, -621932, -639187, -748076, -882054, -1135721, -1576243, -2035040, -2220732, -2008703, -1543682, -1080313, -798351, -757625, -916041, -1129066, -1208009, -1065128, -782620, -521444, -437519, -684211, -1298241, -1968734, -2140852, -1591883, -764600, -275308, -228124, -301821, -335855, -405028, -421652, -187981, 137638, 158540, -94668, -179025, -63847, -296958, -1043241, -1610707, -1434780, -981672, -1044200, -1566684, -1880564, -1806784, -1740128, -1771276, -1531551, -973678, -575578, -568924, -595811, -416329, -405145, -944566, -1716252, -2036907, -1688002, -1045345]
36109a045345N17254K54047l4908l73115o23070n48959j65704J84438K01932j8304
36099a651734j43577p3973l6686j50195j83598M0971K94005L19201L01085M97079
36089g87422O27127K29066m77944p60187m38214j06485j48119k24141J1253L59810
36079a715256N59931O59329N53887j08706j053919j182734l0421J202297J056035
36070e9557j38329p02849J3383Q28699N27120n23954j079861o64280J18528N47219
36060a133881M72337J59825j09908k37149l06913m23791m94093k95861J52368
36051b217066M81546M08261J29189M0366J55367J16188j78390l01329R7443O43292
36041f25133N99205j28791p59066n92693J23977N87144M35067j5887l65771m98850
$$ y = [-1045345, -528091, -274044, -308952, -682067, -1305137, -1854096, -2019800, -1835362, -1633430, -1651734, -1795311, -1869284, -1905970, -2056165, -2239763, -2198792, -1904787, -1585586, -1284501, -787422, -160295, 68771, -409173, -1169360, -1607574, -1714059, -1862178, -2086319, -2075066, -1715256, -1155325, -495996, 57891, -50815, -1104734, -2287468, -2317889, -1115592, -59557, -197886, -900735, -887352, -58653, 468467, -55487, -1135348, -1799628, -1681100, -1133881, -661544, -501719, -611627, -848776, -1155689, -1579480, -2073573, -2369434, -2217066, -1735520, -1327259, -1198070, -1157704, -1002337, -886149, -1064539, -1365868, -1268425, -625133, -25928, -154719, -913785, -1506478, -1382501, -795357, -360290, -376177, -741948, -1240798]
36031a240798l84149P318M46999N06624R7764l21737l01068N0210K63189J00260
36021g75388k41957m05436k02064K32463N15088L48745j35312m67387l43978M1576
36011a433650K30493R212l37635l00386K42649P25895M81969l15067p15124k44908
36001a656552M04114M10436L8330P5119M33193L02122m06916q29447n20119n2791
35991a802511O8806J38882M31556N67701K94320P0151J93784J33058m74854q93699
35981a272806l48436N56958O04252j94271o70893l08184J68175J21141j17818
35972a461882l9700K15120K77392J86880J52921R9958j38324m35109m92041k01347
35962a836132K59486N60385M36514k6586l76595l11834r8832j32676k40551N8353
$$ y = [-1240798, -1624947, -1617629, -1170630, -664006, -566242, -887979, -1189047, -1138837, -875648, -775388, -1017345, -1422781, -1624845, -1392382, -877294, -528549, -663861, -1131248, -1475226, -1433650, -1203157, -1193945, -1531580, -1831966, -1589317, -863422, -381453, -696520, -1411644, -1656552, -1252438, -842002, -803672, -728553, -295360, 6762, -400154, -1229601, -1749720, -1802511, -1733705, -1594823, -1163267, -595566, -301246, -231095, -37311, 95747, -379107, -1272806, -1621242, -1064284, -460032, -654303, -1325196, -1633380, -1465205, -1344064, -1461882, -1501582, -1286462, -1009070, -822190, -669269, -569311, -707635, -1142744, -1634785, -1836132, -1576646, -1016261, -579747, -606333, -982928, -1294762, -1393594, -1526270, -1766821, -1708468]
35952a708468O49215Q08334K54742l62435l46712J23869L54876J09723k10274
35943c27130k30484n1562J1699j14068k05891p8270J47920J88114k9967k75179
35933i64818l32369k40231j31146m1903j0827j21626k69424j55291K38607M60420
35923a568608J99757k03994k62555n6451L9802P3110L24923N90705L81127j72230
35913f54414l60714J7952L24081O6756m11386n65344l98083j98508j1418K17777
35903a973301L51468K96464K12878J85334N2006j54939o5087L50209M61962j06742
35893c89748p07538m99721K61259N63297J22356l09841j74683J75875K42574J32437
35883e83733J31659J06889j39363l29533j07390K78259K78290p6183j92008J42374
$$ y = [-1708468, -1059253, -250919, 3823, -358612, -705324, -581455, -226579, -116856, -327130, -557614, -609176, -597477, -711545, -917436, -995706, -847786, -659672, -689639, -964818, -1297187, -1537418, -1668564, -1710467, -1721294, -1842920, -2112344, -2267635, -2029028, -1568608, -1368851, -1572845, -1835400, -1891851, -1852049, -1778939, -1454016, -863311, -482184, -654414, -1015128, -997176, -673095, -606339, -1017725, -1583069, -1981152, -2179660, -2191078, -1973301, -1621833, -1325369, -1112491, -927157, -875151, -1030090, -1095177, -744968, -283006, -389748, -1097286, -1597007, -1335748, -772451, -650095, -959936, -1134619, -958744, -716170, -583733, -452074, -345185, -484548, -814081, -921471, -643212, -364922, -441105, -633113, -490739]
35873d90739M07920J75690k19020k26858K9722l9774n06687p14135k17969N26126
35863a275724P53330L67659p9343k11475j53994p2382Q9999K61766J24887l34858
35853e30135n64777j71624L97785M42493O5756j4475L29880L87924k09102p89873
35843f56148o14578J2443K27345j57343n56310n28110j44569M00101Q80640Q46366
35833b90163Q1490p37968o49150K07985O48040J49875l91832j10815N07025M90513
35823i5000j13613m93483l64641j06706Q5392L04508L83911R7240k20814o5926
35813e89132L34394L28894n9379k26130r5321j50932l54892j30875L96844L08586
35803b37943n64296j113446n79613K94329M82902J73306J57273M25028L50005
$$ y = [-490739, -82819, 92871, -126149, -353007, -323285, -363059, -869746, -1583881, -1801850, -1275724, -522394, -154735, -234078, -445553, -599547, -671929, -581930, -320164, -195277, -530135, -1094912, -1266536, -868751, -426258, -360502, -374977, -45097, 342827, 133725, -656148, -1270726, -1258283, -1030938, -1188281, -1744591, -2272701, -2417270, -2017169, -1136529, -290163, -208673, -946641, -1595791, -1387806, -739766, -589891, -981723, -1092538, -585513, -95000, -208613, -702096, -1066737, -1173443, -1088051, -783543, -399632, -302392, -523206, -589132, -254738, 74156, 14777, -211353, -306674, -457606, -812498, -943373, -546529, -237943, -802239, -1915685, -2495298, -2200969, -1718067, -1544761, -1387488, -962460, -612455]
35794f12455j42520m94451l86995j435L90527N57738L13149j31748j86945K68799
35784d26336N37672J31473m20271m51826k35855l33861m49601K1315P09199P00719
35774b17372M7597l22888j46915q8980l67117l14952L38350Q32200N47484o1573
35764B45834k92065k19951k72740l62201j39109K43128K68101j71110o06112n71472
35754a877697q1575M33375N42854K44413j4857J06651L60102K63299j55728l96590
35744e75753k61428j10150k22514l52275j42587L33725O79024O32305K94076R800
35734B84223L8595K31494J69246k22810m66061k29335R4209k4102l90652m27022
35724i42215j35519k0616j61789j16197K39886M85375L59076O5020j86613l52325
$$ y = [-612455, -754975, -1249426, -1636421, -1637856, -1247329, -689591, -376442, -508190, -695135, -426336, 111336, 242809, -177462, -629288, -865143, -1199004, -1648605, -1627290, -918091, -217372, -169775, -492663, -639578, -728558, -1095675, -1410627, -1072277, -240077, 307407, 245834, -46231, -266182, -538922, -901123, -1040232, -797104, -529003, -700113, -1306225, -1877697, -1959272, -1525897, -983043, -738630, -753487, -646836, -286734, -23435, -179163, -575753, -837181, -947331, -1169845, -1522120, -1664707, -1330982, -651958, -19653, 274423, 284223, 322818, 554312, 723558, 500748, 34687, -194648, -100439, -124541, -515193, -942215, -1077734, -1098350, -1260139, -1376336, -1136450, -651075, -291999, -226979, -413592, -765917]
35714g65917k84641O9690K70469p5956m73908j36025O21916O64879j64735p28936
35704a003164m07959o8k30437n43059k00115M28081O18563M94093M73822K77307
35694i2936m31675j013054o39685K73763N84424J29554j91407O2837L62110K76534
35684f79535O7654r89j02678l13188l22072J3956L56250L86094J99142Q127j53276
35673e40515k56263j70077Q0343K29589J11376j13924j78359o398K52492L79281
35663b12455K75579P2203j2299M7680Q8627M8538J1823m6009k19467l49471j77926
35652d73177J06809K4222l65231m29646n7K98968J06180r1149Q0124J93230l8090
35641e87817l4559N47840Q71938K09090o01111l52936M64832M00754n06692p65406
$$ y = [-765917, -1050558, -980868, -710399, -786355, -1260263, -1396288, -774372, -109493, -274228, -1003164, -1411123, -1411191, -1641628, -2184687, -2384802, -1956721, -1338158, -844065, -370243, -92936, -524611, -1537665, -2177350, -1903587, -1319163, -1189609, -1381016, -1318179, -956069, -679535, -611881, -612870, -715548, -1028736, -1350808, -1336852, -980602, -594508, -395366, -387239, -540515, -796778, -966855, -886512, -656923, -545547, -659471, -837830, -844228, -591736, -212455, 63124, 135327, 123028, 170708, 259335, 307873, 319696, 273687, 54220, -295251, -473177, -366368, -342146, -707377, -1137023, -1137080, -838112, -731932, -823081, -742957, -549727, -587817, -622376, -74536, 797402, 1006492, 405381, 52445, 517277, 918031, 411339, -354067]
35631c54067N6517O33173J03361o51324o44646k64498k19632k19445K47457P41308
35621e71796N57225o2921l73136k71316j42764j9257K62377M42162J86966k30548
35611b23008l18845j46312o6077K440K89179M81141J24257m79853n98751j98023
35601a133852N3522j09597k41324p9476L6640j04135j27324K70083P21476O76848
35591c7139J51483l77130n70232m10684r513M31561O02267L61283q408j00411
35581C3077N9760L9462l40070o47358l84014K76209O25767L09651k53612m64268
35571g45396k51938K6076J22634L1393j88858l53997j25547N14214R29995N16529
35561D75105l76804q01261m64043L2666K44243L86968N75124M05428k24019o26859
$$ y = [-354067, -297550, 335623, 438984, -212340, -856986, -1121484, -1341116, -1560561, -1313104, -571796, -14571, -77492, -450628, -721944, -864708, -883965, -621588, -179426, 7540, -223008, -541853, -688165, -754242, -751802, -462623, 18518, 142775, -337078, -935829, -1133852, -1080330, -1189927, -1431251, -1510727, -1474087, -1578222, -1705546, -1435463, -713987, -37139, 114344, -262786, -833018, -1243702, -1253215, -821654, -219387, 141896, 133488, 33077, 92837, 132299, -207771, -855129, -1239143, -962934, -337167, -27516, -281128, -745396, -997334, -971258, -848624, -817231, -1006089, -1360086, -1485633, -971419, -41424, 475105, 98301, -702960, -1167003, -1134337, -890094, -503126, 71998, 477426, 253407, -373452]
35551c73452l01518K01182R7749m09414n06256k7559M48617N66348M84065L05422
35541D85184l8090l40058k43133J19777K14128q1238l09145j81125N1745J08722
35531b13233O0282L1833l9294j75421k36836j57627k0476J24994K22730P7158
35521c25890l46080o11919l13841K28173L60017R3055O688J90222J30449k33739
35511h22865k80837J58155L69389m0117l92334o3573M31878L16609j34732j06743
35501e65170L78669N85477L03408N587j01544k59001m13436k05529K00779J43006
35491G2246m57328q11502l90518L16649N44057K11593k28959m56372m06667j08171
35481a714972K34712K74780l0496k37875K0291M91627O01971J69255m08923o14492
$$ y = [-373452, -674970, -473788, -376039, -785453, -1291709, -1319268, -870651, -304303, 179762, 485184, 447094, 107036, -136097, -16320, 197808, 116570, -192575, -373700, -321955, -213233, -152951, -121118, -160412, -335833, -572669, -730296, -750772, -625778, -403048, -325890, -671970, -1283889, -1597730, -1369557, -1009540, -916485, -909797, -719575, -589126, -822865, -1103702, -945547, -576158, -616275, -1008609, -1072182, -640304, -323695, -458427, -565170, -186501, 398976, 702384, 707971, 606427, 347426, -66010, -271539, -70760, 72246, -385082, -1196584, -1587102, -1270453, -726396, -514803, -743762, -1200134, -1606801, -1714972, -1480260, -1205480, -1235976, -1473851, -1453560, -961933, -359962, -190707, -599630, -1214122]
35471a214122l18490J31368L02516J75799J08063J99870M5108n31042q73997l12876
35461b287803O58695Q85888K26432k54138K1871L01615j18482o55545m25390K75968
35451a370889M79902P6258j88414k1513Q8393j54059l98258k95820M7521L77080
35441a359799N29309L57407q1070l27487n4478L20542J80402k64905k62931K21177
35431g41833M19406N1988k26531K6413L46306K75283J41305L09947L81679j04162
35421H79801p11382o88684j63208P5545j96695m23248k50371R270K7958l0098
35411a471112J05090L43222M11559K41103q468j39037l4074K51244M60945L48572
35401E09044m1082m21842n94496n83200m54395j85034K09549N30758N11318J16153
$$ y = [-1214122, -1532612, -1401244, -1098728, -922929, -814866, -614996, -569888, -1100930, -1974927, -2287803, -1629108, -743220, -516788, -770926, -749055, -447440, -565922, -1221467, -1646857, -1370889, -890987, -814729, -1003143, -1024656, -936263, -1090322, -1488580, -1784400, -1736879, -1359799, -830490, -473083, -554153, -881640, -936118, -615576, -435174, -700079, -963010, -741833, -322427, -270439, -496970, -470557, -124251, 151032, 292337, 602284, 983963, 879801, 168419, -520265, -683473, -607928, -804623, -1227871, -1478242, -1468972, -1441014, -1471112, -1366022, -1022800, -611241, -370138, -378606, -517643, -551717, -300473, 160472, 509044, 467962, 46120, -548376, -1131576, -1585971, -1771005, -1561456, -1030698, -519380, -403227]
35391d03227l17677l66280j5433K70038J36542j63346j58991J01981J62227l0040
35381g84206O681M28064O66471K71690l30614m22979j0834K78645J14654k30741
35371a3169m00274l26546j18180P1232Q6326m5386o1094J58768L29057J63679
35361a55587j69020l32604l28203l08901j41895L22776P30832N65956n6548n09540
35351c82734n31289m04534k84912j2089L23788L12750n4160k18122R2107M03519
35341g55676K59372p5351j01525J42919K68870J73813L4892r0004k20359k13324
35331e76373J7897K15129J11283r7162m1181J78729J23829k32140l87766p7128
35321g64883K91803K21969j53694k69822Q5408M98235M67024j4366n13043o56474
$$ y = [-403227, -720904, -1087184, -1102617, -832579, -696037, -859383, -1018374, -916393, -754166, -784206, -777525, -349461, 317010, 588700, 258086, -164893, -175727, 102918, 217572, -13169, -413443, -739989, -858169, -786937, -700611, -745997, -807091, -648323, -319266, -155587, -324607, -657211, -985414, -1294315, -1436210, -1113434, -382602, 183354, 126806, -382734, -914023, -1318557, -1603469, -1615558, -1291770, -979020, -1033180, -1251302, -1159195, -755676, -496304, -571655, -673180, -530261, -261391, -87578, -52686, -142690, -363049, -576373, -558476, -343347, -232064, -329226, -370407, -191678, -67849, -299989, -687755, -764883, -473080, -251111, -404805, -674627, -589219, -90984, 376040, 361674, -151369, -807843]
35311h07843m33882p2116K06194K80331J62553K1342L9995J61676J30640r9537
35301d10647k13502k443K35665J03258k41714k72859R8064L74752K25171q5298
35291a89553k04428k02659k61697k20311J33340N23669M28172j44423n31614k40828
35281i10332L63733M62174j83561q53957p04322J64738P96959N96670N0222o6004
35271b83680J81089J04481m26091p35398l72056K52952N16118L40752J1768k68634
35261f78699l00950J26061P32815P23828j70308j039763q55155J19243P14294
35252f28634M74962O4686M8296J29717j24837n15037n91439l31606j2238K48968
35242a237162M52977M98722L38712J32095k5287k63748n61150n23407N9242O93455
$$ y = [-807843, -1241725, -1313841, -1107647, -827316, -664763, -643421, -603426, -441750, -311110, -410647, -624149, -626592, -390927, -287669, -529383, -802242, -704178, -329426, -104255, -189553, -393981, -596640, -858337, -1078648, -945308, -421639, 6533, -137890, -669504, -910332, -546599, -84425, -267986, -1121943, -1826265, -1661527, -864568, -267898, -217676, -283680, -102591, 1890, -424201, -1159599, -1531655, -1278703, -762585, -421833, -410065, -678699, -979649, -853588, -120773, 603055, 432747, -607016, -1462171, -1342928, -628634, -153672, -88986, -40690, 89027, -35810, -550847, -1142286, -1473892, -1486130, -1237162, -784185, -285463, 53249, 185344, 160057, -103691, -664841, -1188248, -1129006, -435551]
35232d35551P08346J73684k05817r6012O8387j81709o45780p45617k79222L60910
35222a278381O28541L57335q5764j73297J59706L72085K8869m93669m65264P8261
35212h71578L07546j11331m16999M4712O62116M33236l96393o08555J23242P20061
35202a13943L48989l80110m53710O3738L46558J18913j56076j64148q1905q4614
35192e56308j06707j17032j84853k66421k69949k55702k61336j15587K11387L42976
35182a579532O0685j59618K00261P55498O82327K190m34381k61108k3265j31929
35172h88872k49768l5697K59709L30691K97194K88437J64464k8953P680J41089
35162B85974j57722p15066n50054N09557J110209K26541j117418j188109j1464
$$ y = [-435551, 272795, 446479, 240662, 144650, 213037, 31328, -614452, -1360069, -1639291, -1278381, -649840, -292505, -378269, -551566, -391860, -19775, 9094, -484575, -949839, -871578, -564032, -675363, -1092362, -1047650, -385534, 47702, -348691, -957246, -834004, -113943, 235046, -145064, -598774, -535036, -188478, -69565, -225641, -389789, -471694, -556308, -663015, -780047, -964900, -1231321, -1501270, -1756972, -2018308, -2133895, -1922508, -1579532, -1518847, -1678465, -1478204, -722706, -40379, -38189, -472570, -733678, -756943, -888872, -1138640, -1174337, -914628, -583937, -286743, 1694, 166158, 137205, 144885, 285974, 128252, -586814, -1136868, -627311, 482898, 709439, -407979, -1596088, -1607552]
35153a607552Q36255N82995K153j71830j78585k88002j50922L65821O53949K90889
35143C35171k29081k75086l046O3847j08889j92904j22263q1137j11811j43333
35133h68532k04279k92486k57840p7564J6028o3663l4119K83122N67313M27216
35123e04804j3617l12009k95713j23692P8692K96993M35021L58175J05940j46318
35113a21332k91481l12867k05878k3283J10252J48164J59849J45038J1279j77089
35103e57348j92827k4226L5388j40332k66042j11893J10550J34375R1060K03478
35093g17817L15445J73206n5080l2832J37130P0383k40076m37852m00524k92992
35083a481009r7497K98142N66306K19465m56108n33362J88283P42223M14146j65334
$$ y = [-1607552, -771297, -188302, -186149, -357979, -536564, -824566, -975488, -609667, 44282, 335171, 106090, -168996, -172042, -108195, -217084, -409988, -532251, -613388, -725199, -868532, -1072811, -1365297, -1623137, -1700701, -1684673, -1748336, -1782455, -1499333, -932020, -504804, -518421, -830430, -1126143, -1249835, -1171143, -874150, -439129, -80954, 24986, -121332, -412813, -725680, -931558, -954841, -844589, -696425, -536576, -391538, -380259, -557348, -750175, -774401, -739013, -879345, -1145387, -1257280, -1146730, -1012355, -921295, -717817, -402372, -229166, -284246, -317078, -179948, -109565, -349641, -787493, -1188017, -1481009, -1578506, -1280364, -714058, -494593, -950701, -1484063, -1295780, -553557, -139411, -304745]
35073c04745p6787L92429K84498l95573o97446k92686Q3883n6773k39486j3477
35063a316163K55836J45508m8655M6465J27905j53196l86657p5343L62984K22353
35053h18963k10355p1619N52227O73268L8065m49047k20461J51839J17032N5216
35043a82798L56007N16577O945o87537p91190m42926k71325k43008J00501O03720
35033a035034O85570L64041J55239J02590j52807m50327k65645K25719K84218
35024h6436r7399j17586L78202M99355j64034p03727l05814M11180L83521k35334
35014c8072m18305Q8627M68827J42349m62000o23381k60842J02150L3187l26871
35004a294331m37143k9762M56765L75967k15949n86375l59178L1582J62452K55861
$$ y = [-304745, -381532, 10897, 295395, -100178, -797624, -1090310, -1006427, -1063200, -1302686, -1316163, -1060327, -914819, -963474, -917009, -789104, -942300, -1328957, -1404300, -1041316, -818963, -1029318, -1100937, -548710, 124558, 162623, -286424, -506885, -355046, -238014, -182798, 173209, 689786, 696731, 9194, -781996, -1224922, -1496247, -1739255, -1638754, -1035034, -349464, 14577, 169816, 272406, 119599, -330728, -596373, -370654, -86436, -183835, -301421, 76781, 576136, 412102, -291625, -597439, -186259, 197262, -38072, -456377, -367750, 101077, 243426, -218574, -841955, -1102797, -1000647, -967460, -1294331, -1731474, -1761236, -1304471, -928504, -1144453, -1730828, -2090006, -2058424, -1895972, -1640111]
34994a640111N29796N36435j18817q25537o15872L80578R83415N42355k75009
34985e02767n10278j14758K42495J56466j38338k17993Q083K41064J65735j52119
34975h22410l19061j10966K46163M21674L94737K99959R2543k75659n10164k58530
34965h41714K80624M86665J58795j74522m924M05537L50555l51840j035872r38980
34955a665676j05053O68353P66543L85080Q3330l309j45773l94216m75059l15813
34945a201593j61931q2267J24886M07036M14887J73268J51625L93923L12963k37776
34935B95021n03579n6724L49749J4396m13137O564P69343O23144l56987q71158
34925a43368m91793j37136k76757k07202M09419P48470L02683j39760R7196L55476
$$ y = [-1640111, -1110315, -573880, -692697, -1518234, -2134106, -1753528, -770113, -227758, -502767, -1013045, -1127803, -885308, -728842, -867180, -1085173, -1077090, -836026, -670291, -822410, -1141471, -1252437, -1006274, -584600, -189863, 110096, 202639, -73020, -583184, -841714, -561090, -74425, 84370, -90152, -95076, 310461, 661016, 309176, -726696, -1665676, -1770729, -1102376, -335833, 49247, 132577, 129268, -16505, -410721, -885780, -1201593, -1363524, -1445791, -1320905, -913869, -498982, -325714, -174089, 219834, 532797, 295021, -208558, -265282, 84467, 98863, -314274, -307710, 461633, 1084777, 727790, -143368, -635161, -772297, -1049054, -1256256, -846837, -98367, 204316, 64556, 161752, 517228]
34915E17228j01775o39761l28602L26083J51706o85860r12505j94031M57538L89480
34905a020499J02197O2751n9114m67956n94941n5645N38218M79771R6426J80539
34895g38253O74644P67937J86059m04628m15181j17265q7599l11041k91992J18388
34885f18931M69123L48721p4519l48630l28342j92699l6834J87896L63810K42159
34875A1754j10579k75704q2463R3635r8162m07314l29660J55567N67037N58614
34865H2725K51077n1327k05708k61176l06665l07085p4306M53995R01619P47411
34855A230560O3240m44374l82575j99592l59734n03505r9246M65098L40359l70680
34845b60449o30451k6115O17781N22667P022k45830k21492k17208o9023M46727
$$ y = [517228, 415453, -224308, -552910, -226827, -75121, -760981, -1673486, -1867517, -1409979, -1020499, -918302, -855551, -914665, -1382621, -1977562, -2033207, -1494989, -1015218, -918792, -738253, -63609, 704328, 890387, 485759, 70578, -46687, -134286, -445327, -737319, -618931, -149808, 198913, 124394, -224236, -552578, -745277, -782111, -594215, -230405, 11754, -98825, -374529, -456992, -363357, -461519, -868833, -1198493, -1042926, -475889, 82725, 333802, 282475, 76767, -184409, -491074, -798159, -872465, -418470, 483149, 1230560, 1293800, 849426, 466851, 267259, -92475, -595980, -695226, -230128, 110231, -260449, -890900, -917015, -299234, 223433, 230455, -15375, -236867, -454075, -523098, -76371]
34835g6371Q43016M52385m21833p53406k46508K62074Q3063l70501l42604J09890
34825d60795L22696R8264o8614J58349M29865K69683j97225m35591k77005j09664
34815b70037k27627l65541j58090J99934J98804j52960k66801J11419M51801K62103
34805b16995r7345J5671M36261L98112k16936n99318k07137M26870M98516K7456
34795D65155l65122m03322l09157k30623r3660O3380J20463J91674M26870N61025
34785D26683K12168l81131n45451j90757L0279j96280l23609P3016M73145K22710
34775a99227l41860l69328J93405N73294L62150k7016j43387n7979o421n9585
34765g5954k94717p38279r90659n06277N12014J087698O88411n3673k55803N5900
$$ y = [-76371, 766645, 1219030, 797197, 43791, -202717, 59357, 142420, -228081, -570685, -460795, -138099, -39835, -108449, 49900, 479765, 749448, 552223, 116632, -160373, -270037, -497664, -863205, -1021295, -821361, -622557, -775517, -1042318, -930899, -479098, -216995, -314340, -298669, 137592, 535704, 318768, -280550, -487687, -60817, 437699, 465155, 100033, -303289, -612446, -843069, -936729, -873349, -752886, -561212, -134342, 426683, 638851, 257720, -287731, -478488, -448209, -644489, -968098, -895082, -421937, -199227, -541087, -910415, -717010, -143716, 218434, 191418, 48031, -9948, -16369, -75954, -370671, -1108950, -2099609, -2605886, -2093872, -1006174, -317763, -371436, -627239, -571339]
34755e71339K27354N7828l3319J89348L75013J06088n02441q75368n76219J73685
34745a429370O14645K60528m46999o20126p7805M45504L87654R6209J26121L33089
34735c10550K24943j54549l33740k08661j10221j51537q3777J73229L54505K88292
34725c12066J19681K0041j2133k1383l6389j31320k98571l29757q6423K20403
34715h67917L06046K20503J66119J02704p7543j93416p0978J09l16592o72079
34705a403044m02175L69267P18496J93776n39260o20122n7244M62520M62239O9144
34695g46403k45867j32891K68527M12640K5672m19948k91302K81905N87239L42557
34685H2129p1383l41628m99774m58021l9512M22021L27451j62007k15189K90087
$$ y = [-571339, -343985, -286157, -319476, -130128, 244885, 350973, -151468, -1026836, -1603055, -1429370, -814725, -554197, -1001196, -1621322, -1699127, -1253623, -865969, -769760, -643639, -310550, -85607, -240156, -573896, -782557, -892778, -1044315, -1128092, -954863, -600358, -312066, -192385, -172344, -184477, -205860, -242249, -373569, -672140, -1001897, -1088320, -867917, -561871, -341368, -175249, -72545, -150088, -343504, -414482, -414373, -730965, -1403044, -1805219, -1435952, -717456, -523680, -1062940, -1683062, -1740306, -1277786, -815547, -746403, -992270, -1125161, -856634, -443994, -418322, -838270, -1129572, -847667, -260428, 82129, 10746, -330882, -830656, -1288677, -1328189, -906168, -578717, -740724, -955913, -665826]
34675f65826M47009j82160p49772m64317J78940L33643J41721J76230K58533p1211
34665e97210m44222j94361L64988L78859o5528j03634L48481M52763k1467k54856
34655a36187J95101O27852L76316j62019k70699J8498J98181P9498k09862n61313
34645A55366p67636n07518J28732N13322K82992j38366k05814j5377K9885r0255
34635f14669j36323q6095k4334J33204L56867K84361k08369n55817k30222L51902
34625g29495L55155j91998m18518M6039N28156L69211j38083l00500l2685J93299
34615c19419J31193j1192l5960j5518m0996k2985J30259L03986K71886l6971m06070
34604e1787m83145j34033L34512M39410R7308k20826p6102L56189N52275L64462
$$ y = [-665826, -218817, -400977, -1150749, -1615066, -1436126, -1102483, -960762, -784532, -525999, -597210, -1041432, -1235793, -870805, -491946, -557474, -661108, -312627, 140136, 118669, -136187, 58914, 686766, 1063082, 901063, 630364, 648862, 847043, 926541, 716679, 155366, -612270, -1119788, -991056, -477734, -194742, -333108, -538922, -554299, -524414, -614669, -750992, -837087, -861421, -728217, -371350, -86989, -295358, -851175, -1081397, -729495, -374340, -566338, -984856, -938817, -410661, -41450, -179533, -480033, -512718, -319419, -188226, -199418, -235378, -250896, -291892, -314877, -184618, 119368, 391254, 354283, -51787, -534932, -668965, -334453, 104957, 202265, -18561, -94663, 261526, 813801, 1178263]
34594A178263J08335m3978k83745o36199p09282l14936Q0129J1115k04384M1866
34584g72816N79050O24043K5558m40022k47514J29885O5958k51624k63349J9499
34574e31332J52254M2860k7007L998n0973j54103r4418K2561j35245n07409n85330
34563a864144q9123O42302J019800P27817o9082p81651p90881j20342M42536K75148
34553f07620k39023k79482K23561O01752N08665K36764M089k84475m74361j90705
34543e00835L45217L58278k75727o82417l04278K48071K64552N9465K10878L67489
34533I0693j32521q79585p98703J62436Q60382O07539j0100k69681l22812n39797
34523a232149o32137j87650M09444M27134l6788j26679M54936R25587N46148k74283
$$ y = [1178263, 1286598, 1242620, 958875, 322676, -386606, -701542, -621413, -610298, -814682, -772816, -193766, 430277, 455835, 15813, -231701, -101816, -35858, -287482, -550831, -531332, -379078, -336218, -363225, -359227, -410200, -564303, -658721, -636160, -771405, -1278814, -1864144, -1953267, -1310965, -291165, 436652, 367570, -414081, -1204962, -1325304, -882768, -607620, -846643, -1126125, -902564, -300812, 207853, 444617, 448706, 164231, -310130, -500835, -155618, 202660, -73067, -755484, -1059762, -811691, -547139, -487674, -276796, 90693, -41828, -921413, -1720116, -1557680, -697298, -89759, -99859, -369540, -692352, -1232149, -1864286, -2051936, -1642492, -1215358, -1252146, -1378825, -923889, 1698, 547846, 273563]
34513B73563n29243m872M89131K89945k97728o03465n21815l78522k10173J78532
34503a314647N48024L49163l14953n49755R1923Q06596N89205l04979p05680j93922
34493i99025L94512K86460j65661j92543J63426J93345l04379o72915l46907L55262
34483a288425O91357M37173J0233j88637j73293j22493q4906m2837j4931K3619
34473g53140J16651J53193j6660k17684p4185L30331L74811j75388o35134l38073
34463a235278K80742K84991k91865m58602J91001Q26947O07628j61791n77150
34454e33377l32873J31112L46928K34157o924r9232O6728K39741Q9719k56749
34444a20770l36926p7697R9077K9097N6001K81961K45015k43327n97825l43317
$$ y = [273563, -255680, -260552, 228579, 518524, 220796, -382669, -904484, -1283006, -1493179, -1314647, -766623, -417460, -732413, -1282168, -1190245, -383649, 205556, -99423, -805103, -999025, -604513, -318053, -483714, -676257, -512831, -319486, -623865, -1296780, -1643687, -1288425, -597068, -159895, -149662, -338299, -511592, -634085, -718991, -761828, -776759, -753140, -636489, -483296, -499956, -717640, -791825, -461494, -86683, -262071, -897205, -1235278, -954536, -669545, -961410, -1420012, -1229011, -402064, 205564, 43773, -533377, -866250, -735138, -388210, -154053, -160977, -260209, -193481, 46260, 135979, -120770, -457696, -535393, -436316, -407219, -351218, -69257, 175758, -67569, -665394, -1008711]
34434a008711J00317J47987K721J45450L76086K18509j03472k6134K72570J25890
34424B51213l99937n25241m0690L75581K89505O9216M4222n5285m16360o12682
34414a020458k56073L29020N46154K88893q1835k14887J9911M78314P18491L78594
34404A186124k86879o38487n10177l45338l65675k28240K25451N20026K79160
34395a64035j25350j55900Q9067J65955K1342q0387q1073q9058n3205P4238R3669
34384c04737q2733j09008K54454N56326K19156m93759p46457l20084J28168P6948
34374h21726k04237k11418R4689M10133N25554L97286Q2191k03767k36064j28181
34364b95540k09026m27527l01876K88629P10552M05748k31253l58929J18418M79795
$$ y = [-1008711, -908394, -760407, -757686, -612236, -236150, -17641, -121113, -147247, 125323, 251213, -148724, -673965, -714655, -339074, -49569, 19647, 63869, 8584, -407776, -1020458, -1276531, -947511, -401357, -112464, -194299, -409186, -389275, 89039, 807530, 1186124, 899245, 260758, -249419, -594757, -960432, -1188672, -963221, -443195, -164035, -289385, -445285, -356218, -190263, -168921, -249308, -330381, -419439, -472644, -398406, -304737, -387470, -496478, -242024, 314302, 533458, 39699, -706758, -1026842, -898674, -821726, -1025963, -1237381, -1142692, -732559, -207005, 190281, 272472, 68705, -167359, -295540, -504566, -932093, -1233969, -945340, -234788, 170960, -60293, -419222, -300804, 178991]
34354A78991K88000q1428j86905j88335l77626n17018k06957L40835N08862J96463
34344d5118n1662P0935J94735k4203k84350j58695J39232P2866l09816l98242
34334g94318P002L17123J7404n18363m95719K00819Q08183O35604j04934o18685
34324e45884n13560j75167j19548k71679j75315K21881M30919J74919j43962m5607
34314a163003K76097K58774j27495l10420J8035M57258N07473K26367M51m5180
34304I8357p5222j54348j69232r2856m5676p0948n9790N5535J92731K46892J96576
34293A22019N4629j42197k51879j13533J76168K54402m2583l57106k49709J23051
34283d26738J76936k08058m53922j79510J81276J18145n2458K69672Q01011O52060
$$ y = [178991, 466991, 385563, 198658, 10323, -367303, -884321, -1091278, -750443, -241581, -45118, -96780, -25845, 168890, 144687, -139663, -298358, -159126, -86260, -396076, -794318, -787316, -470193, -452789, -971152, -1466871, -1266052, -457869, 177735, 72801, -545884, -1059444, -1234611, -1354159, -1625838, -1801153, -1579272, -1148353, -973434, -1117396, -1163003, -886906, -628132, -755627, -1066047, -1048012, -590754, -83281, 143086, 143537, 98357, 23135, -131213, -300445, -393301, -438977, -509925, -569715, -514180, -321449, -74557, 122019, 176648, 34451, -217428, -330961, -154793, 99609, 57026, -300080, -549789, -426738, -249802, -457860, -911782, -1091292, -910016, -791871, -844329, -574657, 226354, 878414]
34273H78414k19922p88551m71738M0447j7940k98714r8154L58075L30422j34681
34263d22342l11995l4885J42365K4395P1481M20518M84816o7845o38891n24719
34253h57102N8130L12605m4545n04006m76713N9952O22322P41559M15607P2676
34243D00485L4439J05703j06150n50434p27482l43965L21431P66104P24441K56738
34233H81310l32108o06220l24255K38910N14296K56504k41791n48304m75665r4479
34223g31802L46086M92584J78032l03982m72092k44655m7j6923j34517o5187J81643
34212g70860L23744J60439j60140k37918J19858N51974N03712k1399m29495l70114
34202c30199j34096j1577J60130M38533M16836k2670k45800J28660M04030j20974
$$ y = [878414, 658492, -130059, -601797, -561350, -579290, -878004, -976158, -618083, -287661, -422342, -734337, -769222, -626857, -602462, -530981, -110463, 374353, 306508, -332383, -857102, -798972, -486367, -530912, -1034918, -1511631, -1451679, -829357, -87798, 327809, 400485, 434924, 540627, 434477, -115957, -843439, -1187404, -865973, -99869, 624572, 881310, 549202, -57018, -381273, -142363, 371933, 628437, 386646, -161658, -637323, -731802, -385716, 106868, 284900, -19082, -491174, -735829, -735876, -752799, -887316, -952503, -770860, -447116, -286677, -446817, -684735, -564877, -12903, 490809, 469410, 39915, -330199, -464295, -475872, -315742, 122791, 539627, 516957, 271157, 399817, 803847, 682873]
34192F82873q54104p69889p0599K54352J42087L14893O48380K68449o64219q96790
34182i44567j32312M44556J89324k6173M19923O92038P1781o00591k93833M49955
34172B70101M25848l12883p14837m13059m300N1175j24470k71333k07731J36060
34162a165429M52867K81224j69639j24662M58842O43558P8290l11557N6594L29304
34152E29392k27711p70805k84910N82452N82243p8563l09652q0668j58459m41097
34142f57778k32641K06226N9477l81271j46535N32454N32996p4720j05091M98299
34132B31416M24943o21666j183294l69713P35185Q44175K37889j45793j96038
34123d2896k61255k62512n9616M6776j14841j86698K5427J72858R1859J13800
$$ y = [682873, -171231, -941120, -1011719, -757367, -615280, -300387, 347993, 616442, -47777, -944567, -1076879, -632323, -442999, -469172, -49249, 642789, 714570, 113979, -179854, 270101, 695949, 383066, -331771, -744830, -749130, -697955, -822425, -1093758, -1301489, -1165429, -712562, -431338, -600977, -725639, -266797, 376761, 455051, 143494, 200088, 529392, 301681, -469124, -754034, -171582, 410661, 332098, 22446, -58222, -216681, -657778, -890419, -684193, -624716, -1005987, -1152522, -620068, -87072, -161792, -266883, 231416, 656359, 34693, -1148601, -1518314, -783129, 61046, 298935, 153142, -42896, -304151, -566663, -626279, -579503, -694344, -881042, -855615, -682757, -590898, -477098]
34113d77098K77223J25182l20760l65231J25245L26254j51004n23893j66875L47021
34103h03936L12457M6875J17455K74589P6487j74066m9439J16287j04686k92382
34093d80359J14787O78100N30275k49656p70935o28066k41052l8983p952K0173
$$ y = [-477098, -199875, -74693, -395453, -760684, -635439, -309185, -460189, -984082, -1150957, -803936, -491479, -444604, -327149, -52560, 23927, -150139, -199578, -83291, -187977, -480359, -365572, 312528, 842803, 593147, -177788, -805854, -1046906, -1085889, -1093841, -1073668]
$$ [...]
##END NTUPLES=NMR SPECTRUM
##END=
