##TITLE=31Pdec_66-2022
 CDCl3, 24 sc
 22.8.2022
##JCAMPDX= 6.0         $$ Bruker NMR JCAMP-DX V2.0
##DATA TYPE= NMR SPECTRUM
##DATA CLASS= NTUPLES
##ORIGIN= UXNMR, Bruker Analytische Messtechnik GmbH
##OWNER= root
$$ XWIN-NMR		Version 3.5
$$ Mon Aug 22 10:04:06 2022 Russian Standard Time (UT+4h)  she@DPX200
##.OBSERVE FREQUENCY= 81.013821
##.OBSERVE NUCLEUS= ^31P
##.ACQUISITION MODE= SIMULTANEOUS
##.ACQUISITION SCHEME= undefined
##.AVERAGES= 24
##.DIGITISER RES= 16
##SPECTROMETER/DATA SYSTEM= spect
##.PULSE SEQUENCE= zgpg30
##.SOLVENT NAME= CDCl3
##.SHIFT REFERENCE= (INTERNAL, CDCl3, 0, 248.564)
##AUDIT TRAIL= $$ (NUMBER, WHEN, WHO, WHERE, WHAT)
$$ ##TITLE= Audit trail, XWIN-NMR		Version 3.5
$$ ##JCAMPDX= 5.01
$$ ##ORIGIN= Bruker BioSpin GmbH
$$ ##OWNER= she
$$ F:/spectra/data/she/nmr/P31/1/pdata/1/auditp.txt
$$ ##AUDIT TRAIL=  $$ (NUMBER, WHEN, WHO, WHERE, WHAT)
(   1,<2022-08-22 10:03:14.51 +0400>,<she>,<DPX200>,
      <created by zg, POWCHK disabled, PULCHK disabled
       configuration hash MD5:
       00 E9 B6 7A A2 85 ED C7 34 08 36 98 17 FE 4E 26
       data hash MD5: 32K
       51 9F B2 E6 49 10 E9 98 1E 1C 4F 68 A3 A3 2F 7B>)
(   2,<2022-08-22 10:03:18.07 +0400>,<she>,<DPX200>,
      <Start of raw data processing
       efp BC_mod = 2 LB = 1 FT_mod = 6 PKNL = 1 PHC0 = -10237.65 PHC1 = -5.143555 SI = 64K 
       data hash MD5: 64K
       A0 05 B8 56 D9 F8 50 D8 3D 40 D0 A9 5B 0C 0E 28>)
(   3,<2022-08-22 10:03:31.42 +0400>,<she>,<DPX200>,
      <pk PHC0 = 14.63762 PHC1 = 0 
       data hash MD5: 64K
       3E 2E FD F1 97 A0 AC 04 F5 75 35 94 F7 A4 B9 95>)
(   4,<2022-08-22 10:03:42.48 +0400>,<she>,<DPX200>,
      <abs ABSG = 5 
       data hash MD5: 64K
       FE 74 03 D1 A2 7D 3A 7B 6B C9 60 B8 0E B9 F0 28>)
$$ ##END=
$$ 
$$ hash MD5
$$ 7B E2 8E 61 E5 0A AC 75 3A FF B0 1E 29 0C 32 AB
##$RELAX= 
##$RELAX= 
##$RELAX= 
##$RELAX= 
##$RELAX= 
##$RELAX= 
##$RELAX= 
##$RELAX= 
$$ Bruker specific parameters
$$ --------------------------
##$DU= <F:/spectra>
##$EXPNO= 1
##$NAME= <P31>
##$PROCNO= 1
##$TYPE= <nmr>
##$USER= <she>
##$AMP= (0..31)
100 100 100 100 100 100 100 100 100 100 100 100 100 100 100 100 100 100 
100 100 100 100 100 100 100 100 100 100 100 100 100 100 
##$AQSEQ= 0
##$AQ_mod= 1
##$AUNM= <au_zg>
##$AUTOPOS= <>
##$BF1= 81.014009
##$BF2= 200.13
##$BF3= 200.13
##$BF4= 200.13
##$BF5= 200.13
##$BF6= 200.13
##$BF7= 200.13
##$BF8= 200.13
##$BYTORDA= 1
##$CFDGTYP= 0
##$CFRGTYP= 5
##$CHEMSTR= <none>
##$CNST= (0..31)
1 1 145 1 1 1 1 1 1 1 1 1 1 1 1 1 1 1 1 1 1 1 1 1 1 1 1 1 1 1 1 1 
##$CPDPRG= <waltz16>
##$CPDPRG1= <>
##$CPDPRG2= <waltz16>
##$CPDPRG3= <>
##$CPDPRG4= <mlev>
##$CPDPRG5= <mlev>
##$CPDPRG6= <mlev>
##$CPDPRG7= <mlev>
##$CPDPRG8= <mlev>
##$CPDPRGB= <>
##$CPDPRGT= <>
##$D= (0..31)
0 1 0 0 0 0 0 0 0 0 0 0.03 2e-05 3e-06 0 0 0 0 0 0 0 0 0 0 0 0 0 0 0 0 
0 0 
##$DATE= 1661148193
##$DBL= (0..7)
120 120 120 11 120 120 24 19 
##$DBP= (0..7)
150 150 150 150 150 150 150 150 
##$DBP07= 0
##$DBPNAM0= <>
##$DBPNAM1= <>
##$DBPNAM2= <>
$$ [...]
##$SUBNAM3= <"">
##$SUBNAM4= <"">
##$SUBNAM5= <"">
##$SUBNAM6= <"">
##$SUBNAM7= <"">
##$SUBNAM8= <"">
##$SUBNAM9= <"">
##$SW= 501.771253377433
##$SWIBOX= (0..15)
0 1 3 0 0 0 0 0 0 0 0 0 0 0 0 0 
##$SW_h= 40650.406504065
##$TD= 32768
##$TD0= 1
##$TE= 0
##$TE2= 300
##$TE3= 300
##$TEG= 300
##$TL= (0..7)
0 120 53 12 22 120 120 120 
##$TP= (0..7)
150 150 150 150 150 150 150 150 
##$TP07= 0
##$TPNAME0= <>
##$TPNAME1= <>
##$TPNAME2= <>
##$TPNAME3= <>
##$TPNAME4= <>
##$TPNAME5= <>
##$TPNAME6= <>
##$TPNAME7= <>
##$TPOAL= (0..7)
0.5 0.5 0.5 0.5 0.5 0.5 0.5 0.5 
##$TPOFFS= (0..7)
0 0 0 0 0 0 0 0 
##$TUNHIN= 0
##$TUNHOUT= 0
##$TUNXOUT= 0
##$USERA1= <user>
##$USERA2= <user>
##$USERA3= <user>
##$USERA4= <user>
##$USERA5= <user>
##$V9= 5
##$VALIST= <valist>
##$VCLIST= <CCCCCCCCCCCCCCC>
##$VD= 0
##$VDLIST= <DDDDDDDDDDDDDDD>
##$VPLIST= <PPPPPPPPPPPPPPP>
##$VTLIST= <TTTTTTTTTTTTTTT>
##$WBST= 1024
##$WBSW= 4
##$XGAIN= (0..3)
0 0 0 0 
##$XL= 0
##$YL= 0
##$YMAX_a= 3228
##$YMIN_a= -3278
##$ZGOPTNS= <>
##$ZL1= 120
##$ZL2= 120
##$ZL3= 120
##$ZL4= 120
##$ABSF1= 248.5645
##$ABSF2= -253.2056
##$ABSG= 5
##$ABSL= 3
##$ALPHA= 0
##$AQORDER= 0
##$ASSFAC= 0
##$ASSFACI= 0
##$ASSFACX= 0
##$ASSWID= 0
##$AUNMP= <proc_1d>
##$AZFE= 0.1
##$AZFW= 0.5
##$BCFW= 0
##$BC_mod= 2
##$BYTORDP= 0
##$COROFFS= 0
##$CY= -3
##$DATMOD= 1
##$DC= 0
##$DFILT= <>
##$DTYPP= 0
##$F1P= 0
##$F2P= 0
##$FCOR= 1
##$FTSIZE= 65536
##$FT_mod= 6
##$GAMMA= 0
##$GB= 0
##$INTBC= 1
##$INTSCL= 5.30512e-09
##$ISEN= 30
##$LB= 1
##$LEV0= 0
##$LPBIN= 0
##$MAXI= 10000
##$MC2= 0
##$MEAN= 0
##$ME_mod= 0
##$MI= 50
##$NCOEF= 0
##$NC_proc= -5
##$NLEV= 6
##$NOISF1= 182.463
##$NOISF2= 159.3651
##$NSP= 0
##$NTH_PI= 0
##$NZP= 0
##$OFFSET= 248.5645
##$PC= 4
##$PHC0= -10223.01
##$PHC1= -5.143555
##$PH_mod= 1
##$PKNL= yes
##$PPARMOD= 0
##$PSCAL= 0
##$PSIGN= 0
##$REVERSE= no
##$SF= 81.014009
##$SI= 65536
##$SIGF1= 159.3651
##$SIGF2= -187.1042
##$SINO= 113.3802
##$SIOLD= 16384
##$SREGLST= <1H.CDCl3>
##$SSB= 0
##$STSI= 65536
##$STSR= 0
##$SW_p= 40650.406504065
##$SYMM= 0
##$S_DEV= 0
##$TDeff= 32768
##$TDoff= 0
##$TI= <>
##$TILT= no
##$TM1= 0
##$TM2= 0
##$TOPLEV= 0
##$USERP1= <user>
##$USERP2= <user>
##$USERP3= <user>
##$USERP4= <user>
##$USERP5= <user>
##$WDW= 1
##$XDIM= 65536
##$YMAX_p= 429437231
##$YMIN_p= -9506639
$$ End of Bruker specific parameters
$$ ---------------------------------
##NTUPLES= NMR SPECTRUM
##VAR_NAME=  FREQUENCY,     SPECTRUM/REAL,   SPECTRUM/IMAG
##SYMBOL=    X,             R,               I
##VAR_TYPE=  INDEPENDENT,   DEPENDENT,       DEPENDENT
##VAR_FORM=  AFFN,          ASDF,            ASDF
##VAR_DIM=   65536,         65536,           65536
##UNITS=     HZ,            ARBITRARY UNITS, ARBITRARY UNITS
##FACTOR=    0.620285442955139, 1,           1
##FIRST=     20137.2065510759, 0,            0
##LAST=      -20513.1999529892, 0,           0
##MIN=       -20513.1999529892, -9506639,    0
##MAX=       20137.2065510759, 429437231,    0
$$ Real data points
##PAGE= N=1
##DATA TABLE= (X++(R..R)), XYDATA
$$ [...]
42296 172809 188539 324134 514518 641481 797468 926420 694998 137381 -82123 418819
42286 418819 1035987 1019227 605670 556986 861475 774995 82757 -547913 -602827 -346751
42276 -346751 -177292 -20036 297982 606108 692048 652418 626411 522966 291273 127168
42266 127168 130870 85233 -132253 -241001 -3452 308076 289698 45967 29887 347862
42256 347862 630893 602351 436624 465220 739763 985869 906806 503059 101677 7777
42246 7777 150513 242385 265143 483186 892399 1059159 762690 422146 499335 780495
42236 780495 730190 349934 145128 327529 586249 643002 515467 197386 -370894 -894276
42226 -894276 -851167 -278645 65054 -347923 -1094074 -1364679 -920755 -163592 422693 559933
42216 559933 225805 -208411 -185307 298228 477284 -168675 -1001941 -972706 -103916 521582
42206 521582 288132 -213904 -247208 -24618 -211534 -775302 -996218 -538223 50516 66906
42196 66906 -454021 -831613 -609933 -81850 137835 -108409 -395842 -339577 -38987 232090
42186 232090 475578 809219 1063688 943103 539870 309256 478393 787615 890618 738672
42176 738672 478528 213198 -12782 -153716 -186452 -116336 29963 147355 111201 13474
42166 13474 122622 403828 391901 -93299 -448617 -71432 631865 763056 317628 169602
42156 169602 616709 912011 559826 131570 228920 457071 184694 -300069 -249533 329474
42146 329474 766658 802155 774827 847098 792162 584457 563787 886359 1272592 1386822
42136 1386822 1121177 522399 -205831 -671156 -609669 -184485 298757 773032 1157351 1028788
42126 1028788 124567 -983947 -1344661 -749834 114882 621041 758424 750006 681892 621238
42116 621238 627123 558254 281105 50523 197706 486472 377207 -57435 -161996 232968
42106 232968 477234 95100 -535196 -831563 -754233 -532906 -199114 184602 322101 167032
42096 167032 173014 598209 974571 771485 213065 -102725 -67767 24524 135652 409656
42086 409656 642512 494736 148513 100900 319711 268760 -160212 -433858 -299558 -237694
42076 -237694 -603605 -911014 -541564 233446 601179 379382 155574 263910 325777 53321
42066 53321 -103057 403116 1299949 1788215 1581915 1107912 708369 233305 -409444 -820910
42056 -820910 -582437 133574 738419 826802 395318 -291850 -811697 -799935 -344507 24374
42046 24374 -29482 -246425 -224381 35446 320188 575835 701882 376362 -377436 -802542
42036 -802542 -259477 766969 1233790 958295 689017 828224 956066 742483 474869
42027 474869 394891 265443 -45192 -216239 -98684 -78144 -405411 -727646 -711475 -594394
42017 -594394 -656255 -651097 -279232 204839 370618 236657 54809 -160916 -423496 -457716
42007 -457716 -82838 416095 737411 999017 1268597 1136333 378468 -372738 -362755 171944
41997 171944 384352 95075 -121132 -27991 -57070 -446654 -802021 -746573 -439894 -223427
41987 -223427 -207641 -380653 -708509 -982469 -949678 -708807 -612288 -707884 -676856 -407002
41977 -407002 -205678 -311315 -577193 -786997 -937539 -1063499 -1097437 -1040181 -992232 -923599
41967 -923599 -695917 -376008 -216492 -261900 -302844 -288806 -429343 -775527 -1040028 -966858
41957 -966858 -594288 -76008 438261 691129 477871 25070 -188463 -115027 -210292 -651767
41947 -651767 -965773 -729177 -211718 58254 20800 -20529 68935 253969 605206 1097323
41937 1097323 1304506 815892 -85308 -631507 -497560 -92523 156087 371541 854628
41928 854628 1473035 1758358 1495098 957024 584683 598420 911310 1267211 1433404 1363157
41918 1363157 1215889 1165906 1185363 1090261 808112 483710 257933 69297 -184781 -379942
41908 -379942 -265524 163453 584161 685959 445688 38489 -350924 -592765 -685470 -805572
41898 -805572 -1057830 -1156374 -704048 102102 486172 90872 -478858 -541439 -361570 -661181
41888 -661181 -1373754 -1671486 -1221361 -615147 -336184 -50037 633706 1300426 1264765 626782
41878 626782 133107 85186 -4396 -557791 -1219098 -1283834 -609256 192271 436782 52980
41868 52980 -476881 -730359 -721723 -653333 -521182 -192234 231505 433197 309551 111772
41858 111772 57754 61581 16853 100467 509386 1033166 1222742 987868 725466 749957 855526
41847 855526 662039 229628 9383 176660 344709 126861 -271736 -340516 -7099 297187
41837 297187 318719 311771 538757 813407 797854 474740 55943 -328692 -573804 -498287
41827 -498287 -151223 24925 -246772 -551698 -295261 383225 730790 387141 -247759 -688636
41817 -688636 -874771 -874589 -605399 -124510 185405 31118 -420221 -785359 -861754 -645700
41807 -645700 -227266 156208 202597 -131904 -556124 -778824 -729192 -443930 -55088 81513
41797 81513 -325210 -948452 -1037583 -409205 205798 154395 -220785 -139815 450550 870861
41787 870861 761708 532261 618421 769640 406457 -513694 -1325260 -1394681 -823910 -237382
41777 -237382 42522 294815 766309 1115283 882071 280562 -23637 133566 270422 136444
41767 136444 101015 423296 729572 613077 274158 114899 96632 -16885 -115312 37569
41757 37569 295084 361002 328875 456591 556928 189097 -570338 -1080151 -931152 -377618
41747 -377618 84372 194538 -67136 -567421 -973323 -910593 -345411 321428 611030 353855
41737 353855 -204365 -564079 -361191 242923 684519 643227 361777 174257 39379 -182487
41727 -182487 -340606 -282952 -215438 -301915 -224313 275771 710752 444332 -190380 -219761
41717 -219761 502640 1033195 752637 204874 136692 445417 623354 657757 842225 1065932
41707 1065932 925691 383187 -173527 -428492 -359915 -102935 125264 132563 30096 183021
41697 183021 643946 924904 637193 59928 -284420 -327777 -328053 -334120 -252190 -201387 -290798
41686 -290798 -255531 134789 517452 435659 220305 571525 1293638 1380633 578925 -88987
41676 -88987 158504 706597 638249 233674 374319 923663 886485 93765 -450977 -162348
41666 -162348 250893 26296 -424288 -284115 305151 531303 200603 -155728 -308182 -563365
41656 -563365 -916780 -835811 -175214 407787 362588 -3628 -143130 -137591 -383202 -763107
41646 -763107 -781207 -383028 -60512 -140930 -443539 -677568 -763881 -690515 -419851 -60368
41636 -60368 139430 57551 -233113 -626551 -947818 -843314 -130311 707834 838287 73213
41626 73213 -836852 -1128231 -886042 -691808 -728302 -641616 -156176 537679 1001806 941873
41616 941873 432232 -85807 -142410 236327 479730 177258 -321672 -335639 206564 642402
41606 642402 447892 -121880 -421335 -173964 352578 734398 739460 406891 -24897 -321778
41596 -321778 -497481 -751220 -1066314 -1083153 -611103 -74217 -57011 -469990 -633970 -287298
41586 -287298 -8691 -342570 -937533 -1033359 -537571 -60303 19791 -46085 53130 268887
41576 268887 493831 777771 1003684 803530 121741 -507291 -595849 -310188 -101440 -48882
41566 -48882 21023 51419 -105851 -244015 -15126 468114 713205 535894 266271 247407
41556 247407 476736 752963 861587 639726 174532 -120543 28411 292134 131578 -418366
41546 -418366 -802079 -739904 -490455 -311569 -166940 -40109 -43773 -96994 51086 361736
41536 361736 512225 442199 411958 436207 210672 -262309 -552524 -481665 -328662 -173037
41526 -173037 272502 891715 998760 407040 -70435 204247 680067 491094 -239109 -785430
41516 -785430 -1030467 -1356612 -1643591 -1358865 -563826 56171 194476 188785 259833 242733
41506 242733 150568 248498 410635 134935 -548000 -851370 -271206 684403 1177494 1037748
41496 1037748 728830 643530 761424 803098 501435 -122368 -656151 -674093 -261268 76842
41486 76842 33416 -243915 -478464 -510439 -265524 128030 237606 -194127 -689879 -507360
41476 -507360 265837 674966 144797 -772626 -1155345 -763444 -74214 337061 213482 -233927
41466 -233927 -419182 21738 645623 670828 86223 -319698 -176526 -42278 -378476 -767176
41456 -767176 -651804 -195626 182097 510619 841189 712006 -119862 -857864 -533043 523804
41446 523804 1008430 395377 -502776 -798909 -534405 -203448 9817 163036 229233 202535
41436 202535 229710 391746 565505 615435 519663 309471 146624 374686 1089552 1703768
41426 1703768 1456992 459429 -290351 -152290 357609 359988 -160924 -394549 148224 958390
41416 958390 1132302 443152 -391198 -523790 87065 720743 804439 493043 261392 250682
41406 250682 268288 186258 35849 -123169 -166356 59188 401312 384367 -130270 -573775
41396 -573775 -410751 50986 155607 -57784 -939 420250 673216 509555 256976 117274
41386 117274 -78741 -265471 -69584 396012 435982 -145861 -588075 -279701 320585 438303
41376 438303 87723 -213567 -359480 -577758 -768162 -634856 -305473 -181381 -269820 -225482
41366 -225482 18881 193231 226430 346665 614944 760531 534813 -38183 -716411 -1119889
41356 -1119889 -938508 -362670 -78082 -449097 -951830 -883353 -372711 -76426 -64482 211684
41346 211684 820832 1042351 448002 -367421 -560579 -77162 506524 815228 908966 931476
41336 931476 950385 1032909 1149844 1079779 671705 134683 -159131 -99973 117041 287847
41326 287847 330985 197898 -96590 -333946 -199070 358978 963349 1099148 568665 -336050
41316 -336050 -1068804 -1233558 -835118 -235692 102949 -63535 -544849 -805393 -445724 300565
41306 300565 689382 240293 -700312 -1328040 -1234097 -712380 -291446 -210107 -372423 -567555
41296 -567555 -599112 -343341 153666 637994 775392 374857 -428653 -1177048 -1391868 -1001177
41286 -1001177 -412162 -76446 -86761 -293673 -612406 -971555 -1132947 -933520 -657870 -771315
41276 -771315 -1221698 -1398214 -948121 -287818 -58983 -356950 -789600 -1071281 -1191730 -1124258
41266 -1124258 -789550 -355422 -212884 -486241 -803696 -746828 -368096 -62821 -49627 -221258
41256 -221258 -449767 -733765 -971927 -893062 -430296 41850 129209 -43202 -34585 225343
41246 225343 334934 70225 -250945 -249074 -5422 166134 221947 344234 553516 692378
41236 692378 721078 742847 775640 751676 711079 753401 813030 712764 445688 204395 123088
41225 123088 159572 223023 261647 240841 165791 86393 -9388 -184799 -335315 -200008 219235
41214 219235 514362 437743 329911 560155 789838 372473 -606931 -1316490 -1255610 -761333
41204 -761333 -309714 87894 527041 790466 680360 397796 222059 105720 -80337 -182518
41194 -182518 -5958 296061 421169 348031 266123 225574 150886 84871 143914 302824 423519
41183 423519 407086 189235 -231460 -617395 -609283 -240995 -46827 -348492 -719956 -564778
41173 -564778 13992 415153 452391 485725 654056 601944 173606 -161439 50552 544713
41163 544713 710068 462374 288515 455294 611750 335329 -236756 -584328 -456584 -64190
41153 -64190 337220 748396 1207414 1524469 1463472 1077901 663069 429127 378026 421985
41143 421985 440843 303525 43846 -52572 240752 760634 1160220 1334559 1358210 1154180
41133 1154180 646722 141196 13448 19063 -466381 -1377376 -1797021 -1190851 -188027 321040
41123 321040 307652 251946 166835 -266902 -870944 -1077204 -808556 -541505 -455774 -203043
41113 -203043 326581 648271 398719 -82835 -265710 -184328 -289561 -721876 -1102537 -1048382
41103 -1048382 -652873 -356701 -418296 -629657 -634254 -443354 -404829 -626133 -757783 -552539
41093 -552539 -304854 -368875 -500869 -168159 609547 1233800 1326493 1079863 782105 484239
41083 484239 243472 217465 320601 196879 -240974 -604774 -587205 -374845 -248462 -111922
41073 -111922 242430 650997 732595 404963 -39680 -290612 -237367 53737 370640 457819
41063 457819 267633 21199 -100775 -170248 -287092 -368206 -361887 -435089 -670511 -795213
41053 -795213 -564981 -254631 -340443 -758530 -933248 -601706 -185215 -175343 -500287 -736303
41043 -736303 -699449 -569892 -562855 -670228 -642000 -136880 923817 2032812 2383367 1725307
41033 1725307 737250 257611 325152 347903 73442 -126836 17782 203405 53531 -309705
41023 -309705 -531727 -576349 -646278 -741649 -664675 -376359 -50381 157589 159917 -100389 -458903
41012 -458903 -476205 59605 711965 886718 633157 488085 606848 626269 421508 357199
41002 357199 585304 698481 410990 55359 -5674 4408 -263032 -577814 -447425 89843
40992 89843 534612 674755 761415 969470 1141394 1131992 1043437 994549 895780 588787 117228
40981 117228 -219606 -132121 268487 447422 50733 -556661 -737533 -511171 -480392 -770864
40971 -770864 -762851 -170337 375902 345824 192354 490978 818530 413535 -464642 -848671
40961 -848671 -529346 -214855 -281622 -330292 -70615 239588 411179 587306 704318 440700
40951 440700 -80933 -253562 112321 502301 524893 363749 199792 -115986 -551090 -739395
40941 -739395 -628972 -620106 -793247 -721037 -351843 -286805 -755997 -1106976 -839236 -402259
40931 -402259 -365308 -507709 -419786 -343300 -630934 -930525 -737793 -313064 -232007 -417808
40921 -417808 -433388 -359958 -520439 -659715 -336641 108535 -26914 -542303 -518730 188441
40911 188441 662570 356377 -117048 -1909 548911 876354 688368 139560 -477692 -798107
40901 -798107 -604531 -268970 -477328 -1210586 -1551730 -934282 -49960 87030 -407330 -486071
40891 -486071 333207 1390207 1876288 1786606 1623993 1624286 1652078 1577769 1348264 832211
40881 832211 20685 -653513 -656559 -128837 129110 -298623 -836736 -759929 -259762 -89378
40871 -89378 -405066 -694172 -766536 -970776 -1281061 -1052329 -108709 685217 545297 -115949
40861 -115949 -349510 6469 358265 375103 257016 184552 173378 362942 841946 1266257
40851 1266257 1207579 808906 571789 590530 537519 313793 133791 1133 -322172 -791665
40841 -791665 -1032036 -853503 -403302 140499 597280 652838 235483 -110979 162182 727655
40831 727655 783069 280258 10168 391544 904402 908435 396909 -236627 -611371 -425607
40821 -425607 294156 915342 789178 183868 -45100 259002 422279 185782 110075 454719
40811 454719 654745 377978 153889 361828 492226 114349 -261247 -96044 162529 -105567
40801 -105567 -513204 -295178 380190 738674 665584 652633 773248 693840 486409 464649
40791 464649 404708 -67605 -468117 60465 1251925 1827831 1274664 443222 107344 -6620
40781 -6620 -319851 -555796 -440062 -406003 -844228 -1276950 -1060932 -461899 -261287 -584232
40771 -584232 -841731 -692872 -420523 -369378 -524720 -697259 -761500 -673383 -497996 -401099
40761 -401099 -445488 -499998 -481384 -466530 -394136 19366 760295 1235220 937360 165979
40751 165979 -371652 -471716 -434502 -334523 54290 604540 780027 417451 -9960 -142836
40741 -142836 -190783 -326318 -204035 413080 1013999 963623 473099 269504 465001 490945
40731 490945 149739 -42045 235690 561607 505554 304421 330390 388013 123089 -238522
40721 -238522 -207261 131925 233869 -59439 -375581 -449465 -329161 -15106 462939 639801
40711 639801 44407 -855825 -961100 -83194 628595 271248 -583431 -907907 -762510 -902716
40701 -902716 -1304704 -1167881 -318280 380665 232139 -427835 -849946 -773735 -412776 -6533
40691 -6533 296469 424185 476064 579707 564992 146028 -453595 -504604 321063 1384161
40681 1384161 1734515 1121080 110984 -575960 -604245 -103761 481379 700692 468062
40672 468062 98932 -97101 -132626 -175269 -256368 -292549 -246213 -116949 108451 380909
40662 380909 578574 657694 691969 714710 685519 642605 661172 612760 257114 -313540 -638379
40651 -638379 -487926 -208577 -230066 -497189 -667253 -621025 -448639 -142989 304696 639657
40641 639657 581356 282392 178944 380629 552470 437964 162528 -77112 -319534 -666371
40631 -666371 -1010281 -1116730 -891225 -473348 -130252 -75454 -291790 -527006 -575895 -547164
40621 -547164 -694294 -987685 -1063643 -683292 -79111 290744 259221 102741 176225 460539
40611 460539 539811 87571 -661657 -1086331 -889624 -459822 -365211 -649884 -866317 -700257
40601 -700257 -277029 118567 325542 275792 -24433 -370317 -452371 -217298 30204 -5065
40591 -5065 -291239 -597121 -753980 -692391 -417978 -92867 34553 -60352 -98149 109923
40581 109923 353930 319499 42904 -183054 -261651 -362714 -558743 -674089 -569055 -362149
40571 -362149 -270120 -364165 -549916 -671195 -601245 -365222 -188947 -252746 -372662 -167806
40561 -167806 355917 670553 403166 -93719 -198806 96778 212510 -111174 -419578 -268551
40551 -268551 91144 130802 -155905 -346461 -338385 -481653 -927166 -1314599 -1271101 -860106
40541 -860106 -373873 -25864 -16387 -496120 -1173517 -1339777 -693493 146810 398277 127956
40531 127956 -15608 117527 44143 -407003 -723110 -514693 -108381 21074 -47817 34608
40521 34608 248400 304232 188911 181433 394254 627512 651944 407806 -12743 -382360
40511 -382360 -433213 -140863 168947 167750 -128411 -497916 -809487 -978267 -844619 -396167
40501 -396167 33851 95558 -142427 -343983 -367599 -309057 -231797 -166915 -240888 -461906 -519342
40490 -519342 -179716 249407 287398 3975 -120613 8185 9896 -239929 -394668 -295349
40480 -295349 -260187 -475847 -628081 -439919 -117891 44080 69378 7149 -286078 -700426
40470 -700426 -698890 -85486 472339 273368 -374298 -557692 -4663 691926 986001 911591
40460 911591 714378 491812 270686 37805 -321571 -779622 -985658 -757877 -566500 -924733
40450 -924733 -1422664 -1137569 -78356 606225 173502 -703979 -958150 -532167 -145603
40441 -145603 -105456 -77631 148032 346308 337709 265401 270489 238582 698 -414495 -796657
40430 -796657 -912898 -695835 -385083 -355541 -636350 -754986 -302774 463701 868528 607476
40420 607476 24162 -380761 -450035 -350702 -290444 -347580 -462451 -536186 -564130 -614421 -640692
40409 -640692 -476054 -127241 118098 70356 -59912 12056 183664 129849 -202022 -587643
40399 -587643 -892649 -1067786 -890246 -198932 598668 768920 156019 -590863 -874130 -799306
40389 -799306 -732470 -657892 -372130 5613 171610 110986 31278 -47968 -245535 -444492
40379 -444492 -380422 -108767 -4815 -219725 -459696 -429010 -226958 -151631 -315108 -620927
40369 -620927 -969445 -1290933 -1438560 -1233094 -669978 -14869 375024 353813 100569 -95601
40359 -95601 -130020 -92645 -42418 54430 151193 106769 -69755 -187357 -216026 -405558 -849888
40348 -849888 -1187490 -1045925 -591935 -286682 -244351 -231322 -201529 -383109 -831551 -1309091
40338 -1309091 -1639836 -1801175 -1663626 -1098034 -399503 -109949 -277217 -364533 -64923 292020
40328 292020 364798 302168 307762 217094 -83085 -264688 -38741 359345 586786 677682 672338
40317 672338 277036 -514517 -973754 -571410 75910 76144 -289276 -42136 788056 1166086
40307 1166086 806229 628641 1098900 1356879 679192 -241688 -368615 117864 288344
40298 288344 -66376 -408240 -527606 -695169 -917162 -899158 -701112 -687483 -835118 -756848
40288 -756848 -422580 -226711 -292423 -298633 -82976 117114 122791 33195 -94645 -326818 -544050
40277 -544050 -507431 -296943 -219092 -214184 128753 834318 1335148 1219351 738449 350216
40267 350216 177997 158666 304773 519588 505791 170970 -159126 -197668 -81929 -47031
40257 -47031 -20992 154696 375771 471144 517769 641338 713331 570156 337953 196992
40247 196992 2801 -463710 -972370 -984040 -340360 496969 946000 823404 361947 -67350
40237 -67350 -222620 -154466 -130360 -304514 -529852 -603608 -555008 -503646 -386207 -92791 225134
40226 225134 282972 56259 -239058 -514714 -824811 -1013674 -752231 -78999 432168 298265
40216 298265 -279742 -682866 -596585 -254896 -60335 -171119 -433686 -559566 -362268 89282
40206 89282 560402 913562 1182637 1351254 1255145 860292 454296 313278 308082 150327
40196 150327 -47260 146995 782166 1305936 1242983 764652 332858 80652 -111145 -168215
40186 -168215 92231 514588 672831 409864 -31790 -422437 -734266 -905737 -820675 -611283
40176 -611283 -591470 -758889 -746409 -422643 -134513 -141248 -216658 -86285 139130 289703
40166 289703 496279 824264 917071 487205 -125894 -390502 -336893 -374884 -592845 -791805
40156 -791805 -1007842 -1372418 -1590263 -1236177 -534760 -164095 -249694 -242394 93334 275565
40146 275565 -70735 -613539 -856187 -769128 -575772 -360416 -177491 -146723 -197241 -109228
40136 -109228 21631 -161118 -578460 -643162 -154180 321390 313272 115533 156319 252960
40126 252960 16211 -465589 -864346 -1104533 -1124300 -635188 286814 838627 408874 -518139
40116 -518139 -1066723 -1185487 -1373432 -1563218 -1248151 -557617 -201886 -315439 -295298 76951
40106 76951 266624 -10305 -276173 -152465 39926 -11943 -944 363442 683681 450236
40096 450236 -124665 -438154 -355982 -190885 -73909 90644 202992 58879 -186052 -150975
40086 -150975 138322 211947 -134283 -491768 -412072 -32397 148443 -38204 -259724 -192183
40076 -192183 65087 214175 214151 272893 438591 490659 328083 192338 300472 486085 499522
40065 499522 493500 815854 1358256 1533304 1024073 229132 -229618 -213670 -80023 -138240
40055 -138240 -306901 -283768 56931 456342 477955 -18708 -658126 -919409 -692038 -326344
40045 -326344 -174773 -263918 -406588 -430895 -255175 85376 413732 534864 433223 254394
40035 254394 86216 -129462 -454828 -814166 -996072 -774129 -137707 527267 680723 237088
40025 237088 -236574 -170320 311144 626413 533771 319325 242480 205004 61054 -80767
40015 -80767 -42072 128487 192816 -7245 -354816 -505140 -204894 390221 866169 1052683
40005 1052683 1097008 971803 385027 -548324 -1080205 -769132 -177973 -30087 -136706 62862
39995 62862 334576 42864 -547827 -535322 79978 331859 -72694 -310697 -4933 63714
39985 63714 -562398 -1050269 -671542 -85433 -156959 -409500 92044 997734 1181292 592103
39975 592103 227059 404297 392713 -147414 -564371 -343981 160959 482248 686573 917185
39965 917185 992562 810933 573122 343924 -45417 -462107 -452497 20994 436895 533623
39955 533623 623501 827882 715525 116898 -364554 -189289 301724 453156 215488 -65646
39945 -65646 -359878 -812818 -1198783 -1175735 -923600 -911013 -1104484 -1000628 -470321 -33549
39935 -33549 -150164 -634918 -953485 -834831 -440338 -93486 49133 123021 349215 670436
39925 670436 745106 432364 81769 94973 357475 416683 135052 -167820 -202025 -4742
39915 -4742 285317 617802 857693 698076 -934 -871190 -1244662 -774367 191323 907166
39905 907166 943458 574833 387496 562408 749356 653246 430189 336972 298921 135105
39895 135105 -25598 42870 181140 42804 -260312 -225204 220269 468143 69848 -600601
39885 -600601 -901193 -802850 -718789 -653098 -150152 812085 1461286 1148751 291065 -99894
39875 -99894 268788 642279 338747 -281831 -382332 95962 338186 -134881 -736524 -629689
39865 -629689 124176 715711 689395 361668 157396 68602 -48300 -85269 89543 305057
39855 305057 324546 232536 269581 405828 407838 278038 293594 556136 780720 659440 255187
39844 255187 -100701 -194020 -82230 91069 308323 630895 963716 1007399 604435 75206
39834 75206 -55564 264435 504746 287526 -89540 -174397 -89717 -245297 -521853 -396568
39824 -396568 95496 225743 -336132 -915623 -772142 -166051 84464 -198133 -428572 -212049
39814 -212049 194967 422548 463013 459536 418483 312107 191854 81646 -8514 64794 412903
39803 412903 791024 830879 663539 839860 1446980 1814005 1451466 827394 700049 1009090
39793 1009090 1039477 520407 -81159 -352252 -396833 -393414 -281001 -119804 -222785 -585596
39783 -585596 -669857 -204869 209552 -120628 -888956 -1142341 -616716 -12536 111141 -9246
39773 -9246 -21332 -77578 -338140 -469205 -248353 -182850 -756862 -1381784 -1014805 230247
39763 230247 1048441 734007 86492 57922 328460 5782 -824896 -1207635 -772606 -177204
39753 -177204 -34792 -204945 -383433 -692287 -1250388 -1652314 -1400333 -624112 59128 281759
39743 281759 179741 522 -196848 -423738 -601746 -620242 -455777 -210961 -82817 -230171
39733 -230171 -587819 -892602 -1000256 -1072621 -1288369 -1468210 -1250913 -657664 -198377 -253769
39723 -253769 -549576 -494214 41601 560654 587700 211431 -163667 -368495 -519193 -677196
39713 -677196 -795331 -946828 -1225125 -1363938 -884550 155036 929520 733066 -126274
39704 -126274 -710605 -602898 -267522 -293194 -680925 -983256 -854493 -341614 166802 214697
39694 214697 -292587 -878569 -929578 -404134 105312 96616 -277868 -486542 -256078 223964
39684 223964 590116 629721 385895 71900 -125019 -199629 -271718 -390160 -462769 -374528
39674 -374528 -116008 177726 274053 28378 -381371 -525603 -171029 448968 942632 1168939
39664 1168939 1155105 840003 234725 -318285 -447968 -259922 -166596 -261997 -271130 -112054
39654 -112054 -65562 -297533 -587637 -631223 -306536 355784 1087438 1294926 571670 -612080
39644 -612080 -1243390 -938407 -281152 145774 450757 855483 1056519 691132 29111 -338236
39634 -338236 -259782 -56612 -21041 -245829 -701414 -1123428 -1086343 -567450 -178727 -432175
39624 -432175 -1009651 -1186192 -771427 -190415 194998 372577 380422 171571 -205436 -593882
39614 -593882 -881268 -970120 -739253 -260416 129382 210823 124003 8749 -268204 -708615
39604 -708615 -879471 -474981 119890 331137 191016 83633 -37186 -493332 -1077172 -1139449
39594 -1139449 -549282 73281 237057 144591 179309 305929 262683 37870 -113047 5359
39584 5359 309497 499159 390001 225491 417028 840225 796895 22799 -705690 -535890
39574 -535890 233094 585862 239050 -131353 -55184 153782 129067 49570 228126 606440
39564 606440 899956 898535 544463 48175 -141861 104783 258666 -104934 -462492 -57544
39554 -57544 727592 736566 -181520 -853745 -522663 156110 306635 29862 -179959 -311565
39544 -311565 -436166 -232806 325745 520223 -78691 -751440 -643914 -60348 157337 15061
39534 15061 116608 418566 337882 -64749 -82555 420220 726092 338774 -439320 -1125106
39524 -1125106 -1524589 -1467772 -811455 77787 490715 277936 41508 213325 483094 400613
39514 400613 55787 -155613 -85523 112030 212209 41304 -380574 -741314 -755433 -581551
39504 -581551 -578982 -692933 -546518 -147934 50816 -80947 -90571 338688 920289 1273942
39494 1273942 1411517 1412545 1097848 426512 -166438 -258463 -1656 155070 53748 -174833
39484 -174833 -429963 -640413 -703547 -706901 -902576 -1182763 -1001622 -221763 423546 290332
39474 290332 -163261 -62604 485193 586403 70093 -208159 195933 517497 -56595 -1146895
39464 -1146895 -1751468 -1565823 -1064643 -602911 -138652 286036 437144 302444 141195
39455 141195 80449 40487 42625 181948 292031 73678 -372710 -558907 -275681 121124
39445 121124 233619 99026 -71 104067 420621 805887 907377 466389 -185271 -337191
39435 -337191 184847 720041 639235 105255 -321445 -414330 -274125 -28777 47076 -437230
39425 -437230 -1339853 -1821532 -1426743 -873858 -1031151 -1546938 -1448511 -789217 -542417 -912338
39415 -912338 -995845 -360492 257860 313876 367036 921297 1350941 913770 74564 -198685
39405 -198685 83180 174389 -73854 -171924 -53444 -132578 -353391 -174740 401443 694069
39395 694069 426696 118179 123440 66452 -378779 -812091 -703385 -181813 237114 349765
39385 349765 281588 124662 -42220 -22430 237803 451237 369047 163498 119741 143115
39375 143115 -57625 -413093 -506476 -155179 328071 535308 415716 233048 209881 335758
39365 335758 490722 640699 816650 924216 740898 217687 -348438 -625925 -638631 -632788
39355 -632788 -647640 -506264 -206096 -5416 -75526 -331483 -624741 -808766 -615476 134565
39345 134565 1097994 1583812 1336733 796381 434356 261259 186509 330872 593597 418843
39335 418843 -434686 -1270134 -1265135 -664037 -437512 -871485 -1274833 -1142979 -819712 -744908
39325 -744908 -749156 -513375 -184028 -58066 -60396 13226 78354 30203 90970 387967 488914
39314 488914 -45855 -845013 -1103404 -694237 -245264 -98075 87014 502233 685786 259107
39304 259107 -383506 -642985 -580699 -657651 -881054 -826586 -418786 -93224 -103404 -168524
39294 -168524 971 220485 137938 -229096 -537176 -574577 -446639 -347677 -334083 -360190
39284 -360190 -424971 -581997 -800093 -916204 -845459 -784593 -988683 -1307722 -1244995 -678910
39274 -678910 -233397 -538795 -1281580 -1487471 -789947 76658 273075 -68460 -155080 309141
39264 309141 762617 627138 99716 -180930 -76071 -150562 -799754 -1498030 -1336332 -260552
39254 -260552 712099 728091 137898 -83769 350040 835202 843820 496796 111268 -259069
39244 -259069 -604065 -727431 -555319 -377478 -482009 -753092 -866664 -694640 -313856 165854
39234 165854 549048 546305 109787 -359837 -414930 -75086 297799 524945 715532 887994
39224 887994 815621 368405 -205194 -525590 -535554 -513529 -587599 -439790 245860 1100408
39214 1100408 1248636 389663 -656572 -885250 -347545 50964 -146105 -464627 -376181
39205 -376181 -35020 108966 -43113 -267873 -338566 -89500 496826 1083807 1224737 960349
39195 960349 747956 670552 288412 -489364 -1054268 -1038346 -960480 -1365844 -1897473 -1909166
39185 -1909166 -1507188 -1196672 -890977 -165111 742789 1114717 876327 664203 743006 711988
39175 711988 416479 294305 525593 602392 159276 -379544 -432533 -57750 320053 568204
39165 568204 760485 733876 237791 -567300 -1143152 -1129310 -671538 -205377 -30807 -95268
39155 -95268 -152953 -109893 -94549 -143539 -72859 133157 100054 -397280 -922277 -887185 -389633
39144 -389633 14830 215659 541104 919037 859641 403911 245662 586219 683918 63434
39134 63434 -550822 -221673 798629 1441121 1285484 868629 670468 562520 328267 71003
39124 71003 -102429 -310774 -571556 -622209 -321879 57812 217517 293205 614998 1093159
39114 1093159 1194247 633509 -162726 -514153 -291019 5331 -48483 -316183 -439038 -353806
39104 -353806 -244266 -206247 -233408 -354343 -506700 -461462 -171823 20808 -113872 -244603
39094 -244603 9925 381024 366042 125453 197095 421473 88132 -721694 -945589 -105053
39084 -105053 858223 927729 400299 154012 189609 -132760 -794056 -1083050 -783152 -484230
39074 -484230 -596020 -802257 -717928 -483868 -416351 -506960 -562438 -534310 -457703 -284663 -2770
39063 -2770 214746 158699 -161900 -510840 -662806 -621058 -566048 -549383 -336043 255678 921757
39052 921757 1118147 799314 521979 636873 783514 488660 -96811 -447029 -363532 -28257
39042 -28257 385638 714460 649144 95848 -443949 -375591 161772 467226 260493 -17798
39032 -17798 47618 298573 380941 263971 129166 7230 -213896 -529861 -745061 -654829
39022 -654829 -276620 100874 182346 7543 -126459 -115420 -142680 -227624 -88033 282246
39012 282246 347310 -196788 -762837 -604762 33985 204130 -395462 -1045493 -1051483 -524121
39002 -524121 37080 373095 458756 328598 139398 70967 44338 -134539 -346341 -312861
38992 -312861 -176668 -373581 -858222 -1076577 -872011 -757769 -1011192 -1173087 -876197 -550498
38982 -550498 -731602 -1153282 -1174007 -776019 -485665 -483594 -410154 -17443 473081 683769
38972 683769 429011 -184030 -734148 -729285 -175657 306418 286903 181640 618431 1368028
38962 1368028 1547248 873554 87486 -45245 359302 658446 566269 361422 407462 734121
38952 734121 1054627 1083167 839622 607310 541042 466956 228271 26051 114493 319838
38942 319838 265820 -7746 -117431 -21489 -106412 -464610 -622115 -263999 233620 371233
38932 371233 240092 215368 241536 -11018 -409973 -385489 224754 860976 984965 747080
38922 747080 621521 670152 554581 160706 -188457 -214156 -79662 -139826 -475311 -868068
38912 -868068 -1121266 -1170627 -927288 -299446 542080 1172238 1359317 1307988 1256131 1058774
38902 1058774 519354 -30320 1703 559841 828315 293444 -519183 -769457 -418682 -91659
38892 -91659 -34366 133287 585956 866387 591912 114902 61468 484488 876980 869592
38882 869592 549069 182650 -19510 94959 521711 971348 1102718 904679 624069 370541
38872 370541 106347 -12448 275280 797207 953223 531634 139738 427377 1138688 1403196
38862 1403196 874549 119928 -175573 2531 177797 80345 -81489 28970 429948 777425
38852 777425 745190 388911 41294 -120786 -205496 -269127 -154103 148231 288012 52674
38842 52674 -176843 85649 648691 869335 589870 263146 112854 -167587 -667679 -873072
38832 -873072 -435946 206998 487391 530218 750617 991662 752613 85998 -433328 -588919
38822 -588919 -704361 -892172 -784077 -214378 398337 648939 675435 781102 912092 856254
38812 856254 661372 501789 347074 95464 -122028 -76091 222299 552349 750293 762452
38802 762452 583551 345613 307427 529296 706599 550143 166436 -180299 -477729 -807928
38792 -807928 -964919 -669582 -114110 155795 -27458 -222238 -5164 489753 813058 717954
38782 717954 281809 -257316 -618236 -622343 -382974 -197112 -140340 22918 381338 579823
38772 579823 254961 -381960 -718939 -489590 -81104 -33323 -424813 -861288 -955756 -704202
38762 -704202 -424286 -407325 -636330 -797482 -548529 174811 1039057 1502860 1256042 559988
38752 559988 48020 52991 232654 64411 -376113 -465564 75455 705813 733443 208214
38742 208214 -205380 -124536 183035 351319 424785 584449 653499 256473 -570576 -1262014
38732 -1262014 -1329951 -880555 -387707 -129026 -38084 25896 136505 378574 765030 1043425
38722 1043425 897930 437965 143701 150703 -17539 -663224 -1227757 -939966 30627 699615
38712 699615 571303 207288 305716 762310 987717 749595 299098 -67946 -185980 58924
38702 58924 602851 1079936 1127648 780565 359339 64935 -111991 -197341 -184045 -91826
38692 -91826 114862 538879 1071494 1284490 915279 329449 122355 311384 345272 -24053
38682 -24053 -324529 -64596 485167 609580 140463 -282495 -68706 517773 723160 350682
38672 350682 21999 268596 771214 874599 583094 500420 841752 1101588 859233 387837
38662 387837 175739 265391 404552 510418 630844 723672 798468 1002831 1265656 1185221
38652 1185221 628853 88122 7687 127546 14083 -133239 101014 397343 7549 -1027121
38642 -1027121 -1781567 -1701556 -1220563 -911127 -723484 -418687 -155581 -175931 -316450 -291637
38632 -291637 -190136 -287218 -541923 -623962 -356902 86145 357456 195745 -361286 -950440
38622 -950440 -1206678 -1124634 -925744 -653865 -231973 135276 81676 -311015 -487591 -178718
38612 -178718 245004 384679 330524 287333 138449 -202663 -373661 -9951 594978 782865
38602 782865 411895 -5163 -49978 127552 191685 137156 209091 489560 787278 893926
38592 893926 781102 529168 222191 1235 47656 287425 236468 -480314 -1440771 -1723622
38582 -1723622 -1078093 -306899 -158070 -355652 -248937 79517 119858 6159 342750 1035530
38572 1035530 1244793 654649 -56413 -260821 -126249 -18336 91068 232357 142756 -184820
38562 -184820 -259636 136205 488906 336336 -21290 -95249 9968 -66835 -265954 -322886
38552 -322886 -287004 -297362 -197334 118077 337166 235066 161846 460986 780362 617228
38542 617228 233992 295326 770282 937733 466564 -161933 -391709 -230476 -32471 -25245
38532 -25245 -156310 -174674 132403 616760 819913 540384 142061 62626 253093 362675
38522 362675 224271 -103158 -491613 -688901 -432037 130327 492728 488487 455870 490903
38512 490903 203477 -401488 -575981 32651 647611 535257 192032 425140 914193 835905
38502 835905 423253 598060 1290396 1446096 710996 -105231 -359926 -251953 -12974 466943
38492 466943 944952 797526 36208 -555459 -603227 -568513 -723006 -677679 -326559 -281496
38482 -281496 -820551 -1259802 -972890 -301862 120996 263749 334718 216298 -113439 -210468
38472 -210468 136492 397009 140597 -155751 139760 728421 843022 461659 251754 477943
38462 477943 725347 672550 466758 258096 -70227 -529121 -789080 -554479 23608 485954
38452 485954 558931 402280 322461 318002 128357 -219329 -296658 14155 141753 -296886
38442 -296886 -653807 -102399 923702 1166152 401011 -241793 -24007 470540 572288
38433 572288 566591 840579 1010475 731723 504313 750425 874558 275386 -389790 -124392
38423 -124392 733187 1017190 608258 480578 948373 1193880 765172 335959 504042 819123
38413 819123 614824 61865 -268246 -358213 -584495 -905310 -856228 -312991 227969 264011
38403 264011 -76069 -197204 206409 740399 806488 413131 176940 454965 861325 877832
38393 877832 570532 329520 213402 36239 -97263 115825 596466 870970 678720 232498
38383 232498 -149361 -364357 -481849 -642723 -967122 -1344395 -1437759 -1130525 -760173 -613985
38373 -613985 -470676 -61701 297958 108919 -468495 -803619 -743762 -710326 -848340 -786429
38363 -786429 -388927 -78078 -140584 -284621 -197460 -39118 -33965 -14541 241633 573809
38353 573809 706727 660420 558669 335813 -4557 -139712 137284 473138 408945 101524
38343 101524 82779 394102 522131 242809 -36183 21448 156620 57946 -3706 372704
38333 372704 874215 743889 -76457 -712967 -522134 66740 294295 188285 312079 675854
38323 675854 677997 155193 -258087 -80117 327499 407819 243932 252894 399467 272453
38313 272453 -206542 -642026 -721684 -572608 -547951 -861346 -1376526 -1630932 -1240233 -422019
38303 -422019 141181 137355 -32449 -6679 -86033 -609640 -1126650 -908929 -100567 402662
38293 402662 223474 -64656 87284 463234 603406 528642 559786 750547 845569 621609
38283 621609 65491 -620686 -1080255 -1071887 -760384 -526978 -465341 -337802 -43066 220452
38273 220452 315930 324530 257122 7445 -284261 -248697 143964 455293 442715 404178 563334
38262 563334 592584 201031 -214812 -96510 360666 459659 66818 -221965 -38803 231155
38252 231155 90154 -387964 -797559 -958675 -922037 -695422 -307817 23297 108462 69823
38242 69823 130593 218564 91657 -187253 -249825 45709 395039 477830 331212 148816
38232 148816 -11306 -108054 15639 338116 451363 41073 -545790 -642161 -152195 317740
38222 317740 272911 -125130 -422239 -376825 39188 724061 1307664 1319240 766304 193198
38212 193198 -94354 -419245 -974973 -1189275 -495149 591846 957254 372055 -272123
38203 -272123 -296825 -56364 -150566 -490210 -626238 -554709 -637705 -930249 -1068818 -789943
38193 -789943 -229778 285334 523039 448423 225613 96440 145088 240451 275665 318122
38183 318122 416559 448725 338112 250044 351128 518924 538853 457858 447662 422722 162128
38172 162128 -210779 -279497 44542 346271 333941 268334 485551 818490 872811 639788
38162 639788 403904 213495 -68619 -292551 -163184 144340 126311 -175628 -111126 496983
38152 496983 905168 554614 -32279 -123968 26492 -271059 -811255 -748234 -34959 472047
38142 472047 423088 421603 788800 927466 418682 -167551 -205195 22561 11008 -5480 386093
38131 386093 815885 659589 161644 101798 548833 826472 613527 246791 -26047 -288545
38121 -288545 -441123 -240905 60405 -117429 -743272 -1141710 -1069431 -1048011 -1339690 -1374058
38111 -1374058 -677625 251393 575733 216011 -206117 -233495 58268 336229 302376 -89254
38101 -89254 -461442 -333199 178008 366124 -60507 -458232 -191537 345139 297724 -342098
38091 -342098 -763385 -600776 -390501 -583216 -797003 -466108 239637 650097 511847 192281
38081 192281 46974 26159 -19218 -20435 103136 169387 -40420 -380264 -460494 -172094 195189
38070 195189 421360 622028 867884 870433 400069 -211552 -446792 -377534 -544019 -1034437
38060 -1034437 -1274118 -960575 -643901 -925359 -1489869 -1520798 -870718 -207274 -21170 -76531
38050 -76531 16931 201848 219713 81169 -46264 -178829 -407716 -585227 -442043 936
38040 936 374491 353986 -5602 -333731 -307506 -15703 57624 -400116 -988981 -965001 -255466
38029 -255466 349318 302661 77733 300832 601071 175293 -764643 -1152951 -709320 -309660
38019 -309660 -414625 -281064 595184 1302752 800560 -370510 -836561 -386797 3067
38010 3067 -100319 -125334 188533 256137 -224805 -644966 -465449 -9918 208770 247464
38000 247464 325212 278718 -52612 -392623 -455377 -387650 -385265 -289754 44671 382772 475034
37989 475034 421185 360987 207882 -27607 -107072 -47541 -227768 -686346 -867538 -468763
37979 -468763 7680 8107 -294619 -463438 -502062 -543310 -345590 259497 831241 873575 584869
37968 584869 458152 467044 248450 -205502 -613061 -881066 -1011058 -864393 -510128 -386808
37958 -386808 -594661 -544191 58168 461945 -57764 -906326 -952196 -248993 105356 -337747
37948 -337747 -895604 -961693 -698857 -411961 -114271 101644 16719 -225414 -241155 -113799
37938 -113799 -324021 -899480 -1292459 -1202056 -898932 -645741 -389777 -119168 15537 -8410
37928 -8410 -125664 -416613 -818863 -854237 -285070 240957 -3126 -628256 -664282 -87522
37918 -87522 251499 141189 265202 831162 1141576 855909 582701 775646 1018768 889309
37908 889309 640978 537937 340027 -51267 -212626 48872 298172 260973 240927 331105
37898 331105 78673 -537922 -704845 -35905 596379 307217 -437765 -596173 -106188 266703
37888 266703 224406 141432 207868 220441 148403 205821 368797 357547 86727 -256885 -502858
37877 -502858 -562933 -390540 -153686 -194624 -536177 -738119 -534792 -234011 -134285 17889
37867 17889 513612 1010907 959240 460246 137712 251964 428841 253903 -232393 -660877
37857 -660877 -739965 -540428 -444017 -697471 -1039382 -1028428 -703244 -516557 -615060 -703860
37847 -703860 -702333 -915389 -1336217 -1412988 -868653 -202270 33022 -31148 20484 183556
37837 183556 174629 -58235 -338573 -503279 -414920 -75421 136949 -177669 -716556 -708259
37827 -708259 -48240 511112 553240 543830 781927 710465 -85542 -991869 -1231827 -948033
37817 -948033 -664720 -341055 195281 502585 179077 -242449 -52909 396631 252511 -385616
37807 -385616 -671213 -469186 -461083 -820848 -920076 -525788 -251840 -475517 -684188 -349298
37797 -349298 235242 467637 299512 150374 305438 746659 1319073 1767448 1788291 1297957
37787 1297957 591764 117325 100432 380396 584598 543865 527360 857488 1291790 1176533
37777 1176533 374073 -391563 -412274 163304 711538 971821 1064353 996985 680337 282764
37767 282764 137426 355847 763547 1049742 860128 114517 -599068 -472790 393507 919923
37757 919923 501441 -150104 -181524 120863 35447 -265751 -138410 217364 21999 -662726
37747 -662726 -907720 -379710 164245 39579 -538661 -1000449 -1070282 -691140 16360 537139
37737 537139 360133 -217220 -317846 285844 817480 627749 53214 -208346 -54440 93070
37727 93070 -67338 -502719 -989896 -1192165 -846576 -114136 468209 555764 310919 51699
37717 51699 -142415 -339047 -532420 -685449 -794824 -777930 -474620 105820 669853 873466
37707 873466 604579 39262 -470236 -600320 -307913 120848 378208 438128 445631 417320
37697 417320 245921 -35695 -166760 127297 856525 1656419 1998852 1675799 1057217 679239
37687 679239 644248 704874 814377 1116047 1418741 1293395 822757 631546 935164 1183329
37677 1183329 961403 603297 503748 470992 280802 254154 652310 1037671 939595 701846
37667 701846 910891 1333628 1221228 478410 -197908 -271120 116715 492297 458647 -90725
37657 -90725 -763030 -891544 -323616 331605 560954 566146 624259 462707 -121945 -641820
37647 -641820 -657901 -569635 -843279 -1030984 -537711 141712 88471 -475522 -486783 254193
37637 254193 857787 803388 481353 197732 -242413 -736642 -708228 -82523 412982 275999
37627 275999 -161346 -426111 -512403 -532463 -432997 -347038 -615327 -1159821 -1372733 -912647
37617 -912647 -163255 317943 402162 283716 158740 146145 224741 203338 -4395 -184231
37607 -184231 -159375 -66231 29273 374618 919700 993762 296533 -312140 55460 811228
37597 811228 633465 -512330 -1295718 -965103 -197730 176299 216634 307718 462531 568937
37587 568937 624559 468607 -72974 -638910 -620902 -100041 218745 69758 -129754 -128344
37577 -128344 -102891 -25462 333461 663923 312722 -600532 -1179024 -1063660 -835939 -891956
37567 -891956 -879416 -558852 -278031 -219359 -66650 206908 108229 -417718 -676724 -311855
37557 -311855 133527 170678 44223 14016 -173638 -590630 -755881 -518264 -481418 -942908
37547 -942908 -1235270 -828918 -326325 -544219 -1224067 -1498782 -1177466 -751323 -454504 -86638
37537 -86638 401765 766542 836256 629656 252661 -55566 -18758 305792 537912 507934
37527 507934 402359 267566 -114907 -677605 -962169 -816797 -634729 -631856 -495899 -90846
37517 -90846 112703 -234496 -717554 -717823 -221181 330858 629224 584034 177244 -423526
37507 -423526 -853636 -872274 -488268 224301 1059128 1507269 1211693 568620 258997 223646
37497 223646 -150641 -828288 -1000784 -330126 551706 1023009 1119720 975441 501588 -79074
37487 -79074 -259975 -118571 -256281 -597000 -308166 667150 1165433 547116 -214945 -35215
37477 -35215 664662 804246 308705 -113943 -242100 -340386 -320083 106120 671880 801137
37467 801137 467608 168870 191654 394008 511908 310383 -259324 -752712 -536263 285053
37457 285053 803660 534232 60939 35420 255371 299678 337369 593396 680628 274682
37447 274682 -111920 115913 577701 494606 -36464 -227869 179470 711810 1022095 1175901
37437 1175901 1153269 788358 252333 24306 284419 708601 879652 637242 114516 -329109
37427 -329109 -348439 18232 402159 637619 915474 1256313 1267166 718894 8813 -275334
37417 -275334 -15617 412452 541882 157586 -469375 -698742 -243684 317950 245365 -313821
37407 -313821 -631257 -578840 -637584 -814081 -573591 67254 444336 410904 493952 669606
37397 669606 221848 -779739 -1154025 -383572 482590 435293 -107497 -321876 -296213 -409190
37387 -409190 -389599 -7575 160105 -316133 -758405 -393707 348637 548978 194089 -113279
37377 -113279 -274464 -543190 -726443 -477394 -31356 135675 26171 -130695 -366320 -610024
37367 -610024 -432402 205580 570728 182660 -424247 -600909 -521728 -552288 -473976 -95785
37357 -95785 153112 28851 53052 480497 587002 -88039 -704367 -383706 340677 460315
37347 460315 83428 -71317 -13712 -112438 -123212 158574 -407 -1151829 -2285025 -2008573
37337 -2008573 -618589 421960 611911 579921 546080 171051 -280164 -142814 343128
37328 343128 323597 -117526 -55539 617535 979624 641391 258364 289149 406556 381688
37318 381688 482993 723652 673971 300916 141527 386826 557178 314640 -80442 -305515
37308 -305515 -363833 -300709 -63806 255459 460987 529206 523198 400677 221298 226084 373833
37297 373833 261675 -101508 -58978 631948 1196401 968428 408627 219559 186358 -167633
37287 -167633 -464971 -86313 657544 1031366 1046616 1081329 890585 172681 -374167 133132
37277 133132 1194565 1450802 612180 -315035 -608420 -490426 -257172 150874 605022
37268 605022 714254 428831 91121 -76342 -44155 194465 386006 63455 -644940 -870030
37258 -870030 -267155 331490 235109 -47043 47522 -36950 -807120 -1357446 -643676 626140
37248 626140 935948 263384 -110514 296439 772165 869433 846014 803664 630005 596260
37238 596260 895775 940485 241532 -497867 -389005 106618 -4068 -478625 -401843 10310
37228 10310 -169780 -735267 -653065 -23845 -8195 -802530 -1306499 -923257 -236269 238088
37218 238088 638001 971113 952243 729960 740493 878052 747218 499204 481120 492708
37208 492708 385599 739601 1757187 2284540 1388962 123486 53578 773816 779229 156930
37198 156930 261182 1085134 1227712 463295 170951 940213 1679295 1484184 742455 68808
37188 68808 -375679 -327069 400770 1107078 925541 264156 163381 500972 369356 -95897
37178 -95897 18478 574611 602844 144082 76542 307336 -17606 -692738 -738166 -321936
37168 -321936 -453192 -937620 -662941 225552 530263 263329 528719 1214397 1083321 212120
37158 212120 -6382 526028 371719 -739596 -1298470 -593459 289198 559132 728164
37149 728164 1030073 874848 379209 482897 1104387 1104617 412489 187833 585056 462440
37139 462440 -347217 -631601 -58113 293479 48714 52679 398546 130354 -689111 -817803
37129 -817803 -138331 94735 -335676 -256640 480850 646763 115048 225444 1161388 1475230
37119 1475230 799307 504537 1048281 1229290 727705 753734 1450216 1347881 237934
37110 237934 -132555 827107 1446387 823540 286040 729989 1143745 933731 1095958 1858116
37100 1858116 1760799 385640 -514472 108403 1057396 1427958 2103797 3411797 3886708
37091 3886708 2855034 1823440 1857044 1939951 1305883 971207 1512922 1686173 709047
37082 709047 -306831 -503059 -605103 -972074 -706331 191631 296293 -523113 -495500 840422
37072 840422 1610020 950180 437094 883283 795985 -453305 -1030211 44446 962346
37063 962346 363774 -356815 132119 748617 382794 -4890 459877 825217 449392 394331
37053 394331 1136466 1413400 741717 478286 1195203 1795967 2191693 3630547 5407832
37044 5407832 4921616 2228360 666019 1506419 2027527 551312 -800197 -322869 454039
37035 454039 277254 442904 1469572 1555737 379662 265311 1626871 1697569 -244710
37026 -244710 -1150244 226178 1065387 33433 -244896 1291833 1768808 241913 60740
37017 60740 2352683 3282725 1209391 218707 2668906 4659934 3225308 1601026 2687680
37008 2687680 3663235 2025563 669743 1901563 2739033 1209130 717192 3050689 4066245
36999 4066245 1649849 444003 3014710 4411263 1663558 31139 2980889 5096024
36991 5096024 2521700 850938 4229688 6682847 3573735 1195748 4735126 7703027
36983 7703027 4600924 2436912 7154667 11044475 7633613 5751447 13034190 20048374
36975 20048374 18943667 21521776 36856814 48972343 44127143 41299962 61121547 84729843
36967 84729843 90778539 117282389 220373452 365298156 429437231 347182637 196361948
36960 196361948 98162896 77430209 73561130 51458215 34057152 37768160 41309671
36953 41309671 28829731 15744057 15769931 17764291 10865297 4264585 6899508 10467077
36945 10467077 6633884 2114900 4000331 6423329 3336026 218449 2479745 4919325
36937 4919325 2477903 -11782 2144834 4271808 1688457 -1287274 165028 2559280
36929 2559280 1424162 -510131 403666 1574632 -3702 -1532983 -202608 1155251
36921 1155251 -98619 -1085523 707259 2254235 908499 -372616 1190271 2862227
36913 2862227 1847114 588946 1635125 2481803 602234 -1321825 -262595 1582583
36905 1582583 1024180 -465623 -111140 956597 436635 -623192 -306008 341581 -183527
36896 -183527 -592381 406016 1184991 377621 -212410 939033 1962898 1085467 -11215
36887 -11215 540427 1350698 737765 64043 1020586 2481134 2950113 3245736 4022417 3660444
36877 3660444 1398814 -442153 -117613 648781 75385 -502199 368315 1221550 574280
36868 574280 -118824 650697 1470808 812070 -23935 372504 693633 -273237 -862790 394617
36858 394617 1679990 1002254 -234853 25964 731789 -6910 -1243168 -1153013 -538547
36849 -538547 -1046553 -1823269 -1231541 -174072 -500111 -1610215 -1672375 -854138 -545349
36840 -545349 -683269 -440988 -239528 -677355 -884411 -178627 251690 -489696 -991667 20817
36830 20817 1169758 802436 -82182 109100 540183 -217299 -1165871 -670017 355569
36821 355569 47707 -1027693 -1050518 -222420 19668 -125166 410924 1029388 510475 -420088
36811 -420088 -303452 282220 -105224 -840599 -316462 908158 942199 -106312 -475868
36802 -475868 47403 39756 -731038 -999622 -413333 100872 268861 615590 864816 269353
36792 269353 -656270 -724420 -173707 -248329 -927202 -1015595 -345740 -9171 -422915 -843310
36782 -843310 -815526 -669095 -625414 -607193 -700019 -796295 -320683 696554 1101156 288843
36772 288843 -601794 -429790 139866 464 -418875 -178942 320655 287844 222680 791460
36762 791460 1124158 263421 -717828 -232910 1067467 1339822 617056 471831 1127580
36753 1127580 1288293 597589 9221 -198310 -668201 -1255528 -1072355 -296424 -80298
36744 -80298 -577779 -788300 -421372 -245551 -501690 -556966 -251363 -136612 -296732 -262014
36734 -262014 -84078 -220726 -447334 -146949 454102 575453 223490 53503 152821 141722
36724 141722 153734 516403 835264 588441 171908 146233 40755 -745127 -1489272 -1113526
36714 -1113526 -52926 417884 244442 368865 877201 1027470 809145 863890 1113168
36705 1113168 984079 685100 760894 797917 158441 -475477 -41317 851541 709972 -296202
36695 -296202 -575825 201033 693875 281462 -102159 164118 485916 451608 534811 940748
36685 940748 1140331 932822 730982 571504 70706 -535427 -576641 -202117 -149205 -331283
36675 -331283 -77988 330997 -8521 -784258 -712814 216066 564341 -125952 -555597 87061
36665 87061 828856 656412 29429 -252381 -368940 -717737 -951578 -712453 -409619 -437545
36655 -437545 -438534 -86616 185199 -20989 -269194 -37222 345443 270845 -76156 43155
36645 43155 812200 1566615 1603506 961936 322684 206225 394783 365941 192557 439818
36635 439818 1062761 1212670 532767 -233599 -511854 -779572 -1347485 -1350527 -192364 956053
36625 956053 640554 -582443 -997857 -398434 -135781 -741617 -1295417 -1207277 -945567 -784213
36615 -784213 -382266 102562 -61208 -793867 -1085628 -607021 -162261 -207925 -203287 170382
36605 170382 388789 156107 -27448 160119 338313 274718 271957 355278 71143 -559908
36595 -559908 -873684 -664660 -472861 -492952 -258178 266541 398787 -15338 -160168 407122
36585 407122 984214 894002 511753 477927 674976 639740 357034 69640 -167736 -300114
36575 -300114 -160417 98147 -1875 -515732 -860805 -635018 -142448 135975 106530 -85356
36565 -85356 -296186 -355769 -224862 -167736 -322131 -288191 258162 821500 740793 310533
36555 310533 296725 570312 369402 -172995 -74169 756194 1134172 406908 -519034 -569703
36545 -569703 11200 238859 -256246 -1070018 -1706420 -1898837 -1601061 -1002729 -334302 377436
36535 377436 1050850 1259342 773684 184721 254671 796753 987864 646696 314375 169932
36525 169932 -148445 -621276 -718291 -303569 186883 519530 774144 736182 140952 -500455
36515 -500455 -357003 398096 767736 498846 373068 803573 1259431 1303115 1132597 862887
36505 862887 319700 -225769 -178070 296883 383254 29090 89525 767810 1137804 673074
36495 673074 92250 126343 488151 638200 614749 546942 254368 -131454 -28990 586393
36485 586393 895394 465457 -75233 -99712 122190 115761 -28026 -129972 -414240 -955732
36475 -955732 -1293900 -1105658 -681009 -345253 -18582 334617 469277 353644 248237 106099
36465 106099 -369675 -937810 -963552 -538121 -501872 -1077543 -1449392 -1056730 -373778 -16468
36455 -16468 42143 -1831 -175164 -308799 -73776 309366 303063 178959 844459 2277444
36445 2277444 3274653 3133161 2455538 1896211 1309079 624792 343298 531902 476502 -36560
36435 -36560 -217969 300499 696706 350381 -107510 62667 555273 814063 982257 1244935
36425 1244935 1195696 699860 469469 940434 1445785 1303128 860703 697012 668959 518396
36415 518396 517295 744427 644284 58533 -278561 -30050 26705 -594836 -1102151 -806351
36405 -806351 -364584 -548105 -842796 -467655 205973 489343 679368 1231439 1534018 888107
36395 888107 -96982 -485115 -614925 -1249191 -1860075 -1400662 -256470 251968 -13429
36386 -13429 -31214 422865 486495 -69631 -358894 116287 743988 896206 686151 365692
36376 365692 -97645 -581284 -733327 -542134 -338680 -183417 105829 353881 157120 -392650
36366 -392650 -773372 -820707 -846695 -988375 -1001074 -708198 -220875 239680 435938 234357
36356 234357 -122127 -228823 -219413 -655634 -1427337 -1591739 -832415 -161960 -413537 -953544
36346 -953544 -870000 -549049 -822636 -1264723 -802240 358785 883751 299610 -473891 -652582
36336 -652582 -489595 -457168 -494745 -355074 -36634 294505 384759 6721 -604329 -782086
36326 -782086 -389733 -217059 -765460 -1274371 -838470 106869 463580 134703 -117304 -65561
36316 -65561 -86340 -145120 77550 274586 -76832 -582339 -418519 206123 338752 -70516
36306 -70516 -140861 292203 365171 -261776 -815154 -715068 -343396 -133165 71835 338876
36296 338876 266105 -276524 -800151 -948547 -911184 -855466 -665583 -450489 -584983 -1032123
36286 -1032123 -1285107 -1115306 -730677 -182868 613399 1253816 1092738 222312 -591724
36277 -591724 -1001457 -1276172 -1425934 -1104719 -476453 -162808 -160131 169098 819583 954485
36267 954485 335599 -149735 106572 495629 260339 -366447 -749731 -851694 -972714 -1057719
36257 -1057719 -873474 -468617 -12400 442139 745073 656791 296694 81131 51828 -145661
36247 -145661 -495763 -556248 -342233 -431167 -897514 -1031077 -546747 -189117 -546055 -1070322
36237 -1070322 -999696 -571601 -509616 -791109 -757647 -188309 453207 722756 603322 289111
36227 289111 -30604 -224812 -294552 -287917 -68903 538906 1291429 1600683 1232539 565693
36217 565693 51021 -174175 -83805 279501 538199 275652 -248531 -325489 95269 288898
36207 288898 11004 -9429 673805 1326568 1111198 376878 55955 293007 539103 634253
36197 634253 882178 1214650 1143552 577995 8549 -196518 -130416 47424 301613 440569
36187 440569 178419 -345838 -560261 -220610 169122 4203 -586682 -922016 -710496 -417533
36177 -417533 -541701 -859147 -763775 -208259 203158 126525 -72159 -45199 -76460 -478236
36167 -478236 -867405 -724141 -323148 -314386 -590417 -460142 97658 295803 -193209 -714624
36157 -714624 -668655 -281171 13186 224490 436293 455959 284234 319228 638667 686892
36147 686892 177207 -289278 -86788 482239 727243 606314 553663 642185 617325 511155
36137 511155 550303 617108 420285 87871 22269 251809 458837 579290 839723 1212628
36127 1212628 1345923 1107208 794011 716963 867905 1028609 971342 607338 171872 118495
36117 118495 523553 778045 294515 -604875 -1005502 -579036 82615 390009 460477 650168
36107 650168 861665 740561 292378 -134044 -368496 -526180 -605937 -377578 191013 708099
36097 708099 810823 660432 702596 1023185 1246993 1082141 672287 337351 235096 376606
36087 376606 687971 905064 702884 142731 -286406 -310684 -255614 -489233 -804816 -775061
36077 -775061 -451603 -211403 -97551 130295 383933 271217 -233138 -663520 -712026 -571953
36067 -571953 -543765 -677466 -869363 -968588 -780963 -317107 26155 -61291 -262199 -71222
36057 -71222 347851 388191 34419 -83114 241429 454273 205744 -122244 -188996 -246951
36047 -246951 -467221 -409210 248973 999731 1145007 737831 333127 183232 221692 463910
36037 463910 833381 914165 485714 39527 158294 618972 752507 504041 430380 709379
36027 709379 867993 591954 179392 -9454 -46635 -143329 -266742 -304239 -302352 -291791 -102223
36016 -102223 396427 990637 1270583 1060665 610139 371629 605661 1143637 1517494 1365100
36006 1365100 726965 -40852 -584888 -785128 -785006 -844104 -1062755 -1215661 -984625 -397765
35996 -397765 123654 230421 -4326 -279432 -417970 -399007 -231239 9208 133388 22492
35986 22492 -197389 -293986 -196159 -43594 -38026 -289961 -703327 -970451 -829504 -394644
35976 -394644 -82060 -136885 -383029 -500590 -374882 -105095 131911 143094 -136955 -464974
35966 -464974 -493029 -274168 -279992 -722861 -1165968 -1118902 -772087 -715248 -1036376 -1174737
35956 -1174737 -752281 -142440 33239 -276436 -547459 -407572 -53160 138509 153906 266586
35946 266586 528928 636523 359545 -122395 -444119 -448318 -237621 -7873 30932 -239024
35936 -239024 -620093 -659696 -175711 417273 558318 200029 -229376 -394119 -295941 -62691
35926 -62691 184510 296568 212103 78789 39057 -1732 -149982 -232082 -57310 176377
35916 176377 126317 -151223 -304431 -244300 -167516 -81109 230032 748830 1166446 1309403
35906 1309403 1255512 1050915 711359 448913 440762 421416 17089 -532326 -551386 111461
35896 111461 848052 1101012 884193 428711 -103929 -433599 -292813 60240 25211 -447274
35886 -447274 -716473 -414172 53109 217976 150398 28878 -255186 -652813 -707433 -254649
35876 -254649 113573 -184819 -872042 -1221634 -991733 -489593 -18013 275867 258140 -35769
35866 -35769 -287212 -290430 -260116 -446085 -699070 -736019 -581709 -433987 -340783 -305679 -447279
35855 -447279 -752065 -929374 -805659 -606732 -572358 -560641 -321440 81193 376080 396609
35845 396609 122428 -317388 -587262 -465480 -285565 -543458 -978822 -752964 199749 796286
35835 796286 280973 -644918 -825377 -183941 472429 692669 639286 458720 169213 -37407
35825 -37407 -40075 -122752 -490230 -756797 -547517 -263264 -499220 -990145 -976204 -448591
35815 -448591 -148700 -350529 -500299 -190690 258761 402784 246953 24689 -109980 -33182
35805 -33182 257974 436376 177352 -269392 -316192 130283 563823 618026 382906 -33711
35795 -33711 -655030 -1230270 -1285832 -803009 -332542 -215973 -182322 64434 383460 619873
35785 619873 971266 1516044 1808320 1453231 795055 496786 603963 582441 249529 77702
35775 77702 387784 758563 654004 311008 428727 1035200 1297250 705154 -102821 -192898
35765 -192898 358122 647922 268751 -256173 -369128 -117246 255417 684009 981095 781181
35755 781181 144383 -334587 -389857 -497703 -999467 -1387906 -1031545 -141565 569631 791741
35745 791741 615052 62709 -714739 -1142454 -830586 -229192 -30315 -186307 -177988 48035
35735 48035 171324 277156 698899 1197956 1141085 497942 -93953 -271006 -221836 -34133
35725 -34133 432536 920524 817202 62361 -645990 -784552 -557949 -329146 -102558 164766
35715 164766 267636 68048 -270969 -556979 -752864 -837268 -835131 -936549 -1159716 -1048314
35705 -1048314 -289467 537202 604168 153149 245510 1109592 1744204 1465739 841866 583311
35695 583311 461785 52430 -256046 91186 696711 707202 169197 -16489 524773 1079011
35685 1079011 848855 -16169 -681682 -652774 -261262 -140530 -389451 -497771 -168195 163503
35675 163503 14579 -277599 -41398 556309 686398 245394 92004 607701 1031215 788485
35665 788485 523435 953834 1480940 1024635 -202031 -863646 -309748 741627 1317937
35656 1317937 1169886 600223 55561 -32153 364217 596242 67452 -804623 -1055775 -580133
35646 -580133 -224456 -367487 -361660 225712 725664 385585 -404031 -687176 -324401 -19215
35636 -19215 -192657 -556040 -729734 -663414 -439534 -184984 -178084 -540811 -824680 -445609
35626 -445609 402319 835526 453647 -133236 -236382 -27539 -113195 -559485 -866153 -720918
35616 -720918 -306509 65909 245838 216200 94783 98954 235292 163485 -298636 -707646
35606 -707646 -484441 230622 734407 760030 743390 978043 1104618 751551 202754 4170
35596 4170 198685 351296 173729 -196946 -455252 -442093 -263156 -195610 -378958 -594942
35586 -594942 -540530 -260895 -7554 239701 632858 885038 505575 -260350 -472048 189796
35576 189796 872064 797251 352678 286137 475978 349732 22552 37872 266916 77792
35566 77792 -499792 -752505 -457060 -146448 -74264 156031 637764 728247 81817 -578220
35556 -578220 -357548 562970 1181926 953889 288455 -158162 -255828 -345476 -634292 -867680
35546 -867680 -687486 -191190 159727 229677 384851 742730 744829 -9614 -905937 -988503
35536 -988503 -270137 372447 488589 437191 483822 373644 680 -278183 -305051 -418220
35526 -418220 -751061 -874358 -544538 -234827 -438655 -884649 -924048 -388105 332632 800403
35516 800403 818763 486616 218709 418908 923012 1106629 740926 329568 350396 602426
35506 602426 629956 399821 203427 216610 470867 938632 1373030 1420087 1146907 1039380
35496 1039380 1201853 1073613 335357 -424663 -475047 60032 521764 644888 569243 290822
35486 290822 -210897 -556695 -386703 -25421 -34293 -243211 13618 740222 1163810 891348
35476 891348 411836 201741 50754 -338043 -702846 -690045 -499783 -496139 -485630 12857
35466 12857 911399 1532093 1464757 981465 513149 145168 -180824 -335632 -179531 152227
35456 152227 446107 735635 1106569 1305729 975590 295373 -73632 138821 408659 183708
35446 183708 -297303 -354212 202579 917203 1300360 1160498 473444 -550695 -1305949 -1247699
35436 -1247699 -609835 -197365 -361205 -647835 -585069 -291046 -85467 -10129 -40441 -296319
35426 -296319 -672670 -702868 -228599 195194 73486 -208877 39685 674802 878611 427031
35416 427031 58659 380174 1009606 1157727 643992 -39918 -389939 -251442 249925 737538
35406 737538 681033 -87818 -952663 -1043991 -324893 262848 -7244 -684135 -794303 -189210
35396 -189210 348593 288897 -8269 -28602 114875 30245 -259654 -452505 -506564 -556650
35386 -556650 -487855 -93772 434565 638696 380238 -84899 -549768 -962801 -1143375 -843979
35376 -843979 -156037 487472 748129 572171 70326 -439388 -435209 274993 1109490 1310391
35366 1310391 920642 609764 580516 334217 -375112 -1061720 -1268448 -1216378 -1328718 -1556284
35356 -1556284 -1544330 -1147523 -494069 182205 573784 469336 67473 -174805 -116634 -15085
35346 -15085 25902 231174 651338 974123 1035937 1050834 1108823 927214 379482 -173734
35336 -173734 -386656 -368339 -342346 -263096 -66802 65533 -4585 -142877 -237957 -387622
35326 -387622 -575433 -528052 -121310 407175 809414 1020012 910169 341003 -403613 -767284
35316 -767284 -648220 -421991 -172600 349721 866634 625410 -298756 -742537 -109683 651999
35306 651999 524335 -10301 103544 699770 739546 63378 -439930 -330747 -173656 -446069
35296 -446069 -782669 -593523 149054 954856 1276081 892709 153419 -273962 -186386 -119989
35286 -119989 -491901 -875637 -669215 -96292 130022 -151177 -541052 -864517 -1224290 -1459948
35276 -1459948 -1305332 -966649 -831729 -740003 -287369 282938 335214 -62482 -174445 216654
35266 216654 543781 525438 595668 945929 984234 263025 -699630 -1109163 -974821 -944782
35256 -944782 -1312621 -1684082 -1570962 -979849 -367365 -148200 -289273 -407831 -265171 -12713
35246 -12713 119506 129843 77717 -83927 -249571 -73554 493228 901736 677451 107130
35236 107130 -204720 -165432 -80120 -28918 71082 89512 -22638 102075 608755 837423
35226 837423 230167 -536038 -371334 485381 737776 38148 -544663 -301584 133956 77219
35216 77219 -93365 153396 431413 163548 -307912 -242823 310301 681187 642884 554107
35206 554107 590565 503804 143735 -267408 -432284 -266315 74807 268564 62556 -387136
35196 -387136 -601111 -373018 -54982 -51764 -272797 -341508 -174257 -90733 -402233 -1021417
35186 -1021417 -1454047 -1214118 -381723 350378 420836 70354 -48345 215949 443156 408928
35176 408928 380232 578932 828060 837138 462609 -305454 -1199046 -1627154 -1328361 -934106
35166 -934106 -1178447 -1676404 -1415888 -465598 -41086 -569219 -918870 -229848 620980 379894
35156 379894 -622113 -1060784 -642021 -298633 -571008 -945796 -878535 -517861 -198777 41687
35146 41687 205352 174820 30910 62541 305597 484144 496480 516939 531639 277088 -178595
35135 -178595 -294160 183060 704196 582255 -64148 -475122 -284954 55387 14431 -248248
35125 -248248 -193642 203758 363548 432 -347741 -53409 649789 954017 590188 102290
35115 102290 -31673 -3415 -190297 -528878 -694419 -601994 -421479 -294361 -270540 -345531
35105 -345531 -376035 -154164 270928 561554 542149 445276 527530 682379 656642 453973
35095 453973 299152 341700 560454 821249 909213 673786 247722 -62553 -184449 -350114
35085 -350114 -672050 -912910 -827778 -519892 -300788 -332866 -481594 -416101 78797 724676
35075 724676 872104 308939 -298473 -241381 207515 252701 -158145 -373925 -247507 -272048
35065 -272048 -410571 38298 1013376 1316908 363197 -753308 -823365 -234556 -80676 -357566
35055 -357566 -284008 116311 79668 -470865 -777159 -494882 -51515 238807 456882 487865
35045 487865 118755 -244017 62612 785832 946842 375903 27719 451508 964759 844809
35035 844809 423960 348366 490292 331221 -98294 -361101 -336511 -211693 -48713 129359
35025 129359 107451 -182176 -358233 -100219 287783 294805 -41950 -291179 -347002 -457158
35015 -457158 -622050 -513296 -51251 388110 484604 362361 313918 382591 393274 254530
35005 254530 61228 -79970 -224739 -517180 -919609 -1115948 -844990 -291376 89683 165237
34995 165237 255365 564898 818432 707640 408535 292406 319060 142945 -261167 -526593
34985 -526593 -479448 -363660 -350203 -228030 162631 515974 435609 38731 -189389 -79485
34975 -79485 45663 -76592 -239079 -56592 529819 1182358 1475144 1192280 477752 -201436
34965 -201436 -394155 -109428 181457 86365 -295937 -594847 -607149 -378012 -64180 80427
34955 80427 -186218 -723841 -969395 -611805 -102868 -70920 -405548 -466681 -114425 111716
34945 111716 -87727 -331652 -268589 -124985 -191825 -277066 -102281 152518 145566 -85173
34935 -85173 -271240 -323281 -228794 145457 743794 1111622 923912 448991 72072 -300275
34925 -300275 -849692 -1221814 -966979 -367433 -89406 -141295 41365 503020 614732 180823
34915 180823 -118758 250814 895640 1175475 1115386 1131443 1264807 1215273 876599 392632
34905 392632 -117036 -515937 -557719 -213178 115850 90410 -69448 -1451 115411 -145426
34895 -145426 -598955 -559752 79814 547421 295191 -162969 -39050 516626 676956 238406
34885 238406 -109143 79608 340840 146405 -217403 -199495 57043 50865 -69162 279630
34875 279630 925651 934233 54916 -717681 -536941 108270 268046 -56323 -207726 -91929
34865 -91929 -123204 -209465 169809 875513 1089714 577718 80099 133317 317083 110189
34855 110189 -236434 -241699 -27289 676 -136261 -195936 -280872 -585434 -842800 -643699
34845 -643699 -151558 77947 -95991 -302359 -310248 -263965 -282315 -313968 -409916 -674496 -923459
34834 -923459 -869928 -681746 -812440 -1180330 -1134785 -499946 -32796 -376582 -1059957 -1157854
34824 -1157854 -628951 -287826 -544844 -884911 -731100 -222432 152793 243736 208671 129188
34814 129188 28412 57638 297460 511466 443989 256755 305909 551089 597874 353690
34804 353690 206231 391110 571887 325295 -238171 -664584 -787083 -819225 -890372 -825849
34794 -825849 -452604 95706 468422 396214 -95714 -659718 -841875 -475619 129814 500211
34784 500211 474115 260198 77337 -77197 -291690 -551278 -754199 -810593 -687439 -447944
34774 -447944 -256661 -230213 -261004 -110544 277029 655456 719509 398567 -104070 -473554
34764 -473554 -479301 -134262 286034 463570 310469 -32989 -418468 -741737 -799126 -374835
34754 -374835 377693 869644 656963 -4571 -430983 -300239 66397 196902 -42616 -519083
34744 -519083 -1086174 -1566441 -1713878 -1472922 -1141212 -996229 -873240 -454283 93432 224979
34734 224979 -136652 -337577 119277 786607 805092 30365 -818292 -1071728 -759047 -327243
34724 -327243 -106459 -166396 -390120 -528517 -385188 -62287 138821 107436 17910 9040
34714 9040 22902 32901 156580 398067 509407 291364 -114041 -372585 -295267 35951 343801
34703 343801 333845 -14870 -317470 -173196 284348 505093 246573 -136620 -228836 -38797
34693 -38797 208639 423869 573059 547721 360061 216735 186014 65830 -208778 -356633
34683 -356633 -216874 -77059 -186745 -267964 59380 617023 902388 815042 686841 688042
34673 688042 640131 378058 -66146 -583231 -967758 -907217 -369913 121413 38709 -407382
34663 -407382 -522831 -80604 460405 678323 615564 409731 29773 -408485 -515488 -127312
34653 -127312 360551 445303 116299 -217752 -253461 -58398 89664 -7252 -285757 -479541
34643 -479541 -416732 -230603 -168546 -257664 -321090 -259488 -121127 51139 234016 336339
34633 336339 300771 222786 168975 6516 -332787 -593714 -564781 -549149 -993780 -1710623
34623 -1710623 -2008667 -1671338 -1266804 -1299994 -1543101 -1491335 -1088275 -667466 -462058 -488774
34613 -488774 -693341 -909765 -851229 -430882 30572 176900 105949 233294 684670 1040994
34603 1040994 777977 -98618 -927247 -983383 -248115 522488 612247 92683 -428168 -611320
34593 -611320 -585930 -468800 -198237 68940 -92157 -740430 -1251354 -995727 -140035 541606
34583 541606 536735 20829 -488035 -639826 -427470 -58513 260353 451107 517479 446821
34573 446821 251326 48322 -56047 -141037 -360548 -667752 -827482 -702946 -361588 77236
34563 77236 500366 735300 657258 369407 92214 -77026 -106784 110611 532542 767493
34553 767493 542351 238266 400668 772484 516393 -481203 -1287910 -1232885 -813813 -794089
34543 -794089 -1052178 -1032860 -841331 -1014443 -1434352 -1370389 -644935 33680 118191 -54757
34533 -54757 78509 449857 593584 406652 212497 207590 246881 164333 -20981 -277826
34523 -277826 -657722 -1060247 -1120943 -614021 90336 294360 -172344 -632321 -365481 422929
34513 422929 804479 297499 -530748 -770469 -183715 695592 1244012 1251707 863885 329289
34503 329289 -129059 -353540 -275307 67070 489143 678814 414485 -160701 -606764 -624580
34493 -624580 -335292 -55864 74350 126986 159830 133087 31649 -64728 -73870 -19093 -12580
34482 -12580 -131348 -310433 -378654 -217633 142899 594694 1033710 1327601 1312182 936613
34472 936613 353916 -221542 -674741 -943740 -958866 -765538 -578211 -551992 -611635 -641586
34462 -641586 -678797 -742951 -672257 -359923 28717 309999 529587 690264 532792 -10623
34452 -10623 -424796 -194722 408244 676463 457276 201834 140061 79007 -6290 103971
34442 103971 290929 143643 -279910 -439883 -231428 -187921 -542200 -843881 -817539 -807452
34432 -807452 -947832 -708279 135030 817736 626277 28221 -46184 410811 679225 570990
34422 570990 588892 920120 1088018 719145 90219 -215056 124353 882082 1325793 814699
34412 814699 -322448 -925121 -497930 -66206 -796289 -2195710 -2699620 -1887070 -990176
34403 -990176 -1026854 -1500662 -1450529 -919349 -631909 -738623 -705655 -320743 -103549 -523744
34393 -523744 -1226525 -1381180 -725222 47379 126684 -368020 -558056 -20446 651073 726962
34383 726962 307228 -13546 -53709 -63136 -103696 -37332 -3743 -280731 -680137 -666181 -135942
34372 -135942 428990 645084 567213 303614 -167035 -667363 -818968 -551426 -190606 89814
34362 89814 449300 875652 1012792 738722 451269 468960 539443 276605 -242557 -661020
34352 -661020 -854587 -920716 -862788 -632363 -377971 -354365 -593438 -832279 -772349 -376138
34342 -376138 38940 64620 -284737 -442022 31016 732530 833487 213302 -326619 -125413
34332 -125413 569675 1130467 1325004 1210923 742234 3107 -504893 -389466 1552 27404
34322 27404 -280522 -284017 220401 616203 317413 -473642 -1153812 -1503069 -1713671 -1862613
34312 -1862613 -1770752 -1349409 -751697 -139873 420355 772052 682337 225609 -113686 -3730
34302 -3730 255100 152746 -267105 -500779 -389280 -290502 -350795 -216545 216978 368911
34292 368911 -172465 -827456 -753788 -93528 291152 173082 178722 605239 928995 789750
34282 789750 620146 780861 788233 115330 -744436 -845072 -176356 349550 288800 242755
34272 242755 795242 1533326 1622262 1002253 462945 577973 1013603 1050453 508674 -110046
34262 -110046 -302409 -102445 120992 172663 154190 204592 332742 480375 578277 543501
34252 543501 361448 156077 50838 5682 -60819 -63544 126002 398265 490157 345487
34242 345487 156908 46894 -48256 -164102 -238284 -288818 -402776 -506529 -412517 -136207
34232 -136207 113503 292336 544103 824850 899975 818590 933182 1237835 1175399 472512
34222 472512 -258052 -250806 364791 801726 731394 565243 633819 689565 436135 90628
34212 90628 77923 409793 687687 621493 288932 -90842 -411591 -647531 -747311 -719439
34202 -719439 -745338 -991976 -1273065 -1140337 -496883 90187 17281 -514458 -695799 -188611
34192 -188611 421063 430393 -106563 -600788 -716286 -582852 -430692 -378483 -467339 -590470
34182 -590470 -498391 -168886 -21196 -386336 -871699 -711736 216512 1152406 1350146 871592
34172 871592 334628 184993 415989 760220 921161 749404 369272 58192 -66985 -115010
34162 -115010 -145537 -47974 221500 515061 726802 913115 1035095 858594 347388 -93271
34152 -93271 -75556 247814 438648 388512 309220 235445 -16335 -409282 -654924 -684739 -726398
34141 -726398 -807754 -640506 -186189 123998 32213 -102760 116536 484587 597380 574120
34131 574120 797468 1145610 1143417 825874 771731 1164494 1454363 1207414 746056 590830
34121 590830 693239 637596 323241 44826 41073 266683 518689 599885 474148 357663
34111 357663 455423 558635 251232 -370185 -642090 -259826 213004 155039 -228955 -350746
34101 -350746 -204162 -261149 -621816 -924921 -1021470 -1107344 -1177986 -952181 -438017 -44683
34091 -44683 11265 -50517 -58948 -163323 -434900 -607571 -449795 -83132 267691 570686
34081 570686 864357 1083205 1147058 1025657 665704 106363 -323227 -263984 159242 450507
34071 450507 453016 539916 947509 1346521 1347376 1093935 1032222 1291602 1562051 1469843 928811
34060 928811 244684 -85654 119944 429622 298666 -156591 -313707 -5016 230262 42257
34050 42257 -171414 23838 346658 263216 -171143 -473780 -474541 -357323 -158580 209322
34040 209322 516219 351198 -242608 -717230 -704050 -392208 -127909 27790 182754 316817
34030 316817 319079 213003 168029 272272 365871 173555 -353419 -898032 -1104354 -983949
34020 -983949 -802642 -622818 -272089 205433 446383 269868 -57902 -248938 -344973 -429575
34010 -429575 -370338 -157119 -127043 -447639 -695149 -433994 19178 -43084 -694104 -1228650
34000 -1228650 -1054156 -306296 450954 783506 634056 331466 346998 763020 1067593 793129
33990 793129 211926 -41447 70183 -42727 -642248 -1253793 -1382374 -1132159 -858480 -637922
33980 -637922 -403764 -260013 -294527 -311373 -103656 145751 59490 -390823 -798166 -790399
33970 -790399 -419555 -59373 -9804 -218484 -364460 -226852 59865 183766 37713 -194504
33960 -194504 -290277 -179437 70064 273932 180120 -271974 -742156 -789217 -413718 -46083
33950 -46083 56042 99249 317721 546698 474228 128518 -148058 -133504 67740 223013
33940 223013 234102 206598 315021 558426 650926 292235 -403158 -907203 -816703 -271748
33930 -271748 261433 496189 485259 386858 250699 36939 -252528 -497373 -531822 -343308
33920 -343308 -158043 -204907 -408666 -484047 -351435 -252232 -365519 -509357 -377428 59343
33910 59343 543815 842961 935186 937778 944275 912191 697820 271397 -138216 -273996 -209149
33899 -209149 -248453 -450109 -533446 -352493 -134696 -73352 -25776 110394 67053 -331841
33889 -331841 -642699 -280412 564967 1044373 746559 172666 -54744 6598 -88371 -417640
33879 -417640 -628329 -497496 -214829 -79135 -112144 -57765 272290 694772 787650 408890
33869 408890 -40495 -67288 307297 676210 890620 1152580 1433984 1310534 617559 -137493
33859 -137493 -342093 31715 573055 944848 958699 517455 -107829 -291725 163629 570187
33849 570187 237536 -483460 -731361 -474514 -457763 -853457 -934399 -336481 255760 151376
33839 151376 -362423 -643056 -681271 -823183 -994366 -901314 -667746 -585178 -475495 19359
33829 19359 676838 899256 611181 320991 311029 385317 443234 656245 938769 856460 310377
33818 310377 -198823 -276731 -167152 -266827 -498846 -542707 -389054 -249815 -99462 264791
33808 264791 750276 952868 716247 413958 467726 751040 755718 345463 16230 199799
33798 199799 582117 525328 47608 -153452 272985 848408 1038529 935410 784569 405116
33788 405116 -331394 -905965 -759843 -198329 50853 -54870 -11894 156590 -93213 -718828
33778 -718828 -952146 -505972 -50656 -126089 -356838 -201529 198811 436289 524824 628103
33768 628103 565804 145239 -349245 -477584 -197825 242590 650571 823712 542975 -26806
33758 -26806 -330470 -152901 91318 136419 355305 968803 1364291 931657 140885 -41808
33748 -41808 437733 726337 381206 -107794 -166743 178241 606782 928621 1025753 818179
33738 818179 459386 237712 195605 146853 87002 235103 615862 934491 961978 794365
33728 794365 661139 661845 707238 591701 212377 -155143 -19226 650109 1163140 898456
33718 898456 148667 -256536 -46489 238641 62926 -481238 -925475 -954711 -607140 -200001
33708 -200001 -100634 -391410 -782667 -977364 -972792 -851672 -537931 -28760 389810 485509
33698 485509 398949 301682 40777 -479541 -894392 -859674 -650406 -732048 -1005877 -1076298
33688 -1076298 -990926 -1021485 -958322 -443605 135983 -5733 -808490 -1364672 -1267910 -1045910
33678 -1045910 -1039453 -814074 -110071 494105 449057 66153 -131303 -290497 -788809 -1373180
33668 -1373180 -1451058 -978234 -451319 -199348 -191929 -366389 -636164 -690583 -260531 446858
33658 446858 937219 1009726 860767 699095 564609 476192 476333 523474 519966 423128 219750
33647 219750 -116535 -533955 -877336 -1034895 -986801 -699875 -205560 199322 166899 -185383
33637 -185383 -344126 -150923 -69254 -428043 -821532 -698546 -238801 -100772 -419013 -595040
33627 -595040 -173484 485187 632685 54105 -646102 -705623 -81166 471623 302988 -302011
33617 -302011 -507389 -88310 241797 -165918 -988735 -1377625 -1042024 -490553 -296724 -484068
33607 -484068 -671102 -591732 -371444 -329612 -537918 -681251 -504674 -268869 -432279 -925719
33597 -925719 -1190370 -1021780 -871034 -1068601 -1246359 -931464 -321369 16576 -49293 -196484
33587 -196484 -241022 -247607 -156597 194203 665992 862119 635411 224675 -135023 -402570
33577 -402570 -495629 -228786 361728 886144 972210 646474 253658 97984 215985 405337
33567 405337 418123 163751 -254310 -666511 -914250 -838382 -408287 75854 163678 -208816
33557 -208816 -597577 -651543 -574531 -720127 -985106 -995716 -742848 -596501 -717903 -854026
33547 -854026 -763757 -521528 -333305 -319915 -515580 -814419 -911536 -607826 -201871 -230712
33537 -230712 -747867 -1237146 -1371759 -1422925 -1645810 -1693554 -1120584 -208393 279310 109275
33527 109275 -198338 -229811 -205800 -397764 -521244 -176226 424068 717634 647211 664135
33517 664135 864809 748118 78681 -545893 -417537 336508 974975 1072820 785833 373975
33507 373975 -27810 -216960 -5000 417906 580062 301470 -104624 -251075 -45911 339051
33497 339051 584712 375754 -206858 -519838 -45346 770421 906099 87335 -834383 -1022108
33487 -1022108 -639012 -406231 -652514 -1151757 -1514474 -1401830 -702339 192496 639364
33478 639364 539432 453394 633448 523520 -270073 -1084171 -1025362 -313716 38518 -295776
33468 -295776 -657153 -549757 -237994 -26541 278775 850342 1385607 1575469 1575024 1618712
33458 1618712 1533523 1048644 346415 -79499 7224 422154 832814 978446 771896 400899
33448 400899 188023 166934 -4349 -487259 -889886 -839565 -719063 -1248573 -2304598 -2800693
33438 -2800693 -2085399 -939700 -609490 -1152547 -1475325 -969698 -296090 -233169 -486568
33429 -486568 -274722 381808 748944 556619 278814 214602 66853 -347347 -660610 -588791
33419 -588791 -426888 -484663 -517739 -219869 119250 22399 -367824 -469297 -125150 233540
33409 233540 251355 28104 -165070 -175616 20840 279293 297488 -6540 -205650 167481
33399 167481 911019 1339180 1189155 887120 807609 747349 413803 63751 226085 902974
33389 902974 1429457 1224859 477862 -77902 -13758 346477 416651 131909 -16966 268276
33379 268276 627744 512499 -96691 -688122 -832497 -584687 -322923 -336187 -530848 -492222
33369 -492222 31540 677508 764977 168821 -426171 -390252 37829 146109 -295666 -894778
33359 -894778 -1276092 -1403310 -1329876 -1079808 -807098 -703890 -703361 -583377 -370954 -308140
33349 -308140 -395805 -341792 -59685 127350 -40104 -334818 -306772 152175 667060 780519
33339 780519 448483 124393 265845 736931 905129 456296 -153406 -316153 -78933 63979
33329 63979 -7685 51060 335397 408103 -95772 -943030 -1561298 -1577182 -1005582 -183846
33319 -183846 374549 340869 -69514 -321761 -240273 -189120 -440459 -685574 -472947 58828
33309 58828 257288 -216595 -924034 -1167053 -818781 -402092 -343170 -434562 -254902 107624
33299 107624 171168 -148533 -368445 -206503 -18135 -158114 -363951 -232104 36427 -92676
33289 -92676 -668308 -1219405 -1411762 -1270295 -876042 -336947 29935 -14060 -210176 -129296
33279 -129296 172784 316406 284269 352060 426807 161223 -249765 -158134 468902 823375
33269 823375 429793 -139732 -173810 138156 137851 -237019 -421037 -72229 534914 920334
33259 920334 877424 553743 233148 29842 -193422 -477695 -477810 124530 993699 1408378
33249 1408378 1185700 832443 720853 692574 591770 532478 422110 -91759 -899775 -1364358
33239 -1364358 -1331257 -1425165 -1865453 -1876457 -1005506 -157685 -298460 -830310 -501971 532168
33229 532168 955359 419712 -19371 243051 479506 76947 -378088 -186967 277596 311336
33219 311336 35769 -57119 -109627 -510439 -915385 -621613 260804 892566 918457 795963
33209 795963 861622 843863 517999 185171 165968 299692 282474 135837 25374 -86945
33199 -86945 -299676 -506761 -557509 -517904 -549141 -681457 -883364 -1150150 -1329165 -1108955
33189 -1108955 -466344 96198 111705 -211107 -299541 -60893 50839 -167575 -295762 73606
33179 73606 696534 992273 799225 511740 524010 778493 907948 701160 350504 221707
33169 221707 398558 567124 442096 173982 122794 305130 348151 18442 -458954 -679140
33159 -679140 -456443 83549 595754 692988 290409 -205720 -319666 -101777 31548 12151
33149 12151 180247 549955 591506 19647 -702939 -997859 -869954 -621596 -329431 -39394
33139 -39394 -36130 -388729 -607475 -322580 38932 -125085 -608034 -736672 -457955 -306451
33129 -306451 -411348 -353666 -29390 141573 -236 -101968 -35244 -176828 -646506 -899455
33119 -899455 -494170 205259 510270 262621 -134938 -290489 -152089 46751 -1249 -358658
33109 -358658 -695833 -673277 -405158 -221610 -92864 237458 636852 699343 473825 419073
33099 419073 558206 394982 -159184 -537553 -483231 -490144 -868984 -1125283 -815978 -347465
33089 -347465 -270403 -358242 -99317 375842 607232 648330 822829 958446 673079 204402
33079 204402 129412 382354 379738 76297 26726 306593 265194 -347525 -821200 -545452
33069 -545452 12710 11215 -530086 -888249 -808426 -784255 -1118958 -1372748 -1073177 -514636
33059 -514636 -354423 -616954 -642360 -55176 717761 1088263 1026329 846126 690868 645491
33049 645491 963122 1597846 1833683 1123265 112594 -35570 678275 1039660 416480
33040 416480 -409733 -607545 -466230 -526842 -465879 201355 957561 879912 22787 -776884
33030 -776884 -1190162 -1493885 -1581836 -991787 22465 507571 180436 -122022 252670 812429
33020 812429 769698 210896 -187204 -195051 -179605 -399231 -641240 -558253 -97238 408325
33010 408325 485416 -21334 -671090 -787049 -195375 558067 807651 426364 -158121 -419320
33000 -419320 -160541 327276 511752 203273 -149551 -8018 474980 613207 163588 -321468
32990 -321468 -315842 -48248 -50208 -315007 -390479 -151917 36163 -39998 -124910 -17522 -9680
32979 -9680 -421011 -931714 -882207 -244133 207546 -91387 -727977 -919288 -552225 -133011
32969 -133011 65648 195947 255532 6505 -410385 -447937 485 338643 198002 31927
32959 31927 312033 683773 536749 3954 -276450 -124577 97799 167433 146177 5392
32949 5392 -293354 -472714 -286365 -61276 -280914 -757509 -890372 -646454 -538932 -670579
32939 -670579 -623433 -365607 -377093 -658153 -540076 101126 345695 -393915 -1244530 -986686
32929 -986686 170275 862517 446341 -292852 -406329 -6462 121922 -327677 -859163
32920 -859163 -874344 -381960 72662 57689 -333185 -772703 -1201241 -1741258 -2176983 -1967959
32910 -1967959 -991740 69793 419003 27222 -477379 -645540 -564067 -445150 -271824
32901 -271824 20459 295496 356552 208412 19798 -107579 -195365 -242691 -159173 117364
32891 117364 517877 902043 1155354 1179160 876534 265693 -431046 -926707 -1081446 -905579
32881 -905579 -468637 23549 202068 -99887 -505406 -480354 -59250 240169 257020 365090
32871 365090 613905 378243 -615534 -1469909 -1082011 326736 1395910 1290359 527792
32862 527792 101569 360385 898991 1109085 686060 -97047 -562915 -336863 194522 427265
32852 427265 335022 273208 234827 -42604 -358890 -221502 224553 240618 -348864 -836857
32842 -836857 -774866 -644923 -924422 -1203172 -880737 -202654 130053 59476 172948 744870
32832 744870 1370462 1538401 1147009 480469 -16155 -29809 282275 396102 108455 -131127
32822 -131127 93957 444279 276429 -359220 -722518 -368410 355050 845817 863961 532793
32812 532793 131439 24277 424912 1018862 1123508 487826 -290888 -457998 -76155 57639
32802 57639 -507566 -1251112 -1359795 -767836 -141820 73467 118252 311181 471959 313241
32792 313241 42687 59578 246885 129911 -316418 -592076 -457497 -232787 -170539 -90025
32782 -90025 113048 120496 -277478 -733525 -840780 -741150 -799868 -930056 -695252 52108
32772 52108 1001815 1730864 1906973 1324518 125260 -1086959 -1678722 -1517348 -894288
32763 -894288 -106299 611687 956942 791001 436069 352436 528285 537869 210592 -127070
32753 -127070 -167477 -52728 -110630 -368241 -527242 -349067 74679 440773 551303 443446
32743 443446 197460 -227665 -777100 -1046654 -626874 249931 822017 737626 470167 521865
32733 521865 654867 360996 -273386 -756970 -1011382 -1346100 -1715179 -1688129 -1216974 -773640
32723 -773640 -569121 -283410 172268 291244 -183331 -622808 -340908 333305 506322 34401
32713 34401 -345862 -186123 92094 -24162 -387956 -547983 -387849 -30982 510328 1140728
32703 1140728 1416624 991879 204535 -266562 -277818 -262472 -386075 -223359 502487 1325497
32693 1325497 1544480 1058367 377791 -5160 22106 295831 552075 586723 444357 350995
32683 350995 333271 122060 -370005 -743193 -599705 -136463 113441 3649 -121757 25390
32673 25390 357675 595814 497826 -16130 -699581 -1055487 -866918 -523713 -526757 -850431
32663 -850431 -1141024 -1303281 -1416419 -1290860 -714471 -27909 192748 -127 -43784 135596
32653 135596 -10739 -626592 -1047175 -759235 -119963 275754 367560 326639 20137 -657243
32643 -657243 -1283138 -1307037 -765876 -175310 130160 198826 173808 134624 119723 88423 -17059
32632 -17059 -79281 72232 276001 162782 -207131 -318876 -50165 10447 -501778 -995020
32622 -995020 -700877 176861 736049 608630 297510 316207 534812 496646 29751 -603053
32612 -603053 -1013736 -1096742 -1133897 -1372861 -1545164 -1140121 -224310 458906 432291 98082
32602 98082 101218 488260 884683 1142748 1350907 1452091 1300948 956435 592983 279149
32592 279149 62895 17543 13358 -190969 -439229 -269163 222521 272587 -316905 -548234
32582 -548234 432962 1945944 2609898 2159380 1481500 1137401 885795 583222 504392 623501
32572 623501 486536 41757 -177160 41775 205862 -48783 -353906 -178542 482564 1262966
32562 1262966 1823888 1884356 1324249 511382 101888 263275 475391 310363 -9768 -93978
32552 -93978 -19348 -139528 -513896 -836186 -791147 -310116 366806 779149 611843 92054
32542 92054 -176776 119614 678441 968487 757912 230478 -210161 -224408 160749 500186
32532 500186 362176 -187593 -680584 -742308 -324037 395464 1065140 1269173 912283 405020
32522 405020 179721 175920 118325 66523 231433 436354 318105 -7257 -33061 374064
32512 374064 802710 925799 838140 725330 629041 581248 585247 470312 127580 -204739
32502 -204739 -287917 -321842 -528823 -541362 100215 995030 1237089 706138 178581 93434
32492 93434 78057 -138641 -248377 -101146 -56058 -198011 -28539 580371 922619 550178
32482 550178 106829 348437 917829 907576 250004 -271957 -207926 103235 229825 201233
32472 201233 268679 498769 731242 796226 751177 860254 1157203 1158802 467298 -392229
32462 -392229 -413207 454321 1069949 691540 36545 139221 812307 1091140 784088 622353
32452 622353 967183 1253909 915931 232640 -58574 325185 928961 1084187 638362 152096
32442 152096 245653 763247 906084 300700 -480730 -722729 -475076 -271501 -287464 -272677
32432 -272677 -128915 -62116 -187893 -334644 -252542 160945 762601 1179866 1113059 725290
32422 725290 470739 449072 312192 -53568 -256895 -85568 70308 -107832 -259584 67717
32412 67717 630384 863809 734064 624630 609923 436844 91812 -149320 -159637 -31301
32402 -31301 162793 314034 203339 -133129 -241766 113629 479610 377706 85115 143723
32392 143723 431230 442095 212657 150080 137934 -276010 -863905 -857087 -207175 239390
32382 239390 67116 -137482 73437 200556 -271635 -892605 -953774 -636740 -624281 -898654
32372 -898654 -803343 -219014 170819 -26175 -260749 111147 823665 1083045 713229 328933
32362 328933 359302 486007 314900 94656 248918 515193 240688 -525614 -961132 -643074
32352 -643074 -104423 84926 120231 369116 577899 317961 -199556 -437026 -359622 -299737
32342 -299737 -268833 -98998 -37605 -441214 -1023391 -1189015 -1025430 -1128932 -1470963 -1360070
32332 -1360070 -663283 -118673 -127217 -146777 240703 505537 65978 -674870 -946652 -777293
32322 -777293 -756381 -963878 -941229 -595485 -378398 -524743 -735156 -740006 -668483 -685632 -673730
32311 -673730 -478177 -165777 146103 466891 758100 793670 408157 -227706 -737994 -867700
32301 -867700 -588184 -40627 448273 452405 -140389 -811923 -834332 -121452 620916 766799
32291 766799 495372 364734 467473 491232 442112 672583 1130860 1224360 698749 108211
32281 108211 35471 306044 426814 403886 573807 894720 992942 787911 542346 354541
32271 354541 81236 -263915 -479308 -542757 -623472 -739769 -752780 -646099 -464336 -85427
32261 -85427 532312 991619 840727 276271 -36104 156459 483532 626141 658040 632171
32251 632171 373903 -133032 -609249 -891852 -1060367 -1036631 -567565 186584 559954 206376
32241 206376 -384679 -543679 -265027 -44723 -142715 -384768 -547559 -600577 -601574 -579955 -537193
32230 -537193 -468915 -402138 -413130 -536694 -693918 -799552 -842772 -753733 -404881 34508
32220 34508 27971 -649905 -1394879 -1433657 -850444 -403406 -429359 -562367 -512817 -433885 -417565
32209 -417565 -300490 -146531 -287374 -680331 -851042 -683406 -592222 -656629 -349420 450388
32199 450388 941396 515752 -241997 -405624 -77229 -99019 -685105 -1163821 -1026299 -525361
32189 -525361 -138523 21984 99194 159265 141976 -27203 -326494 -547118 -392730 198867
32179 198867 911776 1320142 1209349 638502 -99050 -570167 -547072 -296024 -219416 -233108
32169 -233108 76645 685952 1081953 1063202 964533 920076 619246 102578 34820 676139
32159 676139 1260577 1024363 281947 -188027 -308639 -515487 -834019 -947599 -891665 -899104
32149 -899104 -763527 -123744 730940 1056675 635655 -18796 -380082 -314752 102626 634837
32139 634837 846119 532841 80838 -50295 14321 -104288 -349460 -437655 -440769 -523095
32129 -523095 -436998 -14034 196925 -332829 -1028738 -888399 -71464 300779 -87067 -366814
32119 -366814 -49989 238591 8430 -213153 146500 736507 936625 762408 509278 149446
32109 149446 -300693 -410725 12400 389287 109902 -591346 -1061980 -1137955 -1065636 -884328
32099 -884328 -472879 41824 420408 631627 661065 328739 -302312 -718278 -619090 -413261
32089 -413261 -554127 -790868 -681241 -472941 -737677 -1351547 -1609147 -1291577 -907308 -833062
32079 -833062 -876515 -822879 -820544 -990435 -1110193 -945823 -582558 -233716 12455 103948
32069 103948 -56362 -426277 -748748 -826978 -761497 -799150 -1022426 -1264158 -1291163 -1038644
32059 -1038644 -662994 -346037 -97138 142466 277514 188591 61509 232822 630778 785021
32049 785021 566232 438475 655208 702512 66193 -835849 -1140303 -729552 -259709 -122655
32039 -122655 -93510 -4556 -20154 -84468 186955 757204 943584 371721 -351612 -407077
32029 -407077 182169 763889 999525 1023505 877071 433764 -115116 -304790 -90875 -546
32019 -546 -319678 -539809 -26755 987511 1556586 1169864 353689 -38317 149015 324035
32009 324035 -8064 -658931 -1053650 -883207 -331425 215540 522159 589039 511123 321671
31999 321671 -2768 -394259 -652638 -673578 -649631 -829019 -1061780 -864718 -84440 759688
31989 759688 1047070 779284 412590 111233 -382527 -1095364 -1519495 -1242238 -566100 -137061
31979 -137061 -115686 -98802 182177 493362 543335 447427 492658 650784 630351 339644 23228
31968 23228 -67032 83374 345854 567137 569411 277400 -81496 -145078 110946 306110
31958 306110 177876 -103929 -311859 -535921 -914315 -1273173 -1371216 -1260423 -1048792 -591271
31948 -591271 110818 489273 51586 -692363 -710128 96445 694931 395807 -253351 -439349
31938 -439349 -230235 -171127 -304410 -300953 -205432 -315134 -476702 -180938 634160 1403961
31928 1403961 1622258 1325406 879032 611115 654582 882698 1029164 1051410 1205756 1559931
31918 1559931 1740535 1505237 1216814 1261855 1330279 913530 273828 142901 538804 707384
31908 707384 321818 -84219 -105757 -76958 -291735 -350329 125198 665675 529570 -187144
31898 -187144 -635222 -290476 528565 1155404 1212780 804424 361972 257413 394536 328674
31888 328674 -72370 -381308 -266464 -40670 -158649 -472383 -511250 -307316 -332286 -652246
31878 -652246 -772489 -455786 -126003 -186112 -401946 -336073 -51372 57899 -60222 -79368
31868 -79368 95713 118924 -254590 -726054 -792171 -374589 124341 343692 317917 267910
31858 267910 240169 121416 -55204 -7958 497451 1298799 1876520 1809302 1211038 666276
31848 666276 661292 1091293 1401933 1188197 532108 -219776 -787403 -996669 -754037 -204181
31838 -204181 249874 327715 168868 37537 -106018 -417710 -686784 -506231 32378 299040
31828 299040 3713 -299036 38667 773082 1025002 480463 -145105 -47053 596054 862046
31818 862046 302011 -505988 -788042 -603734 -627041 -1044223 -1232049 -701398 123107 435317
31808 435317 49390 -529106 -810456 -683876 -251979 232540 352228 -96316 -724769 -943211
31798 -943211 -681212 -342926 -173681 -158280 -406457 -978677 -1343129 -770564 535517 1417287
31788 1417287 1187505 439706 72417 137243 142909 -52134 -245366 -389217 -502800 -370880
31778 -370880 145208 722228 945298 827496 573127 146008 -468261 -895815 -809394 -483293
31768 -483293 -386718 -446896 -254347 194517 509044 506490 290477 -100178 -589793 -786252
31758 -786252 -374331 335256 788812 960836 1166930 1305436 997591 392226 75708 153884
31748 153884 148656 -110531 -221659 -2189 152887 -35639 -285657 -284827 -138127 -8049
31738 -8049 210870 576885 871266 927535 844090 728607 607790 657407 1049751 1491195
31728 1491195 1443112 922554 530451 549972 605605 370790 -18339 -420255 -840797 -911799
31718 -911799 -67068 1344661 1978522 1154990 -122337 -522614 -105301 144492 -71367
31709 -71367 -222709 -110791 -126504 -365250 -387812 -34369 232755 47525 -324805 -432463
31699 -432463 -251522 -116531 -256371 -586244 -883023 -1066161 -1230683 -1324814 -973590 3749
31689 3749 984683 1050867 241941 -356695 -81569 452499 439303 103328 112376 367659 293834
31678 293834 -29858 16812 500109 821071 661313 279071 -102520 -465652 -585518 -203255
31668 -203255 356143 461008 118876 -61995 101435 144480 -130038 -304477 -135259 53366
31658 53366 45673 107835 362710 458330 240587 137778 440263 749567 617968 258563
31648 258563 118249 132135 -88289 -591262 -1041874 -1140318 -770378 7972 806228 1036250
31638 1036250 547237 -84017 -203193 197333 665051 920992 974186 836940 511169 157944
31628 157944 -23640 -53163 -132767 -417931 -896372 -1353350 -1439642 -1022385 -493607 -388185
$$ [...]
##END NTUPLES=NMR SPECTRUM
##END=
