##TITLE=31Pdec_66-2021
 CDCl3, 24 sc
 6.08.2021
##JCAMPDX= 6.0         $$ Bruker NMR JCAMP-DX V2.0
##DATA TYPE= NMR SPECTRUM
##DATA CLASS= NTUPLES
##ORIGIN= UXNMR, Bruker Analytische Messtechnik GmbH
##OWNER= root
$$ XWIN-NMR		Version 3.5
$$ Fri Aug  6 09:25:01 2021 Russian Standard Time (UT+4h)  she@DPX200
##.OBSERVE FREQUENCY= 81.013821
##.OBSERVE NUCLEUS= ^31P
##.ACQUISITION MODE= SIMULTANEOUS
##.ACQUISITION SCHEME= undefined
##.AVERAGES= 24
##.DIGITISER RES= 16
##SPECTROMETER/DATA SYSTEM= spect
##.PULSE SEQUENCE= zgpg30
##.SOLVENT NAME= CDCl3
##.SHIFT REFERENCE= (INTERNAL, CDCl3, 0, 248.564)
##AUDIT TRAIL= $$ (NUMBER, WHEN, WHO, WHERE, WHAT)
$$ ##TITLE= Audit trail, XWIN-NMR		Version 3.5
$$ ##JCAMPDX= 5.01
$$ ##ORIGIN= Bruker BioSpin GmbH
$$ ##OWNER= she
$$ F:/spectra/data/she/nmr/P31/1/pdata/1/auditp.txt
$$ ##AUDIT TRAIL=  $$ (NUMBER, WHEN, WHO, WHERE, WHAT)
(   1,<2021-08-06 09:24:17.39 +0400>,<she>,<DPX200>,
      <created by zg, POWCHK disabled, PULCHK disabled
       configuration hash MD5:
       00 E9 B6 7A A2 85 ED C7 34 08 36 98 17 FE 4E 26
       data hash MD5: 32K
       7E BD 57 12 EE 43 92 57 04 90 99 C9 38 FC 88 28>)
(   2,<2021-08-06 09:24:20.31 +0400>,<she>,<DPX200>,
      <Start of raw data processing
       efp BC_mod = 2 LB = 1 FT_mod = 6 PKNL = 1 PHC0 = -7458.623 PHC1 = 279.6746 SI = 64K 
       data hash MD5: 64K
       AB 6B 9F 47 B2 A5 C4 70 F7 B9 0E E2 FD B2 47 FD>)
$$ ##END=
$$ 
$$ hash MD5
$$ F8 5B B7 2A 47 A3 63 6A 58 D9 16 3E 69 BF 48 78
##$RELAX= 
##$RELAX= 
##$RELAX= 
##$RELAX= 
##$RELAX= 
##$RELAX= 
##$RELAX= 
##$RELAX= 
$$ Bruker specific parameters
$$ --------------------------
##$DU= <F:/spectra>
##$EXPNO= 1
##$NAME= <P31>
##$PROCNO= 1
##$TYPE= <nmr>
##$USER= <she>
##$AMP= (0..31)
100 100 100 100 100 100 100 100 100 100 100 100 100 100 100 100 100 100 
100 100 100 100 100 100 100 100 100 100 100 100 100 100 
##$AQSEQ= 0
##$AQ_mod= 1
##$AUNM= <au_zg>
##$AUTOPOS= <>
##$BF1= 81.014009
##$BF2= 200.13
##$BF3= 200.13
##$BF4= 200.13
##$BF5= 200.13
##$BF6= 200.13
##$BF7= 200.13
##$BF8= 200.13
##$BYTORDA= 1
##$CFDGTYP= 0
##$CFRGTYP= 5
##$CHEMSTR= <none>
##$CNST= (0..31)
1 1 145 1 1 1 1 1 1 1 1 1 1 1 1 1 1 1 1 1 1 1 1 1 1 1 1 1 1 1 1 1 
##$CPDPRG= <waltz16>
##$CPDPRG1= <>
##$CPDPRG2= <waltz16>
##$CPDPRG3= <>
##$CPDPRG4= <mlev>
##$CPDPRG5= <mlev>
##$CPDPRG6= <mlev>
##$CPDPRG7= <mlev>
##$CPDPRG8= <mlev>
##$CPDPRGB= <>
##$CPDPRGT= <>
##$D= (0..31)
0 1 0 0 0 0 0 0 0 0 0 0.03 2e-05 3e-06 0 0 0 0 0 0 0 0 0 0 0 0 0 0 0 0 
0 0 
##$DATE= 1628227456
##$DBL= (0..7)
120 120 120 11 120 120 24 19 
##$DBP= (0..7)
150 150 150 150 150 150 150 150 
##$DBP07= 0
##$DBPNAM0= <>
##$DBPNAM1= <>
##$DBPNAM2= <>
##$DBPNAM3= <>
##$DBPNAM4= <>
##$DBPNAM5= <>
##$DBPNAM6= <>
##$DBPNAM7= <>
##$DBPOAL= (0..7)
0.5 0.5 0.5 0.5 0.5 0.5 0.5 0.5 
##$DBPOFFS= (0..7)
0 0 0 0 0 0 0 0 
##$DE= 6
##$DECBNUC= <off>
##$DECIM= 3
##$DECNUC= <off>
##$DECSTAT= 4
##$DIGMOD= 1
##$DIGTYP= 9
##$DL= (0..7)
0 0 52 120 120 21 21 25 
##$DP= (0..7)
$$ [...]
##$SUBNAM2= <"">
##$SUBNAM3= <"">
##$SUBNAM4= <"">
##$SUBNAM5= <"">
##$SUBNAM6= <"">
##$SUBNAM7= <"">
##$SUBNAM8= <"">
##$SUBNAM9= <"">
##$SW= 501.771253377433
##$SWIBOX= (0..15)
0 1 3 0 0 0 0 0 0 0 0 0 0 0 0 0 
##$SW_h= 40650.406504065
##$TD= 32768
##$TD0= 1
##$TE= 0
##$TE2= 300
##$TE3= 300
##$TEG= 300
##$TL= (0..7)
0 120 53 12 22 120 120 120 
##$TP= (0..7)
150 150 150 150 150 150 150 150 
##$TP07= 0
##$TPNAME0= <>
##$TPNAME1= <>
##$TPNAME2= <>
##$TPNAME3= <>
##$TPNAME4= <>
##$TPNAME5= <>
##$TPNAME6= <>
##$TPNAME7= <>
##$TPOAL= (0..7)
0.5 0.5 0.5 0.5 0.5 0.5 0.5 0.5 
##$TPOFFS= (0..7)
0 0 0 0 0 0 0 0 
##$TUNHIN= 0
##$TUNHOUT= 0
##$TUNXOUT= 0
##$USERA1= <user>
##$USERA2= <user>
##$USERA3= <user>
##$USERA4= <user>
##$USERA5= <user>
##$V9= 5
##$VALIST= <valist>
##$VCLIST= <CCCCCCCCCCCCCCC>
##$VD= 0
##$VDLIST= <DDDDDDDDDDDDDDD>
##$VPLIST= <PPPPPPPPPPPPPPP>
##$VTLIST= <TTTTTTTTTTTTTTT>
##$WBST= 1024
##$WBSW= 4
##$XGAIN= (0..3)
0 0 0 0 
##$XL= 0
##$YL= 0
##$YMAX_a= 2630
##$YMIN_a= -2724
##$ZGOPTNS= <>
##$ZL1= 120
##$ZL2= 120
##$ZL3= 120
##$ZL4= 120
##$ABSF1= 0
##$ABSF2= 0
##$ABSG= 0
##$ABSL= 0
##$ALPHA= 0
##$AQORDER= 0
##$ASSFAC= 0
##$ASSFACI= 0
##$ASSFACX= 0
##$ASSWID= 0
##$AUNMP= <proc_1d>
##$AZFE= 0.1
##$AZFW= 0.5
##$BCFW= 0
##$BC_mod= 2
##$BYTORDP= 0
##$COROFFS= 0
##$CY= -3
##$DATMOD= 1
##$DC= 0
##$DFILT= <>
##$DTYPP= 0
##$F1P= 0
##$F2P= 0
##$FCOR= 1
##$FTSIZE= 65536
##$FT_mod= 6
##$GAMMA= 0
##$GB= 0
##$INTBC= 1
##$INTSCL= 5.30512e-09
##$ISEN= 30
##$LB= 1
##$LEV0= 0
##$LPBIN= 0
##$MAXI= 10000
##$MC2= 0
##$MEAN= 0
##$ME_mod= 0
##$MI= 50
##$NCOEF= 0
##$NC_proc= -7
##$NLEV= 6
##$NOISF1= 182.463
##$NOISF2= 159.3651
##$NSP= 0
##$NTH_PI= 0
##$NZP= 0
##$OFFSET= 248.5645
##$PC= 4
##$PHC0= -7458.623
##$PHC1= 279.6746
##$PH_mod= 1
##$PKNL= yes
##$PPARMOD= 0
##$PSCAL= 0
##$PSIGN= 0
##$REVERSE= no
##$SF= 81.014009
##$SI= 65536
##$SIGF1= 159.3651
##$SIGF2= -187.1042
##$SINO= 113.3802
##$SIOLD= 16384
##$SREGLST= <1H.CDCl3>
##$SSB= 0
##$STSI= 65536
##$STSR= 0
##$SW_p= 40650.406504065
##$SYMM= 0
##$S_DEV= 0
##$TDeff= 32768
##$TDoff= 0
##$TI= <>
##$TILT= no
##$TM1= 0
##$TM2= 0
##$TOPLEV= 0
##$USERP1= <user>
##$USERP2= <user>
##$USERP3= <user>
##$USERP4= <user>
##$USERP5= <user>
##$WDW= 1
##$XDIM= 65536
##$YMAX_p= 369396649
##$YMIN_p= -88991646
$$ End of Bruker specific parameters
$$ ---------------------------------
##NTUPLES= NMR SPECTRUM
##VAR_NAME=  FREQUENCY,     SPECTRUM/REAL,   SPECTRUM/IMAG
##SYMBOL=    X,             R,               I
##VAR_TYPE=  INDEPENDENT,   DEPENDENT,       DEPENDENT
##VAR_FORM=  AFFN,          ASDF,            ASDF
##VAR_DIM=   65536,         65536,           65536
##UNITS=     HZ,            ARBITRARY UNITS, ARBITRARY UNITS
##FACTOR=    0.620285442955139, 1,           1
##FIRST=     20137.2065510759, 0,            0
##LAST=      -20513.1999529892, 0,           0
##MIN=       -20513.1999529892, -88991646,   0
##MAX=       20137.2065510759, 369396649,    0
$$ Real data points
##PAGE= N=1
##DATA TABLE= (X++(R..R)), XYDATA
$$ [...]
43270 718420 -18993 -671 -431966 -1210452 -954966 500605 1257768 32398 -1778794
43261 -1778794 -2165845 -1396595 -1080025 -1343555 -997822 90109 907960 1275461 1815294
43252 1815294 2112134 1145782 -305570 -70121 1991372 3212545 1837900 -414643 -878058
43243 -878058 453414 1312387 195077 -2232359 -4071830 -3640231 -742121 2689959 3985296
43234 3985296 2494351 231772 -721945 -421225 -87992 -232830 -639112 -1027783 -781030
43225 -781030 730037 2486800 2025948 -1138117 -3765376 -2696105 640473 1975107
43217 1975107 -94216 -2767270 -3390453 -2423063 -1403428 -509256 454009 570930 -881215
43208 -881215 -2741143 -3171073 -1977894 -543456 69333 -59548 -339101 -243646 399610
43199 399610 1071243 984384 324283 259141 1087046 1448387 429955 -629291 54534 1905420
43189 1905420 2794546 2192806 1531111 1505671 1165356 100175 -550471 -176269 47274
43180 47274 -815570 -1723333 -1336452 -161795 451509 381530 295329 151899 -226696 -42084
43170 -42084 1169776 1947920 748142 -1250163 -1584849 -429613 -355595 -2026330 -3068801
43161 -3068801 -2070902 -837060 -1185882 -2068968 -1834361 -1179245 -1553928 -2369737 -2245956
43152 -2245956 -1613052 -1502805 -999303 1176178 3398505 2731687 -388078 -2326017 -1476327
43143 -1476327 -117672 -170678 -297700 1100547 2756162 2682643 1433926 778497 589493
43134 589493 -375768 -1494651 -704177 2232981 5056726 5805018 4643978 2853588 1559119
43125 1559119 1517055 2541427 2983746 1425556 -895003 -1201881 798260 2140920 918264
43116 918264 -837644 -511967 732465 -181178 -2960100 -3929524 -1660719 664441 15540
43107 15540 -2088971 -2330191 -815369 -528927 -2319152 -3504459 -1838403 1600246 4289969
43098 4289969 5122422 4488351 3175476 2225416 2562574 3782208 4430434 4205519 4475922
43089 4475922 5742288 6229968 4362661 1183070 -1283833 -2762153 -3971351 -4322742
43081 -4322742 -2688541 63259 1616312 1368052 1151938 2471443 4445838 4877281 2509720
43072 2509720 -1645090 -4541901 -3461051 737683 3734684 2626199 -490760 -1758173
43064 -1758173 -1033148 -1273911 -3281207 -4535473 -3476407 -1663326 -887208 -986428 -1411085
43055 -1411085 -2234478 -2687039 -1459771 505762 485133 -1501815 -1844445 1157122 4226006
43046 4226006 4083582 2421672 2589706 3803775 2651852 -1020927 -3730371 -3450811 -1660866
43037 -1660866 -303732 279901 160414 -742227 -1582031 -1183840 -69443 117032 -611493
43028 -611493 -468883 1134018 2568604 2490764 1570091 1131714 1629411 2950883 4710222
43019 4710222 5703292 4523999 1407193 -1620127 -2862536 -2281327 -648168 1296871
43011 1296871 2589137 2326913 784680 -739004 -1529745 -2005829 -2544402 -2853011 -2707620
43002 -2707620 -2248837 -1366284 134323 1614082 2028629 1495881 1237459 1634730 1571480
42993 1571480 278662 -1203117 -1177383 615614 2568217 2649878 267417 -2983021 -4607693
42984 -4607693 -3603727 -1159289 1218157 3148606 4286214 3449365 586703 -1689468
42976 -1689468 -881333 1805687 3103512 2379149 1846454 2176596 1199098 -2068286 -5057392
42967 -5057392 -5019113 -2627511 -517699 115694 -128174 -491516 -484421 260410 1271091
42958 1271091 1326208 241307 -564706 -205083 317991 -42667 -635778 -563567 -501708 -1419260
42948 -1419260 -2549002 -2410766 -1189211 -427764 -724606 -1165271 -851542 143791 1169526
42939 1169526 1476299 596919 -1049085 -2330053 -2700354 -2692613 -2697760 -2272677 -1294252 -595090
42929 -595090 -553486 -296093 621232 1089786 387025 -130072 888239 2085334 978104
42920 978104 -2277127 -4823897 -4722807 -2812528 -984115 -321240 -1021542 -2473655 -3150582
42911 -3150582 -1926391 211354 1112760 297638 -606082 -434257 188115 608115 1472479
42902 1472479 3198460 4452151 3559888 785342 -1935497 -3120587 -2712690 -1387782
42894 -1387782 59983 808522 527557 48590 759324 2892435 4882757 4961258 3198821
42885 3198821 1419313 1087856 1927868 2883007 3632317 4304819 4305520 2881335 930363
42876 930363 658977 2634414 4457904 3587886 579890 -1906253 -2675394 -2792112 -2926558
42867 -2926558 -1970202 770795 3536339 3887088 1950858 269009 274734 486858 -891817
42858 -891817 -2837411 -2733825 -401177 1218510 142363 -1780202 -1628400 409209 1779993
42849 1779993 1610966 1380472 1689475 1211945 -379611 -1052243 605964 3113243 4379163
42840 4379163 4451793 4283252 3505995 1550538 -383022 -748898 -90910 113852 121068 1076513
42830 1076513 2307542 2155306 1138567 1420320 2992055 3274894 1174746 -1188787 -1856651
42821 -1856651 -1594656 -1677730 -1526700 -520957 -130739 -1714667 -3508309 -2600711 577353
42812 577353 2486654 1458054 -105204 481437 2306981 2530844 623456 -1192985 -1405430
42803 -1405430 -1024517 -1420391 -2077089 -1693652 -429852 360746 102813 -571786 -963987
42794 -963987 -610525 1063108 3758742 5300885 3676098 200286 -1582005 -623261 487749
42785 487749 -12504 -380526 1002233 2138590 465613 -2668787 -3953289 -3175564 -2758776
42776 -2758776 -3067030 -2066832 323105 1389657 -45668 -1784524 -1872999 -1126453 -822558
42767 -822558 -702362 -695415 -1890138 -4024988 -4531049 -2142978 645275 832225 -1206674
42758 -1206674 -3068904 -3704326 -3296836 -1594056 1118260 2798727 2011866 445056 620427
42749 620427 2147615 2834622 2550375 3037945 4359971 4499233 2577785 -55932 -2034490
42740 -2034490 -2946292 -2253207 176162 2454154 2368268 910601 1216882 3588136 4809603
42731 4809603 3313684 1525346 1401028 1080380 -1407027 -3970647 -3300077 -1886 2404241
42722 2404241 2416333 1386924 379498 -639999 -1001727 109618 1378273 611804 -1614736
42713 -1614736 -2505312 -1524378 -1250660 -3043720 -4945288 -5074585 -4160221 -3180978 -1449763
42704 -1449763 902224 1401372 -995422 -2925765 -785754 3635654 5186542 2234838
42696 2234838 -1843064 -3700412 -3197036 -1457040 839706 2419337 1682327 -746592
42688 -746592 -2168902 -1636376 -1239344 -2380446 -3336882 -2303123 -531933 -186163 -891183
42679 -891183 -916689 -446948 -1031048 -2536286 -3210608 -2550311 -1864827 -1958532 -2213687 -2117787
42669 -2117787 -1893305 -1368332 5071 1496078 1098439 -1865139 -5200751 -5902948 -3329584
42660 -3329584 281845 2247002 2038029 1467502 2292157 3853203 3791163 1276832 -1514884
42651 -1514884 -1946218 -113135 1511304 1074145 -969354 -2677490 -2295485 284549 2924667
42642 2924667 2939489 349776 -1613178 -481499 2220160 3425025 2924094 2912495 3964871
42633 3964871 4351039 3325881 2238805 1772427 680611 -1675307 -3752666 -4099983 -3441728
42624 -3441728 -3174644 -3247283 -2870202 -2178191 -1884236 -2035182 -2091188 -1696301 -876398 -157952
42614 -157952 -587686 -2492768 -4162182 -3365627 -539368 1329452 624719 -990780 -1509663
42605 -1509663 -1411888 -2102900 -3257027 -3571622 -2984350 -2324706 -1605367 -387986 724356
42596 724356 578295 -777847 -2050514 -2226711 -1317296 7391 796426 385141 -749836
42587 -749836 -1323881 -921493 -466253 -608629 -919293 -1279643 -2458701 -4287009 -4950220
42578 -4950220 -3570802 -1995132 -2310498 -3880021 -4636032 -4095922 -3142790 -1960136 -389661
42569 -389661 575366 24190 -759347 213559 2447039 3630043 3222041 2883684 3316025
42560 3316025 3224725 1903084 527168 104751 63005 -317553 -693227 -599176 -208221 337543
42550 337543 1022360 1199846 307380 -568391 278898 2362967 3331682 2489232 1618845
42541 1618845 1606953 911517 -1315075 -3221621 -3270434 -2868748 -3613312 -3985433 -1744932
42532 -1744932 1810513 3232331 1911913 509709 511971 508663 -570002 -1459405 -1017190
42523 -1017190 -287715 -564425 -1171702 -755921 550588 1700699 2332156 2480620 1863100
42514 1863100 875707 1116975 3179584 4948947 4153909 1863012 1101298 2373805 3200555
42505 3200555 2257621 1170988 1350692 1755396 1261290 788386 1127823 859430 -1136938
42496 -1136938 -2934854 -2167370 16757 734577 83128 546759 2194765 2415794 785480
42487 785480 161069 1721841 2787797 1539337 332545 1604356 3525481 3055828 1039836
42478 1039836 641224 2220389 3387721 3239454 3016898 3008205 2261891 1423644 2521235
42469 2521235 5300947 6655305 4642944 818629 -2201250 -3450328 -3313926 -2609418
42461 -2609418 -2593233 -3880388 -4826690 -3144178 309033 1833642 -36922 -2310532 -1864930
42452 -1864930 383841 1593740 1203856 629860 298728 -304387 -449529 1235070 4001438
42443 4001438 5233792 4064176 2878085 4182086 7127014 8375186 6121189 2256324
42435 2256324 145097 753441 1895135 1549172 727008 1720818 4211338 5205557 3161849
42426 3161849 166959 -991958 -237213 691413 1127527 1671357 2315656 2297085 1681875
42417 1681875 1548619 2408208 3533648 4002810 3563398 2444899 1095902 107691 -281532
42408 -281532 -516869 -929456 -882232 420715 2417305 3468029 2788687 1280494 243005
42399 243005 24014 222630 506773 761345 911685 1062605 1482773 2048745 2027997 955344
42389 955344 -419186 -706723 403126 1559260 1380678 329235 201687 1705509 3322679
42380 3322679 3047239 753760 -1704310 -2460135 -1254929 578821 1269858 35061 -2148184
42371 -2148184 -3410210 -2956834 -1783754 -1180389 -1289176 -1660080 -2218580 -2720897 -2243715
42362 -2243715 -573689 726417 280339 -722772 -27299 2193521 3484385 2748757 1553276
42353 1553276 1466818 2222436 3034107 3579979 2987456 172723 -3673439 -5209191 -3143430
42344 -3143430 -357591 -18811 -1328035 -1265885 819109 2753965 2898159 1751483 566469
42335 566469 195396 1050575 2617408 3305393 2230792 708671 460904 874625 -112647
42326 -112647 -2594145 -4090983 -2714824 539421 3100334 3350225 1603611 -462034
42318 -462034 -1102531 18199 1517372 1925804 1336494 859193 1029435 1619423 2402076
42309 2402076 3057188 2931826 2054536 1725952 2738085 3669781 2628119 226920 -1078871
42300 -1078871 -513630 163950 -360820 -1027254 -264663 1601916 2783447 2119598 135986
42291 135986 -1507486 -1454898 -55951 803416 -99680 -1689588 -2008846 -704763 1038899
42282 1038899 2371899 3007332 2182546 -505915 -3280482 -3396697 -698524 1880475 1976567
42273 1976567 301032 -1073533 -1214967 -390793 729695 1056286 -282017 -2455919 -3506370
42264 -3506370 -3085223 -2950141 -3857855 -3950431 -1787283 715863 484283 -2463997 -4895228
42255 -4895228 -4115611 -367554 4154429 7250291 7794568 6079758 3309270 355835
42247 355835 -2610967 -5012253 -5459214 -3430488 -565215 829819 136484 -1479716 -2694460
42238 -2694460 -2920213 -2248758 -1382012 -1074733 -1039749 -238421 1209259 1733137 806616
42229 806616 100866 730860 1066822 -612610 -2766697 -2621035 -636978 127844 -1138360
42220 -1138360 -2035772 -1227598 -400366 -753854 -560589 1768159 4541818 5163931 4062059
42211 4062059 3701231 4593465 4803970 3171256 779073 -971674 -1841470 -1806875 -315669
42202 -315669 2519306 4978013 5064892 2569579 -717515 -2716433 -2743849 -1657665 -584308
42193 -584308 272507 1282251 2046803 1368589 -857024 -2588703 -1684291 1293203 3535883
42184 3535883 3284654 1493677 -13981 -813069 -1644977 -2854576 -3901582 -3959929 -2493289
42175 -2493289 190398 2517367 2609868 433970 -1716269 -1745450 -103642 1332618 1884667
42166 1884667 2132612 1979797 623022 -1483154 -2596109 -2206464 -1837318 -2490853 -3044899
42157 -3044899 -2449131 -1859983 -2751294 -4124430 -3837486 -2073662 -1065420 -1403745 -1130915
42148 -1130915 779747 2352083 1515268 -552009 -910544 1068840 2972711 2606864 472614
42139 472614 -1377129 -1811659 -1252352 -474520 325069 1194646 1775858 1554875 750821
42130 750821 389221 1095995 2184907 2470160 1689629 482264 -691249 -1610896 -1498512
42121 -1498512 383925 2953778 3652595 1627136 -600570 -76453 2717338 4593615
42113 4593615 3938735 2376642 1827519 1811250 922031 -336237 -79871 1840098 3044060
42104 3044060 1579895 -1531238 -3665953 -3745792 -2847374 -2079788 -1303341 -199655 730308
42095 730308 998189 990255 1128294 1007086 381054 174953 1105059 1857485 371344 -3108164
42085 -3108164 -5922013 -6162874 -4368077 -1801063 1018607 3255185 3223578 580240 -2203279
42076 -2203279 -2337604 -41872 2104803 2579082 2200987 2345028 3251868 4033214 3370581
42067 3370581 570222 -3111895 -4888989 -3522996 -1292447 -1193170 -2769303 -2914801 -673575
42058 -673575 1310059 771843 -1142027 -2120109 -2022269 -2301104 -3450704 -4734185 -5540594
42049 -5540594 -5525822 -4264438 -2261733 -1439071 -2834542 -4452426 -3410760 -3401 2456733
42040 2456733 2034184 365135 -133339 712748 1669473 2276232 2713420 2666681 1897306
42031 1897306 1168483 1122258 923682 -367973 -1683280 -1162900 747772 1675449 1076641
42022 1076641 1156266 2999998 4256494 2698067 168370 182352 2586866 3748252 2075091
42013 2075091 265605 1057272 3362043 4345899 3463454 2411730 2245867 2527288 2723680
42004 2723680 2693292 2054868 557887 -1038490 -1631300 -1126322 -143152 1153470 2745737
41995 2745737 3803944 3461790 2229136 1236351 454616 -763135 -1796011 -1384320 -16205
41986 -16205 488348 -51194 37381 1052302 1112823 -332592 -907339 874972 2557753
41977 2557753 1134193 -2144635 -3330353 -1354505 845750 626444 -1557193 -3862658
41969 -3862658 -5131045 -4615268 -1846369 2066287 4491345 3784979 931235 -1846839
41961 -1846839 -3139474 -2670053 -857225 1202465 2256129 2046823 1267255 204645 -1474988
41952 -1474988 -3399056 -4410575 -4378588 -4593574 -5540483 -5807399 -4376715 -2556381 -2063967
41943 -2063967 -2332605 -1580156 135713 889553 -255289 -2093734 -3091978 -2870706 -1687857
41934 -1687857 105163 1593094 1489692 -418628 -2649527 -3409700 -2312649 -570901
41926 -570901 168519 -772922 -2417883 -2975377 -1809287 -216624 349700 255850 884411
41917 884411 2378483 3588891 4052196 4376034 4476321 3216228 575765 -1353403 -774317
41908 -774317 1368760 2566807 1802151 362463 -50797 922063 2327770 2992963 2573955
41899 2573955 1842587 1794277 2375026 2531136 1668585 446010 -179290 -79578 209149 179316
41889 179316 -441301 -1541933 -2408313 -2360966 -1832467 -1899990 -2504411 -2348015 -1053878 3223
41879 3223 -83577 -159278 1020064 2488717 2489760 1320420 827458 1480540 1870835 1127772
41869 1127772 97834 -213348 3415 -12419 -581941 -1446601 -1919802 -1313995 9895
41860 9895 471222 -813249 -2549139 -3082442 -3032849 -4232276 -6449677 -7479062 -6604565
41851 -6604565 -5544135 -5302098 -4488796 -2002246 690305 1590644 981786 570913 972040
41842 972040 1585100 2050015 2341634 2141426 1433444 1060832 1485378 1694449 559222
41833 559222 -1396498 -2795993 -3273960 -3255043 -2594469 -983488 726838 1194335 497928
41824 497928 71229 747993 1972942 2855498 2973810 2293299 1295982 973636 1694460
41815 1694460 2394779 1963866 1003431 937829 1790893 2362057 2340012 2508605 2850895 2300143
41805 2300143 741202 -517695 -899107 -1511627 -3078679 -4422960 -4127267 -2484285 -658701
41796 -658701 975946 2417712 3003402 2361786 1748253 2751479 4834682 5680565 4137352
41787 4137352 1533213 -247656 -812769 -848417 -712658 -372453 -198418 -801449 -2034134
41778 -2034134 -2846518 -2437052 -1230029 -420944 -656731 -1405252 -1674559 -1194897 -718068
41769 -718068 -1112742 -2268840 -3056446 -2472789 -783029 648439 748641 -181569 -921697
41760 -921697 -712683 99613 723801 813247 556420 228737 -29433 -111993 71994 389846
41750 389846 331860 -655223 -2299653 -3064588 -1410123 1994351 4182727 3138494 562186
41741 562186 -137030 1611452 2973887 2065372 563463 603058 1149042 -155028 -2754195
41732 -2754195 -3688829 -2186078 -913381 -1821621 -3145531 -2188027 523260 1963531 904301
41723 904301 -554959 -96059 1737286 2593493 1628280 428106 621948 1835704 2677843
41714 2677843 2737671 2449600 1703103 220545 -956751 -325627 1461598 1934499 514028
41705 514028 -350132 918225 2286092 1361212 -708258 -1396184 -1218985 -2479170 -4436779
41696 -4436779 -3719948 112962 3145583 2397890 -574443 -2774467 -3544352 -3446228 -2012611
41687 -2012611 972786 3732282 4355096 3267331 2104425 1392882 1001872 1402547 2461534
41678 2461534 2277983 -498706 -4061478 -5383998 -4190737 -2875876 -2845704 -3029251 -1998831
41669 -1998831 200707 2446130 3423867 2288545 -329714 -2365141 -2602811 -2265723 -2906788
41660 -2906788 -3711022 -2954303 -1343830 -1250343 -2750302 -3210802 -1353063 814323 1098106
41651 1098106 -53988 -1072360 -1686366 -2269115 -2208565 -680554 1648918 3061912 2645425
41642 2645425 980908 -564043 -758695 605830 2299260 2809453 2191666 1847444 2239253
41633 2239253 2138629 754068 -735475 -763708 530594 1795900 2195939 1691821 400452
41624 400452 -1327436 -2781184 -3600701 -3941244 -3424610 -1147590 2330265 4397729 3353863
41615 3353863 953836 222143 1451263 2362141 1848073 1299905 1923561 2837591 2729893
41606 2729893 1837947 1178126 876349 342221 -607713 -1751220 -3071145 -4480346 -5229820
41597 -5229820 -4391640 -1962296 896617 2670377 2457934 558850 -1587439 -2451887 -1830792
41588 -1830792 -931874 -723590 -665171 295994 1805176 2142959 420916 -2026918 -3048961
41579 -3048961 -2122168 -756791 -551842 -1520217 -2536747 -2802922 -2358419 -1600953 -1019795
41570 -1019795 -1193152 -2239668 -3247861 -3050259 -1756838 -776418 -1068720 -2139332 -3033523
41561 -3033523 -3389651 -3069952 -1859745 -320158 183736 -553347 -636119 1359589 3692464
41552 3692464 3307122 104806 -2692257 -2656030 -698781 995640 1700476 1910719 1991165
41543 1991165 2174198 2673924 2827306 1329409 -1719197 -4270303 -4858906 -4317508 -3822229
41534 -3822229 -2838742 -668227 1469994 2036262 1703617 1957153 2097506 325840 -2698965
41525 -2698965 -4289947 -3692901 -2708091 -2104703 -620277 1576207 1792395 -908492 -3176991
41516 -3176991 -1715405 1874704 3361922 1641954 -597710 -1214056 -834742 -820359 -1387022
41507 -1387022 -2174905 -2956216 -3347452 -3035988 -2453815 -2244682 -2242723 -1965896 -1637272 -1543304
41497 -1543304 -1095788 -75813 -20981 -2279311 -5142646 -5373860 -2652484 760 645021
41488 645021 613084 1328052 1629708 141019 -1761935 -1705089 101223 1257936 633068
41479 633068 -475257 -481235 696481 2013577 2385517 1477641 246425 324175 1941286
41470 1941286 3004659 1515196 -1455323 -2738747 -1123313 1074015 1077682 -919205 -2376726
41461 -2376726 -1753283 -72004 809107 483933 -29476 -103999 -307648 -1063816 -1317529
41452 -1317529 415255 3723596 6070976 5435086 2632859 456883 743354 2699563
41444 2699563 4024365 3430834 2002423 1883983 3519259 4771605 3516716 640400
41436 640400 -760046 862239 3819795 5488497 4937511 2830161 253330 -1368991
41428 -1368991 -582478 2354060 4788608 4224076 1221390 -1419322 -2021447 -1352578 -837004
41419 -837004 -832902 -899970 -671509 -16459 950979 1656194 1418559 407686 -137696 874653
41409 874653 2937474 4019773 2501128 -814911 -3077327 -2347487 118364 1343655
41401 1343655 202821 -1519875 -1665007 -85905 1808557 2706893 2093133 414938 -875980
41392 -875980 -536751 662724 537606 -1509674 -3443575 -3345647 -1770521 -335652 580341
41383 580341 1435617 2122570 2366130 2433918 2285187 1347653 287114 1157407 4123906
41374 4123906 6046360 4604772 1929525 1305876 2030746 1097789 -1211106 -1546079 943968
41365 943968 3309501 3517093 2749113 2263724 1602385 960898 1685259 2968254 1749413
41356 1749413 -2078721 -3959623 -890843 3800424 5166561 3496141 2691812 3740508
41348 3740508 4066560 2568279 1058625 414127 -954512 -3691501 -5593109 -4743056 -2401059
41339 -2401059 -1043945 -1015934 -856126 -28984 431404 -216556 -1391115 -2336996 -3209978
41330 -3209978 -4275353 -4707379 -3366758 -813831 665340 -317799 -2622819 -4472763
41322 -4472763 -5805051 -7175126 -7427479 -5026553 -1481749 -462803 -2681068 -4478248
41314 -4478248 -3105171 -833991 -1395820 -4245704 -5420384 -3274628 -357161 547938
41306 547938 -273754 -858027 -439613 88046 -338080 -1697861 -2740419 -2073428 91296
41297 91296 1628528 810749 -1362179 -2227474 -750850 1407963 2243427 1611986 573592
41288 573592 -433240 -1684407 -2745626 -2180253 560588 3496330 3705924 1031770 -1075110
41279 -1075110 340534 3770997 5246162 3712272 1928647 1868948 2123892 1073007 -74364
41270 -74364 456304 1702725 1494379 79943 -324043 963125 2294019 2174890 664534
41261 664534 -1476530 -3302963 -3583576 -1899876 221965 761188 -330802 -1410197 -1521195
41252 -1521195 -1070622 -535505 -64147 -78092 -773262 -1329380 -1015638 -536830 -757121 -910174
41242 -910174 -44471 587757 -905059 -3573396 -4488218 -3002876 -1271005 -358458 912817
41233 912817 2495917 1978541 -1322950 -4079242 -3107865 378228 3025478 3885188 4054081
41224 4054081 3382063 764150 -2824392 -4634566 -3832197 -2503587 -2359236 -2441722 -1078776
41215 -1078776 1432847 3355777 3845639 3561340 3312888 3148762 2890196 2831507 3462567
41206 3462567 4727301 5923116 6341743 5818179 4722356 3702142 3363416 3750226 4112442
41197 4112442 3711083 2855769 2402972 2234001 1425746 225079 227988 1656998 2192700
41188 2192700 185246 -2450835 -2768667 -1130779 -418035 -1547795 -2677415 -2700602 -2390281
41179 -2390281 -1694719 710981 4016620 4765912 1793171 -1192715 -594537 1828398 1847026
41170 1847026 -778709 -2393278 -1405429 -420390 -1750301 -3899316 -4082573 -2195132 -487849
41161 -487849 -406712 -1334102 -1973384 -1725128 -792846 201006 647011 516736 435815 736777
41151 736777 637895 -910892 -3531530 -5446547 -5611414 -4943795 -4667154 -4338675 -2859404
41142 -2859404 -762130 424257 887839 2265385 4292348 4459962 2222822 692919
41134 692919 2017809 3733457 2639674 -29097 -947130 -277854 -522183 -1146292 420403
41125 420403 2776834 1345178 -3817354 -6789266 -4590082 -1734649 -2723687 -5095647
41117 -5095647 -4444361 -2120078 -2446287 -5113569 -6104320 -4613270 -3489959 -3486598 -2393944
41108 -2393944 9127 1126985 375602 290608 1668894 1853755 -457028 -2521284 -1851019
41099 -1851019 18975 556299 398240 1660686 3840941 4295226 2113812 -736394 -1975007
41090 -1975007 -1177038 515304 1705358 1722853 943620 172539 -373542 -1089439 -2012521
41081 -2012521 -2489067 -1943238 -498058 1060536 1499810 -84963 -2832789 -4156146 -2509708
41072 -2509708 457340 1976380 1749110 1648434 2408157 2919582 2696007 2543776 2479028
41063 2479028 1495638 63269 322741 2683518 4535265 3738440 1352949 -597875 -2075660
41054 -2075660 -3894538 -5350699 -5149772 -3638903 -2186973 -1148765 -135121 530951
41046 530951 402868 285858 1221572 2513849 2481649 980666 -372494 -399573 598715
41037 598715 1880911 2917260 2978554 1546906 -446667 -969615 873446 3610071 4901634
41028 4901634 3891888 1782509 382522 347258 822440 777534 420717 748838 1741433
41019 1741433 1961586 491059 -1538792 -2192769 -1033368 636813 1485898 1288326 580930
41010 580930 35077 188667 1121967 2223032 2638320 2034875 762839 -572216 -1498044
41001 -1498044 -1883373 -2005487 -2204613 -2336875 -1888856 -749763 541317 1424862 1700158
40992 1700158 1204226 -186506 -1984624 -3207000 -3359242 -2681200 -1342732 572420 2047969
40983 2047969 1560004 -625742 -1984794 -956803 475133 -732936 -4240685 -6495399
40975 -6495399 -5450031 -3019169 -1987201 -2199332 -1351945 1354791 4094328 4905608 3893360
40966 3893360 2461264 1408998 666145 306420 690464 1610999 2285834 2480019 2776416
40957 2776416 3346069 3407064 2609127 2024679 2671916 3726784 3508597 1876770 319900
40948 319900 -151348 135629 650871 1189050 1142030 -231338 -2321296 -3203887 -1785316
40939 -1785316 901049 2815546 2601134 357026 -2149340 -2364009 429666 3607552
40931 3607552 4115900 2582200 2162954 3401241 3391347 886153 -1134684 92245 2935398
40922 2935398 4060771 3047492 1718557 744377 -329141 -1125824 -1221972 -1666786 -3152189
40913 -3152189 -3956458 -2468406 -481982 -851341 -2881043 -3454590 -2066369 -1066858 -1145778
40904 -1145778 -467330 1266361 1700383 -156492 -2189575 -2801395 -3201135 -4558226 -5775648
40895 -5775648 -5872749 -5890504 -6395530 -5583669 -2290469 1147824 1713749 -1011 -880190
40886 -880190 291550 1904614 2450715 2065690 1210471 -230572 -2097852 -3421125 -3252046
40877 -3252046 -1670920 27679 191245 -1481199 -3072499 -2376082 187136 2011345
40869 2011345 1904944 1369519 1672944 1874114 1009064 36981 -141785 -522038 -1678569
40860 -1678569 -1623677 1197564 4326474 4065608 1059222 -388492 1472749 3713075 3436387
40851 3436387 1469930 79103 -368370 -766223 -1238027 -1467652 -1725064 -2122392 -1941046
40842 -1941046 -882943 114475 421887 878083 2164627 3242420 2956046 2163081 2414157
40833 2414157 3171409 2420402 -8849 -1731880 -931972 1413013 3195197 3760186 3825333
40824 3825333 3806059 3476529 2855981 2267803 1573271 310464 -1241955 -1920500 -936977
40815 -936977 1189745 3182122 4066864 3605981 2305777 1280647 1434452 2289058 2257419
40806 2257419 720977 -821359 -623935 805595 1360371 343578 -626991 -76307 1301454
40797 1301454 1830916 1054498 -156959 -919802 -794111 455561 2398043 3497081 2344048
40788 2344048 -400100 -2118382 -818702 2638221 5184510 4456530 1086444 -1954413
40780 -1954413 -2412856 -917080 325684 575312 1142420 2764062 3875897 2631619 -232937
40771 -232937 -1979013 -1100548 1191987 2748360 2712639 1744944 861051 543029 603938
40762 603938 518949 -88520 -1185731 -2430292 -3317064 -3373500 -2740092 -2477786 -3422974 -4603010
40752 -4603010 -3997318 -1429693 667293 442486 -775312 -705003 215819 -306644 -2397315
40743 -2397315 -3524360 -2409996 -868408 -640139 -626970 1003349 3623163 5106749 4954833
40734 4954833 4389775 3949452 3114723 2117195 1914314 2118667 1169322 -718288 -1051847
40725 -1051847 1078075 2776983 1275458 -1497007 -1319127 1993650 4166621 2815880
40717 2815880 602136 420278 859115 -657923 -2883678 -2744439 -756214 -204024 -1504775
40708 -1504775 -1822957 -555973 -504503 -2243840 -2071251 1767526 5015664 3384039 -612056
40699 -612056 -1288367 1816273 3949755 2557115 -44454 -1413792 -2006569 -2558894 -2209286
40690 -2209286 -701766 384786 33851 -789989 -1145589 -1436924 -1875958 -1709025 -806983
40681 -806983 -95004 185354 658470 1031097 564116 452166 2565221 5279357 4372818
40672 4372818 -476955 -4038280 -2714127 381130 693567 -935118 -911337 355687 -522614
40663 -522614 -3386332 -4274434 -1917351 187722 -567545 -2023557 -996344 1869067 3246827
40654 3246827 1607215 -1301825 -2783637 -1920572 -298233 -287829 -2180154 -3428024 -1750355
40645 -1750355 1527060 2781009 561465 -2894778 -4686228 -4144870 -2436925 -852864
40637 -852864 -122262 -309567 -777209 -815153 -363255 361332 1372008 2190355 1520950 -951276
40627 -951276 -3281591 -3503696 -2365049 -1860009 -1910581 -1056001 194274 -136719 -1623321
40618 -1623321 -1484545 751859 2016736 564718 -1088380 -186673 1976713 2356692 749447
40609 749447 -646474 -942955 -1167515 -1860668 -2438374 -2696038 -3029015 -3224240 -2545205
40600 -2545205 -1027005 378473 819606 32680 -1641918 -3059496 -2882397 -1175214 430549
40591 430549 829779 632118 593711 316938 -459400 -804662 -183057 312524 -229994 -877842
40581 -877842 -529406 179361 298347 385457 1108634 1669214 1622288 2362954 4313607 4734540
40571 4734540 1638287 -2026047 -2218045 -385051 -1245631 -4608110 -5111883 -969424 2807631
40562 2807631 2206961 11492 398729 2223401 2085537 759455 1535015 4034913 4630207
40553 4630207 2362288 83472 -333255 -87240 -304139 -229172 499954 586165 -747891
40544 -747891 -2400780 -3158377 -3083425 -2473148 -1154494 481374 1292338 897876 79248
40535 79248 -675834 -1604958 -2432909 -2359906 -1625031 -1371475 -1581646 -998081 432411 1099965
40525 1099965 445961 -36839 439922 460422 -849926 -1767943 -694036 874592 462218
40516 462218 -1591755 -2879356 -2523831 -1614345 -735163 458143 1585054 1927263 2290955
40507 2290955 3963882 5750846 4736086 604838 -3298267 -4191645 -2909459 -1651942
40499 -1651942 -951919 -472074 -851949 -2652815 -4655331 -5191728 -4481808 -4030705 -4341532
40490 -4341532 -4718072 -4721969 -4330640 -3195924 -1270944 271990 290819 -505389 -513804 329275
40480 329275 760163 591534 938728 1875961 1901890 434321 -948207 -770994 288233
40471 288233 759232 545334 404969 245796 -524188 -1446915 -1326007 -38798 1196557
40462 1196557 1500503 1213946 809667 -58457 -1670951 -2959626 -2142312 1025766 4195953
40453 4195953 4435880 1521368 -1442130 -1386470 1132556 2767791 1747544 -12246 135342
40444 135342 1812027 2321639 547955 -1596363 -1868737 -377388 1185340 1892916 2065357
40435 2065357 2019377 1647002 1266095 1750865 3285679 4681315 4592072 3088417 1437968
40426 1437968 503054 -55195 -982082 -2382783 -3635813 -3988864 -3110741 -1385780 194711
40417 194711 743282 270649 -397548 -515721 9449 834646 1508010 1603555 1092067 648280
40407 648280 975720 1724496 1820391 1073274 573880 1057003 1776944 1707157 1093395 957153
40397 957153 1564895 2174894 1968155 740992 -817528 -1234629 403696 2725246 2991220
40388 2991220 643937 -1530597 -1161674 303187 -35865 -2006720 -2797721 -1313601 660555
40379 660555 1658784 2221944 2883965 2884899 1740667 156181 -1324173 -2746842 -3368513
40370 -3368513 -2029452 352168 963742 -1067632 -3121280 -2679956 -533515 1012938
40362 1012938 1229893 692287 -267347 -1042082 -258252 2309108 4572991 4580554 2926875
40353 2926875 1236615 -263380 -1890733 -2756949 -2017520 -743549 -482943 -920475 -868531
40344 -868531 -502376 -611514 -716497 -40559 694016 617383 761852 2371398 4181671
40335 4181671 4019339 2354856 1568257 2219055 2705817 2209867 1353338 318268 -1060742
40326 -1060742 -1741948 -731631 534561 -73973 -1699043 -1632989 243030 1564266 1799261
40317 1799261 2670487 4092203 3736906 1377719 -334090 -472298 -1206734 -3257058 -4150315
40308 -4150315 -2865628 -2090439 -3473248 -4560285 -3239223 -1475807 -1440441 -1498261 260568
40299 260568 1758631 360232 -2162025 -2446492 -1007124 -375963 73928 2408260 4810288
40290 4810288 3490786 -698077 -3016244 -2284083 -2169249 -4245145 -5150316 -2506690 1081483
40281 1081483 2411976 2102280 1994571 1673347 488727 -3766 1174578 1718466 -502979
40272 -502979 -3272708 -2918069 -67180 1187616 -616642 -2582997 -2087783 -26493 1471923
40263 1471923 2007158 2160242 1586373 -427384 -3257796 -5121278 -4839359 -2853282 -702455
40254 -702455 182201 -488208 -1688232 -2150134 -1721999 -1298177 -1342387 -1147414 -29322
40245 -29322 1287436 1327474 -122907 -1456890 -1093388 601628 1756276 1115919 -780971
40236 -780971 -2404433 -2637686 -1409571 394133 1400201 689465 -1308346 -3134559 -3741746
40227 -3741746 -3302211 -2487929 -1545771 -469560 454203 889197 1001860 1266609 1811864
40218 1811864 2286700 2303266 1849607 1381908 1492077 2223746 2862338 2844227 2569327 2494494
40208 2494494 1740710 -978046 -4815108 -6783896 -5199219 -1907685 36397 -19751 -293328
40199 -293328 510831 1638469 1635776 336641 -808474 -308899 1392919 2027743 414359
40190 414359 -1401632 -675238 1738803 2206006 -184316 -2021197 -807628 1432778 2104777
40181 2104777 2507052 4935260 7740759 7506175 4790178 3284546 3767537 3364385 1119167
40172 1119167 -63397 1751406 4446821 5188963 3866724 1780984 -317407 -1468161
40164 -1468161 -464781 1899914 2953712 1793627 318851 -434517 -1852507 -4095118
40156 -4095118 -4435805 -1767301 492870 -734303 -3118839 -2466295 731801 2435228
40148 2435228 1523259 869521 2188212 3693387 3440021 1865801 251520 -819043 -779076
40139 -779076 926895 3462918 4982546 4824322 3819745 2520691 1012580 327477 1693355
40130 1693355 4073687 4727751 2792493 267585 -1063920 -1530703 -1733143 -1110069 517303
40121 517303 1930402 2315982 2455117 2993702 3179679 2475211 1692356 1193944 -207956
40112 -207956 -2818151 -4248241 -2355050 1137608 2471275 831740 -932253 -605063
40104 -605063 707522 879861 -130268 -724859 -151868 743635 958032 534500 96311
40095 96311 -281473 -1104197 -2252163 -2463387 -879268 1218112 1457703 -670553 -3191457
40086 -3191457 -4323764 -4320637 -4036279 -3452009 -2813312 -3350819 -5009310 -5201056 -2368654
40077 -2368654 602457 -235023 -3842266 -5281009 -2957456 -685996 -1324473 -2506295
40069 -2506295 -1288084 489340 -741358 -4058316 -5051035 -2223930 1359767 2815656
40061 2815656 2528992 2058586 1846253 1897792 2456758 3057953 2666936 1388638 408594
40052 408594 -73407 -1001530 -2299207 -2636735 -1748744 -780613 64976 1676491 3276176
40043 3276176 2593217 -8560 -865453 1565616 3855157 2873929 862221 1606207 3988935
40034 3988935 3792507 634980 -1513870 -559231 1247368 1590056 1022508 635837 169836
40025 169836 -248045 621759 2705775 3928296 3213113 1893368 1069336 38556 -1452237
40016 -1452237 -2043403 -1397097 -1377856 -2717422 -3052930 -627174 2345780 2736457 1022808
40007 1022808 -210620 -714225 -2096522 -3776428 -3056625 556825 4216177 5664102
39999 5664102 5803236 6368799 7116166 6634098 4645739 2314681 904792 798714 1419243
39990 1419243 1879377 2001093 2372741 2933837 2401718 271201 -1533198 -853836 1324045
39981 1324045 1875807 -31925 -1822033 -1439520 -161820 -230072 -1515916 -2247958 -1854088
39972 -1854088 -1301582 -1225540 -1296351 -1205378 -999067 -520080 439979 1448821 1722595 1074441
39962 1074441 -20900 -1013038 -1267126 -32274 2488673 4449645 4153198 2438850 1710093
39953 1710093 2399577 2278390 58146 -2310218 -2548555 -1622092 -2079184 -3812241 -4273187
39944 -4273187 -2765032 -1536081 -1849584 -1828760 152124 2310861 1952142 -501739 -2325808
39935 -2325808 -2207485 -892482 833037 2303452 1945500 -1066898 -4446755 -4920128 -2663317
39926 -2663317 -743153 -184806 888466 2630619 2093050 -1597247 -4415684 -2846420
39918 -2846420 687508 1310935 -1375855 -3615725 -3462698 -2413739 -1456183 422524 3009259
39909 3009259 3753197 1606335 -621286 217191 3430818 5801482 5905200 5078066 4567301
39900 4567301 3821798 2163245 638692 844970 2300583 2447550 -97821 -3350922 -4257125
39891 -4257125 -2590071 -878479 -552142 -257201 1306809 2970038 2948493 1472675 -109027
39882 -109027 -1426804 -2405956 -1854918 851147 3537597 3321660 672676 -1109427 -474261
39873 -474261 802002 892975 213603 -359682 -1223050 -2755981 -4103395 -4469866 -4112924
39864 -4112924 -3027212 -406445 3172563 4775781 2417778 -1676168 -3305500 -1396837
39856 -1396837 1170590 1808601 1164298 1125618 1732033 1584497 370990 -757146 -1203395
39847 -1203395 -1689116 -2475644 -2286978 -255781 2022726 2165878 514776 28108 2128395
39838 2128395 4434954 3840276 579736 -2236400 -2441848 -817623 311583 -641422 -3329574
39829 -3329574 -5643579 -5475784 -3093051 -1165234 -1653528 -3506464 -4395561 -3676217 -2293921
39820 -2293921 -827003 599764 1248723 629824 5550 1052822 3206074 4194519 3093586
39811 3093586 1044751 -821596 -2183023 -2448639 -1181909 274621 -66452 -1719313
39803 -1719313 -2090076 -471513 847302 350004 -421878 205565 1196215 845530 -184039
39794 -184039 -87318 1035658 1506959 768093 -111098 -259273 180424 834252 1473144 1773146
39784 1773146 1616413 1383349 1296620 996531 404360 237198 810131 1114746 157412 -1427071
39774 -1427071 -2252736 -2142826 -1895658 -1370400 638993 4155262 6815981 6002922 1998983
39765 1998983 -1850396 -2588118 -795765 509915 -50670 -633630 694848 2714998 2575308
39756 2575308 -230103 -3269569 -4290927 -3181338 -1018884 854455 755495 -2109929
39748 -2109929 -5669797 -6218614 -2653629 2020944 4304394 3888669 2859844 2620839 2748969
39739 2748969 2059805 37824 -2218894 -2500505 -5977 2978391 3613818 2348751 1899276
39730 1899276 2635895 2152813 -62609 -1142762 471346 2277547 1835827 529547 541810
39721 541810 933841 -33438 -1027381 277127 2899611 3928302 3026080 2181056 1987732
39712 1987732 1563747 1259956 1938472 2293328 574787 -1569851 -938687 1776988 2669363
39703 2669363 1020502 424999 2380030 3446622 1103768 -1707779 -1122364 1716046
39695 1716046 2892333 1738462 880461 1489181 2074536 1683609 1165418 988402 411921
39686 411921 -541176 -457464 1135221 2402574 1359130 -1535168 -3998076 -4631696 -4015428
39677 -4015428 -3229685 -2295022 -626966 1515424 3032556 3578207 4144580 5351748 6028804
39668 6028804 4770542 2470183 1696475 3345351 5401125 5635364 4249119 2957269
39660 2957269 2552088 2571296 2658027 2864581 2799803 1766511 33769 -990907 -433816
39651 -433816 753303 859868 -367919 -1257642 -263864 1944525 3067612 1834719 -517335
39642 -517335 -1699044 -845929 844063 1604747 772925 -829233 -1721154 -1007683 880915
39633 880915 2611639 3122666 2310539 788615 -585366 -1100035 -773728 -491905 -820510
39624 -820510 -854974 614359 2828390 3523708 2108872 677777 935039 1744343 1093696
39615 1093696 -850450 -2207950 -1875700 -140900 2114937 3412592 2203684 -838998
39607 -838998 -2428997 -704329 1678806 1101551 -1571691 -2380814 -452097 1014983 243626
39598 243626 -488827 973188 3186544 3742470 2789813 1883654 1387628 1022055 1244751
39589 1244751 2141764 2480154 1705910 1343501 2454731 3248960 1544894 -1593286 -3193586
39580 -3193586 -2548015 -1478217 -885476 229282 2094571 3093699 2288394 1133892 1540619
39571 1540619 3440234 5224035 5691182 4740135 2838383 652290 -1069865 -1809646 -1558765
39562 -1558765 -871791 -726592 -1772988 -3145419 -2725196 255963 3351944 3258561 56763
39553 56763 -2677555 -2502486 -966749 -715856 -1535397 -1228952 678943 2458888 3034759
39544 3034759 2979566 2504428 908329 -1137527 -1166722 1578121 4163779 3646916 1270676
39535 1270676 418774 1394020 1379212 -510090 -1520971 311821 2893331 3045617 739921
39526 739921 -1560932 -2284024 -1599983 -107356 1449200 1996350 1330668 751168 1085719
39517 1085719 1099755 -542438 -2814766 -3649416 -2723828 -1048305 1046568 3191296 3411402
39508 3411402 286954 -3853315 -5080709 -3224731 -1936696 -3064877 -4291057 -3349442
39500 -3349442 -1392267 -505393 -546851 -361868 36041 368497 1223271 2436799 2246931
39491 2246931 72686 -1657073 -731946 1342050 1605404 189233 -176569 1483456 3319084
39482 3319084 3778194 3172804 1906018 -310395 -2697395 -3119543 -901712 1593040 1653682
39473 1653682 -424891 -1991504 -1482368 79268 905523 552532 -235647 -952297 -1711947
39464 -1711947 -2405676 -2411169 -1519673 -446055 218204 958804 2309051 3322298 2437674
39455 2437674 -60146 -1881959 -1628149 -621759 -887391 -2195654 -2422986 -618200 1505423
39446 1505423 1569268 -609603 -2791725 -2879296 -1083894 861369 2035818 2815181 3300791
39437 3300791 2951447 2232927 2716942 4368865 4684248 2370135 -2502 391835 2020235
39428 2020235 1367107 -1200387 -2076355 -694925 -535745 -2859437 -4006007 -1159257 3070972
39419 3070972 4706620 3935137 3469289 3910609 4034193 3733393 3419413 2038587 -1121689
39410 -1121689 -3902367 -3675426 -1314665 163463 -15255 -308062 -228540 -567109 -831565
39401 -831565 231662 1778443 1729606 465058 427474 1800063 1926192 -146526 -1669482
39392 -1669482 -117189 3360791 5844650 6018846 4359610 1752770 -689250 -1799709
39384 -1799709 -1600239 -1416254 -1942025 -2193083 -1104339 746485 1710738 808796 -1396225
39375 -1396225 -3234698 -3390579 -2353517 -1779962 -1939069 -1227880 701748 1385779 -725514
39366 -725514 -3020749 -2372312 -361001 -822368 -3231487 -3364903 -482248 1436622 673297
39357 673297 578728 3126009 4795357 2421501 -1154319 -1594236 98599 -15643 -1965001
39348 -1965001 -2432374 -858690 -76678 -1145432 -1938524 -1206555 -233350 164410 854681
39339 854681 1761059 1173845 -1072342 -2371335 -754591 2430441 4480699 4343563 2674791
39330 2674791 487641 -1167984 -1442320 -595898 211577 565314 1224007 2581508 3933649
39321 3933649 4716543 5251168 5760740 5814579 5269841 4704504 4464000 4273145 4070550 4087931
39311 4087931 3843280 2371442 -114689 -2080091 -2683015 -2704025 -2989572 -3269573 -3089828
39302 -3089828 -2632945 -1997266 -919440 215506 458139 -12466 187151 1297627 1711759
39293 1711759 639408 -319731 315991 1509166 1557923 902678 1098556 2142765 2897499
39284 2897499 3231784 3628502 3530338 2392255 1645164 2959693 4901987 4213648 686535
39275 686535 -2045287 -1362215 1188670 2627163 2125024 559524 -1423974 -3253104 -3931760
39266 -3931760 -3355193 -2919135 -3439250 -3719925 -2591627 -1024344 -513898 -518388 567397
39257 567397 2672148 4216538 4514437 4162542 3415153 2089599 964247 1280884 2537314
39248 2537314 2581405 602012 -1436938 -1315053 495336 1501212 388304 -1467441 -1890738
39239 -1890738 -674426 285721 -314889 -1373214 -1238522 -531960 -1169068 -2739617 -2458639
39230 -2458639 383581 2596596 1584040 -682487 -783744 938517 1513577 468969
39222 468969 193904 1495172 2361731 1600234 538733 320401 284744 -57538 45233
39213 45233 806230 1387855 1821131 2945144 3923698 2807759 340947 -241089 1475094
39204 1475094 1740487 -1245954 -3705327 -1942400 1655374 2263201 -205883 -1968277
39196 -1968277 -1761614 -1669049 -2165332 -970787 2598537 5950408 6875093 5888992 4131161
39187 4131161 1817912 -189006 -7762 2560098 4934786 4740937 2400892 -211980
39179 -211980 -2163491 -3472321 -4105890 -4100472 -3811944 -3300805 -2232057 -773208 337035
39170 337035 908855 1461374 2007698 1844718 974906 628907 1735169 3579135 4449734
39161 4449734 3201187 129266 -3201772 -5108890 -5191413 -4253184 -2674624 -48129 2933505
39152 2933505 4040479 2588364 1240892 2349649 3911504 2240358 -2173416 -4998569
39144 -4998569 -4203412 -2293921 -1802122 -1988786 -1299205 -41944 1035209 2294947 3666664
39135 3666664 3819124 2500447 1549180 1947774 2049136 525580 -1106662 -1018728 -123742
39126 -123742 -225429 -838441 -471068 265769 -375008 -2022428 -2632131 -1842843 -1360249
39117 -1360249 -1931393 -2181331 -914922 1147365 2490775 2464317 1414017 43173 -1048338
39108 -1048338 -1654540 -1805138 -1240163 259098 1745624 1503739 -633248 -2511910 -2232504
39099 -2232504 -403135 1275538 2418155 3465575 3932264 3012492 1297095 136836
39091 136836 -303680 -826646 -1487813 -1653508 -1407103 -1389068 -1510539 -1221448 -748483 -698411
39081 -698411 -762488 -177244 858647 1530588 1730549 1716642 1067827 -476282 -1749901
39072 -1749901 -1524496 -676033 -1079958 -2646987 -3454473 -2704994 -1542213 -906836 -591174
39063 -591174 -542072 -1062341 -1473091 -619347 946705 1317319 119429 -1078364 -1605770
39054 -1605770 -2444473 -3460781 -2744557 -178378 1068695 -1129440 -4162879 -3983945 -686469
39045 -686469 1907390 1369399 -1227849 -3800421 -5195839 -4685568 -2129986 755202 1494582
39036 1494582 105706 -592773 1037750 2919717 2212240 -562927 -2315914 -1665259 -297020
39027 -297020 102836 246935 1532293 3355634 3759153 2251942 470429 -28117 598175
39018 598175 1245484 1098819 -228776 -2539907 -4475118 -4409647 -2755902 -1938163 -2853152
39009 -2853152 -2976441 -55407 3618744 3580392 -472060 -3894571 -3364873 -947940 -382927
39000 -382927 -1938976 -3291401 -3619439 -3968013 -4393178 -3597640 -1511132 80507 49904
38991 49904 -673749 -864181 -673923 -741477 -842776 -467099 47684 11006 -403891 -435924
38981 -435924 -112797 -357335 -1395513 -1919271 -740777 1048608 847149 -2018730 -4737530
38972 -4737530 -4067503 -273575 3498615 5410163 6464649 7552136 7319364 4481609
38964 4481609 546032 -1780331 -1966902 -1545211 -1292247 -544740 935094 2365678 3317949
38955 3317949 4022421 4246629 3531040 2603599 2718442 3354339 2584217 276737 -1178101
38946 -1178101 -300049 1327007 1629163 919490 584376 553756 58770 -372083 153348
38937 153348 853422 377015 -678482 -642570 195417 -125695 -1860504 -2965831 -2442817
38928 -2442817 -1866933 -2512821 -3107452 -2022129 -32857 958141 783522 569282 82163
38919 82163 -2273176 -6553567 -10147609 -10428046 -7624679 -4327628 -2734300 -3088884 -4411410
38910 -4411410 -5758084 -6449919 -5759336 -3279160 213716 2840730 3063364 947481 -2124072
38901 -2124072 -4585075 -5286661 -3702313 -461098 2533986 3460766 2258766 460837
38893 460837 -609749 -929125 -1200720 -1886228 -2792569 -3061763 -1759613 862552 2996195
38884 2996195 3014534 1262664 -855645 -3022819 -5665866 -7748170 -7047084 -3287669 791885
38875 791885 2515394 2013555 948950 3740 -979087 -1567161 -1206240 -561966 -795866
38866 -795866 -1621800 -1433137 381859 2204840 1834317 -842085 -3232389 -2569736 778340
38857 778340 3327433 2630362 530540 667688 3326599 5044833 3464994 120114 -2339524
38848 -2339524 -3288259 -3301732 -2458764 -1104411 -469604 -873687 -925282 25110 502860 -377708
38838 -377708 -898799 442755 2056015 1677636 -27010 -972425 -1253834 -2296707 -3580043
38829 -3580043 -3265658 -1330261 769769 2781870 5142317 6611171 5579238 3222643
38821 3222643 2239353 2852074 3146047 2804391 2994724 2915655 457818 -3372802 -4648077
38812 -4648077 -2041367 1367309 2791250 2831735 2780866 2290690 1278270 1099303 2150433
38803 2150433 2868832 2446852 2020004 2152750 1985131 1866724 3599433 6723237 7910444
38794 7910444 5750441 2905540 1744807 1232517 191513 44747 1631756 2650287
38786 2650287 1359224 -130027 522424 1734584 893721 -1136472 -2016867 -2142990 -3004090
38777 -3004090 -3345592 -1148752 1981066 2625588 934383 229132 1678567 3096498 2943850
38768 2943850 2122402 1607859 1194696 764620 421022 -416244 -1841577 -2132995 -97646
38759 -97646 2186312 1872994 -248547 -1019151 141973 1015583 845724 1068279 1747844
38750 1747844 1093175 -913076 -1994352 -1541168 -1651316 -3065697 -3395922 -1058663 1877259
38741 1877259 2686533 1575644 444138 -84761 -627497 -1436364 -2336706 -3231699 -3666916
38732 -3666916 -2943904 -1334982 -2343 713240 1484524 2178455 1712483 346045 91607
38723 91607 1720401 3086029 1801932 -1649375 -4667165 -5360399 -3672500 -770343 1646376
38714 1646376 2283610 1437554 635217 602688 501587 -307661 -901942 -94934 1758367
38705 1758367 3234051 3629434 3504724 3728885 4538916 5390489 5466065 4476002 3007950
38696 3007950 1928399 1608752 1921228 2527770 2781281 1973999 354374 -665461 -67097
38687 -67097 1498481 2625300 2669593 1683385 -253172 -2653871 -4356072 -4611252 -3797364
38678 -3797364 -2434736 -611588 970374 1047793 -36093 -129543 1290933 1647575 -695354
38669 -695354 -3107423 -2206915 1091329 3178818 2932863 1927033 761623 -1003638 -2084205
38660 -2084205 -745555 1357479 673268 -2669517 -4724720 -3718696 -2221681 -2334852
38652 -2334852 -2569254 -1129848 1015769 2184824 2374487 1991888 690446 -1032881 -1443052
38643 -1443052 -188887 852153 502275 -183565 -280288 -384837 -582140 304919 2112057
38634 2112057 2586494 688192 -1834828 -3489866 -4942859 -6367341 -5837840 -2493408
38626 -2493408 1243279 2885197 3111116 3603229 3904034 2944538 1859015 2635085 5133066
38617 5133066 7511952 8466744 7459073 4378997 803710 -128851 2781592 6781443
38609 6781443 8463541 7598852 5977214 4341595 2708842 1994180 2695998 3205787 1925735
38600 1925735 -4027 -516118 -57123 -524328 -1544749 -774043 2110458 4380718 3853216
38591 3853216 1611402 352510 1176521 2662520 2675877 917571 -390460 964395 3991555
38582 3991555 5258526 3321921 645124 96534 1402612 2635101 3434288 4552595
38574 4552595 5451381 4894275 3452517 3065798 4050063 4547523 3378062 1825203 1826878
38565 1826878 3393845 4675801 4277679 2890393 2376384 3417739 4670457 4608429 3491927
38556 3491927 2639910 2390665 2074968 1614863 1632191 2058428 2084251 1506255 862937 437232
38546 437232 402712 1425880 3537163 5076281 4651419 3401746 3172058 3387731 2358891
38537 2358891 660984 23314 -164297 -1375386 -1804305 1496364 6359388 6802101 1794017
38528 1794017 -2495391 -1225610 3218679 6335161 7704586 8799050 8887208 7174198
38520 7174198 5883078 7255681 9726916 10367216 9061103 7439446 5904860 4535513
38512 4535513 4785224 7447284 10647314 12107593 11666234 10043837 7586999 5643367
38504 5643367 6038057 7552583 6527761 2831691 1077583 3492901 6069384 4963855
38496 4963855 2269810 1640732 2420315 2399907 2483503 3975263 4749272 2890282 964267
38487 964267 1939255 3938124 3803423 2737008 3332275 4042315 2123601 -447798 328024
38478 328024 3743542 5668340 5024655 4141622 4176623 4656429 5935821 7966141 8511435
38469 8511435 6449689 4523918 5120786 6263252 5626708 5009288 6589128 8559809 8969816
38460 8969816 9815049 12736675 15228843 15862756 18022923 23377867 27668013 28537630 30688996
38451 30688996 37227461 43974245 49110536 58508466 73154584 83520015 88022381 103516718
38443 103516718 141770744 189313949 230100041 272670789 327260009 369396649 364489930
38436 364489930 325818050 306342621 324778833 340629209 319370313 282629828 266470719
38429 266470719 264963190 252976626 240091545 256888913 297158835 316261025 289323750
38422 289323750 237033005 188399595 148799531 114443127 90936900 81745291 76596787
38415 76596787 65868645 53965537 47781948 43740558 36391202 29327058 27492027 27304731
38407 27304731 23822885 20412114 22376100 26906440 27644641 24584802 22058969 20673192
38399 20673192 17982116 14409298 12654648 12943359 13167072 12238258 10377693 7941987
38391 7941987 6069756 6267470 7831899 8156592 6459823 4274797 1968496 -1451325
38383 -1451325 -4833477 -5596656 -4353155 -4090528 -4374438 -1771175 3183682 5352698 2835227
38374 2835227 -383519 -1448841 -2380770 -4527667 -5261009 -3206738 -1314171 -1544776 -1609655
38365 -1609655 -47624 681549 -544142 -470169 2613308 5087779 4213876 3097988 4955747
38356 4955747 7208754 6353266 4455879 5389218 8160719 9380902 9246297 9693386 9447436
38347 9447436 6463160 2937987 2366643 3594222 3283632 2440627 4562042 8476376 9171465
38338 9171465 5596205 1955877 857206 483565 -599691 -950075 -57927 -135205 -2126676
38329 -2126676 -3656985 -2957548 -1586742 -1191816 -574364 1575581 3470382 2546803 -507790
38320 -507790 -2679545 -2767523 -2212274 -2056171 -1409797 349180 1588021 205814 -3107847
38311 -3107847 -5079371 -3855592 -1414597 -689480 -1379991 -785999 1548348 2810046 1335266
38302 1335266 -652917 -500476 915908 1120107 277921 517952 1806926 1730975 -368308
38293 -368308 -2026518 -1533531 -713332 -1983940 -4285580 -4275904 -1068750 2450962 3436161
38284 3436161 2327665 1229087 554596 -818854 -2756651 -3547958 -2683718 -1760154 -1668731
38275 -1668731 -946020 1550389 4148616 4574262 3215856 1920176 795483 -1101066
38267 -1101066 -2786760 -2144124 478717 2314956 1996236 826305 242651 558412 2070985
38258 2070985 4537321 5693071 3617820 580966 644178 3032095 2470388 -2509287 -6488289
38249 -6488289 -5024601 -1123522 -184606 -2195169 -3345912 -2679596 -2309008 -2542779 -1454836
38240 -1454836 1139004 3181290 3798092 4019251 4197638 3649536 2768161 2740165 3212165
38231 3212165 2787857 1694319 1415542 1859895 1539357 499963 339746 1165675 1312397
38222 1312397 532373 710671 2544045 4011202 3378962 1726290 1156517 2009047 3039349
38213 3039349 3236472 2515030 1471064 1046966 1662254 2486513 2499142 2109815 2356167
38204 2356167 2693205 1518862 -849881 -1909835 -582083 887729 36742 -2358076
38196 -2358076 -3612497 -2874163 -1701384 -1358112 -1321233 -754708 -122161 -501902 -1813500
38187 -1813500 -2572877 -1651012 169823 1013724 254456 -774585 -770122 -181600 -63021
38178 -63021 -127224 596398 1701203 1807878 992502 879157 1865598 2232161 1016360 -80843
38168 -80843 732049 2318620 2254607 607823 -306711 232802 253399 -1549421 -3615550
38159 -3615550 -4012701 -3336510 -3354553 -4045384 -4067448 -3402464 -3245726 -3515299 -2856855 -1355971
38149 -1355971 -765452 -1285035 -681131 1953282 4012725 3114901 959329 673840 1823739
38140 1823739 1384026 -1033393 -2500422 -1519472 -71184 -47477 -677948 -809903 -976132
38131 -976132 -1500767 -1075859 639571 1189226 -1278963 -4350550 -4056937 -532876 1994246
38122 1994246 987368 -1326411 -1626315 -136336 175904 -1869357 -3891559 -3206257 -558060
38113 -558060 852432 -144694 -1020594 634517 3281571 3546123 1333084 136421 1984338
38104 1984338 4584619 4514467 1367866 -2334403 -3845252 -1995247 2064160 5084296
38096 5084296 4359527 974358 -1318028 -1093971 -837448 -2542306 -4524955 -4502844 -3297357
38087 -3297357 -2988766 -3453506 -3421126 -3205780 -3521575 -3116823 -719219 1820750 1626398
38078 1626398 -651213 -1599185 4443 2118873 3095013 3178546 2293986 -272330 -3244917
38069 -3244917 -3541105 -358460 3370537 4820405 4388292 3786698 3164059 1729968 -243780
38060 -243780 -1587263 -1601574 -443119 1018704 1360359 -198030 -2402200 -3066657 -1869851
38051 -1869851 -617673 -451675 -483406 314982 1640500 2990342 4514821 5829427 5657420
38042 5657420 3838422 2290342 2684465 4199272 4703378 3324634 985250 -749826
38034 -749826 -701933 982424 2270211 842292 -2959009 -6020426 -6133210 -4455404 -3357121
38025 -3357121 -3318191 -3361763 -3233985 -3354754 -3422073 -2841669 -2096408 -2092323 -2436363 -1886589
38015 -1886589 -400779 694369 639424 52066 -372684 -727165 -1035061 -619445 898477
38006 898477 2539503 2693622 882130 -1615138 -3009175 -2716716 -1662886 -938176 -572807
37997 -572807 16132 782432 1057658 745628 584903 903313 916381 -193762 -2063127
37988 -2063127 -3533407 -3849238 -3108492 -2018044 -1559687 -2271541 -3338068 -3034107 -832356
37979 -832356 1395864 1194625 -1593895 -4550325 -5301308 -3722755 -1420353 178426 617089
37970 617089 -207198 -2338975 -4942991 -5999468 -4164284 -1088376 -419872 -3411488 -6615704
37961 -6615704 -5717181 -1196875 2024922 997414 -1490027 -964727 2696520 5529073
37953 5529073 4950814 2473814 741725 160994 -345053 -862799 -593529 135702 -264552
37944 -264552 -2421359 -4769435 -5133226 -2921446 632294 3725408 4959113 3822441
37936 3822441 1211315 -824332 -845015 454559 1241984 899219 360695 170375 -416188
37927 -416188 -1915154 -3445477 -3867338 -3141640 -1806352 -65568 1727173 2620556 2122366
37918 2122366 908370 -405936 -2096799 -3797327 -3579454 -568258 2543898 2139414
37910 2139414 -1425204 -4111604 -3630585 -1982310 -1704012 -2082583 -850739 2063848 4566228
37901 4566228 5362254 5061636 4557893 3812015 2460168 685839 -821585 -1376957 -780569
37892 -780569 357896 873454 10701 -1775954 -3117781 -2956031 -1664387 -931180 -2015737
37883 -2015737 -3895828 -3944224 -1144413 2187403 3052594 1516165 294964 940364 2233557
37874 2233557 2525246 1817203 865543 -160082 -1127511 -1289526 -276536 1051145 1607166
37865 1607166 1322752 821865 541945 585062 630145 -286896 -2807078 -5691232 -6582471
37856 -6582471 -5000280 -3199131 -3123938 -3869635 -3384051 -1505158 150234 471614 -369521
37847 -369521 -1730403 -2762080 -2544728 -1330271 -1021179 -2934803 -5599333 -6335190 -4660151
37838 -4660151 -2481400 -1149105 -193165 840824 1221230 467621 -524709 -805290 -792882
37829 -792882 -1410028 -2565019 -3473212 -3958789 -4458228 -4990454 -5005275 -4177553 -2583581
37820 -2583581 -138570 3191091 6303067 7101757 4740185 1310193 91135 1918824
37812 1918824 4305444 4568616 2781400 883159 -20775 -121964 560828 2287976 4268999
37803 4268999 4962458 4163416 3368370 3486902 3532893 2349810 397669 -1117540 -1802580
37794 -1802580 -1726500 -597289 1304181 2136741 183017 -3528328 -5789918 -4841461 -2352283
37785 -2352283 -1147531 -1755491 -2249835 -1364203 -487896 -1614668 -4021217 -4749394 -2755070
37776 -2755070 -667526 -1066257 -2721225 -2797174 -1561596 -1801024 -3880528 -4921149 -3655904
37767 -3655904 -2592057 -3537040 -4073768 -1215539 3611679 6283420 5414566 3259124 1932664
37758 1932664 1388664 893606 234759 -608480 -1361201 -1203209 51697 1122178 965123
37749 965123 395280 454144 386160 -759737 -1786557 -1116990 151720 -173865 -1534403
37740 -1534403 -1526631 -221185 -89139 -1525378 -2048506 -669167 389393 -501724 -1994697
37731 -1994697 -2583667 -2891894 -3588909 -3747367 -2926561 -2307950 -2131872 -741061 1987480
37722 1987480 3190693 1341918 -814324 -444210 962397 676923 -265112 779261 2686084
37713 2686084 1926070 -1444776 -3669503 -3233173 -2668565 -3745522 -4853243 -4484836 -3759320
37704 -3759320 -3648816 -2707371 230559 3360462 4151051 2700509 983880 99233 -61639
37695 -61639 362558 1039822 1041896 -13058 -1275370 -2134184 -3110189 -4129759 -3538025 -651826
37685 -651826 2082350 1814717 -601837 -1704346 -389585 762864 -358703 -2274180
37677 -2274180 -2276706 -325424 1200047 1005599 394778 970467 2138048 1980095 168288
37668 168288 -1340972 -957138 351346 569983 -509174 -1471878 -1786808 -2117185 -2132405
37659 -2132405 -388063 2814287 4739343 3777339 1671206 548011 -173139 -1669357
37651 -1669357 -2527928 -797465 2042981 2679266 1043320 262151 1502605 2540242 2100283
37642 2100283 1829779 2506080 1944961 -993400 -3449559 -2543047 142710 1229447 678196
37633 678196 682504 969886 -561217 -2967015 -2491196 1396996 4166942 2418924 -1231836
37624 -1231836 -2147017 -257392 667265 -726423 -1526475 438429 2885263 2419712 -252778
37615 -252778 -1212505 975487 3282646 2876558 1272371 1683707 3911421 4881202 3698037
37606 3698037 2785555 3461811 3790886 2452548 1675609 3782149 7203612 8950067 9241490
37597 9241490 10380584 12443495 13902699 15742902 20718404 28492885 36058864 43965448
37589 43965448 57126721 76364673 92922027 95880820 83817277 65691380 50904286
37582 50904286 41635662 34797980 28088661 22336071 19231345 18369241 16965523 12699951
37574 12699951 6768151 3111220 3953090 7130192 8923055 8516552 7979975 8351532 7854027
37565 7854027 4652079 -295 -2563053 -983119 2993210 5590825 4971382 2888092
37557 2888092 2005251 2394977 2070240 628389 216011 2119330 4367478 4250270 1845369
37548 1845369 -643757 -2006325 -2647266 -2845782 -2376381 -1617689 -1281102 -1077208 -166248
37539 -166248 1157175 1738586 1426752 1076633 752893 -259363 -1464495 -1199104 616216
37530 616216 1665638 382746 -1647379 -1943230 -575693 476110 688974 1523818 3436538
37521 3436538 4502667 3245813 1426738 2107810 5220746 7001096 4615939 -75745
37513 -75745 -2795671 -2066551 -363677 -165396 -877377 -562834 873152 1803430 1465885
37504 1465885 873029 1121072 1876703 1893486 586207 -1107285 -1464012 139920 2188399
37495 2188399 2584909 1281671 314392 950663 2082360 2072778 882564 -521279 -1555482
37486 -1555482 -1779397 -700831 862233 779918 -1302045 -2482128 -537098 2111173 1441003
37477 1441003 -1968038 -3378117 -725839 2564204 2726261 503971 -883039 -159128
37469 -159128 1581065 2944759 2770763 179567 -3872398 -6323826 -5290727 -2650529
37461 -2650529 -1442103 -1641885 -787232 1688612 3264347 1952399 -821262 -1974194
37453 -1974194 -378482 2154863 3049881 1569451 -651360 -1498912 -703591 72673 -480983
37444 -480983 -1649689 -1751147 -270099 1625727 2231332 600303 -2523611 -4563437 -2996474
37435 -2996474 1579435 5209971 4756102 1579127 -438845 126453 1214152 974488 109830
37426 109830 -130765 -129377 -658739 -987263 46583 1920552 3082437 3288511 3638080
37417 3638080 4351984 4203643 2626075 930034 518740 936685 822015 114592 -18596
37408 -18596 731524 1140362 172120 -1670352 -3229312 -4035210 -4064495 -2956058 -586184
37399 -586184 1864958 2601064 1254589 -512101 -839680 351271 1519794 1280094 -258883
37390 -258883 -1639113 -1287895 1102332 4051719 5262169 3565863 219417 -1830691
37382 -1830691 -397293 3831594 7685970 8403186 6148307 3310523 1501808 147480
37374 147480 -1762865 -3723655 -4447243 -3764278 -2617204 -1576902 -582037 34902 -402986
37365 -402986 -1581944 -1992178 -578754 1978617 3897201 3789848 1638681 -1090144 -2441266
37356 -2441266 -1800576 -542283 -134514 -164642 532148 1416526 886038 -730672 -1167419
37347 -1167419 204963 1200529 429849 -267962 1034695 2790469 2222004 -146381 -1217565
37338 -1217565 -104327 890746 324724 -371074 54730 340408 -762759 -1723512 -327173
37329 -327173 2658061 4285713 3401545 1593975 245223 -1117628 -2893081 -3793158 -2506907
37320 -2506907 147598 2064195 2235320 1236456 -58960 -995791 -754781 1066946 3326164
37311 3326164 4036294 2641617 644966 -419187 -654230 -920595 -1300291 -1296166 -849046
37302 -849046 -270698 321769 717173 306037 -1045107 -2272507 -2207069 -1047263 131626
37293 131626 929987 1688694 2375921 2562190 2314971 1979902 1209968 -575823 -2795224
37284 -2795224 -4048159 -4036128 -3919270 -4419869 -4648149 -3289734 -243015 3126898 4782611
37275 4782611 3403553 53444 -1939733 -315822 3069388 4310670 2530568 678770
37267 678770 893092 1714038 1199063 296739 938071 2525351 2838663 1508852 267114
37258 267114 209142 862916 1710411 2727907 3457197 3213063 2255412 1355923 405379 -991672
37248 -991672 -1838442 -709228 1421239 1543689 -1232783 -3787007 -2819401 626319 2354479
37239 2354479 402866 -2541152 -2676741 157472 2450949 1461310 -1599991 -3434276
37231 -3434276 -2721101 -1003059 64666 539422 856727 520038 -634676 -1266000 -283893
37222 -283893 1096410 796920 -1173855 -2965357 -3696701 -4097256 -4416925 -3814032 -2323048
37213 -2323048 -1481522 -2043997 -2657671 -1965980 -702156 -311046 -517797 58736 1340579
37204 1340579 1599720 101624 -1472504 -1087095 917757 2164898 1175585 -953399 -2140290
37195 -2140290 -1789681 -855940 17357 1049451 1926015 1464251 -425260 -1795582 -1107528
37186 -1107528 370225 373572 -792035 -680163 1323815 2826299 2027082 391194 231879
37177 231879 1164511 890013 -1258129 -3503845 -4300011 -4126402 -4150659 -4344549 -3788522
37168 -3788522 -2277591 -818603 -531894 -1446398 -2521172 -2785223 -2332937 -2039506 -2331743
37159 -2331743 -2626006 -2249040 -1531225 -1357630 -1702985 -1408988 162733 1889687 2119282
37150 2119282 907659 38105 608122 1625090 1663260 1002243 954791 1577095 1500763 97464
37140 97464 -1564908 -2352067 -2460570 -2577217 -2727413 -2807959 -3395761 -4990920 -6927580
37131 -6927580 -7925463 -7477960 -6111171 -4606232 -3453004 -2688663 -1891798 -759982 179877
37122 179877 218395 -75925 718165 2558961 3507414 2432120 690077 3081 114219
37113 114219 -43840 -260061 140682 588771 279483 -86044 493250 1282228 1014457 269028
37103 269028 464152 1272581 1364010 964524 1145669 1294237 158984 -1152113 -470770
37094 -470770 1367635 1303567 -872331 -1935195 -465229 1057717 642897 -366359 -509872
37085 -509872 -746524 -1652828 -1422197 747167 2234880 880833 -1264435 -1159242 440781
37076 440781 665211 -736660 -1641602 -1305752 -798061 -573108 -302804 -265071 -520158 174864
37066 174864 2239149 3411787 1670537 -1312704 -2426603 -1537565 -752270 -654713 -523189
37057 -523189 -1023757 -3098507 -5120391 -4810424 -3189869 -2931562 -3674192 -3057552 -1610281
37048 -1610281 -1983625 -3701459 -3628720 -1730565 -1146019 -2057020 -1114457 1893349 2768427
37039 2768427 363047 -674730 2309129 5113089 3593698 353062 -116508 1481471
37031 1481471 2099323 2375288 4231932 5629588 3627558 326706 -127586 1389522 866320
37022 866320 -1419116 -1697700 -97836 -570759 -3251381 -3492900 245372 3639977 3530031
37013 3530031 2176732 2216861 2526634 1896977 2118501 4113304 5001414 2527106 -879043
37004 -879043 -1828131 -879441 -473175 -614893 53711 1123781 1549570 1966727 3020584
36995 3020584 3414716 2422478 2104561 3975400 5741548 4777090 2705512 2748288 4394394
36986 4394394 4773599 3738494 3222996 2816054 681719 -1886076 -1764338 384339 864034
36977 864034 -447643 392619 4253361 6808125 5640997 4225154 5689893 7281158
36969 7281158 5121742 880958 -859720 583047 2293602 3083174 4010272 4630134 3219063
36960 3219063 569072 -508403 254210 306055 -835842 -274361 3304596 6886434 7544483
36951 7544483 6732951 7342767 8527639 6925543 2390960 -874522 246836 3603035
36943 3603035 4560447 1725317 -1810139 -2677829 -1195910 -462596 -2261556 -4970881 -5743225
36934 -5743225 -3917957 -1411535 42836 884086 2325147 3841675 3525564 1122363
36926 1122363 -780533 201075 2899377 4028953 2767801 1791548 3050330 4737826
36918 4737826 4280891 2607857 2668954 4450010 4712570 2207541 42628 1198236 4057281
36909 4057281 4727696 2378627 -236166 -948593 -417607 -22986 374402 1596852 3280608
36900 3280608 4015111 3148183 1764273 1544643 2709422 3555472 2557446 514040 -485502
36891 -485502 -112767 -235168 -1799851 -2971850 -1537566 2173701 6073857 8762021 9709391
36882 9709391 8360284 5134497 2444061 2418061 3986147 4310379 2725135 987021 -43615
36873 -43615 -1194456 -2256612 -1486427 1135294 2841981 1820276 -214261 -831318 -193281
36864 -193281 364561 1089469 2721106 4119127 3671929 2200091 1812677 2406539 2003656
36855 2003656 380254 -493040 4424 -18812 -1595121 -2920401 -2304168 -1011350 -1187772
36846 -1187772 -2413014 -2474341 -804983 853449 985425 -117574 -1290910 -1755603 -1432523
36837 -1432523 -929521 -1037111 -1500670 -935919 1002678 2285993 974080 -1721381 -2926715
36828 -2926715 -2236473 -1860729 -2610588 -2638816 -1053118 98417 -833269 -2154800 -1346451
36819 -1346451 1336760 3914661 5593856 6335590 5305290 2601076 1042315 2897610
36811 2897610 5798083 5512757 2260381 295631 1119740 1406428 -1186103 -4230391 -4596722
36802 -4596722 -2892732 -1388400 -338262 926264 1533874 582495 -524376 56991 1594565
36793 1594565 1951931 689460 -1066801 -2658513 -3730635 -3269974 -1015928 1195828
36785 1195828 1587044 940193 1017852 1690110 1710428 1070602 334863 -1062012 -3391684
36776 -3391684 -4785032 -3510179 -1012419 69591 -139595 328980 1480671 1667769 892082
36767 892082 529709 471119 -127283 -69040 2111892 4269777 2869471 -990555 -2310843
36758 -2310843 525821 3660049 3862074 2303384 936473 -432758 -1612482 -799880
36750 -799880 1820641 3033300 1461104 -143004 248349 667421 -558194 -1232846 534207
36741 534207 2199425 878207 -1402229 -869332 1891735 3373840 2896115 2524685 2496901
36732 2496901 1082655 -1532793 -3129483 -3038007 -2526958 -1877603 -224665 1851966 2503197
36723 2503197 1329243 -518773 -2515381 -4598083 -5541701 -4213584 -1898075 -756813
36715 -756813 -662776 -216825 79668 -1160081 -2825981 -2488167 -622399 -124642 -1645386
36706 -1645386 -2873684 -2589146 -1947551 -1483499 -456188 298525 -1345405 -4604387 -5497405
36697 -5497405 -2312792 1802756 3375905 2782670 2073754 1399565 -151384 -2212557 -3720313
36688 -3720313 -4302407 -3626014 -1140326 2124583 3497824 2113991 611684 1601585 4145266
36679 4145266 5684954 5841041 5926925 5820755 3974346 364999 -2780284 -3689033 -3026579
36670 -3026579 -2548083 -2637907 -1984618 369360 3256158 4349882 2964876 954444 254787
36661 254787 606010 756890 791409 1633894 3083128 4139587 4580528 4378432 2525334
36652 2525334 -1199335 -4183785 -3633392 -801303 528633 -508669 -1378085 -1036766 -1252297
36643 -1252297 -2358121 -2006785 208632 948066 -1700377 -4768142 -4851437 -2937478 -1868710
36634 -1868710 -1763370 -1230156 -852385 -1915141 -3207150 -2474156 -102904 1552082 1694084
36625 1694084 1319219 751740 -482574 -1900969 -2484034 -2399296 -2436685 -2423386 -1919774 -1509928
36615 -1509928 -1608934 -1145325 625605 2233286 2034182 911459 649903 792814 -369656
36606 -369656 -2590464 -3970748 -3845951 -3131074 -2482990 -2190225 -2943851 -4548575 -4992652
36597 -4992652 -3178521 -1356636 -2182367 -4557044 -5329812 -3987450 -2405896 -975856
36589 -975856 1332227 3644816 3805831 2212442 1297867 1149694 -519364 -3757337 -5725739
36580 -5725739 -5340119 -4596080 -4316742 -2674522 577455 2449865 1369803 -172380 2699
36571 2699 191023 -1584993 -3478035 -2639428 153493 1987794 2215713 2237875 2233760 1170129
36561 1170129 -737442 -2201334 -2870247 -3007215 -2087662 38132 1564876 803966 -885204
36552 -885204 -753790 1275353 2792518 2848568 2960425 3939587 4384129 3205040 1513634
36543 1513634 825001 928841 698083 -108494 -913165 -1381949 -1457957 -853642 619891
36534 619891 2378176 3304609 2743240 1118397 -362304 -648729 269079 1353843 1530979
36525 1530979 703340 -306630 -687584 -351900 209155 623912 1045722 1674457 2011404
36516 2011404 1269103 -194173 -766653 249767 1225467 284993 -1837465 -2743111 -1845313
36507 -1845313 -878876 -869921 -878429 -384206 -571822 -1940767 -2699128 -1335866 754381 1180897
36497 1180897 -5199 -750461 -149738 748493 927079 517173 58574 -43660 497127
36488 497127 1334928 1361698 179780 -852004 -287368 1252245 1982164 1530072 1091939
36479 1091939 1359704 1891746 2391720 2999015 3261666 2372458 643318 -659842 -1197713
36470 -1197713 -1917223 -3240361 -4255722 -4164978 -3298982 -2230674 -1126293 -528363 -1398172
36461 -1398172 -3382869 -4182793 -2046113 1624999 3516711 2238068 -214458 -1157738
36453 -1157738 -438620 -107634 -1302207 -2677506 -2456181 -1075424 -542320 -1455819 -2205732
36444 -2205732 -1517719 -295630 38030 -202022 227694 1213364 1368860 141054 -1504980
36435 -1504980 -2407916 -2105931 -631370 1360829 2395399 1436902 -558227 -1539641 -901691
36426 -901691 53022 217597 -133109 -463125 -763509 -719792 379614 2069479 2475380
36417 2475380 859473 -753565 27211 2701471 4607159 4462269 3396583 2423280 895243
36408 895243 -1540179 -3079963 -1722997 1487179 3158082 1792320 -410409 -844926
36400 -844926 56107 260094 -257030 292855 2069856 2964831 1950794 690098 648356
36391 648356 740099 -500930 -2211190 -2717686 -2417471 -2858279 -3832598 -3736455 -2374149
36382 -2374149 -1179678 -838527 -747632 -691839 -996196 -1106889 -174975 920700 377414
36373 377414 -1542587 -2663546 -2309617 -1997474 -2194733 -1316860 824558 1492781 -1012152
36364 -1012152 -4189007 -4543986 -2297826 -512703 -804985 -2240110 -3416708 -3261082 -591361
36355 -591361 4524443 9274437 10361462 7821582 4582567 2316767 36392 -2893876
36347 -2893876 -4846799 -4251858 -2061049 -435685 -37960 49952 413989 616041 199910
36338 199910 -617289 -1344056 -1683155 -1518127 -924323 -368959 -500907 -1358945 -1956490 -1189239
36328 -1189239 685992 2021320 1652050 276547 -712384 -1217290 -2143555 -3458975 -4050318
36319 -4050318 -3646189 -3291722 -3381376 -2788744 -859513 1101304 1432965 86495 -1990521
36310 -1990521 -4133232 -5443687 -4488972 -1306242 1373159 908222 -1875065 -3932275
36302 -3932275 -4003496 -3365262 -3069502 -2753907 -2273210 -2283985 -2649756 -2107032 -263943 1485573
36292 1485573 1690116 329847 -1820286 -4099587 -5810688 -6323449 -5841614 -5233193 -4922701
36283 -4922701 -4762926 -4772609 -4843263 -4075564 -1948447 160458 491662 -255410 165115 1745587
36273 1745587 2002311 179479 -1133753 95927 2392803 3441050 3364875 3274121 2692708
36264 2692708 992419 -325054 325916 1437167 312284 -2424068 -3298102 -1069064
36256 -1069064 1495733 1613967 -86270 -1141734 -470017 1070620 2082352 1691291 124235
36247 124235 -1201394 -1020664 16677 -58351 -1838185 -3570081 -3414935 -1654883 -35644
36238 -35644 190669 -1074874 -3224737 -5254094 -6193957 -5966218 -5465682 -5331684 -5129876
36229 -5129876 -4297966 -3384526 -3497721 -4598692 -5105841 -3569934 -464161 2079198 2361690
36220 2361690 667447 -1426989 -2835682 -3458420 -3297491 -2307570 -1295930 -1498019 -2442668
36211 -2442668 -1708718 1704706 4962625 4484750 920133 -1414956 -321673 1521426
36203 1521426 689273 -2170412 -3520278 -1785998 980005 2003793 690280 -1579013
36195 -1579013 -3221745 -3445211 -2333848 -773044 -4793 -519044 -1242068 -389237 2410630
36186 2410630 5186777 5553911 3514096 1425308 952701 1199749 609225 -468118 -534900
36177 -534900 433942 889692 151467 -682456 -571207 107936 503637 420642 -368 -688278
36167 -688278 -1200623 -816323 388193 1333982 1220757 291879 -854500 -1788967 -1972859
36158 -1972859 -1182173 -495247 -1443272 -3595710 -4439137 -2567811 291873 1544369 945173
36149 945173 366647 1151602 2850041 4050503 3589626 1461373 -870514 -1772241 -1433297
36140 -1433297 -1421586 -1852436 -814945 2266655 4614682 3353824 -567038 -3745391 -4508894
36131 -4508894 -3571899 -1567804 1374465 3948810 4256697 2385236 330057 -777266
36123 -777266 -1318238 -1143742 533063 2725731 2843848 437959 -1532574 -673072 1569810
36114 1569810 2342498 1441997 886180 1541076 2369419 2631195 2857078 3435129 3661401
36105 3661401 2681941 652752 -1280100 -1783394 -277498 2429056 4575762 4930428 3720379
36096 3720379 1947855 282464 -975697 -1380010 -513699 1373032 3271184 3969499 2800936
36087 2800936 306720 -1802264 -2012623 -626107 529630 242063 -838590 -1350830 -912932
36078 -912932 -202396 97602 -77543 -288794 -44065 627467 1106196 1110484 1349788 2399039
36068 2399039 3340422 2933311 1941202 2353142 3934188 3821552 745553 -2462977 -2487914
36059 -2487914 -25436 1640608 1413196 1052614 1556992 1761053 976768 439023 987396
36050 987396 1332100 132081 -1652010 -2157172 -1444079 -1168362 -1818966 -2048409 -1000653
36041 -1000653 221480 231857 -526277 -466027 853551 2360788 3309723 4114287 4899713
36032 4899713 4637108 2896633 1408905 2158522 4355580 5188925 3653392 1658661 808252
36023 808252 161283 -1533906 -3147532 -2623431 -172762 1864192 1958729 664406 -726753
36014 -726753 -1293697 -426211 1794161 3943234 4240287 2567097 675124 218368 1296733
36005 1296733 2894677 3896117 3642960 2335562 1000066 452497 411649 226084 2882
35996 2882 16412 -515212 -2542659 -5062782 -5513061 -2915530 606764 2286607 1802526
35987 1802526 1022137 1283137 2011712 2049013 1505776 1684384 3196251 4712907 4227536
35978 4227536 1552773 -1142777 -1593025 357318 3041520 4635747 4118665 1654418
35970 1654418 -1069849 -1762436 119082 2535520 3285377 2439515 1358563 392779 -883079
35961 -883079 -2014442 -2098254 -1407358 -883773 -468879 348054 890821 196771 -925649
35952 -925649 -952786 -391141 -982688 -2331824 -2129777 -8392 1743033 1950817 2050490
35943 2050490 2753171 2307838 -176852 -2469648 -2526812 -1783549 -2636726 -4428000 -4594129
35934 -4594129 -2647985 -531503 264099 -177982 -1306478 -2430455 -2522050 -1395511 -503474
35925 -503474 -1071290 -2239915 -2586345 -2466102 -2990934 -3612647 -2904036 -1225992 -450849
35916 -450849 -1153879 -1960929 -1735551 -881973 -471935 -1292690 -3488767 -6019996 -7030680
35907 -7030680 -5937435 -4345420 -3619511 -2757938 -446031 2105446 2786806 2066932 2119663
35898 2119663 3142503 3513629 3232434 3837777 4680914 2885458 -1807345 -5376640 -4577981
35889 -4577981 -1230238 531866 -591794 -2620516 -3535752 -3032677 -1930537 -1363471 -1912727
35880 -1912727 -2584689 -1594825 1013574 2825385 2181066 500455 184211 1465570 2881526
35871 2881526 3768029 4482738 4852888 4267709 3093782 2398944 2278771 1830977 873110
35862 873110 378384 853598 1358929 759153 -672716 -1548909 -1092913 -75921 183278
35853 183278 -470603 -841144 -106262 920117 968379 242073 28572 555308 627354 -271825
35843 -271825 -869558 86813 1823040 2279367 454844 -2579001 -4682605 -4359923 -1961341
35834 -1961341 470119 946410 -629975 -2612958 -3395765 -2532056 -515256 1562572 2400284
35825 2400284 1730942 1032635 1724937 2892824 2471810 622067 -198657 1000084 2126256
35816 2126256 1226800 -655048 -1337782 -657735 -90566 -301052 -669640 -588912 25007
35807 25007 959176 1556998 1047808 -314138 -1356481 -1697641 -2015424 -2168693 -1030416
35798 -1030416 857709 819921 -2009290 -4487652 -3614645 -1041653 -555866 -2406902 -3417077
35789 -3417077 -2134623 -541015 -473948 -1359239 -2133210 -2808072 -3183979 -2203664 235344
35780 235344 2445146 2970358 2231205 1426208 1003026 922414 1335291 2197545 2919528 2957630
35770 2957630 2336771 1484577 973846 1155825 1515377 1007615 -277807 -856731 -348771
35761 -348771 -749430 -3310446 -5656097 -4827369 -2154805 -1548514 -3220562 -3175880 252339
35752 252339 3486380 3263288 1479301 1642687 3300671 3391817 1362689 -503727 -963307
35743 -963307 -908273 -994058 -960258 -1230166 -2599769 -4107933 -3594202 -917877 1464434
35734 1464434 1876859 1544618 2372890 4126757 5009611 4045312 1829867 -360086 -1339695
35725 -1339695 -616108 842871 1029672 -877364 -3108823 -3254958 -1430646 -159515 -832064
35716 -832064 -1692007 -343930 2730408 4639494 3749842 1380284 -342208 -873034 -901178
35707 -901178 -899693 -1008156 -1477674 -2249199 -2740081 -2804802 -3047039 -3401768 -2668095 -700670
35697 -700670 344138 -1124248 -3174490 -2733015 -207215 1150375 364754 44527 1906595
35688 1906595 4148565 4765447 4698289 5528609 6205758 4679405 1529725 -556506 -422271
35679 -422271 503107 599693 -135465 -718035 -487676 260623 465736 -441689 -1284086 -336924
35669 -336924 1762187 2085058 -470990 -3031230 -2522850 64542 1516597 1129338 779347
35660 779347 1076672 693100 -356782 85394 2821857 5478832 5553829 3438038 1078007
35651 1078007 -732471 -2138663 -2558248 -1151443 1390144 3089305 2950179 2040459 1981077
35642 1981077 2921940 3465137 2455065 391377 -1231954 -1674076 -1328427 -413837 1560864
35633 1560864 4377061 6208618 5395090 2664414 417899 -29216 473528 426675 -634177
35624 -634177 -1898294 -2086153 -764087 720890 450016 -1221733 -1342029 1681143 5103761
35615 5103761 5016417 1626489 -1281236 -1821134 -1899419 -3184235 -4307622 -3516651 -1577466
35606 -1577466 -178105 586519 1152572 600252 -1849499 -4534322 -4926133 -3073346 -1410504
35597 -1410504 -1317932 -1824942 -1887872 -2081815 -3234674 -4596306 -4404215 -1972626 1300078
35588 1300078 3029195 1960801 -912346 -3432390 -4322972 -3713923 -1988281 592690
35580 592690 2846128 2875109 452098 -2020133 -2340933 -1345667 -1303328 -2324419 -2459695
35571 -2459695 -1122290 -119472 -712331 -1577023 -810239 1290778 2634493 1850860 -489840
35562 -489840 -2731217 -3542977 -2798268 -1502332 -676063 -283012 337730 1237397 1942885
35553 1942885 2579214 3579218 4166652 2812715 -125920 -1957458 -1063808 804109 1277742
35544 1277742 960477 1965106 3832432 3825483 1332775 -917290 -926188 -161054 -754668
35535 -754668 -2118396 -2329293 -1335399 -527878 -54618 1155873 3057884 4250619 4043848
35526 4043848 2959435 1174966 -1652802 -4719723 -6051830 -4835263 -2415585 -467189
35518 -467189 520171 568515 -349809 -1477359 -1389582 124649 1580719 1991220 2092773
35509 2092773 2461141 2086383 256459 -1639828 -1969471 -1343277 -1344475 -1722712 -964256
35500 -964256 896512 2149196 1921782 974012 81454 -652094 -998481 -860238 -1196259
35491 -1196259 -2869087 -4648802 -4353050 -2065629 -129200 321491 564341 1503295 2100867
35482 2100867 1647164 1308121 1911611 2186494 1028651 -145569 586142 2484520 3191306
35473 3191306 2181567 984278 324472 -719213 -2459811 -3463141 -2467605 -147453
35465 -147453 1917239 3179439 4114757 4725297 4130357 2022026 -118206 -255476 1512896
35456 1512896 2508815 665116 -2533758 -3740842 -2070284 57318 574645 225338 456798
35447 456798 786619 -59547 -1615701 -2143098 -1128210 179263 488843 -365480 -1671485
35438 -1671485 -2330715 -1521859 290745 1544844 1548239 1470969 2419823 3481948 3067480
35429 3067480 1482722 575800 1135029 2087807 2189019 1303147 70619 -733549 -651785
35420 -651785 -77703 62574 -300787 -215699 429886 390445 -415204 219737 3310539 5884170
35410 5884170 4606063 932884 -830167 102753 541603 -766624 -1191652 633107 2010923
35401 2010923 849695 -523531 663420 2623762 1594925 -2262219 -5077902 -4580912
35393 -4580912 -2128782 122927 1261258 894074 -1071260 -3540532 -4940014 -5018560 -4605730
35384 -4605730 -3990905 -3172302 -3089065 -4488165 -5958323 -5465291 -3732765 -3501425 -5155193
35375 -5155193 -5894004 -4158116 -2102074 -2017463 -2647391 -1326121 1803998 4175046 4545498
35366 4545498 4017774 3577107 2798881 1339710 -30032 -580142 -622692 -647155 -308166
35357 -308166 926674 2552229 3194465 2050744 -190439 -2036301 -2714360 -2771072 -2986492
35348 -2986492 -3074743 -2179273 -572803 245450 -349679 -1003972 -357711 828261 981038
35339 981038 498313 1240438 3205991 3894049 1863692 -988479 -2165470 -1966501 -2117085
35330 -2117085 -2209994 -289348 3169607 4813742 2971244 263157 2266 1817926 2927791
35321 2927791 2431795 1878895 2182564 2529601 2403279 2293726 1956227 335059 -1888392
35312 -1888392 -2036094 744706 3464269 3186835 1340348 1583460 4365899 6495533 5910254
35303 5910254 3952254 2339046 670504 -1637352 -3167279 -2260379 321434 2347398
35295 2347398 2909401 2621585 1799335 327493 -985945 -871440 369523 954317 219510
35286 219510 -318541 783689 2793699 3870993 3374240 2174110 1287248 1094769 1475419
35277 1475419 1871947 1531562 399861 -572996 -728513 -791530 -1643317 -2447247 -1504203
35268 -1504203 896949 2097675 371020 -2602457 -3741283 -2324400 -506201 -434749
35260 -434749 -2074707 -3836045 -4219894 -2655491 241711 2773079 3273602 1658065 -557325
35251 -557325 -1959493 -2363460 -2107569 -1168082 460829 2250939 3655935 4516880 4396143
35242 4396143 2440915 -1063176 -3832608 -3792721 -1828304 -770672 -1648406 -2622124 -2059149
35233 -2059149 -924200 -1029906 -2231066 -2835232 -2114083 -966716 -315015 -49496 414158
35224 414158 1428626 2913296 4066997 3520481 829121 -2263185 -3257772 -1810929 -49758
35215 -49758 361058 172081 859081 2263390 3146934 3199067 3002508 2499166 1117923 -645564
35205 -645564 -1429732 -1114769 -1145841 -2071232 -2292130 -427877 2328607 3722137 3372711
35196 3372711 2462776 1201930 -1134477 -3670946 -3975845 -1602921 582370 230783 -1009282
35187 -1009282 85540 3472432 5778763 4764402 1616303 -1378794 -3330477 -4264688
35179 -4264688 -4028325 -2812134 -1550593 -841904 -454032 -536342 -1945335 -4385200 -5676977
35170 -5676977 -4367711 -1949295 -808952 -892748 -336757 1244553 2374248 2492543 2743830
35161 2743830 3490188 3266772 1278735 -888570 -1412468 -676421 -182588 -295777 -643566
35152 -643566 -1572181 -3181337 -3739763 -1552335 1711436 2231671 -700841 -3218887 -2241439
35143 -2241439 -10699 -713636 -4081828 -5748950 -3801224 -1364278 -1439420 -2439725 -1409378
35134 -1409378 724358 637082 -1779663 -3152477 -2100564 -1199528 -2283559 -3286569 -1991549
35125 -1991549 -48658 -254559 -1879604 -2137727 -1038004 -1021885 -2181539 -1756834 977398
35116 977398 2967467 2003740 -6818 -422220 58123 -736176 -2370276 -2563793 -1158258
35107 -1158258 -450571 -1512643 -2577120 -1808996 -6649 518058 -1038173 -2959341 -2934100
35098 -2934100 -637287 1771993 1846120 -620102 -3605301 -5104862 -4602810 -2626722 -155335
35089 -155335 1439981 1362277 702252 1261274 2635548 2430443 216477 -1092880 499066
35080 499066 2696238 2278762 28233 -825153 105715 221854 -1200751 -1764130 -327907
35071 -327907 782562 -408195 -2204969 -1882278 218261 1517799 1072045 473145 1201220
35062 1201220 2729669 3396904 2193168 -396397 -2781100 -3610492 -3062080 -2470491 -2466511
35053 -2466511 -2131124 -474460 1886474 3317148 3207701 2716047 3302957 4891831 5896140
35044 5896140 5229009 3864221 3636960 4602205 4871410 3581071 2467283 3140065 4149794
35035 4149794 2889015 -237641 -1914100 -285264 2832663 4497831 3603064 883153
35027 883153 -2243207 -4191852 -4105295 -2864764 -1972931 -1278682 502397 2845190 3246131
35018 3246131 825872 -1990391 -2579602 -1138416 571884 1735566 2394261 2467104 2301705
35009 2301705 2792539 3643717 3035033 405223 -2068219 -2394229 -1553879 -1481592 -1804991
35000 -1804991 -847296 1292797 3034469 3880696 4400609 4291054 2830897 982950 764090
34991 764090 2431084 4167347 4631961 4133150 3284021 2192777 1142635 629939 584636
34982 584636 648247 955473 1493299 1334536 45143 -863880 144938 1781197 1277605
34973 1277605 -1510233 -3714723 -3471046 -2078880 -1529525 -1899200 -2085766 -1516360 -305019
34964 -305019 939384 941419 -1131612 -3931067 -4933970 -3719995 -2450721 -2404469 -2114981
34955 -2114981 -194789 1996526 2370062 1312107 726104 798541 20113 -1831348 -2978673
34946 -2978673 -2407467 -1557923 -2255062 -4068212 -4914372 -3816329 -1953364 -936876 -964732
34937 -964732 -1135629 -952857 -735053 -730267 -649064 -252144 250258 663145 1125916 1680657
34927 1680657 2025969 1987357 1807414 1836961 2392542 3742591 5402353 5745098 3729083
34918 3729083 965021 247802 1747603 2817445 2212869 1825039 2808090 2950604 527987
34909 527987 -1716798 -24136 4387940 6556535 4444543 827566 -1345662 -1946214
34901 -1946214 -1657493 -427389 1025028 1005425 -614826 -1893637 -1753049 -1201360 -880754
34892 -880754 99019 1763798 2166848 279688 -1901100 -1767749 690921 3278539 3996880
34883 3996880 2296813 -685757 -2509571 -1581458 525054 628352 -1691072 -3341049
34875 -3341049 -2102456 419879 1387853 334093 -1113678 -1525826 -620556 644822 304214
34866 304214 -2573277 -5693041 -5664162 -2838813 -1266672 -2891118 -4862468 -4155739 -1764806
34857 -1764806 -171772 541865 1549740 2653867 3346648 4305672 5346331 4204158 161116
34848 161116 -3361509 -3019893 -431409 482749 -736670 -1614096 -1534392 -1934621 -2474471
34839 -2474471 -1125017 1881004 3790393 3405446 2404188 2316640 2954748 3965145 5150401
34830 5150401 5160277 2765666 -376973 -1217041 149906 630449 -624252 -702753 1917951
34821 1917951 4158844 2786780 -426587 -1079454 1554639 3660170 2394991 -213961
34813 -213961 -154645 3007640 5277785 3334207 -987546 -2985440 -1291919 644305 -165422
34804 -165422 -2164666 -2220044 -421847 713136 399765 66702 373275 431184 -218807
34795 -218807 -1084058 -1932600 -2627136 -2358540 -1051761 -627663 -2438834 -4330079 -3079894
34786 -3079894 830305 3846615 4296242 3591401 2771195 1241334 -855263 -2300624 -3234959
34777 -3234959 -4815108 -6152626 -4958266 -1736624 209644 -215934 -472136 986175
34769 986175 2326730 2055288 1476386 1595764 1062894 -619828 -1187113 556994 2100048
34760 2100048 1254592 24759 1291534 3995304 4951611 3636897 1901806 389778
34752 389778 -1536109 -3366230 -3978159 -3850363 -4079690 -3960206 -2120812 662160 2390333
34743 2390333 2983566 3892694 4973286 4389004 1701213 -1219028 -2642460 -2572750 -1797550
34734 -1797550 -976513 -746695 -1305021 -1835457 -1477543 -647438 -359803 -707262 -1092851
34725 -1092851 -1335241 -1407281 -896717 -22966 -238132 -2217312 -4100266 -3563988 -1072679
34716 -1072679 765948 695794 -132951 -390710 -99071 150118 61442 -496490 -1490418 -2531064
34706 -2531064 -3327888 -4013231 -4470897 -4067354 -2754329 -1552715 -1153522 -1029703 -659436
34697 -659436 -312853 182086 1699376 3655308 3628245 899155 -1633370 -1323877 280609
34688 280609 37830 -1861168 -2666305 -1662431 -706997 -742160 -945088 -1151189 -2108127
34679 -2108127 -3254186 -3019305 -1499009 -284182 402055 1768247 3561136 3838919 2068067
34670 2068067 43038 -679993 -135555 1275988 3013346 3466143 1406853 -1538191 -2425900
34661 -2425900 -992062 492739 1007031 1280733 911089 -1118689 -2931403 -1158333 3334936
34652 3334936 5644934 4103306 2628942 3787055 4458267 1623087 -2055066 -2564689
34644 -2564689 -844272 -302132 -1010878 -1031186 -1055406 -2752078 -4301851 -2752525 297325
34635 297325 524204 -2205350 -3935364 -3514460 -3899084 -5781198 -5523700 -1625756 1663305
34626 1663305 424907 -2920590 -3290582 -81627 2952528 3383396 2285412 1399883 995002
34617 995002 647859 225503 -158368 -154472 593421 1559890 1521455 454528 88846 1414095
34607 1414095 2884288 2634572 1335405 949664 1550154 1597891 907566 862152 1525608
34598 1525608 1015818 -1371077 -3504346 -3278604 -1621683 -1014724 -1933778 -2481119 -1290447
34589 -1290447 700324 1643126 960565 -306771 -871830 -611158 -666491 -2034005 -4036103
34580 -4036103 -4731356 -3191737 -754292 609996 563423 185856 100886 48586 -40563 -52520
34570 -52520 -710238 -2838331 -5224860 -5126139 -1951152 1234883 1392828 -646226 -1807894
34561 -1807894 -1143751 -337573 -401389 -383061 375332 985090 835767 803491 1561011 2204525
34551 2204525 1825433 1282790 2031725 3892573 5186313 4644814 2288179 -1052609 -4146840
34542 -4146840 -5763597 -5611648 -4619438 -3636653 -2409897 -646831 617170 11134 -2070897
34533 -2070897 -3667908 -3668845 -2919132 -2618048 -2628760 -2019844 -680621 343149 65316 -1267506
34523 -1267506 -2325672 -2015091 -675966 149529 -706131 -2801809 -4602375 -5079249 -4503527
34514 -4503527 -3665462 -2687745 -1044500 1119014 2192230 546807 -2958218 -4948195
34506 -4948195 -3057713 1062375 3526202 2740045 698394 -223879 8225 175855 -77040
34497 -77040 -352340 -498167 -315811 735638 2400667 3183959 2293782 1073007 1106131
34488 1106131 1861383 1900246 1595691 2526467 4459100 5133571 3385058 668292 -1036719
34479 -1036719 -1303407 -711717 320553 1395070 1901840 1620456 805942 -554262 -2531683
34470 -2531683 -4102116 -3579817 -883809 1733343 2010356 -7356 -2418429 -3337998 -1957997
34461 -1957997 1099021 3830049 4308907 2831110 1662057 2013291 2448160 1238239 -867192
34452 -867192 -1625685 -393683 1152118 1193005 -352597 -2066197 -2488840 -1471476 -391403
34443 -391403 -637121 -1810555 -2349963 -2086908 -2664201 -4681861 -6163640 -5333653 -3462072
34434 -3462072 -3014809 -4019053 -4444262 -3550473 -2546899 -2145455 -1760791 -1282192 -1439204
34425 -1439204 -1985350 -1579597 -92257 876899 465283 -335989 -750746 -1351153 -2098491
34416 -2098491 -1448241 944171 2546531 1105335 -1920413 -3346052 -2637859 -1874560 -2034812
34407 -2034812 -2042939 -1478738 -1495342 -2336121 -2370181 -872731 222745 -929515 -2998876
34398 -2998876 -3152691 -1112411 552515 199445 -792569 -489221 587029 414395 -1226806
34389 -1226806 -2152615 -822076 1374808 1857043 134782 -1816370 -2200035 -1238994 -265425
34380 -265425 -92438 -742784 -1893539 -2925152 -3079750 -2130094 -556270 1141597 2745020
34371 2745020 3866341 4130478 4035972 4464448 4923264 3780339 1120168 -295650 1534386
34362 1534386 4792451 6082199 4649535 2288757 69850 -2131384 -3325834 -1840832
34354 -1840832 1371906 2763453 781034 -1882806 -2035721 69340 2090658 2962963
34346 2962963 2936508 1782029 -723166 -3260000 -3992633 -2896078 -1548552 -925106 -760539
34337 -760539 -739685 -942658 -1297638 -1709163 -2420918 -3255922 -3096842 -1382407 468801
34328 468801 652911 -354454 -341406 1493244 3470070 3702171 2176166 344814 -325299
34319 -325299 679025 2444086 3178168 2130825 634712 203772 289476 -439405 -1239355
34310 -1239355 -113118 2466996 3348901 1163085 -1430459 -1537225 -47272 255060 -848212
34301 -848212 -1040881 484283 1599286 511904 -1416655 -1426564 942042 3254927 3284394
34292 3284394 1658941 766823 1562351 2590018 2365908 1468515 1296559 1731003 1562898
34283 1562898 761507 530397 1100070 1283460 581768 -105025 -514296 -1824836 -4281574
34274 -4281574 -5841727 -4871154 -2792865 -2109002 -2764572 -2562868 -654288 1492836 2486954
34265 2486954 2429254 1772051 558859 -780170 -1439216 -1545729 -2033277 -2706698 -2006584
34256 -2006584 403278 2254420 1238079 -1914313 -4256268 -4068415 -2326099 -1058051
34248 -1058051 -1365144 -2965523 -4688552 -5308689 -4610398 -3621464 -3186412 -2660880 -1053135
34239 -1053135 852394 1138607 -194496 -698253 917333 2394187 1070294 -1825419
34231 -1825419 -2659921 -836527 238469 -1586876 -3770014 -2683796 1372254 4948596
34223 4948596 5803872 4217384 1128106 -2357060 -4191393 -2990145 -540570 -177565
34215 -177565 -2335833 -4197989 -4164989 -3836192 -4555883 -4925353 -3548646 -1741699 -1237200
34206 -1237200 -1219328 -167434 987300 350873 -1398890 -1849909 -638347 369042 390967
34197 390967 495188 996998 788659 -279323 -835481 -520883 -789873 -2242385 -3261129
34188 -3261129 -2470303 -726310 566254 1437181 2304602 2510476 1492849 210249 -224089
34179 -224089 -391421 -1464017 -3013106 -3555079 -2820616 -1933081 -1564854 -1326158 -906245
34170 -906245 -557595 -422233 -464204 -1036311 -2400739 -3695307 -3637073 -2517351 -2234313
34161 -2234313 -3702674 -5282063 -4766356 -2311283 -223943 60474 -378039 138043 1194809
34152 1194809 730314 -1837682 -4245064 -4092161 -2163421 -1613819 -3863689 -6730971 -7209861
34143 -7209861 -4919611 -1870311 272455 1422175 2022502 2132793 1733723 991715 -97100
34134 -97100 -1679698 -3398417 -4340201 -4003710 -2947850 -2092316 -1578946 -770731 543139
34125 543139 1378549 559642 -1489908 -2720257 -1812934 54848 798990 323533 342262
34116 342262 1346265 1658084 262026 -1268027 -1106941 26840 268087 -264215 103608
34107 103608 1575376 2537916 2214690 1592641 1463849 1466648 1422337 1725188 1954336 1055787
34097 1055787 -517720 -940188 -56465 4377 -1601940 -2746661 -1945894 -1153953 -2430568
34088 -2430568 -4011052 -2966617 -279973 468682 -1183539 -2060347 -667971 772027
34080 772027 461869 -373523 -441771 -621944 -1331066 -735761 1845208 3326933 734074
34071 734074 -4078052 -6679395 -5751526 -3408429 -909436 2324824 5593565 6482387 4483958
34062 4483958 2198867 1697464 1968371 1247988 -180508 -1066992 -1439092 -2034677 -2534709
34053 -2534709 -2005882 -591959 572409 976369 1333213 2519592 4331927 5342888 4156925
34044 4156925 1161842 -1377726 -1705444 -524421 453506 1042238 1875727 2004467 37001
34035 37001 -2338638 -1394558 2969472 5977562 4442872 1383754 1312306 3581212 4151788
34026 4151788 2156845 416293 169003 -338786 -1764416 -2280360 -1300180 -922495 -2080163
34017 -2080163 -2464218 -289954 2576261 3497319 2815715 2369171 2238594 1613622 1334789
34008 1334789 2644414 4314259 3930483 1704169 263046 554675 546834 -1392020 -4036285
33999 -4036285 -5181694 -4305394 -2386451 -401131 1067456 1758736 2096892 2806638 3628226
33990 3628226 3357587 1661633 -255665 -1411940 -2216697 -3015076 -2837000 -1026735 929972
33981 929972 980522 -666053 -2099702 -2747138 -3726936 -5004568 -4591671 -1752615 960408
33972 960408 779377 -1319007 -1827056 531880 3277699 3581085 1425289 -1190277 -2695445
33963 -2695445 -2751873 -1814903 -939830 -1232289 -2557315 -3429518 -2949693 -2034137 -1793039
33954 -1793039 -1650907 -476216 1159883 1626118 837249 332116 664327 693270 -19806
33945 -19806 -172386 811120 1154972 -684922 -3187380 -3639916 -2102203 -1231078 -2267163
33936 -2267163 -3450550 -2976934 -1525883 -729679 -671624 -424668 -126661 -798840 -2321692
33927 -2321692 -3135730 -2320492 -881020 -365239 -907140 -1372284 -1120235 -822528 -1316278
33918 -1316278 -2136608 -1756883 579935 3608384 5026868 3738071 754271 -2144777
33910 -2144777 -4020338 -4642200 -3566824 -677870 2352882 2745217 -168143 -3393358
33902 -3393358 -3457588 -694852 1393239 1056002 374988 1461795 2817037 1777983 -755410
33893 -755410 -1140924 1493554 3701953 2817509 816404 967984 2729699 2896556 811845
33884 811845 -749861 -3663 1430582 1455912 503173 206808 797191 1377416 1602177
33875 1602177 1569512 916466 -536723 -1860646 -2001697 -1154794 -94295 1058709 2119475
33866 2119475 1835202 -589056 -3530656 -4531387 -3628896 -3018880 -3365693 -2827197 -408013
33857 -408013 2048843 2553878 1796205 1621508 2076372 1834071 743160 102544 601722
33848 601722 1394495 1263493 -181979 -2350092 -4042160 -4237940 -2981314 -1079698 1208388
33839 1208388 4124643 6713787 6835973 3996325 648434 -819836 -999944 -1608113 -2196616
33830 -2196616 -1136593 1127802 2557715 2779908 3092621 3383519 2026515 -752055 -2345312
33821 -2345312 -1573944 -455375 -934852 -2092800 -2010038 -524974 1249658 2523040 2702767
33812 2702767 1253978 -1139818 -2750510 -3073131 -3245089 -3417053 -1949293 1473246 4254285
33803 4254285 4203910 2375430 737355 -778460 -2648398 -3405758 -1842490 136126 27143
33794 27143 -1140596 -489621 1739729 2406194 473838 -1564497 -1744633 -1230697 -1975615
33785 -1975615 -3932797 -5454036 -5057015 -2552001 370079 1071480 -1025654 -3105356
33777 -3105356 -2398393 109838 1637933 1922657 2500315 2814373 988245 -1811431 -2012673
33768 -2012673 791496 2884414 1996574 18853 -1000917 -1614090 -2131811 -1049269 1494236
33759 1494236 2486096 892394 89209 2373735 4607669 3157300 61039 -277300 1783292
33750 1783292 2345288 997142 1330175 4481854 7064087 6534714 4523772 3274757 2222614
33741 2222614 130612 -1991024 -2386120 -1357624 -549221 -366599 161651 1329970 1941898
33732 1941898 789875 -1685374 -3631465 -3736793 -2657455 -2015317 -2229440 -2364559 -2085942
33723 -2085942 -2162075 -2520431 -1698692 580690 2070411 877311 -1820405 -3687464 -4341542
33714 -4341542 -4541492 -3876762 -1868880 -138388 -524208 -1797915 -1265959 814989 1594907
33705 1594907 347399 -418651 922551 2872440 3568874 3204324 2710606 2270089 2013665
33696 2013665 2177099 1987775 568510 -696264 590020 3567548 4242527 1264792 -1502685
33687 -1502685 -301585 3260008 4816203 3097354 475580 -905766 -892710 -109882 630379
33678 630379 245042 -1367308 -2553220 -2033943 -1007201 -1373053 -2727486 -3114536 -2105576
33669 -2105576 -1023220 -501955 54110 701733 679844 45203 -219489 27572 -134601
33660 -134601 -863208 -1106865 -397482 433750 881796 1659220 3165661 4306980 3910602
33651 3910602 2545124 1873801 2548614 3609819 3886667 3298022 2567371 2076830 1488842
33642 1488842 592030 33405 577520 1787850 2343361 1888284 1570794 2179687 2788883
33633 2788883 2270993 1321058 1563059 2972015 3633807 2271156 -68756 -1222429 -173404
33624 -173404 2061844 3366100 2439228 228384 -909662 -22665 1134044 578870 -890010
33615 -890010 -809215 1162677 2585531 1722903 -234769 -1280788 -1212914 -926261 -567024
33606 -567024 18803 92189 -900697 -1730356 -776537 1282551 2130328 1167230 115087
$$ [...]
##END NTUPLES=NMR SPECTRUM
##END=
