##TITLE=31Pdec_65-2021
 CDCl3, 24 sc
 6.08.2021
##JCAMPDX= 6.0         $$ Bruker NMR JCAMP-DX V2.0
##DATA TYPE= NMR SPECTRUM
##DATA CLASS= NTUPLES
##ORIGIN= UXNMR, Bruker Analytische Messtechnik GmbH
##OWNER= root
$$ XWIN-NMR		Version 3.5
$$ Fri Aug  6 09:10:08 2021 Russian Standard Time (UT+4h)  she@DPX200
##.OBSERVE FREQUENCY= 81.013821
##.OBSERVE NUCLEUS= ^31P
##.ACQUISITION MODE= SIMULTANEOUS
##.ACQUISITION SCHEME= undefined
##.AVERAGES= 24
##.DIGITISER RES= 16
##SPECTROMETER/DATA SYSTEM= spect
##.PULSE SEQUENCE= zgpg30
##.SOLVENT NAME= CDCl3
##.SHIFT REFERENCE= (INTERNAL, CDCl3, 0, 248.564)
##AUDIT TRAIL= $$ (NUMBER, WHEN, WHO, WHERE, WHAT)
$$ ##TITLE= Audit trail, XWIN-NMR		Version 3.5
$$ ##JCAMPDX= 5.01
$$ ##ORIGIN= Bruker BioSpin GmbH
$$ ##OWNER= she
$$ F:/spectra/data/she/nmr/P31/1/pdata/1/auditp.txt
$$ ##AUDIT TRAIL=  $$ (NUMBER, WHEN, WHO, WHERE, WHAT)
(   1,<2021-08-06 09:07:51.93 +0400>,<she>,<DPX200>,
      <created by zg, POWCHK disabled, PULCHK disabled
       configuration hash MD5:
       00 E9 B6 7A A2 85 ED C7 34 08 36 98 17 FE 4E 26
       data hash MD5: 32K
       11 CE C7 55 3E E1 C9 1E 60 E1 8D B8 49 F6 F4 53>)
(   2,<2021-08-06 09:07:54.71 +0400>,<she>,<DPX200>,
      <Start of raw data processing
       efp BC_mod = 2 LB = 1 FT_mod = 6 PKNL = 1 PHC0 = -7420.224 PHC1 = 184.8746 SI = 64K 
       data hash MD5: 64K
       D0 AE F1 2B 06 3F 7D 22 91 FC A8 D7 B0 A8 EF 37>)
(   3,<2021-08-06 09:08:16.65 +0400>,<she>,<DPX200>,
      <pk PHC0 = -38.39901 PHC1 = 94.8 
       data hash MD5: 64K
       F1 7E 8A 0D FF 2D 1E EA 49 3C F4 6C C1 17 43 AC>)
(   4,<2021-08-06 09:08:19.90 +0400>,<she>,<DPX200>,
      <abs ABSG = 5 
       data hash MD5: 64K
       15 0F 05 B0 3A D6 52 C7 B1 71 CD 19 E3 18 67 1F>)
$$ ##END=
$$ 
$$ hash MD5
$$ 72 5D 96 CA B4 3F 57 B5 10 55 95 86 27 DF A0 BA
##$RELAX= 
##$RELAX= 
##$RELAX= 
##$RELAX= 
##$RELAX= 
##$RELAX= 
##$RELAX= 
##$RELAX= 
$$ Bruker specific parameters
$$ --------------------------
##$DU= <F:/spectra>
##$EXPNO= 1
##$NAME= <P31>
##$PROCNO= 1
##$TYPE= <nmr>
##$USER= <she>
##$AMP= (0..31)
100 100 100 100 100 100 100 100 100 100 100 100 100 100 100 100 100 100 
100 100 100 100 100 100 100 100 100 100 100 100 100 100 
##$AQSEQ= 0
##$AQ_mod= 1
##$AUNM= <au_zg>
##$AUTOPOS= <>
##$BF1= 81.014009
##$BF2= 200.13
##$BF3= 200.13
##$BF4= 200.13
##$BF5= 200.13
##$BF6= 200.13
##$BF7= 200.13
##$BF8= 200.13
##$BYTORDA= 1
##$CFDGTYP= 0
##$CFRGTYP= 5
##$CHEMSTR= <none>
##$CNST= (0..31)
1 1 145 1 1 1 1 1 1 1 1 1 1 1 1 1 1 1 1 1 1 1 1 1 1 1 1 1 1 1 1 1 
##$CPDPRG= <waltz16>
##$CPDPRG1= <>
##$CPDPRG2= <waltz16>
##$CPDPRG3= <>
##$CPDPRG4= <mlev>
##$CPDPRG5= <mlev>
##$CPDPRG6= <mlev>
##$CPDPRG7= <mlev>
##$CPDPRG8= <mlev>
##$CPDPRGB= <>
##$CPDPRGT= <>
##$D= (0..31)
0 1 0 0 0 0 0 0 0 0 0 0.03 2e-05 3e-06 0 0 0 0 0 0 0 0 0 0 0 0 0 0 0 0 
0 0 
##$DATE= 1628226471
##$DBL= (0..7)
120 120 120 11 120 120 24 19 
##$DBP= (0..7)
150 150 150 150 150 150 150 150 
##$DBP07= 0
##$DBPNAM0= <>
##$DBPNAM1= <>
##$DBPNAM2= <>
$$ [...]
##$SUBNAM3= <"">
##$SUBNAM4= <"">
##$SUBNAM5= <"">
##$SUBNAM6= <"">
##$SUBNAM7= <"">
##$SUBNAM8= <"">
##$SUBNAM9= <"">
##$SW= 501.771253377433
##$SWIBOX= (0..15)
0 1 3 0 0 0 0 0 0 0 0 0 0 0 0 0 
##$SW_h= 40650.406504065
##$TD= 32768
##$TD0= 1
##$TE= 0
##$TE2= 300
##$TE3= 300
##$TEG= 300
##$TL= (0..7)
0 120 53 12 22 120 120 120 
##$TP= (0..7)
150 150 150 150 150 150 150 150 
##$TP07= 0
##$TPNAME0= <>
##$TPNAME1= <>
##$TPNAME2= <>
##$TPNAME3= <>
##$TPNAME4= <>
##$TPNAME5= <>
##$TPNAME6= <>
##$TPNAME7= <>
##$TPOAL= (0..7)
0.5 0.5 0.5 0.5 0.5 0.5 0.5 0.5 
##$TPOFFS= (0..7)
0 0 0 0 0 0 0 0 
##$TUNHIN= 0
##$TUNHOUT= 0
##$TUNXOUT= 0
##$USERA1= <user>
##$USERA2= <user>
##$USERA3= <user>
##$USERA4= <user>
##$USERA5= <user>
##$V9= 5
##$VALIST= <valist>
##$VCLIST= <CCCCCCCCCCCCCCC>
##$VD= 0
##$VDLIST= <DDDDDDDDDDDDDDD>
##$VPLIST= <PPPPPPPPPPPPPPP>
##$VTLIST= <TTTTTTTTTTTTTTT>
##$WBST= 1024
##$WBSW= 4
##$XGAIN= (0..3)
0 0 0 0 
##$XL= 0
##$YL= 0
##$YMAX_a= 2948
##$YMIN_a= -4471
##$ZGOPTNS= <>
##$ZL1= 120
##$ZL2= 120
##$ZL3= 120
##$ZL4= 120
##$ABSF1= 248.5645
##$ABSF2= -253.2056
##$ABSG= 5
##$ABSL= 3
##$ALPHA= 0
##$AQORDER= 0
##$ASSFAC= 0
##$ASSFACI= 0
##$ASSFACX= 0
##$ASSWID= 0
##$AUNMP= <proc_1d>
##$AZFE= 0.1
##$AZFW= 0.5
##$BCFW= 0
##$BC_mod= 2
##$BYTORDP= 0
##$COROFFS= 0
##$CY= -3
##$DATMOD= 1
##$DC= 0
##$DFILT= <>
##$DTYPP= 0
##$F1P= 0
##$F2P= 0
##$FCOR= 1
##$FTSIZE= 65536
##$FT_mod= 6
##$GAMMA= 0
##$GB= 0
##$INTBC= 1
##$INTSCL= 5.30512e-09
##$ISEN= 30
##$LB= 1
##$LEV0= 0
##$LPBIN= 0
##$MAXI= 10000
##$MC2= 0
##$MEAN= 0
##$ME_mod= 0
##$MI= 50
##$NCOEF= 0
##$NC_proc= -6
##$NLEV= 6
##$NOISF1= 182.463
##$NOISF2= 159.3651
##$NSP= 0
##$NTH_PI= 0
##$NZP= 0
##$OFFSET= 248.5645
##$PC= 4
##$PHC0= -7458.623
##$PHC1= 279.6746
##$PH_mod= 1
##$PKNL= yes
##$PPARMOD= 0
##$PSCAL= 0
##$PSIGN= 0
##$REVERSE= no
##$SF= 81.014009
##$SI= 65536
##$SIGF1= 159.3651
##$SIGF2= -187.1042
##$SINO= 113.3802
##$SIOLD= 16384
##$SREGLST= <1H.CDCl3>
##$SSB= 0
##$STSI= 65536
##$STSR= 0
##$SW_p= 40650.406504065
##$SYMM= 0
##$S_DEV= 0
##$TDeff= 32768
##$TDoff= 0
##$TI= <>
##$TILT= no
##$TM1= 0
##$TM2= 0
##$TOPLEV= 0
##$USERP1= <user>
##$USERP2= <user>
##$USERP3= <user>
##$USERP4= <user>
##$USERP5= <user>
##$WDW= 1
##$XDIM= 65536
##$YMAX_p= 267635953
##$YMIN_p= -20554298
$$ End of Bruker specific parameters
$$ ---------------------------------
##NTUPLES= NMR SPECTRUM
##VAR_NAME=  FREQUENCY,     SPECTRUM/REAL,   SPECTRUM/IMAG
##SYMBOL=    X,             R,               I
##VAR_TYPE=  INDEPENDENT,   DEPENDENT,       DEPENDENT
##VAR_FORM=  AFFN,          ASDF,            ASDF
##VAR_DIM=   65536,         65536,           65536
##UNITS=     HZ,            ARBITRARY UNITS, ARBITRARY UNITS
##FACTOR=    0.620285442955139, 1,           1
##FIRST=     20137.2065510759, 0,            0
##LAST=      -20513.1999529892, 0,           0
##MIN=       -20513.1999529892, -20554298,   0
##MAX=       20137.2065510759, 267635953,    0
$$ Real data points
##PAGE= N=1
##DATA TABLE= (X++(R..R)), XYDATA
$$ [...]
40294E6349M54799J029426N02300p00902j159241o45844k39703m20243n49122
40285a672181k47956J09126L51746O44187O31850j33207q60127k30585J302247
40276a04900J705092M08019p30070m28295J0557p95447j606355n34779J506524
40267e69654J877743K51391r75367m54845L46737r5658r56878p02130L67455P33273
40257a77933M991p21943n26891L34560R85218Q37341M5263o03230m75625O6007
40247b32242Q1229n47384q35527j46336Q51176J178914P94782K59100j62724m07621
40237H33367k70746J22442J05550n01075p75104p49R95246Q95207j45799p75693
40227D82646m68868m5856j50962l96521k92009j4670J51721L50090O93330Q86321
$$ plain form
40294 56349 511148 1540574 2042874 1341972 182731 -463113 -702816 -1123059 -1672181
40285 -1672181 -1920137 -1811011 -1459265 -815078 -183228 -316435 -1176562 -1407147 -104900
40276 -104900 1600192 2008211 1278141 849846 860403 64956 -1541399 -2076178 -569654
40267 -569654 1308089 1559480 584113 129268 476005 380347 -576531 -1278661 -911206 -177933
40257 -177933 -172942 -894885 -1421776 -1087216 -101998 735343 780606 177376 -298249 -232242
40247 -232242 -151013 -698397 -1533924 -1680260 -829084 349830 1144612 1403712 1240988 833367
40237 833367 562621 685063 790613 289538 -485566 -486315 508931 1404138 1258339 482646
40227 482646 13778 -32078 -183040 -579561 -871570 -886240 -734519 -384429 308901 1195222
40217A195222O89812L00980k432j98007l29774l67480l36357k25245J42919O60343
40207A529981N85005n50839j778560j489123L65040J888240J561560M5764r82747
40198A174321r75810o19841m15150k20838M061J8032n4769K90654J058438J485996
40188A745094J005852L2996n68992m95903j17342J67150K46243Q1544l39212p64348
40178I93082q32267o17757n76913p18538m04910N34992J100828L87608q58404
40169i92279j075883j29831N83046L78296J38922M46279M74140k66387o18085
40160a061782L13677J230085M83287j073013j227402R6137Q19042J40029m38908
40151g18848J977K77869m80968j013213q3711J197281J043046j47128m97220M07650
$$ plain form
40217 1195222 1885034 2186014 2183582 1985575 1655801 1288321 951964 726719 869638 1529981
40207 1529981 2114986 1564147 -214413 -1703536 -1338496 549744 2111304 2157068 1174321
40198 1174321 198511 -421330 -836480 -1057318 -1053257 -1035225 -1089994 -799340 259098 1745094
40188 1745094 2750946 2783942 2214950 1719047 1601705 1768855 2015098 2096642 1757430 993082
40178 993082 160815 -456942 -1033855 -1752393 -2157303 -1622311 -521483 -133875 -992279
40169 -992279 -2068162 -2197993 -1614947 -1236651 -1097729 -651450 -177310 -443697 -1061782
40160 -1061782 -748105 481980 965267 -107746 -1335148 -1239011 -419969 -279940 -718848
40151 -718848 -716871 -439002 -919970 -1933183 -2016894 -819613 223433 76305 -420915 -13265
40141a3265J114023O25161m54091j150294j167013n43448N37223J314606Q93858
40132A156760m32387j174653n00685O01353O67775k49809p83444k89191K55759
40123g48522j89049j001087o80170P94974J570583M29098j288467j359429K74113
40114b197956J486707R27282l89735q26759k27231M49242O87091P07605O86845
40105A303091M84786K3346n12772p82250n08398J42180M89440J31857l56268k18910
40095A96102K09512K2539o17496o58937m6154R2981n07318o59906J60758P89149
40085a018770M17212K3045M87699Q49385K0791j093603r76217Q7119P60859Q39458
40075C96978Q23229L31185r52611j657443m61435J221942R45496p82262j138350
$$ plain form
40141 -13265 1100758 1725919 1271828 121534 -1045479 -1588927 -1051704 262902 1156760
40132 1156760 724373 -450280 -950965 -349612 318163 68354 -715090 -1004281 -748522
40123 -748522 -937571 -1938658 -2618828 -1823854 -253271 175827 -1112640 -2472069 -2197956
40114 -2197956 -711249 216033 -173702 -1000461 -1227692 -778450 -91359 616246 1303091
40105 1303091 1787877 1811223 1298451 516201 7803 149983 639423 771280 415012 196102
40095 196102 405614 428153 -189343 -848280 -894434 -801453 -1308771 -1968677 -1807919 -1018770
40085 -1018770 -601558 -578513 -90814 758571 779362 -314241 -1290458 -1203339 -442480 396978
40075 396978 1220207 1551392 598781 -1058662 -1520097 -298155 647341 -134921 -1273271
40066a273271L88698J222906J72925o22845L69423J274581J16627j567685j149477
40057a068118P55023J298904j16955j216680n62622O11344P23611J1068m22373
40048A3202l29040j98896k44519k66076j45780M755O3866R4566L27068Q08475
40038A27621J064725N42766m66235r49028n25355N887p6132l75797k29760J80729
40028g00579L69604M66881O73320N10789k99329q92140m63078K04424r0034p76189
40018i96331l04785J085615J456688K91691n76872Q8338J048852Q38282J07072
40009C038550J27795M04683k96962j501925j659680p24372r7048j83372j276O65299
39999b28308P23109j22274n82399O1850O80806K31276m90482l14431L12263K56998
$$ plain form
40066 -1273271 -884573 338333 511258 -111587 257836 1532417 1649044 81359 -1068118
40057 -1068118 -313095 985809 868854 -347826 -910448 -299104 424507 435575 13202
40048 13202 -315838 -514734 -759253 -1025329 -1171109 -1166354 -1102488 -1007922 -680854 127621
40038 127621 1192346 1735112 1268877 319849 -205506 -199619 -275751 -651548 -881308 -700579
40028 -700579 -330975 135906 809226 1320015 1020686 128546 -334532 -130108 -220142 -996331
40018 -996331 -1301116 -215501 1241187 1532878 956006 1044344 2093196 2931478 3038550
40009 3038550 3166345 3571028 3274066 1772141 112461 -611911 -708959 -892331 -893607 -228308
39999 -228308 494801 372527 -209872 -148022 532784 764060 273578 -40853 271410 528408
39989E28408l31442n16940k94179k45741j01564O63795J253038M46875j086570
39980C15680j365139j26389P21573J39605n80824k23936M33159L29835K1151L49004
39970A3719O50159n91q90637p95232r5584M8410j44731K79231Q29436K38146r61896
39959h29570q64308O45324J457755N37837n33287k53894N34131L54454n59639
39950D88803j083064j077136r63096m71871O26069J352016O96249n39722o41708
39941a613460N22546J370133R27330n8994m98015k75774J12685L27769K42360
39932A056580q0744k57003j4136K11562j81510q19458o51150M19166J141444O13586
39922A438337m53951p86388k01934N02620Q17617Q20184M90673l17577j158850
$$ plain form
39989 528408 196966 -319974 -614153 -859894 -961458 -297663 955375 1402250 315680
39980 315680 -1049459 -1175848 -454275 -314670 -895494 -1119430 -686271 -356436 -335285 13719
39970 13719 663878 663287 -227350 -1022582 -1118166 -1069756 -1214487 -935256 -105820 132326 -829570
39959 -829570 -1693878 -1048554 409201 947038 413751 159857 693988 1048442 488803
39950 488803 -594261 -1671397 -2634493 -3106364 -2480295 -1128279 -432030 -971752 -1613460
39941 -1613460 -1090914 279219 1206549 1147555 649540 373766 486451 814220 1056580
39932 1056580 975836 718833 704697 916259 734749 -84709 -735859 -316693 824751 1438337
39922 1438337 984386 197998 -3936 498684 1316301 2136485 2627158 2309581 1150731
39913A150731j118774m4904R66693Q39268j26127p37729n20712j54793k82248
39904b8595n78566l80594K28913N14514J32285m04268m21324L1740K44408j84012
39894h45499o42506j62319J111447J686333N82871j060501j333229k99253J07401
39885h55255p97653j271599j00487J127218N66163n58588K19351K230455K230434
39876B790039m44372k420999j188337J280017J709238J88002p36182k08206K89165
39867A258365j61669p69496p96972n08193j29050N17959J050304O28001o00988
39858D88261j373375j005465j53171M20922P47777R33111O22879k15386q36123
39849c70570o86106j97033m1630j37092M3417N52885Q93278O79482N2952m71434
$$ plain form
39913 1150731 31957 -12947 953746 1793014 1666887 929158 408446 253653 -28595
39904 -28595 -607161 -987755 -758842 -244328 -112043 -516311 -937635 -905895 -661487 -845499
39894 -845499 -1488005 -1650324 -538877 1147456 1730327 669826 -663403 -962656 -855255
39885 -855255 -1652908 -2924507 -3024994 -1897776 -1331613 -1890201 -1670850 559605 2790039
39876 2790039 2345667 -75332 -1263669 16348 1725586 1913588 1177406 969200 1258365
39867 1258365 1096696 327200 -469772 -977965 -1107015 -589056 461248 1089249 488261
39858 488261 -885114 -1890579 -2043750 -1622828 -875051 58060 680939 465553 -370570
39849 -370570 -1056676 -1253709 -1295339 -1432431 -1389014 -836129 57149 736631 789583 318149
39839C18149m71635o7379J76630J7466o3390L41597P21424L39419m74985o90350
39829A46946j88875P5064k72643l98102J89986O02752j3347r10201p45979L63934
39819a150465J055984Q01666M89697P04988O78026l02206j347746j009158M74841
39810C95627J225373K75034j043744r73982K68935J057988P70476K47289o4124
39801B158872q11117k059660k443711j091218P21449J184420M45079L0495L29786
39792a535605L20475l17590n23629L21784J295951J292442M66504k76732m38392
39783F05208o5662N48184Q47154L40916o49765j162750q07593j95644O2302P0264
39773d07386J08883J56634K55934N86103Q63681M82262m31424r75492q16585n86859
$$ plain form
39839 318149 -153486 -220865 -44235 -26769 -90159 251438 972862 1312281 837296 146946
39829 146946 -41929 33135 -239508 -637610 -447624 155128 141781 -768420 -1514399 -1150465
39819 -1150465 -94481 707185 1196882 1901870 2579896 2277690 929944 -79214 395627
39810 395627 1621000 1896034 852290 -121692 147243 1205231 1975707 2222996 2158872
39801 2158872 1347755 -711905 -3155616 -4246834 -3525385 -2340965 -1895886 -1865391 -1535605
39792 -1535605 -1215130 -1532720 -2056349 -1734565 -438614 853828 1320332 1043600 605208
39783 605208 539546 1087730 1934884 2275800 1626035 463285 -344308 -539952 -477650 -407386
39773 -407386 -298503 -141869 114065 700168 1563849 2046111 1614687 639195 -177390 -764249
39763g64249n50814n8845J027706J608167R88799J28018Q4759K60835l99832j313391
39753A011153j052835K06174Q00847J24432n82177k88951M02648M60511q7181
39744I94621n47770o41902n25541k98999o2272n5798k72951k30086M62991J456299
39734B78592J873944J154840l71115j671558j851299r63037R8305N91031N62152
39725b98145L75500R7375k61397l71764l9916L22320K96047J74742L82275N25540
39715A202577o6650j032922j205770k31060R27193J288467Q70497J86929m76226
39706A463035r18955q30106k05709M38951O22430L82930N0583j44897j47625q8916
39696F21721k44104o29445p49503k22062M84280N55925J575l74932j59744K34601
$$ plain form
39763 -764249 -1315063 -1373908 -346202 1261965 2250764 2378782 2463541 2724376 2324544 1011153
39753 1011153 -41682 164492 965339 1089771 507594 218643 621291 1081802 994621
39744 994621 446851 -195051 -720592 -1019591 -1081863 -1137661 -1410612 -1640698 -1177707 278592
39734 278592 2152536 3307376 2936261 1264703 -586596 -1549633 -1451328 -860297 -298145
39725 -298145 77355 174730 -86667 -458431 -498347 -176027 120020 294762 677037 1202577
39715 1202577 1135927 103005 -1102765 -1333825 -406632 881835 1752332 1939261 1463035
39706 1463035 544080 -286026 -491735 -52784 569646 952576 1003159 858262 710637 621721
39696 621721 377617 -251828 -1001331 -1223393 -739113 -183188 -181613 -556545 -716289 -481688
39686d81688L64757K61633O0395j60164j09436M06993Q97072P03609O7750k69692
39676A741229m08539r85079j555553r01376P01582J302594J51213j008191o54346
39667a616466K37716J86535j91650L56733J002304J45089j326441r60398J127089
39658a039489J938656J00730j932441j460134P88011K135957J522493n8644j428765
39649E66374j877048r21265R14940J808541P22499q36397p69576N10596Q32545
39640I51209k43710r01579k17713M28047j07221q08485m06451M37620M33655q8981
39630e23609L729M55356J43837o60556n43319N54086R99042M8420r65039p59351
39620a247404Q7982M25818L40025M88729O29793J63880m93551m26478K42770N43508
$$ plain form
39686 -481688 -116931 144702 205097 44933 -64503 342490 1239562 1943171 2010921 1741229
39676 1741229 1332690 347611 -1207942 -2109318 -1407736 -105142 46071 -962120 -1616466
39667 -1616466 -1378750 -1192215 -1383865 -1027132 -24828 120261 -1206180 -2166578 -1039489
39658 -1039489 899167 999897 -932544 -2392678 -1604667 531290 2053783 1995139 566374
39649 566374 -1310674 -2231939 -1316999 491542 1214041 377644 -391932 118664 951209
39640 951209 707499 -194080 -411793 16254 -90967 -899452 -1305903 -868283 -434628 -523609
39630 -523609 -519880 -64524 79313 -581243 -1124562 -570476 428566 476986 -488053 -1247404
39620 -1247404 -1159422 -733604 -393579 95150 724943 888823 395272 -31206 211564 755072
39610G55072J73559k97814n74836q33598q49237j38794Q90163J101196K54072
39601D79783n73386n72294k13884j74999k06957K07886P89802Q47111L15883k37860
39591F61085m04728k59048j01997j60165l36556k15458L11657N46968j79188j220491
39581a357921j147467K30953J450368J392183N91675m508l83071p40158n95165
39572e63111K41371P96655K93727m50638l18420K07893k7005o66284l63955Q12199
39562c7568J340925O54134j49453k52425j44737k71669k05830J97052J99472m82877
39552H47024r20211l76194M95149O81370K31710j32178j56630r3184j04088j76291
39542B96477k25149l8700L67194L66774m56066j212896o88950N58037P09771l72301
$$ plain form
39610 755072 928631 630817 55981 -777617 -1626854 -1765648 -875485 225711 479783
39601 479783 -93603 -665897 -879781 -1054780 -1261737 -1053851 -264049 583062 898945 661085
39591 661085 256357 -2691 -104688 -264853 -601409 -816867 -505210 41758 -137430 -1357921
39581 -1357921 -2505388 -2274435 -824067 568116 1159791 1155283 772212 32054 -563111
39572 -563111 -321740 474915 768642 318004 -416 207477 180472 -485812 -849767 -37568
39562 -37568 1303357 1957491 1808038 1555613 1410876 1139207 933377 1130429 1329901 847024
39552 847024 -73187 -449381 45768 727138 958848 826670 670040 576856 472768 296477
39542 296477 71328 32628 399822 766596 310530 -902366 -1591316 -1033279 -323508 -695809
39532f95809o77537O38337J574849M51097j168042q61511P69066J165991o6112
39523A130329q42065k25957L09418k70891q44969k45886P76740R02035K03384
39514H92138l56830m01572j42551K79004O40886N37407N8103j81532j63523o05674
39504E55856j370396j013219R87708K710732K043442k85848j655023j162249m07521
39495D03482n55426o34873L54205J344710P61271q19595j349585l37780N56952
39486b76639J98136m39159j43559N23250M14966n7523K98014J081755P00831q03763
39476A496309j407146k35817R38480N39250l14026Q9114R70356M32542j030317
39467A478745j112195M05569J122037q9153j293697p60419L41379K25333m48218
$$ plain form
39532 -695809 -1373346 -735009 839840 1290937 122895 -738616 30450 1196441 1130329
39523 1130329 288264 62307 371725 100834 -744135 -990021 -213281 688754 892138
39514 892138 535308 133736 -8815 270189 911075 1448482 1506585 1325053 1161530 555856
39504 555856 -814540 -1827759 -840051 1870681 3914123 3628275 1973252 811003 403482
39495 403482 -151944 -786817 -432612 912098 1673369 853774 -495811 -833591 -276639
39486 -276639 -78503 -517662 -661221 -137971 276995 219472 517486 1599241 2300072 1496309
39476 1496309 89163 -146654 791826 1331076 1017050 1106164 2076520 2509062 1478745
39467 1478745 366550 772119 1894156 1805003 511306 -249113 92266 317599 -130619
39458a30619M312J071869P37907j057495k011721q03041J082797J590971P51229
39449A236209J21476M12767P12373m1578j473771k024103q31171R59574J388958
39440D60734K02449p68954j97678Q74263P59252k74159o41313q5556J43053l39364
39430A32727m11345L90677Q55922J15303q24166p05711m52N8746m34977l66840
39420a190116M65972J077843Q31906J41163l75035n22646k98617J69770M18749
39411G18989J01455l46484j91120M60219P29839K24996m89996p71081n71352j36788
39401b71323L14333M88291K35179k7095K26444O78241M70225m00375q82735l84837
39391D46348M03237O38202M07862J32774k62289q60843j169581q01314j37284
$$ plain form
39458 -130619 -126307 945562 1683469 625974 -1385747 -2188788 -1105991 484980 1236209
39449 1236209 1357685 1770452 2482825 2441247 967476 -1056627 -1887798 -928224 460734
39440 460734 663183 -105771 -303449 570814 1330066 1055907 414594 329038 472091 132727
39430 132727 -278618 112059 967981 1083284 259118 -446593 -447045 -388299 -823276 -1190116
39420 -1190116 -724144 353699 1185605 1326768 951733 429087 130470 300240 718989
39411 718989 820444 473960 282840 743059 1472898 1697894 1207898 436817 -134535 -271323
39401 -271323 43010 531301 766480 739385 965829 1644070 2114295 1713920 831185 446348
39391 446348 849585 1487787 1895649 2028423 1766134 905291 -264290 -1065604 -1202888
39382a202888L86074R32821J435479J006108o66578k100726j664229L1782R44441
39373h97716N37752J76139N43060N78453l92669j195673n76343P83027J245472
39364H01502M62999m76459o96000l82995k00400m79670q82225o39973N05143J583544
39354d04534J357451P1726p82307o57334n64454r95711q51725M70728J471534
39345h84626O76376q04117q19035M68505R46384J2832n83048K93557J390549J123206
39335A820583j36643q98760o74131k36421l31676q97712j274086p92913N24156
39326b897603J698834J664490M96270o86548j015590n25758L26741J032223J009008
39317A102067J13932p84973o26362L65402Q79077K69813p69969j347672j226228
$$ plain form
39382 -1202888 -816814 116007 1551486 2557594 1891016 -209710 -1873939 -1842157 -897716
39373 -897716 -359964 -183825 359235 937688 545019 -650654 -1226997 -443970 801502
39364 801502 1264501 788042 92042 -290953 -491353 -971023 -1853248 -2493221 -1988078 -404534
39354 -404534 952917 1024643 242336 -414998 -979452 -1975163 -2826888 -2356160 -884626
39345 -884626 -208250 -1012367 -1831402 -1362897 -416513 -403681 -986729 -693172 697377 1820583
39335 1820583 1683940 785180 111049 -125372 -457048 -1354760 -2628846 -3421759 -2897603
39326 -2897603 -1198769 465721 961991 275443 -740147 -1265905 -939164 93059 1102067
39317 1102067 1215999 431026 -195336 170066 1049143 1318956 548987 -798685 -2024913
39308b024913m83056O29153J331687R15244r7550m47372M3105L31432J0062j05514
39298A02278L67250O17945J78933k08093o1889j12378q13083j219291n20375M36115
39288a232588M16704l13771o15324k13728L39718P48763R28544N71310k15612
39279D14016n55107o5203L44141m4363m42555O1351P99681O41836o4429k42249
39269H47119j8031k29733o40444m05832J71219J58817j37839K82069J006704O74792
39259A708841n26153r18337q3760N09262O6504l47139J09424O17633K85708l66731
39249A055252n13727l45809l37665k76822R9950M22983L70709J88595K596m47719
39239B18343r63657q63726k47833q3521n45722o03474J59103P89637P81242J004283
$$ plain form
39308 -2024913 -2507969 -1878816 -547129 368115 270565 -176807 -133702 197730 207792 102278
39298 102278 469528 1087473 1266406 1058313 996424 884046 70963 -1148328 -1668703 -1232588
39288 -1232588 -815884 -1129655 -1744979 -1958707 -1618989 -870226 58318 629628 414016
39279 414016 -141091 -206294 137847 93484 -349071 -287720 511961 1153797 1089368 847119
39269 847119 829088 599355 -41089 -446921 -275702 -116885 -254724 27345 1034049 1708841
39259 1708841 1182688 264351 180591 689853 756357 409218 518642 1136275 1421983 1055252
39249 1055252 541525 195716 -141949 -418771 -318821 104162 474871 663466 666062 218343
39239 218343 -745314 -1609040 -1856873 -1940394 -2486116 -3089590 -2930487 -2140850 -1359608 -355325
39229c55325J764194J632989k33207k086208j824304j83135L97850n61944j229846
39220b678936n52816M34842O62969M94057N28198M88337J04919r1910K51678M61123
39210A02461j11184q16375m73723Q62890J780342J228585k38148j181928q73109
39201B79811J57768R54020J063613N92243j38343o19750l16060N84437R35398
39192C493137k5108j356644j499038n52635j15352o69650p88335L44162J338353
39183A68890Q51931n6788L32232J385930J058457o63886j619052q46362J80963
39174G92315K45299J33819O68506R14599j29277j469202j455542k83621M90866
39165i2238L38243O1937R2049N5622o8134J34056L89084k1030p44693n79755M60274
$$ plain form
39229 -355325 1408869 3041858 2808651 722443 -1101861 -1284996 -887146 -1449090 -2678936
39220 -2678936 -3231752 -2796910 -2133941 -1639884 -1111686 -623349 -518430 -610340 -358662 102461
39210 102461 -8723 -825098 -1298821 -435931 1344411 2572996 2334848 1152920 279811
39201 279811 437579 1391599 2455212 3047455 2909112 2289362 1973302 2557739 3493137
39192 3493137 3468029 2111385 612347 59712 -55640 -725290 -1513625 -1169463 168890
39183 168890 1020821 964033 1296265 2682195 3740652 3076766 1457714 611352 792315
39174 792315 1037614 1171433 1839939 2754538 2625261 1156059 -299483 -583104 -92238
39165 -92238 246005 307942 399991 455613 387479 521535 910619 889589 144896 -434859 25415
39154B5415Q64531K4040o77349j49733N48135N0867q97742o74945M36589P25493
39144B75301p7608m98745P2524N37908K74643J87448P81690R87098K9209j036950
39134A532518r54883j86351J28866L9198J96894L67449L5741k81796J09550N57937
39124A545123j896j085362j261620l82714L80058M51869K26013j95991r38942
39115a263462j239817k36556J184182J251105J05399l13554N40416R65332K1630
39106A014675q30224k54007P58097O75397j38196l53389J48051N34211N40987
39097B095602L65283j63343j033438j379462n67513O27357R92361M74592j13949
39088A297490l64381l44375n0868L17085J60509o15620j141384p79904p9071J73578
$$ plain form
39154 25415 889946 913986 236637 86904 635039 685906 -211836 -886781 -450192 275301
39144 275301 197693 -301052 -228528 309380 584023 771471 1553161 2540259 2569468 1532518
39134 1532518 577635 391284 520150 559348 756242 1123691 1159432 877636 987186 1545123
39124 1545123 1543227 457865 -803755 -1186469 -806411 -354542 -128529 -324520 -1263462
39115 -1263462 -2503279 -2739835 -1555653 -304548 -199149 -512703 27713 993045 1014675
39106 1014675 184451 -69556 688541 1363938 1225742 872353 1020404 1554615 2095602
39097 2095602 2460885 2297542 1264104 -115358 -682871 -55514 936847 1411439 1297490
39088 1297490 933109 588734 537866 854951 1015460 399840 -741544 -1521448 -1600519 -1426941
39078a426941L4060j34323l30379l67204K18069R72115O17790p31238j067227
39069b215278M81602J828950R57548q02940q31425O37843J063676l20133j624868
39060h25025j413096k78730Q32360J686222J849753P68699p80629j136068j25156
39051E78330O54717L18243k49380k85156l43960q58979j071539l42616O53940
39042i46400R21571M33036j99112n42580m02371J50361N26171J91832m05456l82498
39032f55446J69848M07986K44387L04323M37565j53100j139074j100363K31544
39023a252330J345048J130670K35067l31077m82297l50367K33488Q48331N19713
39014A896246o08484j074319l35053L16591m0578m46537P9565P06581K65840p04083
$$ plain form
39078 -1426941 -1392881 -1527204 -1857583 -2224787 -2006718 -1034603 -416813 -1148051 -2215278
39069 -2215278 -1733676 95274 1052822 249882 -581543 56300 1119976 799843 -825025
39060 -825025 -2238121 -2516851 -1684491 1731 1851484 2620183 1839554 703486 578330
39051 578330 1233047 1551290 1301910 1016754 672794 -186185 -1257724 -1600340 -946400
39042 -946400 -24829 408207 209095 -333485 -735856 -585495 -59324 132508 -272948 -655446
39032 -655446 -485598 -77612 166775 471098 908663 755563 -383511 -1483874 -1252330
39023 -1252330 92718 1223388 1458455 1127378 645081 294714 528202 1376533 1896246
39014 1896246 1287762 213443 -121610 194981 154403 -292134 -212569 494012 759852 55769
39004E5769r24462l92748M6214K78509O19926P04801J25520m61829k59291K48640
38994D1049J53919k20149N740M99149K52696m72824m62396K87178M37857m44358
38984G7861j136245p31206P9940L97410N08970R49358J170413L65865r12995j237103
38974d67732l39075M65565J95374m68509m41424L960j54959p52978n47433O00844
38964a906367J188514L91023n34526l15533J93130m27481j482306j120195N42362
38955c471379J474746Q73062Q0667R6443K80032Q4532M9006L15910Q8951n75493
38945g03523l66691Q85872J381500J67710j122434q55209R7276J83425j78271
38936e10345J90832P84292M17573l60944j46643P33075P13276l50691j072488
$$ plain form
39004 55769 -868693 -1261441 -1215227 -936718 -316792 388009 513529 51700 -207591 41049
38994 41049 194968 -25181 -19441 479708 732404 259580 -202816 84362 522219 77861
38984 77861 -1058384 -1789590 -1709650 -1312240 -803270 146088 1316501 1682366 769371 -467732
38974 -467732 -806807 -341242 -145868 -614377 -1055801 -1051841 -1206800 -1959778 -2507211 -1906367
38964 -1906367 -717853 -326830 -861356 -1176889 -983759 -1411240 -2893546 -4013741 -3471379
38955 -3471379 -1996633 -1123571 -1042904 -946461 -666429 -581897 -532891 -216981 -128030 -703523
38945 -703523 -1070214 -184342 1197158 1364868 242434 -612775 -515499 -332074 -510345
38936 -510345 -319513 464779 882352 521408 374765 1107840 1821116 1470425 397937
38927C97937q30437l01014J02583N48363O96130N896r34767r74394j99738L08673
38917a180768L05051L92476M70143o8538o92721j66937J216975J663886N09102
38908B448669q35964j055110n10067q9447Q9113J24452k79910j068909j406595
38899b583768p23601M63228J279373J463796J267191R18268M75635j29405r17724
38890A512993j479692j164364j00341O08450L93275J30547O03838J011384L54996
38881A871086n95251m63597L05036J92809o46154o05502M73901R03311k2586r30173
38871D82880p04446j5947K02566J10208O6820q8053k36255Q3649M63300q7406
38861B77316j201818j257533K8114R66050N74437n1609K9960M144q25279j399545
$$ plain form
38927 397937 -432500 -733514 -630931 -82568 613562 619458 -315309 -1289703 -1489441 -1180768
38917 -1180768 -875717 -483241 -13098 -81636 -774357 -941294 275681 1939567 2448669
38908 2448669 1612705 557595 47528 -41919 47194 171646 -108264 -1177173 -2583768
38899 -2583768 -3307369 -2844141 -1564768 -100972 1166219 2084487 2560122 2430717 1512993
38890 1512993 33301 -1131063 -1231404 -622954 -229679 -99132 504706 1516090 1871086
38881 1871086 1275835 812238 1117274 1310083 663929 58427 532328 1435639 1413053 482880
38871 482880 -221566 -237513 -34947 75261 142081 54028 -182227 -98578 364722 277316
38861 277316 -924502 -2182035 -2153921 -1187871 -613434 -665043 -635083 -630939 -1456218 -2855763
38851b855763o49435O46928J236883J266979J361474J168012L24800l44294j19747
38842B035837K38956j43494o52281m12988L0835j57960m37423L38N37860L07927
38832A347607k3867M43930Q36745n1208j231960q84479M13867M79320p41581j062731
38822d74357J09427P29823k67841j018831J28847J727165J420677m53369j495502
38813D06039p01890N53892P52257p3083r61547j214212o93839K73724R94844R05870
38803B42055K12565l03879k55961p9294l01501p31193p63072k97740J74437M16714
38793a686869P19146J062433P79915k71605r17656j41980J106374R92415m42306
38784A199867j210396l43546P72536P26831J02859N7600L06809l8704o81474o90149
$$ plain form
38851 -2855763 -3505198 -2858270 -1621387 -354408 1007066 2175078 2499878 2155584 2035837
38842 2035837 2274793 2131299 1479018 1066030 1096865 938905 501482 501820 1039680 1347607
38832 1347607 1323740 1767670 2604415 2553207 1321247 436768 850635 1329955 588374 -474357
38822 -474357 -364930 364893 97052 -921779 -792932 934233 2354910 1901541 406039
38813 406039 -295851 258041 1010298 937215 -24332 -1238544 -1932383 -1658659 -663815 242055
38803 242055 454620 150741 -105220 -184514 -486015 -1217208 -1980280 -2278020 -2103583 -1686869
38793 -1686869 -967723 94710 874625 603020 -314636 -456616 649758 1642173 1199867
38784 1199867 -10529 -354075 418461 1145292 1248151 1305751 1612560 1573856 892382 202233
38774B02233j14096L22765M94201N57507Q7417j076937j797058r85476N36512
38765a772932J087553N61109J81613K52109k6995o60773o62232J02749N61673
38756c76126J82568m06441p04003p85892m19127O74098J587927J020440n05774
38747B67670j046885j61565N44490K43299O0711O34605P89720q6193n21178M98534
38737A223208J386059L84755j408814j688103m49625M41023L70373L00144M45389
38728A004409Q942q30453q87219j42547P8916n26765o45015L09576J080755O40954
38718I1553k36675m66071l03193m00455m17960J58809P31382M11493m82113q97476
38708a810706n24471K13228J069396J782222J562040J10712j248639r61279L97231
$$ plain form
38774 202233 88137 410902 905103 1462610 1550027 473090 -1323968 -2309444 -1772932
38765 -1772932 -685379 -124270 57343 309452 282457 -378316 -1040548 -937799 -376126
38756 -376126 -193558 -599999 -1304002 -2089894 -2509021 -1834923 -246996 773444 267670
38747 267670 -779215 -940780 -396290 -152991 -92280 542325 1332045 1245852 724674 1223208
38737 1223208 2609267 2994022 1585208 -102895 -552520 -111497 258876 559020 1004409
38728 1004409 1013351 182898 -704321 -846868 -767952 -1294717 -1939732 -1630156 -549401 91553
38718 91553 -145122 -611193 -914386 -1314841 -1732801 -1573992 -842610 -431117 -913230 -1810706
38708 -1810706 -2335177 -2121949 -1052553 729669 2291709 2402421 1153782 192503 589734
38699E89734P63032l14805j008052j97839P12248J54329r86103q23956M60118
38690f51294R85651K04734m31397Q914N97755L26266l43308n90892o32747r44892
38680a471210j097095n35146K11662L07345M8309L00528Q98161R13692L33504
38671i0250Q9580L60939K45250n13395q29711l7804Q00239L78562q44932j284175
38661a725697m42863O52898J083399R52078N63519j56259r20713p86028N03369
38652b76297J549197Q41317r83696j697257m75556R53494Q27725j70161j77309
38643C91457Q72884J168617j50301j656114j654737l54003P53609Q49997L15707
38634E37116j87375l89445l67667l13821k74436m8128L73207M34461k41368r06578
$$ plain form
38699 589734 1352766 1037961 29909 -167930 544318 698647 -287456 -1111412 -651294
38690 -651294 334357 539091 107694 116608 714363 1040629 697321 106429 -526318 -1471210
38680 -1471210 -2568305 -3103451 -2891789 -2584444 -2536135 -2235607 -1337446 -423754 -90250
38671 -90250 -670 360269 605519 92124 -737587 -775391 24848 403410 -441522 -1725697
38661 -1725697 -2168560 -1515662 -432263 519815 1083334 927075 6362 -779666 -276297
38652 -276297 1272900 2114217 1130521 -566736 -1042292 -88798 738927 568766 391457
38643 391457 1264341 2432958 2282657 626543 -1028194 -1382197 -628588 221409 537116
38634 537116 349741 -39704 -407371 -721192 -995628 -1043756 -670549 -236088 -477456 -1384034
38624a384034m98517O16362R85509L39780j6043M46489N21675m00658r13059P070
38614b95426Q84748L4432j413950j153246N36680J232736J97254p88007m89621
38605a254400K53174M67637L90909L20104p029l16195J82446J143612J160046
38596B340304K5322p83887m60447L6571j14386l64409k36994k64981o07341m05881
38586h36129N36774J042699M49722l63634o67425q51374r11405m1188J244266
38577c97694R46353j018425j791975P6623J816945O26533j646280j369814J033373
38568a724361J950264M00994r33077m43964L51905Q2674m45047m41165n16118
38559a717895p75499j01553J443316J870019L22830j227645q81672M56104Q64558
$$ plain form
38624 -1384034 -1882551 -1266189 -280680 59100 43057 489546 1011221 610563 -302496 -295426
38614 -295426 589322 623754 -790196 -1943442 -1406762 -174026 23228 -764779 -1254400
38605 -1254400 -1001226 -533589 -142680 177424 170395 -145800 36646 1180258 2340304
38596 2340304 2365626 1581739 1121292 1157863 1043477 679068 442074 177093 -430248 -836129
38586 -836129 -299355 743344 1193066 829432 162007 -689367 -1600772 -1641960 -397694
38577 -397694 548659 -469766 -2261741 -2185118 -368173 258360 -1387920 -2757734 -1724361
38568 -1724361 225903 626897 -306180 -750144 -398239 -315565 -760612 -1201777 -1717895
38559 -1717895 -2493394 -2594947 -1151631 718388 1041218 -186427 -1068099 -611995 252563
38550B52563L08224l43J41545R3584q6700R7410L68342Q2043o05952j051504j077370
38539a478158p35412J45659J214372J267521j25591j434412r85413O02293J283508
38530b45633N23258k36385j3035M43701K47271j63231J8348N03388L97265l22263
38520A152684p54490m28522P1724O8614j87246M0020P31247R45156Q7453j132346
38510E94294j451994n43355O81437J147981O27865k52082o56163k53885M36517
38501C30615N54287k5279m40718k5293O91557P15170o6308r00810j170937p02670
38491a040386M57906J726826J914763N30284j202897j720066j110065n27690j61368
38482a132693N61494J129406L95190j052498j180527L20155J349033O95821j86122
$$ plain form
38550 252563 560787 560444 701989 795573 708873 806283 1174625 1256668 650716 -400788 -1478158
38539 -1478158 -2213570 -2067911 -853539 413982 288391 -1146021 -2131434 -1529141 -245633
38530 -245633 277625 41240 28205 471906 719177 555946 574294 1077682 1474947 1152684
38520 1152684 398194 -30328 41396 110010 -77236 -37216 694031 1639187 1726640 594294
38510 594294 -857700 -1401055 -719618 428363 1056228 804146 147983 -105902 330615
38501 330615 884902 859623 418905 393612 1085169 1800339 1734031 833221 -337716 -1040386
38491 -1040386 -582480 1144346 3059109 3589393 2386496 666430 -443635 -971325 -1132693
38482 -1132693 -571199 558207 953397 -99101 -1279628 -959473 389560 1085381 899259
38473H99259R7319N58314r1195r40879n42332L93173K12526p73057q70021J15326
38463i41567P39058L84178r2170j02238r734n5662n0496q8469l19297k76213L21515
38452d91095O01267j76817r80972m16653P73425O95888n24042q77907J90992J015237
38442a90677O83152L70394Q77128J121313K81304n56647l02576K73100P4095l76291
38432B254295j07677L80586K5898q51696j077979m79540J62054M68451N24408
38423A298800J19053q04535j377125p45904M78227Q79628J91845m57802k05797
38414f23610N63321R57366O21100o1644m49632l58317l28966p82618j016549M229
38404a475320J723515K190751P68895p44634o67401K42843L13864m02044o53194
$$ plain form
38473 899259 996578 1554892 1463697 522818 -19514 373659 586185 -186872 -1056893 -941567
38463 -941567 -202509 181669 89499 -12739 -22473 -78135 -128631 -217100 -536397 -812610 -491095
38452 -491095 110172 -66645 -1047617 -1464270 -690845 5043 -518999 -1396906 -1205914 -190677
38442 -190677 492475 862869 1739997 2861310 3142614 2585967 2283391 2556491 2630586 2254295
38432 2254295 2146618 2527204 2553102 1701406 623427 143887 305941 774392 1298800
38423 1298800 1417853 613318 -763807 -1509711 -1031484 -151856 39989 -417813 -623610
38414 -623610 -60289 897077 1518177 1456533 1006901 648584 319618 -463000 -1479549 -1475320
38404 -1475320 248195 2438946 3207841 2463207 1795806 2038649 2352513 1950469 1297275
38395A297275k71875j64869n37082p64908o76656m80654J24984J235434J682039
38386A443688M77973j126564j061310L17972O32192p54267j719423p41882R32120
38377a599501J484032R89034M60433Q142o71313j142780r00041l64952j51812
38368a888758n7556L31704P50027P63278M98006K18892j13231l71555j91945K17168
38358A56030J87560j37981J09929P88238O52852l76152o86557K94909Q06982l30725
38348A465085j428781n63739J138472J279686L7463m39628K45714M14661m82391
38339A666542j034283n25467j1029j88657l18709N9755K29136j57680l31677N5564
38329e56505K37463j00089j17017N10786P25816j61396j182584j150690k57287
$$ plain form
38395 1297275 1025400 860531 323449 -441459 -1118115 -1598769 -1473785 -238351 1443688
38386 1443688 1921661 795097 -266213 51759 683951 -70316 -1789739 -2531621 -1599501
38377 -1599501 -115469 873565 1333998 1342140 670827 -471953 -1371994 -1736946 -1888758
38368 -1888758 -1946314 -1614610 -864583 -101305 396701 615593 502362 130807 -61138 156030
38358 156030 343590 205609 315538 1103776 1756628 1380476 693919 988828 1795810 1465085
38348 1465085 36304 -527435 611037 1890723 1928186 1488558 1734272 2148933 1666542
38339 1666542 632259 106792 95763 -92894 -411603 -351848 -122712 -280392 -612069 -556505
38329 -556505 -319042 -419131 -536148 -25362 700454 539058 -643526 -1794216 -2051503
38320b051503O37416J213453J372237Q28519j25056n16942j76330j90102j034306
38311d2614j487628m97392R97349J363558N17252l34874m57128R050O90568J027136
38301A785277M24285p01703r48549N475M98092o52598j982924j435149L87039
38292b620755J109953K11804m83343P9618P37025K78910p11067r89258l67863
38283b754976M49811Q76821P61019L62514K56275O39216P96762N3419r60340j042544
38273e62023k33656L46150L53358M59111O80349J40356j079140j492181l94905
38264a782581R16797J045425L80641P1882K06030J71255j7871K9372J06560j72620
38254I54890m20977j3206P25429Q67647K56453l71273n61089o07941p73651p53826
$$ plain form
38320 -2051503 -1414087 -200634 1171603 2000122 1875066 1358124 1181794 991692 -42614
38311 -42614 -1530242 -2027634 -1030285 333273 850525 515651 58523 67573 758141 1785277
38301 1785277 2209562 1507859 559310 564785 1062877 410279 -1572645 -3007794 -2620755
38292 -2620755 -1510802 -1298998 -1782341 -1702723 -965698 -686788 -1397855 -2387113 -2754976
38283 -2754976 -2305165 -1428344 -667325 -304811 -48536 590680 1387442 1440861 480521 -562023
38273 -562023 -795679 -449529 -96171 362940 1043289 1183645 104505 -1387676 -1782581
38264 -1782581 -865784 179641 560282 632164 838194 1009449 991578 1020950 1127510 954890
38254 954890 533913 520707 1246136 2113783 2370236 1998963 1437874 829933 56282 -697544
38244f97544k08591N66523Q21349K13870o09783n78521M18797J101958L92416
38235A420474q91778r80526K58929J007909J75060r72115p24520O30871J418248
38226A342552Q52780m07713j423386j624428q00914M87629R10321j42185j402923
38217b208267j160711M31609J608032J348729L23440m25559n44160o9907P37402
38208D0608J093865L55062p61970p49372N27685J383599O17651p98503j183570
38199E25055m59595M6906l39413q72628o78104L1625L76111L0742l75461j02062
38189a816824P03415J148851P71781J51274L9770L01940K75258j21995l70347
38180A083123k94228k45929l50616l43127k25461l06914m78199k57526K87478
$$ plain form
38244 -697544 -906135 -339612 481737 695607 85824 -492697 -73900 1028058 1420474
38235 1420474 528696 -451830 -192901 815008 990068 17953 -706567 -75696 1342552
38226 1342552 2195332 1787619 364233 -1260195 -2061109 -1573480 -663159 -805344 -2208267
38217 -2208267 -3368978 -2937369 -1329337 19392 342832 -82727 -626887 -696794 40608
38208 40608 1134473 1489535 727565 -21807 505878 1889477 2507128 1708625 525055
38199 525055 65460 112366 -227047 -1099675 -1777779 -1746154 -1370043 -1339301 -1714762 -1816824
38189 -1816824 -1113409 35442 807223 958497 998267 1300207 1575465 1453470 1083123
38180 1083123 788895 542966 192350 -150777 -376238 -683152 -1161351 -1418877 -1131399
38171a131399N32031M05982N39491R86668Q99884K1303o16843k79136K26892r2003
38161A492870p37390o44410o5292j00050p54962r34343k63687M31142N29280K87662
38151g59180J0821k97110l58349J17718N17971j7191q94325n79738Q44537J420066
38141E220L34628o99509l00970K73219m85708j356988l17467J693278J917628
38132A063331K80350m47497O77878J214201l41971j766648p63981J107357R42902
38123A965922q11411j304574R260Q57064K01713l47850K34038O18488k36856j095849
38113H9945o60864J73112O2886l60926J96218J128103Q34484m59816r49941j47321
38103i4120M88189N0550m91792r8383O79571P13099r358n69560m24505J52704
$$ plain form
38171 -1131399 -599368 -193386 346105 1332773 2232657 2253960 1637117 1357981 1584873 1492870
38161 1492870 755480 111070 45778 -54272 -809234 -1743577 -2007264 -1576122 -1046842 -759180
38151 -759180 -748359 -1045469 -1403818 -1286100 -768129 -785320 -1679645 -2259383 -1414846 5220
38141 5220 339848 -359661 -660631 -387412 -873120 -2230108 -2547575 -854297 1063331
38132 1063331 1343681 896184 1574062 2788263 2446292 679644 -84337 1023020 1965922
38123 1965922 1154511 -150063 -140803 716261 917974 570124 804162 1422650 1185794 89945
38113 89945 -570919 -397807 -334921 -695847 -499629 628474 1462958 1003142 53201 -94120
38103 -94120 394069 444619 -47173 -145556 534015 1247114 1237756 668196 243691 396395
38093C96395N94602N74078K60740J81067M89961M83019n16975j846459k009481
38084a393053p26873N08218M24739l84734n40868J74216Q74575J045393R14748
38075H96361N90773j10700q96707r91268k41504M53867K66619m67884p46140k07734
38065a454317N20985P06839L09302j89678m37430m49181l23428k5901M17605O89375
38055b35829M03108l73338r79392p41246K52406J069477Q24555k95872j121473
38046a197604q28808L2405K70787l09635o76269j39049O20988O40497J28097k2541
38036a481132K51555K13503k21914j92750O70306J478507J284247L23898n07752
38027A818468q40676q64580o39778q5648N34501P18898L16090l26427p32426o15672
$$ plain form
38093 396395 990997 1565075 1825815 2006882 2496843 2979862 2462887 616428 -1393053
38084 -1393053 -2119926 -1611708 -1186969 -1571703 -2112571 -1938355 -1063780 -18387 896361
38075 896361 1487134 1376434 479727 -511541 -753045 -299178 -32559 -500443 -1246583 -1454317
38065 -1454317 -933332 -226493 82809 -106869 -544299 -993480 -1316908 -1342809 -925204 -235829
38055 -235829 167279 -206059 -1185451 -1926697 -1674291 -604814 219741 -76131 -1197604
38046 -1197604 -2026412 -1994007 -1723220 -2032855 -2709124 -2848173 -2227185 -1586688 -1458591 -1481132
38036 -1481132 -1229577 -1016074 -1237988 -1430738 -760432 718075 2002322 2326220 1818468
38027 1818468 977792 113212 -526566 -612214 -77713 641185 957275 630848 -101578 -717250
38017g17250l8791N20839N05825r7247p15187r08933p60990m13904J94755Q29020
38007a601863Q55239J84355k94952Q9211P06285N56162j65520m18025K9193L38489
37997B78574l6920p01749j082160r51468j65600J145023K011808J361708l43541
37988A515675j271296n45362N84292N70940l52721q05113k60802N32830P23818
37979F92261J42822p31274r90371j2941J411843J446225l88843k010113j318100
37970a758491P27258J323651j63026j429312p68226O73201J065763N24058J87336
37961C82212P2776m66138j023835o50158L42068P10755K78385O9264M35912N67641
37951G18882J33130o9752L33339M43540l50248j078058n80701N44713O47592n93224
$$ plain form
38017 -717250 -756041 -235202 270623 173376 -541811 -1450744 -2211734 -2625638 -2430883 -1601863
38007 -1601863 -746624 -562269 -857221 -768010 -61725 494437 328917 -89108 -59915 278574
37997 278574 241654 -460095 -1542255 -2493723 -2659323 -1514300 497508 1859216 1515675
37988 1515675 244379 -300983 283309 854249 501528 -303585 -564387 -31557 692261
37979 692261 835083 103809 -886562 -899503 512340 1958565 1569722 -440391 -1758491
37970 -1758491 -1031233 292418 129392 -1299920 -2068146 -1394945 -329182 194876 382212
37961 382212 454988 -11150 -1034985 -1685143 -1343075 -632320 -353935 -284671 151241 718882
37951 718882 852012 782260 1115599 1559139 1208891 130833 -449868 94845 742437 149213
37941A49213j647509j160265L41263J181256N53788o31081q96698P5188J146429
37932h88416J196414M87433J18904M18502O26811J80778n08120p99147o02203
37923B30956r3794N96361J012926M98580p25297j364656o60538M95931Q33844
37914H24313L67732j43067o36042j357480j594071m05750J458820K004409O99509
37905A218373o66229m31547Q16331J330820M80997q87209j681865j381637j43535
37896a345501J186105J539558O96176m20039r01132q31474o66475k78564O22656
37887c98690J554292J630096P59529k40888p18478p46544n98686l06644L3916
37878I67903M0124m40708q27697l42412Q25142J347262K84352j401614j687750
$$ plain form
37941 149213 -1498296 -2658561 -2317298 -1136042 -582254 -1213335 -2110033 -2034845 -888416
37932 -888416 307998 795431 914335 1332837 1959648 2140426 1632306 833159 230956
37923 230956 137162 733523 1746449 2245029 1519732 155076 -505462 -9531 824313
37914 824313 1192045 1048978 412936 -944544 -2538615 -2944365 -1485545 518864 1218373
37905 1218373 552144 120597 936928 2267748 2748745 1861536 179671 -1201966 -1345501
37896 -1345501 -159396 1380162 2076338 1656299 755167 -76307 -742782 -1021346 -398690
37887 -398690 1155602 2785698 3545227 3304339 2585861 1839317 1240631 933987 967903
37878 967903 1008027 567319 -260378 -602790 222352 1569614 1853966 452352 -1235398
37869a235398j02561J433352J098100m03764j113589p74369p33034j155215n62805
37860c549283J296726K320990J098913p16831q20636L58091P11207r5545n29260
37851G4372j03552N51o25899p77482J52788J011903Q06511J89167L5628m4521
37841G19466n92877q95812j05858J034451J065545K3409n85526K5047R21634Q64965
37831B474444j41018j079048j188329o65264k66785l48844l68095L87904J556209
37822C61174J787903M69424j235592j728772r19815j5044L13158N03676Q54264
37813C90376Q33589J34759m65531r2143Q52610J115265K56257q26313j114659
37804A084210o14774m2869J57084Q6935l7046j25718q8134J28152L07362J27307
$$ plain form
37869 -1235398 -1337959 95393 1193493 789729 -323860 -1098229 -1831263 -2986478 -3549283
37860 -3549283 -2252557 68433 1167346 450515 -370121 -12030 699177 603632 74372
37851 74372 -29180 -28629 -654528 -1432010 -1279222 -267319 539192 728359 763987 719466
37841 719466 126589 -769223 -875081 159370 1224915 1248324 662798 687845 1609479 2474444
37831 2474444 2333426 1254378 66049 -599215 -866000 -1214844 -1582939 -1195035 361174
37822 361174 2149077 2618501 1382909 -345863 -1265678 -1280722 -967564 -463888 390376
37813 390376 1223965 1358724 893193 801050 1653660 2768925 3025182 2198869 1084210
37804 1084210 469436 426567 583651 670586 633540 507822 419688 547840 855202 982509
37794I82509l30597n66975l33324L2388J89036L16172O35495P90676L59533k43765
37784A831148k13866L05447K93803m55642p89136m0003N89391k76283j763720
37775e18861j675770K09598J568444R02677k26921K85873J652358J310739r84712
37766B523425k489459j367790P55741J317459L25908k94759J26689M50617N6571
37757A404402j81814L70292R31090N70716m14276j110760j170153p63321q4504
37748d48328M95970M47791j63770n57215l81454k48754n36855n27606L93495J449370
37738g7356J457938N60317j36140k22171j76671k31418k17248l14679p58559r47136
37728a063123j22935J092089J211876J02951p06627l16634L28043J55847l75056
$$ plain form
37794 982509 651912 84937 -248387 -215999 -26963 289209 924704 1715380 2074913 1831148
37784 1831148 1617282 1922729 2216532 1760890 971754 931751 1521142 1244859 -518861
37775 -518861 -2194631 -1985033 -416589 486088 259167 545040 2197398 3508137 2523425
37766 2523425 33966 -1333824 -578083 739376 1065284 770525 897214 1347831 1404402
37757 1404402 1222588 1592880 2523970 3094686 2680410 1569650 399497 -363824 -448328
37748 -448328 47642 495433 331663 -225552 -607006 -855760 -1392615 -1920221 -1526726 -77356
37738 -77356 1380582 1940899 1804759 1582588 1405917 1174499 957251 642572 -115987 -1063123
37728 -1063123 -1186058 -93969 1117907 1220858 514231 197597 525640 681487 306431
37719C06431k86571K36292K84020k30179m95376m1076P16821J075428P12930j24100
37709B154620q34942j049779j035471j131653r35901J36082J499543J770484Q19841
37700A392824J78425O95489J100827N1069j500372j545893o972J198719R05233
37691B469349o9914o15930p89848j045706j160676p19847L2285N55691Q05319
37682e39277J042003J132471O48159l48698j082325q58155O6048O52172K20447
37673I32845p58054j238605q38506j20032K91100L34226J83932q4699k48806L3001
37663a513598N83875O91343J45009l25460j55062J73313J0463l30676j63043L70915
37653e12921O15744N49235O37028P80258L97861n02221j198084j196311o15232
$$ plain form
37719 306431 19860 256152 540172 309993 -185383 -226459 490362 1565790 2278720 2154620
37709 2154620 1319678 269899 -765572 -1897225 -2833126 -2697044 -1197501 572983 1392824
37700 1392824 1571249 2266738 3367565 3418634 1918262 372369 365397 1564116 2469349
37691 2469349 2399435 1783505 993657 -52049 -1212725 -1932572 -1900287 -1344596 -539277
37682 -539277 502726 1635197 2283356 1934658 852333 -5822 60226 712398 932845
37673 932845 174791 -1063814 -1902320 -2022352 -1731252 -1397026 -1213094 -1297793 -1546599 -1513598
37663 -1513598 -929723 -238380 -93371 -418831 -573893 -400580 -390117 -720793 -883836 -512921
37653 -512921 102823 652058 1289086 2069344 2467205 1964984 766900 -429411 -1044643
37644a044643K14371Q32093O42525k95479p90774J12563J528612J700566M67525
37635C367359n91375n57603k36414m28945o27944k22882K34403n976n48391n23105
37625a40873J050K68325J18570R9567M35581O27515J79678o46390r25247J0475
37615B8251J550526K006384M71283j716315k310811r52466N18759P31422L83851
37606G10884N71911R27870N53230k48917n15482k45438k03307n23288o71853m80529
37596a24919j45995M62017J377050J736019O73902j067589j688827o28778Q00984
37587A393864J267080Q11003J07118n64188j033539q37697J30619J072892J059196
37578C406348J27697q16468j025997n57673n8806r3837n68411p99270l19780M85641
$$ plain form
37644 -1044643 -830272 1821 644346 348867 -441907 -329344 1199268 2899834 3367359
37635 3367359 2775984 2218381 1981967 1553022 925078 702196 936599 930623 382232 -140873
37625 -140873 -139823 128502 247072 346639 782220 1409735 1589413 943023 17776 28251
37615 28251 1578777 3585161 4056444 2340129 29318 -923148 -404389 327033 710884
37606 710884 1282795 2210665 2763895 2514978 1999496 1754058 1550751 1027463 355610 -124919
37596 -124919 -270914 191103 1568153 3304172 3978074 2910485 1221658 592880 1393864
37587 1393864 2660944 3471947 3579065 3014877 1981338 1143641 1274260 2347152 3406348
37578 3406348 3534045 2717577 1691580 1133907 1075101 981264 412853 -386417 -706197 -220556
37568b20556Q30243M83440p1589l15539j37923K67811N46691L70055j23387l29161
37558A300085n8596J8112n36295r43832l41383N73686M22021n25009n75137N89579
37548g6769J182048J46612j030900o47593N45926O97775j69815m92489Q9217L71434
37538F15446p2630j72079O20557J336450J198337P90982O75009K59902q19540
37529D432434j467863p04786M80880M94036k98335k08103Q41362J091722m0365
37520D620982q24619n4216Q37125P8589j390453j220827O69250J904482J180424
37511E800737p0219j63369M54759M40955j17786n3102Q35979J444842R89072N33
37501I562401m07105K93202J608312K420264K019955J033218Q96122K026607L120205
$$ plain form
37568 -220556 609687 1093127 1021538 705999 568076 835887 1382578 1752633 1629246 1300085
37558 1300085 1241489 1259601 723306 -220526 -561909 11777 433798 -91211 -666348 -76769
37548 -76769 1105279 1251891 220991 -426602 119324 817099 647284 154795 244012 615446
37538 615446 542816 370737 991294 2327744 3526081 4317063 4992072 5251974 4432434
37529 4432434 2964571 2259785 2740665 3234701 2936366 2728263 3569625 4661347 4620982
37520 4620982 3796363 3742147 4579272 4657861 3267408 2046581 2715831 4620313 5800737
37511 5800737 5730518 5567149 6021908 6462863 6345077 6291975 7127954 8572796 9561868 9562401
37501 9562401 9155296 9448498 11056810 13477074 15497029 16530247 17426369 19452976 22573181
37492B2573181K918931K099571K447708M444462O678700P671316P463705P258829
37484F3556403Q093882J0064014J2635966J5792306K0652566K7830856L4630293
37477A93256286L5448327K6898367J2032973k337919j2300037j8961625k4234501
37470B09801871k7296133k6473593k2544138j8203243j5129217j3049684j1147361
37463G5958502r153087p332321o213554o043320o107587n278265l641074k603082
37455B9586212k814012l150239k574562j726641j543897j575420j118993q73642
37447A4208806j676857k513144j831342k82669N1729j019462j512256n34269L98307
37438E288843L6370o12266j39059R57455J198424L42758o48785j225783j587674
$$ plain form
37492 22573181 25492112 27591683 30039391 34483853 41162553 48833869 56297574 63556403
37484 63556403 71650285 81714299 94350265 110142571 130795137 158625993 193256286
37477 193256286 228704613 255602980 267635953 265298034 252997997 234036372 209801871
37470 209801871 182505738 156032145 133488007 115284764 100155547 87105863 75958502
37463 75958502 66805415 59473094 53259540 47216220 41108633 35830368 32189294 29586212
37455 29586212 26772200 23621961 21047399 19320758 17776861 16201441 15082448 14208806
37447 14208806 12531949 10018805 8187463 7904794 7956523 6937061 5424805 4890536 5288843
37438 5288843 5325213 4712947 4573888 5531343 6729767 7072525 6423740 5197957 3610283
37429C610283j713084j162342L0909R91397Q59253k06523j125989j079309m23054
37420b18459o7990n7802M18945J369549J506210K33805j027922q42439o8587l88338
37410H56972j286563p74271J103528K002916R38544k36551O2795Q12071N06625
37401C986066k97241k94135J65745j58808j155790j606301j143325n32962l36846
37392a373597l97693l54690R6698R86956J581716R28028n51788j130963j89538
37383d04871P40368L29522n37975m01427M62699Q95253Q24520P32250K81824p40327
37373B181836j201594k89764O32205q518j143785o42785J007581J365827L9630
37364A940633q56112l33386K35486n374l1934P00474J020696K40904n54502m83215
$$ plain form
37429 3610283 1897199 734857 765766 1757163 2616416 2409893 1283904 204595 -218459
37420 -218459 -286449 -344251 74694 1444243 2950453 3184258 2156336 1313897 1245310 856972
37410 856972 -429591 -1203862 -100334 1902582 2841126 2604575 2667370 3479441 3986066
37401 3986066 3688825 3394690 3560435 3401627 2245837 639536 -503789 -1036751 -1373597
37392 -1373597 -1771290 -2125980 -2029282 -1042326 539390 1467418 915630 -215333 -404871
37383 -404871 335497 665019 127044 -274383 188316 1083569 1908089 2640339 2922163 2181836
37373 2181836 980242 690478 1322683 1314165 170380 -472405 535176 1901003 1940633
37364 1940633 1084521 751135 986621 981247 949313 1649787 2670483 2911387 2356885 1873670
37354A873670j72863j38938J53355O23292O2020j529180k151423p56640R42463
37345a094244J103722L37895N8837R7684k07140k49104N00225R02080J4382q55538
37335F08799k02742Q74285M13992r41104r69091L04750O89343m12709j129774
37326g64251l55814O47398N76797q5344l96526l70027k43767K11670Q79431R98417
37316A097984L39004l31413m14403j64754N9817K38512K01207k64450p16489n21633
37306d76618J5079J39273Q0989N68642J100062M78810q79116j156766K404Q78407
37296G51166M91166o9198M3668k3581p45278q18004M91247J464382L98227j514059
37286D69736j879184n49583P44379J262323J518007J358982J56464j320356j464900
$$ plain form
37354 1873670 1700807 1561869 1715224 2338516 2400536 871356 -1280067 -2036707 -1094244
37345 -1094244 9478 347373 406210 503894 296754 47650 547875 1449955 1464337 608799
37335 608799 406057 1280342 1694334 753230 -215861 88889 778232 365523 -764251
37326 -764251 -1120065 -472667 104130 18786 -377740 -747767 -991534 -779864 99567 1097984
37316 1097984 1436988 1105575 691172 526418 586235 824747 1025954 761504 45015 -476618
37306 -476618 -461539 -322266 -241277 327365 1427427 1906237 1027121 -129645 -127241 751166
37296 751166 1242332 1173134 1216802 1193221 447943 -370061 121186 1585568 1983795 469736
37286 469736 -1409448 -1959031 -1214652 47671 1565678 2924660 3081124 1760768 295868
37277B95868l42917L69990R9942K2299O87768J036845M55944l7500L68037Q00991
37267C757267J97320r13952j258121o12357K16919N57531K43535n35122j108911
37258E44109p40039K59554O06267j43193p58579j12170J095173J379573N21240
37249B651935m97102r99600r76946m69798K54339L63898m70862j071697j82337
37240a398170J376021J557962R9919j032747n76475L62498L63380j55492o6570
37231E30326L88692J64636o44560r49216m81394r5449k45049l60832K9851N45706
37221a117289O57266M07633R1907j99302m11088l71106q4211J59165J43341p4077
37211g97761l49993n33070m21904k7870K47237J62014J76841Q20107J669072J747719
$$ plain form
37277 295868 -47049 322941 422883 445182 1132950 2169795 2625739 2588239 2956276 3757267
37267 3757267 3954587 3040635 1782514 1170157 1387076 1944607 2188142 1653020 544109
37258 544109 -195930 63624 669891 526698 -231881 -344051 751122 2130695 2651935
37249 2651935 2154833 1155233 178287 -291511 -37172 326726 -144136 -1215833 -1398170
37240 -1398170 -22149 1535813 1635732 602985 26510 389008 752388 596896 530326
37231 530326 919018 1083654 439094 -510122 -991516 -1086965 -1332014 -1692846 -1662995 -1117289
37221 -1117289 -460023 -52390 39517 -159785 -570873 -941979 -1026190 -867025 -723684 -797761
37211 -797761 -1147754 -1680824 -2102728 -2130598 -1883361 -1721347 -1544506 -724399 944673 2692392
37201B692392R17618L0596l73899o18499r63300j103484r30986q55667r22542
37192b127771n30872M37212J123771R44712M28935J53029j64252o87438o66269
37183a088943K72446J020718N26711m06349l89271K21067P0022o15676l16635
37174g05910R36982J234500j58568j443099r63524M44522R96700N01750J0898
37165H54251p5496j58194l10021k35120j2191N9010J5717p7095m74646j071699
37155a485484j040189k1528R95629J001259M94930M94399O56040q2717j325181
37146c12842j427806m1731J198626J030182J69484j45620M7783M1123j60430j39862
37136B58907m0954j67272j50717L95948Q30428K92636o62813n88960N83586J171607
$$ plain form
37201 2692392 3610010 3640606 3266707 2648208 1684908 581424 -349562 -1205229 -2127771
37192 -2127771 -2658643 -2221431 -1097660 -152948 275987 429016 264764 -422674 -1088943
37183 -1088943 -816497 204221 730932 324583 -64688 156379 226401 -389275 -705910
37174 -705910 231072 1465572 1307004 -136095 -1099619 -655097 341603 843353 854251
37165 854251 778755 620561 310540 75420 63229 122239 137956 60861 -413785 -1485484
37155 -1485484 -2525673 -2547201 -1551572 -550313 -55383 439016 1095056 1012339 -312842
37146 -312842 -1740648 -1782379 -583753 446429 615913 470293 518076 559199 398769 258907
37136 258907 217953 50681 -100036 295912 1126340 1418976 756163 167203 750789 1922396
37126A922396J71636j161875j105551R3641P95146M44715O5016L24609N53454
37117B103187J50054k57906P0181N75795J91153r17537j503273j006838j57197
37108g52381K75501L86109N18581N74803M02035K49098L10687K52580k85659r89893
37098I41461j152403n47062K90527O03698J20342o31458p14887J90685J173211
37089B74114R99212k81992j284725j063274k05064K79422L61187N44733O95986
37080C19599L50995j79692j40157L32167L08967l75061p78114l91847O3615k8651
37070e18179r1437M91306R84496L34823q74247r76374K38392J023893K38316r39189
37060h8200q34857K17437N61657j61297o18763J3388Q89784R17336J81222n66851
$$ plain form
37126 1922396 2094032 932157 -173394 -79753 715393 1160108 1225124 1549733 2103187
37117 2103187 2253241 1995335 2065516 2641311 2832464 1914927 411654 -595184 -752381
37108 -752381 -476880 -90771 427810 1002613 1404648 1653746 1964433 2217013 1931354 941461
37098 941461 -210942 -758004 -467477 136221 256563 -374895 -1089782 -899097 274114
37089 274114 1273326 991334 -293391 -1356665 -1561729 -1282307 -921120 -376387 319599
37080 319599 670594 490902 350745 682912 991879 616818 -161296 -553143 -489528 -518179
37070 -518179 -609616 -118310 866186 1201009 326762 -649612 -411220 612673 850989 -88200
37060 -88200 -923057 -705620 -143963 -305260 -924023 -910635 -20851 896485 1077707 510856
37050E10856q80136n58864M35139J426929J340453K11441o02580m28366k91176
37041A163696r37846j228005m9412J363744J047182n66038j358721q52945l94820
37032a813165k86120N04626J561851R62984j147171j911538j40875J506177P07828
37023e5403q31433m85237Q14735M53564j137319j251415L86275J323037O80024
37014a03172K34230P46979O00059q27483j508810j33692J457641J180455l7187
37005A609020j11680O74883M49643q82250j486786o16550L35908J22214o54598
36996e60196p44780o3706M50583K45412k32913k72817J11850J97146l59221q02477
36986b031119k08346J039445J528250P16067l34478n11018o9133J34695N8949
$$ plain form
37050 510856 -369280 -928144 -493005 933924 2274377 2485818 1883238 1454872 1163696
37041 1163696 225850 -1002155 -1051567 312177 1359359 793321 -565400 -1418345 -1813165
37032 -1813165 -2099285 -1594659 -32808 930176 -216995 -2128533 -2269408 -763231 -55403
37023 -55403 -886836 -1372073 -557338 -103774 -1241093 -2492508 -2106233 -783196 -103172
37014 -103172 131058 878037 1478096 650613 -858197 -991889 465752 1646207 1609020
37005 1609020 1497340 2172223 2621866 1739616 252830 -363720 -27812 94402 -560196
36996 -560196 -1304976 -1368682 -918099 -672687 -905600 -1178417 -1066567 -869421 -1228642 -2031119
36986 -2031119 -2239465 -1200020 328230 1044297 709819 198801 129668 264363 323312
36977C23312K47897O65352P03709K16416k53315l20607k24430k99459m27310k66464
36967C65101J61840L75118J1437n98290p11976j04113O39886R38484Q38606N09636
36957B425729j92374j020866r87864K38253J271593P26108n32994n53166N94061
36948A968480R10713k06856j002927l77473L50610j52445j045309r91459l42844
36939h89510m6934J41837O84533Q70459J76462l04263L09426P52006l18234j559535
36929a83753q33889J079522J533288K66248m38353J98531L96419o65390j310042
36920D2581m20378O36703N12543r141J03149K01578m43341r30984l56635L86335
36910b77590J66226l75563j12240M75583K72818m23239n75035k45503j01243O4621
$$ plain form
36977 323312 571209 1236561 1940270 2156686 1903371 1582764 1358334 1058875 631565 365101
36967 365101 526941 902059 913496 315206 -396770 -500883 139003 1077487 1916093 2425729
36957 2425729 2233355 1212489 224625 462878 1734471 2460579 1927585 1374419 1968480
36948 1968480 2879193 2672337 1669410 1291937 1642547 1490102 444793 -546666 -889510
36939 -889510 -936444 -794607 -110074 760385 936847 632584 942010 1694016 1375782 -183753
36929 -183753 -1017642 61880 1595168 1861416 1423063 1621594 2018013 1352623 42581
36920 42581 -377797 258906 771449 762308 865457 1067035 623694 -307290 -663925 -277590
36910 -277590 -111364 -486927 -599167 -123584 149234 -274005 -849040 -1094543 -1195786 -1131165
36900a131165O41609R07155J93995m96041K9161Q45954K49179j204538j384828
36891a349519o5976P87738L41073k7889N09503Q26488J57297l66996K13920R14416
36881A940055N41083k95699m28592j67592m93726j111035q89815K36033J138943
36872D69655R84350q2069j311249j670045m83825J391561J900312L44083j324192
36863B18581j092162J93658L08598o74532n46505J190613K144661O37524j593393
36854G87043j861258k90903P32363J64792n59123m4682J049552J214982K78472
36845A471238n75427n75454k53361m38786j004935j080558k79146P89773J301450
36836f45206J096034N71657N1977l80380o27257n65888k69999M6773K78533M06082
$$ plain form
36900 -1131165 -489556 417599 611594 115553 144714 990668 1239847 35309 -1349519
36891 -1349519 -1415495 -627757 -286684 -314573 194930 1021418 1178715 811719 1025639 1940055
36881 1940055 2481138 2185439 1756847 1589255 1095529 -15506 -905321 -669288 469655
36872 469655 1454005 1371936 60687 -1609358 -2093183 -701622 1198690 1542773 218581
36863 218581 -873581 -679923 -371325 -1045857 -1592362 -401749 1742912 2380436 787043
36854 787043 -1074215 -1365118 -632755 -467963 -1027086 -1071768 -22216 1192766 1471238
36845 1471238 895811 320357 66996 -371790 -1376725 -2457283 -2736429 -1946656 -645206
36836 -645206 450828 1022485 1074462 694082 66825 -499063 -769062 -722289 -443756 -37674
36826c7674L50193J19301k5409J18285L17198J98623j46438k47919O3132M34385
36816A143677M77930J38983m09388q50317p03337K75183J497110J816901P58931
36807D145673p93473j492375r83840j54309M5910l11385m01582J92503R32133
36798A179255J017226L30705n59046j092434j044810l96018N49348J018829M61413
36789A464468n64559r33503m69457l5111K5979L29683R00223O30850p44684j558541
36779i54652n39839R59123Q92469k69068m50343M89457O69037l81089q74189K0048
36769d39046O83122n3177q19346j59352Q71569N74228m01791k13670R09189R23789
36759A875515o88173j957621j197383Q21572K054897J522921o4087j345109j518997
$$ plain form
36826 -37674 312519 431820 406411 524696 841894 1040517 894079 646160 709292 1143677
36816 1143677 1621607 1760590 1351202 500885 -202452 72731 1569841 3386742 4145673
36807 4145673 3352200 1859825 875985 721676 767586 456201 54619 247122 1179255
36798 1179255 2196481 2527186 1968140 875706 -169104 -565122 -15774 1003055 1464468
36789 1464468 899909 -33594 -503051 -538162 -512183 -182500 717723 1348573 603889 -954652
36779 -954652 -1494491 -535368 357101 88033 -362310 127147 796184 415095 -459094 -439046
36769 -439046 244076 190899 -628447 -787799 83770 657998 256207 42537 951726 1875515
36759 1875515 1187342 -770279 -1967662 -1146090 908807 2431728 2367641 1022532 -496465
36750d96465q31739j13241J50568J13250J0485j18380m2826N56293J306813J311615
36740A846373M84221k07627k78763m01358r24462r82414k7066R42796Q30040N1262
36730A333002m75986q37674j286803j077779K36243J356290Q80193m27101q00093
36721a099708j11711N28295R58961J598971J640519P8118j880960k004849m98136
36712g90500K90369l66683p74204l5623O66690N85320N49716Q33656M63905m66575
36702I56071m02885P37504R25171m50561j209055j17010Q44387j0266j036236
36693B37120k65865J016317O64851m26745j06609R48097M64227j126782j263766
36684A40845K59396R22140k36544j245735p42305O2932p2720m55841k04223J55432
$$ plain form
36750 -496465 -1328204 -1441445 -1290877 -1177627 -1167142 -1285522 -1328348 -772055 534758 1846373
36740 1846373 2330594 2122967 1844204 1442846 518384 -464030 -491096 451700 1281740 1333002
36730 1333002 857016 19342 -1267461 -2345240 -2108997 -752707 127486 -299615 -1099708
36721 -1099708 -1211419 -683124 275837 1874808 3515327 3593445 1712485 -292364 -790500
36712 -790500 -500131 -866814 -1641018 -1676641 -1009951 -424631 125085 958741 1422646 956071
36702 956071 553186 1290690 2215861 1765300 556245 439235 1283622 1273356 237120
36693 237120 -28745 987572 1652423 1225678 1119069 2067166 2531393 1404611 140845
36684 140845 400241 1322381 1085837 -159898 -902203 -839271 -911991 -1367832 -1572055 -1416623
36674a416623O1116J15437P11765R69378K18731o98102o97973J6643O29466R14701
36664H24539Q88670K17941j050921j900462j410699K8098J214166J436346Q62075
36655A109753J17738j83948K3499N8040n96822j248957p97695M48560J007816
36646f2016M92379J70379O89224Q34615l16007j417014o97827J085820J456351
36637B235904k20881j788268j300429N09130J561400J161202L15291j21606m08010
36628A943733r38743j303513r01125K7057O55957O60930L80714j1335o79124j295140
36618a460589r68973L99852J456803R59228m72412j147416n77171J13948L5450
36609a661280l17077j06738N42686Q75908O12002J76132P4503L84942P14547N16326
$$ plain form
36674 -1416623 -1355507 -1240070 -528305 441073 659804 -38298 -736271 -719628 -90162 824539
36664 824539 1713209 1931150 880229 -1020233 -2430932 -2402834 -1188668 247678 1109753
36655 1109753 1227491 1043543 1067042 1125082 528260 -720697 -1518392 -1069832 -62016
36646 -62016 430363 600742 1289966 2124581 1808574 391560 -306267 779553 2235904
36637 2235904 2015023 226755 -1073674 -564544 996856 2158058 2473349 2351743 1943733
36628 1943733 1004990 -298523 -1199648 -1172591 -516634 144296 525010 513675 -165449 -1460589
36618 -1460589 -2429562 -2029710 -572907 386321 -86091 -1233507 -1810678 -1696730 -1661280
36609 -1661280 -1978357 -2085095 -1542409 -666501 -54499 121633 196136 581078 1295625 1811951
36599A811951l31955j192320j223039l96187L54246K04885n54221q36762n2522
36590b215924J090730J275224J62733r76310o76803Q08155J722503J058039k58244
36581A990103q33053n84627l47438m61476o63063q11532p80991j34554J080918
36572a545713J706301Q31262n67189o98234M45837J006794n474j272747j077481
36563a176644L61599J268743N58448r12945j322072K468J548239J230203q08386
36554G49653k022164q18123J117503J254946o7710m24589P46566J408613L27894
36545B272589j141175j407240p37902l9735O29671J179572P55392p53728j796245
36536a038801j121712L85121J063417O72309N5425l64556n04336j347J001116
$$ plain form
36599 1811951 1479996 287676 -935363 -1331550 -977304 -772419 -1326640 -2163402 -2215924
36590 -2215924 -1125194 150030 312763 -663547 -1340350 -532195 1190308 2248347 1990103
36581 1990103 1157050 572423 224985 -236491 -899554 -1711086 -2492077 -2626631 -1545713
36572 -1545713 160588 991850 424661 -273573 172264 1179058 1173584 -99163 -1176644
36563 -1176644 -815045 453698 1012146 99201 -1222871 -1220403 327836 1558039 749653
36554 749653 -1272511 -2090634 -973131 281815 214105 -210484 536082 1944695 2272589
36545 2272589 1131414 -275826 -1013728 -1053463 -423792 755780 1511172 757444 -1038801
36536 -1038801 -2160513 -1775392 -711975 -39666 15759 -348797 -853133 -854480 146636
36527A46636J317282K94064q99388q92675j72521p0258n40447o02510k72559k30139
36517a922515j25424P77867J622942Q35781r97992j442646J12709J343195N22922
36508G26839q96101p22183O14176J039738J73513l69983K60186R52625N40250
36499B319060m99078r31760m79842J04657K27215L9434m0910J02109K82156K93754
36489A416795N2722m00317q64312r83703m97573L91448J022566Q68845J33259
36480A139730m38698m02793o8779L0060j06546m5370L22252N80915M72656K95201
36470A778628K83921P1102o37063j211270q03869K09848N34960j21956n61653
36461d57352m547O74059M76114l7764J57025O07750R2813j145021j517627m63096
$$ plain form
36527 146636 1463918 1757982 858594 -34081 -206602 -276860 -817307 -1419817 -1692376 -1922515
36517 -1922515 -2047939 -1270072 352870 1188651 190659 -1251987 -1139278 203917 726839
36508 726839 -169262 -891445 -277269 762469 935982 565999 826185 1778810 2319060
36499 2319060 1819982 888222 408380 513037 740252 779686 738776 840885 1123041 1416795
36489 1416795 1469517 1069200 204888 -778815 -1276388 -884940 137626 1006471 1139730
36480 1139730 701032 298239 229460 259520 152974 107604 429856 1010771 1483427 1778628
36470 1778628 2062549 2133651 1496588 285318 -518551 -308703 226257 104301 -457352
36461 -457352 -461899 212160 688274 650510 807535 1415285 1508098 363077 -1154550 -1617646
36451a617646P76769R97438L80712l02437o84912o51877k15976J59536K8767j60814
36441a290440K93847R15640O37829j80834q6738Q58016Q48321n55839j285429
36432A54373m4411J334539P06773r28321j127778M3633M04506n53815r88508J1020
36422i87989R46537N07859l67141k20617N62087M95912o52096j515737r67340
36413b198525N52606J656604J523271O02159r0129j81354j85500n25488q04780
36404C48864m33384L74840P71230L38605m37191p82824m90480j06520k46644o88817
36394a352321n04164N28014J183502L78812r43042q88107N46369J390971P35980
36385A076014l7977K15047N98415J16786l86833J02773O84025K1884j265335j655655
$$ plain form
36451 -1617646 -840877 156561 537273 234836 -450076 -1101953 -1317929 -1158393 -1129626 -1290440
36441 -1290440 -996593 -80953 556876 376042 289304 1147320 1995641 1439802 154373
36432 154373 109962 1444501 2151274 1222953 95175 138808 543314 -10501 -999009 -987989
36422 -987989 -41452 466407 99266 -121351 440736 936648 284552 -1231185 -2198525
36413 -2198525 -1645919 10685 1533956 2136115 2045986 1864632 1679132 1153644 348864
36404 348864 -84520 290320 1061550 1400155 962964 180140 -310340 -416860 -663504 -1352321
36394 -1352321 -1856485 -1328471 -144969 233843 -709199 -1597306 -1050937 340034 1076014
36385 1076014 1038037 1253084 1851499 1968285 1581452 1684225 2368250 2390134 1124799 -530856
36375e30856j145829o41187N9292J424768K222496R67216j162744j572222k47640
36366f26706L09217o76041j066221L38955J647738R99545n52030j025854m85844
36357a137241j69983j36636K90317P67529M77660k17220k95720J84271L07085
36348G0062n2891j53374J75389K44758k36298o24575l44766K60894M36926J8265
36338b05610l90913k33204J95725R8113n54190p04397K31435J117294N39146q60978
36328g67579j014966M87500J615847Q66946n44238o41854L64337O50324l05458
36319G10859j020918l27903R20106J079821k9043q93280l33609Q48643Q60993
36310A815669n56529j543170o22342J093739J374374J7513j007591n29932L63198
$$ plain form
36375 -530856 -1676685 -2317872 -2258580 -833812 1388684 2355900 1193156 -379066 -626706
36366 -626706 -317489 -993530 -2059751 -1720796 -73058 926487 374457 -651397 -1137241
36357 -1137241 -1307224 -1443860 -1153543 -386014 91646 -125574 -421294 -237023 70062
36348 70062 17171 -136203 39186 283944 47646 -576929 -921695 -660801 -223875 -205610
36338 -205610 -596523 -829727 -634002 -535889 -1090079 -1794476 -1563041 -445747 93399 -767579
36328 -767579 -1782545 -1295045 320802 1187748 643510 1656 365993 1016317 710859
36319 710859 -310059 -637962 282144 1361965 1332922 439642 106033 954676 1815669
36310 1815669 1259140 -284030 -906372 187367 1561741 1579254 571663 41731 404929
36301D04929L33597k39665k50110K49072K67843n52320j486119j594160n56346
36292c423279J044340J998935J510697J78679n99750l27239J91462K23995l6824
36283G61016k14772l35666l08990J67774P49836N21199n36082j172404o00615
36274i68704L72744O14968J30398m33717q05544q62605k95987O89882J158941
36265c99624O87769L6122q2953L1282J3077K25659P28233O16326m75283j289023
36255I1585o71971N48015Q25602K26862l4655K39302J59700m88388r33737p53641
36245g91326k44146L98280J091830J286420N68737l48977m45310J5082l8672o04773
36235H87145o30462P1976L98981k25028q97251o55446J52878N38512K21865k39218
$$ plain form
36301 404929 738526 498861 248751 497823 765666 213346 -1272773 -2866933 -3423279
36292 -3423279 -2378939 -380004 1130693 1309372 709622 382383 573845 797840 761016
36283 761016 546244 210578 -98412 69362 819198 1340397 804315 -368089 -968704
36274 -968704 -595960 19008 149406 -284311 -1089855 -1952460 -2248447 -1558565 -399624
36265 -399624 288145 324267 241314 272596 285673 511332 1239565 1855891 1380608 91585
36255 91585 -580386 -32371 793231 1020093 985438 1224740 1384440 896052 -37685 -791326
36245 -791326 -1035472 -637192 454638 1741058 2309795 1960818 1515508 1530590 1491918 887145
36235 887145 256683 328659 727640 502612 -394639 -1050085 -897207 -358695 -136830 -376048
36225c76048k77308R9050L75210J17127m20999n50947j90056p2502n11543p04397
36215b512413j854Q81407R24566M17645L26743N59384K44452n24160o75536O5469
36205b94297P03557M94333j46420n02181m25867j56241J8132j08222k60028K58381
36195d18853J347157J578672Q3934j624532j354864N35999J497046M45227r10538
36186A179248r19199k29668j85379n77313l40187N32027J053717O86994k10864
36177I89376r62251r76481q6086J013431J203479K65703p85033j019172n86887
36168i43921r1986K43447L72517J40746l06100m63358k00457M7733M7865K2605
36158a130909J7247j08532K2653Q84964J754530J218182o04017j834367j480278
$$ plain form
36225 -376048 -653356 -554306 -179096 -61969 -482968 -1033915 -1223971 -1296473 -1808016 -2512413
36215 -2512413 -2514267 -1632860 -708294 -290649 36094 595478 839930 315770 -359766 -294297
36205 -294297 409260 903593 757173 254992 -170875 -327116 -308984 -417206 -677234 -418853
36195 -418853 928304 2506976 2590910 966378 -388486 147513 1644559 2089786 1179248
36186 1179248 260049 30381 -154998 -732311 -1072498 -540471 513246 1200240 989376
36177 989376 27125 -949356 -1035442 -22011 1181468 1447171 662138 -357034 -943921
36168 -943921 -1035907 -792460 -419943 -279197 -585297 -1048655 -1249112 -1201379 -1153514 -1130909
36158 -1130909 -1113662 -1222194 -1199541 -314577 1439953 2658135 2054118 219751 -1260527
36149a260527p10111n77727k25318J170574K243697J277131q03947j502581l75447
36140g64256N72722J04268p15288o40728q6031J6699j60725R1933O61276P86777
36130a33353K23542m54583n64941J1090P07890P19258j63524j126373j117941
36121a898935j04850Q58920Q78331J33271n25339n08102Q7125O64433O68126J60616
36111D13596j96752R469L32279J33258l57971l10226M08630R12516M86756m94854
36101A336701j143703j074053n27001J05715N01884M68945J78594J14790M15483
36092C77355M92877k11312j217770j370908l50740P73610R16971M07840L35702
36083A53625P52045N66233n51708j303996o10379N89724O50739j99698k24790
$$ plain form
36149 -1260527 -1970638 -2548365 -2773683 -1603109 640588 1917719 1113772 -388809 -764256
36140 -764256 -191534 -87266 -802554 -1443282 -1529313 -1512614 -1673339 -1581406 -920130 -133353
36130 -133353 90189 -364394 -929335 -918245 -210355 508903 345379 -780994 -1898935
36121 -1898935 -2003785 -1144865 -266534 -133263 -658602 -1166704 -1079579 -415146 252980 413596
36111 413596 216844 226313 558592 691850 333879 23653 432283 1344799 1831555 1336701
36101 1336701 192998 -881055 -1408056 -1302341 -800457 -331512 -152918 -38128 377355
36092 377355 870232 658920 -558850 -1929758 -2280498 -1506888 -589917 -182077 153625
36083 153625 905670 1471903 920195 -383801 -994180 -404456 246283 46585 -178205
36074a78205Q88098J306115k7350j462856j017760N83606J056022M7393n61725
36065F33338J79870Q85089K54353q12017p35907K54674N84159k82651j233857
36056b72949j164976j82268Q91537J368087R72865J2271o59560n14347j71252
36047B79408n38014j183552p40114P94285J564377N08803q32013n40413P07536
36038B0303P54210n64415j266003n38853J38624j84338l14550O40653J325503
36029A1134M30949q04161n75169L64843P5432j029593q34499O94144J349731M58538
36019A41349j77032K58064J87516j095564j666149k89693J077941M43495p54702
36010a874775j09358J499524J289101p26401j716744n53073P48945N36551k78589
$$ plain form
36074 -178205 709893 2016008 1988658 525802 -491958 91648 1147670 1195063 633338
36065 633338 813208 1698297 1952650 1140633 404726 659400 1243559 960908 -272949
36056 -272949 -1437925 -1620193 -728656 639431 1612296 1624567 965007 450660 279408
36047 279408 -258606 -1442158 -2182272 -1387987 176390 685193 -146820 -687233 20303
36038 20303 774513 210098 -1055905 -1594758 -1456134 -1640472 -1955022 -1314369 11134
36029 11134 442083 -362078 -937247 -572404 -496972 -1526565 -2361064 -1666920 -317189 141349
36019 141349 -35683 222381 409897 -685667 -2351816 -2641509 -1563568 -1120073 -1874775
36010 -1874775 -1984133 -484609 804492 78091 -1638653 -2191726 -1442781 -906230 -1184819
36001a184819l79838o0348L8062K76558Q97554J114088N00744m2153J55576K61157
35991A576581n65834j499691j203820J29103J152872J206626O67960m817n12999
35982I45981m58930J09633K91900n07592j392533j061546J72959O74493j76649
35973a402284j105166p58474N21074J306830R23931R3648j09217M34275P67175
35964F71792O9684j175276j637632q17798L26234P45216O17470O82025Q68230
35955C49945N32692k47610o42430l19707J64007L26974L13885L29548K69745J21534
35945A198583N5481n1976m81966r00829n66672L84033P71626N1976o88770k21504
35935d50018R90366J410140N37562n64216p82416j70200M53360M89743j1445m96611
$$ plain form
36001 -1184819 -1564657 -1625005 -1586943 -1310385 -412831 701257 1202001 1159848 1315424 1576581
35991 1576581 1010747 -488944 -1692764 -1563661 -410789 795837 1463797 1458980 945981
35982 945981 487051 596684 888584 380992 -1011541 -2073087 -1900128 -1225635 -1402284
35973 -1402284 -2507450 -3265924 -2744850 -1438020 -514089 -420441 -529658 -95383 671792
35964 671792 741476 -433800 -2071432 -2889230 -2562996 -1817780 -1200310 -518285 349945
35955 349945 882637 635027 -7403 -327110 -163103 163871 477756 807304 1077049 1198583
35945 1198583 1254064 1202088 720122 -180707 -747379 -363346 408280 460256 -228514 -450018
35935 -450018 540348 1950488 2488050 1923834 1141418 971218 1424578 1914321 1902876 1406265
35925A406265m18554J01274K63695l68449j083680q79002R0414O92230M27113
35916B31306M681J09321M20235K93208k38854o67324p36467n08577j21240J08683
35906a105028j92690p75782p41313K04875J006630N98467m05326m19119P97584
35897a031702J665206R55152n25334j062053k31360P81748Q18898K8639n74472
35888H24722m19045L2852k180n22917p05217j11123N46002L89080k48608l12365
35878e28799K47595L64342l00940o50047K6035O84765J39287q77384p47692M38204
35868a204634J011467L75079k22965P2030M27398P0245k40259K85606P74970O2926
35858A411863j127180j118901P5526Q37136N17044J10933J93708M7896n83683
$$ plain form
35925 1406265 987711 1088985 1352680 984231 -99449 -978451 -888037 -195807 231306
35916 231306 235987 345308 765543 1058751 819897 152573 -583894 -1092471 -1213711 -1105028
35906 -1105028 -1297718 -2073500 -2814813 -2609938 -1603308 -1004841 -1410167 -1829286 -1031702
35897 -1031702 633504 1588656 1063322 1269 -230091 551657 1370555 1399194 824722
35888 824722 405677 438529 436349 -86568 -791785 -902908 -356906 32174 -216434 -528799
35878 -528799 -281204 83138 -217802 -867849 -841814 -157049 -17762 -895146 -1642838 -1204634
35868 -1204634 -193167 181912 -41053 30977 458375 528620 288361 573967 1348937 1411863
35858 1411863 284683 -834218 -758692 78444 595488 706421 900129 948025 364342
35849C64342o80722J60662O50735q5265p57897Q0712J410081J098756p39293j829799
35839c27688j056349K87065P88421O04314L26992j31424p13121p08283O756M36404
35829d86913O2118k18523K75860O64327L3643p76233m23521O96002J079067M75092
35819A380919k3334J6338p8489n22947o42759k61393j22699n43065q63074o49902
35809b310405l11237j02643L32776R48887R80695K82284j20086L98879R41061
35800A040211M76711m87973p07235n4813N03659M29898R7054n7329p151J35568
35790A368600K14874K0814k86144j20896N35916O50986m30824j579197j166400
35781g92271M63939J272597M17456o42318m97353K06692J49767m43116l94671
$$ plain form
35849 364342 -316380 -155718 495017 409752 -348145 -267433 1142648 2241404 1502111 -327688
35839 -327688 -1384037 -1096972 -308551 295763 622755 491331 -221790 -930073 -923317 -486913
35829 -486913 -424795 -643318 -367458 296869 330512 -445721 -869242 -173240 905827 1380919
35819 1380919 1357585 1373923 1295434 772487 129728 -131665 -254364 -797429 -1660503 -2310405
35809 -2310405 -2621642 -2724285 -2391509 -1442622 -461927 -179643 -299729 99150 1040211
35800 1040211 1516922 1028949 321714 266901 770560 1200458 1297512 1240183 1233032 1368600
35790 1368600 1583474 1604288 1318144 1197248 1733164 2384150 1953326 374129 -792271
35781 -792271 -328332 944265 1361721 719403 222050 428742 578509 135393 -259278
35772b59278K75248L68307m47771j065925o66705K07236P34986Q81252Q03925
35763H31275K51067o30139q11982K09226J236556Q55588l97553p84984m9355K88768
35753I98467n00100j183570o54870L10808M57976K9818O0934N27187N75848J12881
35743G35379j61959q3362j94737o31717q31537m21841L35364R48479R80243K07183
35733H81495q99995j294897o42355Q5019O5916j19089K62529N64691k3605o31167
35723a751458P186J080276P82465m94437o20488N73639Q74354m32537j153338
35714a134338Q1710J380411P13689q03710r49868P2005M81938n528k90874j72228
35704f26793l31613o32170l64216K56211M66435K94908R4752m24778j205411j005450
$$ plain form
35772 -259278 15970 384277 -63494 -1129419 -1796124 -1588888 -853902 27350 831275
35763 831275 1082342 452203 -359779 -150553 1086003 1941591 1544038 759054 709699 998467
35753 998467 498367 -685203 -1340073 -1029265 -571289 -541471 -480537 46650 622498 735379
35743 735379 573420 490058 295321 -336396 -1167933 -1589774 -1254410 -305931 674312 881495
35733 881495 -18500 -1313397 -1955752 -1870733 -1804817 -1923906 -1661377 -1096686 -1120291 -1751458
35723 -1751458 -1744272 -663996 118469 -375968 -996456 -422817 451537 19000 -1134338
35714 -1134338 -1052628 327783 1041472 237762 -712106 -640101 -158163 -163691 -454565 -626793
35704 -626793 -958406 -1590576 -1954792 -1698581 -1232146 -937238 -842486 -1267264 -2472675 -3478125
35694c478125O12425J683626M86981j348551j068218P80365J267502l6911n76225
35685a677131O14773J411473N55144k88294J35299L95009o36673j291983J4611
35676g67772J656472J194718p21636j527822o82030J63816K01427J79029M05544
35667A01746L14957l056J94692O92773M63188m53188q52399l49712R3653r4442
35657A08212l14110j46239r5515m13683m06919L58575J106441Q52172k82882j326866
35647e60814j519980p58286M63678J236069R40644P6662k04199L59399P67131
35638H00304K90246m05409k98340M40902P35384J20708p67073j122048p70654
35629i75980l7316O66916R91612P53507J04335n35292p94811n78219n7956M29707
$$ plain form
35694 -3478125 -2865700 -1182074 -695093 -2043644 -3111862 -2331497 -1063995 -1100906 -1677131
35685 -1677131 -1062358 349115 904259 615965 751264 1146273 509600 -782383 -767772
35676 -767772 888700 2083418 1361782 -166040 -848070 -684254 -482827 -303798 101746
35667 101746 416703 413647 608339 1301112 1764300 1311112 458713 109001 202654 108212
35657 108212 -205898 -352137 -447652 -861335 -1268254 -909679 196762 1048934 766052 -560814
35647 -560814 -2080794 -2839080 -2375402 -1139333 -198689 -122027 -326226 33173 800304
35638 800304 1090550 685141 386801 827703 1563087 1683795 916722 -205326 -975980
35629 -975980 -1013296 -346380 645232 1398739 1503074 967782 172971 -405248 -463204 -33497
35619c3497N60873K66019j92250m56422l75711p1995J86861J63614j30934l46111
35609d29553j28286L54435M88222P730n58922n57024r9086J37730r5918l30851
35599a211523j42028K63221M01852J03563m21469p66153m73556N34144J500951
35590b10998J405342L20305m58666j66820K99383j63697j023937r75832j46797
35581a121717J45158k77822j60771Q09145J216617L53937l60522K64452J012384
35572A880861K20869j305025j479480k90546L42223j92863m71335K11328O51634
35563d32334M8293n39897j46438M04969O4813n87330m94022J1832L6206p2065
35553a705973N62439J377538R27588o55316j427477k81036J463450J779551M05114
$$ plain form
35619 -33497 527376 793395 601145 144723 -230988 -302983 -116122 47492 -83442 -429553
35609 -429553 -557839 -203404 284818 292548 -266374 -823398 -922484 -784754 -880672 -1211523
35599 -1211523 -1353551 -1090330 -688478 -584915 -1006384 -1772537 -2246093 -1711949 -210998
35590 -210998 1194344 1514649 1055983 889163 1188546 1024849 912 -974920 -1121717
35581 -1121717 -976559 -1254381 -1415152 -606007 610610 964547 604025 868477 1880861
35572 1880861 2101730 796705 -682775 -973321 -631098 -823961 -1295296 -1083968 -432334
35563 -432334 -384041 -923938 -1070376 -665407 -600594 -1187924 -1681946 -1670114 -1633908 -1705973
35553 -1705973 -1143534 234004 1161592 506276 -921201 -1202237 261213 2040764 2445878
35544B445878j110106j357146m41080M59047M59098k22888o92148m13657L32110
35535e40892R10335R28592M08763k22981l21850K71286P07502N4764j139436j216519
35525a60436K21629J426221Q49916o28188j062617k70330K38101j91864n52557
35516a30125p8318N79566O38227M08658M71111N48170P5149o79627r06030m16386
35506E10395J27219J00218l67347o03843k11235L67943L27741k74396k83547R09443
35496F02591K013858J310132p10384j690571o95535M72507P6622j007420r43840
35487e72040J08949N38070M9294j35079L23307L23873m78751p99801J67743J311404
35477H36969J289686M56277j5517L3714k6138k73913l13983k25089l49412m79908
$$ plain form
35544 2445878 1335772 -21374 -462454 -3407 455691 232803 -459345 -873002 -540892
35535 -540892 369443 1298035 1706798 1483817 1161967 1433253 2140755 2195519 1056083 -160436
35525 -160436 61193 1487414 2337330 1709142 646525 376195 614296 422432 -130125
35516 -130125 -208443 371123 1009350 1418008 1889119 2437289 2512438 1832811 926781 510395
35506 510395 637614 737832 370485 -233358 -444593 -76650 251091 -23305 -306852 602591
35496 602591 2616449 3926581 3216197 1525626 830091 1302598 1379220 371800 -572040
35487 -572040 -463091 74979 124273 -10806 312501 636374 157623 -642178 -474435 836969
35477 836969 2126655 2582932 2567415 2601129 2574991 2301078 1987095 1762006 1412594 932686
35467I32686k27473J28507P2013k18576k77425k67408m95676m94674K19431R01444
35457B72849N03522m31090m00165N79040Q64282j59760j072884o89048K39473
35448b93781M27583j49564p17403q18188k66489Q29132J419894L35176j573859
35439h07499j841622O3030J514046N22741j179143q91559Q84058J547225N12752
35430C24029m98192o29229o26635o40046R0517J231392J423522O12186J37862
35421A425406L03590N4259o91760p09335J44286N25272O4721j30866N9982n63195
35411D82360j664876j089351J307783K485393O95667j601408j554606j37558J59645
35402i16951l31670L39382J716211J579754o8034r25871j82803N20112J30394
$$ plain form
35467 932686 705213 833720 905733 687157 409732 142324 -353352 -848026 -628595 272849
35457 272849 776371 345281 -54884 524156 1388438 1228678 155794 -533254 -293781
35448 -293781 133802 -15762 -733165 -1551353 -1817842 -988710 431184 766360 -807499
35439 -807499 -2649121 -2586091 -1072045 -549304 -1728447 -2620006 -1735948 -188723 324029
35430 324029 -174163 -803392 -1430027 -2070073 -1979556 -748164 675358 1287544 1425406
35421 1425406 1728996 1783255 1091495 382160 526446 1051718 1116439 985573 1045555 482360
35411 482360 -1182516 -2271867 -964084 1521309 2216976 615568 -939038 -1076596 -916951
35402 -916951 -1248621 -909239 806972 2386726 2318692 1392821 1210018 1730130 1860524
35393A860524m14532l09677j62738n03491q33422p53195n28812j63203O33450
35384a175096J304119Q29439m33170q45082J38606J128010Q40729l04412j145196
35375C37947j179558n56897L05651P50303M52539R2748M61476J010917O03180
35366B278306m29428o35161O3147J46505p77788j071808J78339J411116R71266
35357B134494l10270n50710L00172P33482J51899n75842p39395n70493m48177
35348A25160l98015m13092m88044l70931J20023O84240R32225Q93864O71703N1667
35338A808800r47394j618744j368809n75515L1291L95663P80602Q77349K57544
35329c59213n75469o44880N4290N48169L60329M1293O7175J44199n2180k56492
$$ plain form
35393 1860524 1445992 1136315 973577 470086 -363336 -1116531 -1645343 -1808546 -1175096
35384 -1175096 129023 958462 525292 -319790 -181184 946826 1787555 1483143 337947
35375 337947 -841611 -1398508 -1092857 -342554 109985 202733 664209 1675126 2278306
35366 2278306 1848878 1213717 1276864 1423369 645581 -426227 -247888 1163228 2134494
35357 2134494 1824224 1273514 1573686 2307168 2459067 1883225 1143830 573337 125160
35348 125160 -272855 -685947 -1173991 -1544922 -1424899 -740659 191566 1085430 1757133 1808800
35338 1808800 861406 -757338 -2126147 -2701662 -2670371 -2274708 -1494106 -616757 -359213
35329 -359213 -934682 -1579562 -1525272 -977103 -616774 -575481 -508306 -364107 -416287 -672779
35319f72779j84493p2114j54492j44443K37578O18178M04174l68955j053965j079665
35309b470976l30588Q52808J704430J450522K13651q17259p13078p744J35303
35300A7069l35211m53486q170K4118p94055j397015p72785M50649R48688N39879
35290a780319P4131M1047L18561P97909J171728O37601r09098j891801q22913
35281b363154J248705J832046M85906p19510m84735N7884l30191j016753r66451
35272b256253m64494j01900M43246J274466J359040K01497q71185o23850J25914
35263i13519O0686l71763o0600N43441L38712k10524R1287Q17734N85663m24688
35253D56429p81427k70838P9636J32412N97828J099236N71412n13621o67157r8574
$$ plain form
35319 -672779 -857272 -929386 -1083878 -1228321 -990743 -372565 31609 -337346 -1391311 -2470976
35309 -2470976 -2801564 -1948756 -244326 1206196 1419847 602588 -110490 -118234 17069
35300 17069 -318142 -771628 -779798 -755680 -1549735 -2946750 -3719535 -3268886 -2320198 -1780319
35290 -1780319 -1706188 -1665141 -1346580 -548671 623057 1260658 351560 -1540241 -2363154
35281 -2363154 -1114449 717597 1203503 483993 -742 57142 -273049 -1289802 -2256253
35272 -2256253 -2720747 -2822647 -2379401 -1104935 254105 455602 -415583 -1039433 -913519
35263 -913519 -852833 -1224596 -1285196 -741755 -403043 -613567 -522280 295454 881117 456429
35253 456429 -324998 -595836 -516200 -383788 214040 1313276 1884688 1371067 703910 605336
35243F05336m04747j428738j183284N71468J487877L41886j054753r25549n6948
35234b047452K52066M58748J179519J362294J47599j054319n28229Q97315J100772
35225A768313p4854q59533l67569M69065O17505J21460m21900n20254l2521N24528
35215A224240K83717p45817j362394p48555L41610O98784K31560l24719n33060
35206i34634l39243K44569Q44839Q41845L44648J95325N28227M33313l89225r42831
35196H26833o22403j97197k68538k45971J61279Q8176o27230n03237J068832K103324
35186A783868Q23493j305658j633599k37422O57234K92901j36480j13659l50064
35177b19386q01874m87331N21543R47652L92005j83861j98805l9443J19769M62436
$$ plain form
35243 605336 200589 -1228149 -2411433 -1839965 -352088 -10202 -1064955 -1990504 -2047452
35234 -2047452 -1795386 -1336638 -157119 1205175 1352774 298455 -229774 667541 1768313
35225 1768313 1693459 833926 466357 935422 1552927 1674387 1252487 732233 699712 1224240
35215 1224240 1507957 762140 -600254 -1348809 -1007199 -308415 -76855 -401574 -934634
35206 -934634 -1273877 -1029308 -184469 657376 1002024 1197349 1725576 2158889 1769664 826833
35196 826833 204430 7233 -261305 -507276 -345997 -257821 -885051 -1388288 -319456 1783868
35186 1783868 2607361 1301703 -331896 -569318 87916 380817 244337 130678 -219386
35177 -219386 -1021260 -1508591 -987048 -39396 352609 168748 -30057 -69500 50269 512705
35167E12705N57057r5289o72087J0825J267156J240006j46268j022329n77238
35158A074538p7897m17315p46909k94273L40012N28251N78983O04921P8275p63147
35148I05439p77121L7443J54333q86774j380870j98633J163619Q62858m49880
35139e69586q39960k5775O78874N83338J20796l23928o11789l30621N89172J195080
35129D65601P16916n7007M8335N65079J09618j137038j429836j29350J237509
35120C89827J140556k2558q67884q64129m08708J49059O38003O94966J76886k71392
35110G54626Q3472Q18481O69405o57041j792744j416009m5196P18803L86651o6470
35100e46022l0549j57494q84947j251419k59382J336799J856723R41808k15598
$$ plain form
35167 512705 1069762 974473 302386 313211 1580367 2820373 2674105 1651776 1074538
35158 1074538 996641 579326 -167583 -461856 -121844 406407 985390 1590311 1668586 905439
35148 905439 128318 165761 320094 -566680 -1947550 -2146183 -982564 -119706 -569586
35139 -569586 -1409546 -1435321 -756447 -173109 -52313 -376241 -988030 -1318651 -729479 465601
35129 465601 1182517 1125510 1173845 1738924 1848542 711504 -718332 -847682 389827
35120 389827 1530383 1507825 639941 -224188 -632896 -483837 154166 849132 1026018 754626
35110 754626 838098 1656579 2325984 1668943 -123801 -1539810 -1585006 -866203 -479552 -546022
35100 -546022 -576571 -734065 -1619012 -2870431 -3129813 -1793014 63709 1005517 789919
35091G89919o84753o09933k60793L96769R16920M41705q74420j565780p11500
35082b161866P33779J240281O66550O7242P670K2066l44594p72224o73638j9449
35072a234183O26308P64483M75013K17857J95232J32583k03060n61688n91064
35063a78519m17001m14738n41549l75072J96972P41497P92911L41864j67352j78412
35053a99399M31998R91082O17098n39284j182746n07577O15462P99293K667o47153
35043C81441n59362k26997j69390k37047p4024L64360Q11347Q23830J51233o76568
35033E88823o76573J57848N34348k51054j033415n36451N15199N91749p9359l8111
35023b26996P36344P80958k04752p71131j98067L77692K6873m76763j38799O33605
$$ plain form
35091 789919 105166 -504767 -765560 -368791 548129 989834 115414 -1450366 -2161866
35082 -2161866 -1428087 -187806 478744 545986 553656 575722 231128 -541096 -1214734 -1234183
35072 -1234183 -607875 156608 631621 849478 1044710 1177293 974233 412545 -178519
35063 -178519 -595520 -1010258 -1551807 -1926879 -1729907 -988410 -195499 146365 -20987 -199399
35053 -199399 232599 1223681 1840779 1301495 118749 -388828 226634 1025927 1028594 381441
35043 381441 -177921 -404918 -574308 -811355 -885379 -521019 290328 1114158 1265391 588823
35033 588823 -87750 70098 604446 353392 -680023 -1216474 -701275 -109526 -188885 -226996
35023 -226996 509348 1290306 1085554 314423 116356 494048 520921 44158 -94641 538964
35013E38964Q37743L14865l60743o59684l42660L04301L72043n83177j456780
35004a035128q67329O22213J139071L41652k18038K19367N82394J28682l51139
34995E61745k24139l6867p7133K29299P32126L48621p44345q78520J73460M26090
34985E10337q69085j560152j59811J436155J061400j74274j11103O74366L26989
34976A134822o12565k69067Q76842P14567o12905q48453M22271J096907J99410
34967B101829o93156l90522Q6291l71033j082707r49945j59813M37483N06382
34958e15191J40018m16517o07067o9652O10575O28173K67064L45825O99515O00652
34948A683395K90608M35610M39871p11629k116811j739879K68392J385372M40734
$$ plain form
35013 538964 1376707 1691572 1330829 671145 328485 632786 1004829 421652 -1035128
35004 -1035128 -1902457 -1280244 -141173 200479 -17559 201808 784202 912884 561745
34995 561745 337606 300739 223606 452905 1185031 1533652 789307 -89213 84247 510337
34985 510337 -358748 -1918900 -2078711 -642556 418844 244570 133467 807833 1134822
34976 1134822 522257 253190 1130032 1844599 1231694 383241 805512 1902419 2101829
34967 2101829 1408673 1018151 1104442 733409 -349298 -1299243 -1459056 -1021573 -515191
34958 -515191 -375173 -791690 -1398757 -1468409 -857834 -229661 37403 383228 1082743 1683395
34948 1683395 1974003 2409613 2849484 2137855 21044 -1718835 -1450443 -65071 375663
34939C75663p73671n58760K34938J84525j81999L67610J321806J138370k37298
34930A871184j235021q93809J2415K13516m77547j096624p83992J03268M09956
34921a876654j78345n57013J49402J110549J017477J40505k28545P7856J19773
34912b24995k83884m47684l87725o00293m32018J077502K668946J863562r07775
34903B325636k067383p8302J954492Q73022j825668k491999o66795J046823J273438
34894C43264R44729O00901l48667j487470j240955M30905J434082N68733p21733
34885E23789p21069O7605J72803l31130j98164O90326J013607Q0338j025315q69039
34875e96249M67522J542673J302419J50809p48030q37925n66762n53384p22148
$$ plain form
34939 375663 -398008 -956768 -721830 -537305 -719304 -351694 970112 2108482 1871184
34930 1871184 636163 -257646 -245231 -31715 -509262 -1605886 -2389878 -2286610 -1876654
34921 -1876654 -2054999 -2612012 -2462610 -1352061 -334584 -194079 -422624 -344768 -224995
34912 -224995 -508879 -956563 -1344288 -1944581 -2376599 -1299097 1369849 3233411 2325636
34903 2325636 258253 179951 2134443 3007465 1181797 -1310202 -1976997 -930174 343264
34894 343264 1287993 1888894 1540227 52757 -1188198 -757293 676789 1245522 523789
34885 523789 -197280 -129675 43128 -288002 -486166 204160 1217767 1298105 272790 -596249
34875 -596249 -128727 1413946 2716365 2867174 2119144 1281219 714457 161073 -561075
34866e61075m96267K41705P34849K29736q14514r74885K89743J577847J177808
34857A404947n06963j359232n06856N43100L83983j60185L27176J299229J110999
34848B536198k51773j232313j211071j016382r18509j32408J243022J713278O66968
34839A397010m22700j00004J037360J457784Q28753j6752m77566o01071o34378
34830B468436q40820j291124j464267p25524N27153J079918N86027J9610N7980
34821D17389J48738k46676o20678l74718J58988L69769K07608j68024o71167q11804
34811a590575l6113J043654J050751l9126o55766j17321L27779j91761o29538
34802h38016j5760P44308N59920M3082O5528j9376q59703j302819k61200R11868
$$ plain form
34866 -561075 -1057342 -815637 -80788 148948 -665566 -1640451 -1350708 227139 1404947
34857 1404947 897984 -461248 -968104 -425004 -41021 -201206 125970 1425199 2536198
34848 2536198 2284425 1052112 -158959 -1175341 -2093850 -2226258 -983236 730042 1397010
34839 1397010 974310 874306 1911666 3369450 4198203 4181451 3703885 3102814 2468436
34830 2468436 1627616 336492 -1127775 -1853299 -1326146 -246228 339799 359409 417389
34821 417389 566127 319451 -301227 -675945 -516957 -147188 60420 -107604 -778771 -1590575
34811 -1590575 -1626688 -583034 467717 428591 -227175 -344496 -16717 -208478 -838016
34802 -838016 -853776 -109468 450452 493534 559062 539686 -320017 -1622836 -1884036 -972168
34792i72168L25283j154011j088524O54887J830798J359702M00428j38696o64795
34783E52904j140151o23095P39505J289830K84106r25820r57704j85389L61191
34774f04623N88470R14294J191872R12720q374j087053j580074j010407J37263
34765e45912O31889Q9604l04874L51395R96981K57043j060166j078376P6039N54883
34755c1494p4818l83224J03676J55162n60333o17319M82399J096047J71065q86747
34745e45586n45841M68936P37157N09357P58982J121226N94905n32412j093589
34736A473135q13367l50672j07335j03315m30394q20386m69533P05374J436366
34727E19873Q04084k75274m57930j7798q1199n43568l91151K79439K69200o46858
$$ plain form
34792 -972168 -646885 -1800896 -2889420 -2234533 -403735 955967 1356395 1217699 552904
34783 552904 -587247 -1210342 -470837 818993 1103099 177279 -780425 -965814 -604623
34774 -604623 -16153 898141 2090013 3002733 2994359 1907306 327232 -683175 -545912
34765 -545912 85977 175581 -129293 222102 1219083 1476126 415960 -662416 -586377 -31494
34755 -31494 -106312 -489536 -385860 -230698 -791031 -1408350 -925951 170096 341161 -545586
34745 -545586 -1091427 -622491 114666 624023 1383005 2504231 3099136 2566724 1473135
34736 1473135 659768 309096 201761 98446 -331948 -1152334 -1621867 -916493 519873
34727 519873 1323957 1048683 590753 572955 491756 -51812 -442963 -163524 105676 -541182
34717e41182j184590n01147N15154N36129l88604r84146m08706P83558J396507
34708g77027J008192K98469l2414j16582l12747m00873j67228j61751p15314p88477
34698b165752N92253K147482J672556m29641j337571o2339J063305K63216r10389
34689H33120m63166P08478O75007j90628k80985K70896K94104R9962O21820J005598
34679C574206j10853j656169j467464q7835k374j217200j097067R08411J952283
34670G95938M44390j267260p42571P97768Q53783m01639j054316p53041n50236
34661a877184m81260K43760J182699J057077M4790l14487L98908Q77156L08524
$$ plain form
34717 -541182 -1725772 -2226919 -1711765 -1175636 -1564240 -2548386 -2957092 -2173534 -777027
34708 -777027 231165 529634 497220 380638 67891 -332982 -500210 -661961 -1377275 -2165752
34698 -2165752 -1573499 573983 2246539 1816898 479327 416988 1480293 1743509 833120
34689 833120 369954 1078432 1753439 1562811 1281826 1552722 1846826 1946788 2568608 3574206
34679 3574206 3463353 1807184 339720 251885 249511 -967689 -2064756 -1156345 795938
34670 795938 1240328 -26932 -769503 28265 882048 480409 -573907 -1326948 -1877184
34661 -1877184 -2358444 -2114684 -931985 125092 169882 -144605 254303 1131459 1439983
$$ [...]
##END NTUPLES=NMR SPECTRUM
##END=
