##TITLE=31Pdec_64-2021
 CDCl3, 24 sc
 4.08.2021
##JCAMPDX= 6.0         $$ Bruker NMR JCAMP-DX V2.0
##DATA TYPE= NMR SPECTRUM
##DATA CLASS= NTUPLES
##ORIGIN= UXNMR, Bruker Analytische Messtechnik GmbH
##OWNER= root
$$ XWIN-NMR		Version 3.5
$$ Wed Aug  4 10:47:21 2021 Russian Standard Time (UT+4h)  she@DPX200
##.OBSERVE FREQUENCY= 81.013821
##.OBSERVE NUCLEUS= ^31P
##.ACQUISITION MODE= SIMULTANEOUS
##.ACQUISITION SCHEME= undefined
##.AVERAGES= 24
##.DIGITISER RES= 16
##SPECTROMETER/DATA SYSTEM= spect
##.PULSE SEQUENCE= zgpg30
##.SOLVENT NAME= CDCl3
##.SHIFT REFERENCE= (INTERNAL, CDCl3, 0, 248.564)
##AUDIT TRAIL= $$ (NUMBER, WHEN, WHO, WHERE, WHAT)
$$ ##TITLE= Audit trail, XWIN-NMR		Version 3.5
$$ ##JCAMPDX= 5.01
$$ ##ORIGIN= Bruker BioSpin GmbH
$$ ##OWNER= she
$$ F:/spectra/data/she/nmr/P31/1/pdata/1/auditp.txt
$$ ##AUDIT TRAIL=  $$ (NUMBER, WHEN, WHO, WHERE, WHAT)
(   1,<2021-08-04 10:46:16.26 +0400>,<she>,<DPX200>,
      <created by zg, POWCHK disabled, PULCHK disabled
       configuration hash MD5:
       00 E9 B6 7A A2 85 ED C7 34 08 36 98 17 FE 4E 26
       data hash MD5: 32K
       F3 87 8E B2 4B 1F AB 51 99 94 2A AA 35 E9 C2 29>)
(   2,<2021-08-04 10:46:21.21 +0400>,<she>,<DPX200>,
      <Start of raw data processing
       efp BC_mod = 2 LB = 1 FT_mod = 6 PKNL = 1 PHC0 = -7731.337 PHC1 = 836.8746 SI = 64K 
       data hash MD5: 64K
       F2 AF 0F E9 3D EC 2C 20 E4 8D D7 1C 75 64 BA 26>)
(   3,<2021-08-04 10:46:42.03 +0400>,<she>,<DPX200>,
      <pk PHC0 = 311.1126 PHC1 = -651.9999 
       data hash MD5: 64K
       2A AC 62 11 DD DF 92 A8 FC F0 4E 87 ED 37 46 18>)
$$ ##END=
$$ 
$$ hash MD5
$$ 97 A2 53 96 89 A6 0E 87 BF DB 3E B7 16 AC 93 87
##$RELAX= 
##$RELAX= 
##$RELAX= 
##$RELAX= 
##$RELAX= 
##$RELAX= 
##$RELAX= 
##$RELAX= 
$$ Bruker specific parameters
$$ --------------------------
##$DU= <F:/spectra>
##$EXPNO= 1
##$NAME= <P31>
##$PROCNO= 1
##$TYPE= <nmr>
##$USER= <she>
##$AMP= (0..31)
100 100 100 100 100 100 100 100 100 100 100 100 100 100 100 100 100 100 
100 100 100 100 100 100 100 100 100 100 100 100 100 100 
##$AQSEQ= 0
##$AQ_mod= 1
##$AUNM= <au_zg>
##$AUTOPOS= <>
##$BF1= 81.014009
##$BF2= 200.13
##$BF3= 200.13
##$BF4= 200.13
##$BF5= 200.13
##$BF6= 200.13
##$BF7= 200.13
##$BF8= 200.13
##$BYTORDA= 1
##$CFDGTYP= 0
##$CFRGTYP= 5
##$CHEMSTR= <none>
##$CNST= (0..31)
1 1 145 1 1 1 1 1 1 1 1 1 1 1 1 1 1 1 1 1 1 1 1 1 1 1 1 1 1 1 1 1 
##$CPDPRG= <waltz16>
##$CPDPRG1= <>
##$CPDPRG2= <waltz16>
##$CPDPRG3= <>
##$CPDPRG4= <mlev>
##$CPDPRG5= <mlev>
##$CPDPRG6= <mlev>
##$CPDPRG7= <mlev>
##$CPDPRG8= <mlev>
##$CPDPRGB= <>
##$CPDPRGT= <>
##$D= (0..31)
0 1 0 0 0 0 0 0 0 0 0 0.03 2e-05 3e-06 0 0 0 0 0 0 0 0 0 0 0 0 0 0 0 0 
0 0 
##$DATE= 1628059575
##$DBL= (0..7)
120 120 120 11 120 120 24 19 
##$DBP= (0..7)
150 150 150 150 150 150 150 150 
##$DBP07= 0
##$DBPNAM0= <>
##$DBPNAM1= <>
##$DBPNAM2= <>
##$DBPNAM3= <>
##$DBPNAM4= <>
##$DBPNAM5= <>
##$DBPNAM6= <>
##$DBPNAM7= <>
##$DBPOAL= (0..7)
0.5 0.5 0.5 0.5 0.5 0.5 0.5 0.5 
##$DBPOFFS= (0..7)
$$ [...]
##$SUBNAM2= <"">
##$SUBNAM3= <"">
##$SUBNAM4= <"">
##$SUBNAM5= <"">
##$SUBNAM6= <"">
##$SUBNAM7= <"">
##$SUBNAM8= <"">
##$SUBNAM9= <"">
##$SW= 501.771253377433
##$SWIBOX= (0..15)
0 1 3 0 0 0 0 0 0 0 0 0 0 0 0 0 
##$SW_h= 40650.406504065
##$TD= 32768
##$TD0= 1
##$TE= 0
##$TE2= 300
##$TE3= 300
##$TEG= 300
##$TL= (0..7)
0 120 53 12 22 120 120 120 
##$TP= (0..7)
150 150 150 150 150 150 150 150 
##$TP07= 0
##$TPNAME0= <>
##$TPNAME1= <>
##$TPNAME2= <>
##$TPNAME3= <>
##$TPNAME4= <>
##$TPNAME5= <>
##$TPNAME6= <>
##$TPNAME7= <>
##$TPOAL= (0..7)
0.5 0.5 0.5 0.5 0.5 0.5 0.5 0.5 
##$TPOFFS= (0..7)
0 0 0 0 0 0 0 0 
##$TUNHIN= 0
##$TUNHOUT= 0
##$TUNXOUT= 0
##$USERA1= <user>
##$USERA2= <user>
##$USERA3= <user>
##$USERA4= <user>
##$USERA5= <user>
##$V9= 5
##$VALIST= <valist>
##$VCLIST= <CCCCCCCCCCCCCCC>
##$VD= 0
##$VDLIST= <DDDDDDDDDDDDDDD>
##$VPLIST= <PPPPPPPPPPPPPPP>
##$VTLIST= <TTTTTTTTTTTTTTT>
##$WBST= 1024
##$WBSW= 4
##$XGAIN= (0..3)
0 0 0 0 
##$XL= 0
##$YL= 0
##$YMAX_a= 5712
##$YMIN_a= -6883
##$ZGOPTNS= <>
##$ZL1= 120
##$ZL2= 120
##$ZL3= 120
##$ZL4= 120
##$ABSF1= 0
##$ABSF2= 0
##$ABSG= 0
##$ABSL= 0
##$ALPHA= 0
##$AQORDER= 0
##$ASSFAC= 0
##$ASSFACI= 0
##$ASSFACX= 0
##$ASSWID= 0
##$AUNMP= <proc_1d>
##$AZFE= 0.1
##$AZFW= 0.5
##$BCFW= 0
##$BC_mod= 2
##$BYTORDP= 0
##$COROFFS= 0
##$CY= -3
##$DATMOD= 1
##$DC= 0
##$DFILT= <>
##$DTYPP= 0
##$F1P= 0
##$F2P= 0
##$FCOR= 1
##$FTSIZE= 65536
##$FT_mod= 6
##$GAMMA= 0
##$GB= 0
##$INTBC= 1
##$INTSCL= 5.30512e-09
##$ISEN= 30
##$LB= 1
##$LEV0= 0
##$LPBIN= 0
##$MAXI= 10000
##$MC2= 0
##$MEAN= 0
##$ME_mod= 0
##$MI= 50
##$NCOEF= 0
##$NC_proc= -4
##$NLEV= 6
##$NOISF1= 182.463
##$NOISF2= 159.3651
##$NSP= 0
##$NTH_PI= 0
##$NZP= 0
##$OFFSET= 248.5645
##$PC= 4
##$PHC0= -7420.224
##$PHC1= 184.8747
##$PH_mod= 1
##$PKNL= yes
##$PPARMOD= 0
##$PSCAL= 0
##$PSIGN= 0
##$REVERSE= no
##$SF= 81.014009
##$SI= 65536
##$SIGF1= 159.3651
##$SIGF2= -187.1042
##$SINO= 113.3802
##$SIOLD= 16384
##$SREGLST= <1H.CDCl3>
##$SSB= 0
##$STSI= 65536
##$STSR= 0
##$SW_p= 40650.406504065
##$SYMM= 0
##$S_DEV= 0
##$TDeff= 32768
##$TDoff= 0
##$TI= <>
##$TILT= no
##$TM1= 0
##$TM2= 0
##$TOPLEV= 0
##$USERP1= <user>
##$USERP2= <user>
##$USERP3= <user>
##$USERP4= <user>
##$USERP5= <user>
##$WDW= 1
##$XDIM= 65536
##$YMAX_p= 342247018
##$YMIN_p= -1527662
$$ End of Bruker specific parameters
$$ ---------------------------------
##NTUPLES= NMR SPECTRUM
##VAR_NAME=  FREQUENCY,     SPECTRUM/REAL,   SPECTRUM/IMAG
##SYMBOL=    X,             R,               I
##VAR_TYPE=  INDEPENDENT,   DEPENDENT,       DEPENDENT
##VAR_FORM=  AFFN,          ASDF,            ASDF
##VAR_DIM=   65536,         65536,           65536
##UNITS=     HZ,            ARBITRARY UNITS, ARBITRARY UNITS
##FACTOR=    0.620285442955139, 1,           1
##FIRST=     20137.2065510759, 0,            0
##LAST=      -20513.1999529892, 0,           0
##MIN=       -20513.1999529892, -1527662,    0
##MAX=       20137.2065510759, 342247018,    0
$$ Real data points
##PAGE= N=1
##DATA TABLE= (X++(R..R)), XYDATA
$$ [...]
39575g8392j80368o4592N9739J1658j21241j11301P2830K26990J99025P2036J9345
39564A05729P0736R7172Q745r9404n8478J23177K18657O4658j99318l00596j87442
39553a56364n3494k9895l8227J9668R8901J06207L0303p3005j24161m7434J17808
39542a49693J68813j2707k03996q7159K50614L68828Q6760k73579l66040k17985
39532d36144o936K09942L34888J56463k66712m67499j72624K22960J82121j92913
39522d36454l47901r6730K14472K98594K21675R6892q0149k15756j23549J40071
39512c28835K68970J43955j9455n4539o3278j27662j16578L3186J18149k2676
39502a68763k15042k02986k6289R7902J37034K18922L13927K23910p3723k98891
$$ plain form
39575 -78392 -258760 -323352 -263613 -251955 -373196 -484497 -411667 -184677 14348 86384 105729
39564 105729 176465 273637 282382 182978 124500 247677 466334 530992 331674 31078 -156364
39553 -156364 -209858 -239753 -277980 -258312 -159411 -53204 -22901 -95906 -220067 -267501 -149693
39542 -149693 19120 6413 -197583 -284742 -34128 334700 421460 147881 -218159 -436144
39532 -436144 -443080 -233138 101750 258213 -8499 -475998 -648622 -425662 -243541 -436454
39522 -436454 -784355 -881085 -666613 -368019 -146344 -49452 -129601 -345357 -468906 -328835
39512 -328835 -59865 84090 64635 10096 -53182 -180844 -297422 -264236 -146087 -168763
39502 -168763 -383805 -586791 -613080 -515178 -378144 -159222 154705 378615 304892 6001
39492F001k00820J11012K91537J63965j06388k39644j53667p62N6387K1117K835
39481d8427N0793J06147J02029N8395M8243P5671L3834j48575l30242k58489P5204
39470b35417L23128J95334j20794j97897K4108J75318M4747j06399M377K08293
39460C14798J50590j42471k81798o8056K36742K49975p1511l87841l50833K949
39450c47456K66219J32634k00872k73759J2688K66027J77518n7235q4153P9747
39440b8642J34068k4403j84724j44249N9450K28356J88934n6407k76706k15538
39430c19861O5191K01094P351k44109k08515N5121K22609J71526N1606j1140k4524
39419c3651l74O1206R3739M7625m575M747L270p4917j37661j01097n2025n1827
$$ plain form
39492 6001 -194819 -83807 207730 371695 265307 25663 -128004 -128766 -72379 -51262 -48427
39481 -48427 2366 108513 210542 268937 317180 392851 426685 278110 -52132 -310621 -235417
39470 -235417 87711 283045 162251 -35646 -11538 163780 208527 102128 106505 314798
39460 314798 465388 322917 41119 -26937 209805 459780 388269 428 -350405 -347456
39450 -347456 -81237 51397 -149475 -423234 -410546 -144519 32999 -24236 -108389 -28642
39440 -28642 105426 81023 -103701 -247950 -188500 39856 228790 172383 -104323 -319861
39430 -319861 -254670 -53576 -46225 -290334 -498849 -443728 -221119 -49593 2013 -9127 -33651
39419 -33651 -34025 27181 120920 168545 163970 168717 171987 97070 -40591 -141688 -193713 -245540
39407b45540K7998K28843K82484O94l03114j98785J73999K71589l2696k84317
39397g8845j75440M1332M4471p2045o5819L3297O7779P3882J50107J78426k263
39386A94882k40097k11464Q4075K67575J07183j47661j31581J10248K10774L8369
39376B82303j21927k4169J66647J57818j6549j04225p2845j07222k17522k13798
39366b71489r8192j03170k41729k08312R4892L09286J55699j09893r2968J49988
39356d15888K63675J45136p39l7631k7527n4230j37538k39110k11673Q3255M64091
39345a68179M99211J00042k50302j44852J65004J87973p2806k21168j10859M1264
39335B5328O8377K379r6584j46990j7099K26613K48235o7821l16501j34237K25180
$$ plain form
39407 -245540 -217542 11301 293785 294479 -8635 -207420 -33421 238168 205472 -78845
39397 -78845 -254285 -212953 -168482 -240527 -306346 -273049 -205270 -131388 18719 197145 194882
39386 194882 -45215 -256679 -172604 94971 202154 54493 -77088 33160 243934 282303
39376 282303 160376 136207 302854 460672 444123 339898 267053 159831 -57691 -271489
39366 -271489 -369681 -472851 -714580 -922892 -828000 -518714 -363015 -472908 -565876 -415888
39356 -415888 -152213 -7077 -7816 -45447 -72974 -127204 -264742 -503852 -715525 -632270 -168179
39345 -168179 331032 431074 180772 35920 200924 388897 316091 94923 -15936 25328
39335 25328 93705 96084 -500 -147490 -164589 62024 310259 242438 -74063 -208300 16880
39324A6880L15114J94644J80208J89672m4114l29881k68015O840K9362j66161
39314A24549j54805K4079o4929l33326k04131L02186M34768m5772l87259n6663
39304c61303L91757K60228j74246k09387J18272J95211j23731l57373j98101J16376
39294c42297K48255J51854j7894j01770l2030Q7330N7096j33853k42285j13353
39284d38947R9310J92592J71784R9756n8799k56996k86893r7614M9698k7062j25181
39273f78352M670K40226K93869J57925N2290N5192N7741J52p8375j56293k06767
39262b57722j38626O3258K20681J63658q866l8362J42201L02957J91374j51590
39252D88963m01045l08823k1194R8473j9736n8717J47507K96083J13650j36738
$$ plain form
39324 16880 331994 526638 706846 896518 852404 522523 254508 261348 290710 124549
39314 124549 -30256 -6177 -71106 -404432 -608563 -306377 128391 82619 -304640 -361303
39304 -361303 30454 290682 116436 -92951 25321 220532 96801 -260572 -458673 -342297
39294 -342297 -94042 57812 39918 -61852 -93882 -6552 50544 -83309 -325594 -438947
39284 -438947 -339637 -147045 24739 124495 65696 -191300 -478193 -575807 -526109 -553171 -678352
39273 -678352 -673682 -433456 -139587 18338 70628 125820 183561 183713 105338 -50955 -257722
39262 -257722 -396348 -333090 -112409 51249 42383 4021 146222 449179 640553 488963
39252 488963 87918 -220905 -242099 -143626 -163362 -222079 -74572 221511 335161 198423
39242A98423o9451J51062Q0682k22948k90263m9395Q5503l7002j05577P797L9033
39231b12136p4648l0390K00303K09504r6148k25550O7861L13433J07931k10069
39221E0091j68164P4094J10208n643p66L7977j01099k41295r2391J96627K66493
39210A26132J22386K0185j0319q9853j52015j02608r0357k11509k08734R8818
39200d97874L71132K26114j05251j42044O4211R7043n4706k4083K14477K70747
39190D19766J0838k37404k29062r7944k4103Q463M3468N5144O1342Q4133L7726
39179A32367r9978j24274R2975K89014J52318j63975k59205q8240O6300J10358
39169A07660J76082K17550M6071k32317k66223q29K15077J24774j59498m00728
$$ plain form
39242 198423 128972 280034 360716 137768 -152495 -201890 -116387 -153389 -258966 -251169 -212136
39231 -212136 -286784 -317174 -116871 92633 -3515 -229065 -161204 152229 260160 50091
39221 50091 -118073 -43979 66229 60586 59820 97797 -3302 -244597 -336988 -140361 126132
39210 126132 248518 268703 258384 168531 16516 -86092 -176449 -387958 -596692 -497874
39200 -497874 -126742 99372 -5879 -147923 -83712 13331 -41375 -65458 149019 419766
39190 419766 430604 193200 -35862 -133806 -157909 -149446 -105978 -50834 10508 94641 132367
39179 132367 32389 -91885 1090 290104 442422 278447 19242 -68998 -2698 107660
39169 107660 283742 501292 547363 315046 48823 47994 263071 387845 228347 -172381
39159a72381m51172k30076J91693M87247L65073k9992k76710k01933J6138J81754
39149a20359K23396R9963j20683j91724o896J51304K0137j75374p7181J74373
39139b3044J66252p1254j33982M1080J14140m447k8843J03900Q4972j71091l07058
39128b29375r8846J90379K32483M4185j81314l17365k70895l5700J60664J03685
39118d02099j5044J41756M29615L67220n9863l15300j53017M1938m9080k11530
39108b25404j92367j18890j07736L3431L50452M64540J63243j50105m7116K41304
39098D11352K06535j50322l93383l25152j36875l037Q1402J22583J01513P9103
39088f281R9978P8925l0734r3603o553J00909P1692l8489j07987j52692j98567
$$ plain form
39159 -172381 -623553 -853629 -661936 -174689 190384 160392 -116318 -318251 -302113 -120359
39149 -120359 103037 203000 82317 -109407 -116303 35001 55138 -120236 -197417 -23044
39139 -23044 143208 71954 -62028 -20948 93192 88745 59902 163802 248774 77683 -229375
39128 -229375 -328221 -137842 94641 138826 -42488 -359853 -630748 -666448 -505784 -402099
39118 -402099 -417143 -275387 154228 521448 461585 146285 -6732 35206 -13874 -225404
39108 -225404 -417771 -536661 -644397 -610966 -260514 204026 367269 217164 170048 411352
39098 411352 617887 467565 74182 -250970 -387845 -390882 -309480 -186897 -85384 -6281
39088 -6281 93697 172622 141888 48285 41732 142641 214333 175844 67857 -84835 -283402
39077b83402j49814K2887J64285J87651K18954L03912K43921m3053k78242k15790
39067A71309j8955M4763J0788M884p7025k90329l35090p77L23904J34977l49293
39056c80844m35827N007L68153K56053j0371k5188R7374O7295n5412n4775J6503
39045a52032j6517p6880K7720K07921J79038q1718k66362j69490M8830J24958
39035a74532M1947j0522O4927J48996Q1667j20887k72727k22501j0423J86714
39025b87341K30475J18173m9691j44081p8441J15715K78508K59093Q5932o3723
39015D64619q8665p6585j33898j90476j00762R3837J68229K9471j22456o8312
39005b4998J10862J57486J6431j10349p9201L5628J30406J98238J94052J5244
$$ plain form
39077 -283402 -433216 -410329 -246044 -58393 160561 464473 708394 665341 387099 171309
39067 171309 152354 197117 207905 212789 135764 -154565 -489655 -490432 -166528 -31551 -380844
39056 -380844 -816671 -811664 -443511 -187458 -197829 -223017 -125643 -58348 -113760 -168535 -152032
39045 -152032 -168549 -245429 -217709 -9788 169250 87532 -178830 -348320 -299490 -174532
39035 -174532 -132585 -143107 -78180 70816 152483 31596 -241131 -463632 -474055 -287341
39025 -287341 -56866 61307 11616 -132465 -210906 -95191 183317 442410 528342 464619
39015 464619 375954 299369 165471 -25005 -125767 -31930 136299 165770 43314 -24998
39005 -24998 85864 243350 259781 149432 70231 105859 236265 434503 628555 643799
38995F43799k47861k88033j5678K07829N0306k62749k47927J20347L84623K70472
38985F15128j9193k23481l36009l66284j77362J98005L87944J31135l04322m45650
38975e40089k21863L6853J10166J01095J52721K19180J87211N0683j09353k12426
38965b25822k06743r5922L6901R9728R3276Q0055O8345J6377m5256r08J82631
38954B662L41266K57686o7361l52228l09747J9625K86690K27810l1641j55244
38944B19518k6850J28752P0743j40789k35756q2175J47231J74721m8564k59105
38934e2274j82478J08648K59153R4020j42548j45153K826k3661k57978l53342
38924f92787r4419K68412L61378J77990J4824J6039K1023j14465k48739j42864
$$ plain form
38995 643799 395938 107905 92227 300056 350362 87613 -160314 -39967 344656 615128
38985 615128 595935 372454 36445 -329839 -507201 -309196 78748 209883 -94439 -540089
38975 -540089 -761952 -725099 -614933 -513838 -361117 -141937 45274 95957 -13396 -225822
38965 -225822 -432565 -528487 -491586 -391858 -298582 -218527 -150182 -133805 -179061 -179969 2662
38954 2662 343928 601614 534253 182025 -127722 -108097 178593 406403 374762 219518
38944 219518 192668 321420 392163 251374 15618 -66557 80674 255395 206831 -52274
38934 -52274 -234752 -126104 133049 227069 84521 -60632 -57806 -81467 -339445 -692787
38924 -692787 -787206 -518794 -157416 20574 35398 51437 72460 -42005 -290744 -433608
38914d33608J60798L21582J24120k01592k40698N8732L04919J98950o3381j07443
38904A22379P3275J62275L9225o7453J217O3945q5262l02095k66766N0043L17295
38893A08078K61712l608j55119p7191K7864l8386j77467j51470M6037J81344J49120
38882A70914J10770J72590J75108j1271k02327j71148l0424l6588j40731r3720
38872e6827O7272M4120j80395k40966L1770L05187K41678k377n7232J01176J89601
38861D43007R0542l3694p3921j24829k31186k24050K1107K94945K48318j12155
38851B98084l40982j20722K47227K05324k45328m74008j06450M04907M22057K5585
38841C15694j86206k1843J31365L9245n0041M7352J00992o6273k00203n5300J32997
$$ plain form
38914 -433608 -272810 48772 172892 -28700 -269398 -210666 94253 293203 229822 122379
38904 122379 195654 357929 397154 329701 330918 394863 309601 7506 -259260 -209217 108078
38893 108078 369790 366182 211063 133872 161736 123350 -54117 -205587 -159550 21794 170914
38882 170914 281684 454274 629382 618111 415784 244636 214212 177624 36893 -56827
38872 -56827 10445 54565 -125830 -366796 -335026 -29839 211839 209462 152230 253406 443007
38861 443007 533549 499855 425934 301105 69919 -154131 -133024 161921 410239 298084
38851 298084 -42898 -163620 83607 288931 43603 -430405 -536855 -131948 290109 315694
38841 315694 129488 107645 239010 278255 228214 275566 376558 310285 110082 54782 187779
38830A87779J5567k81845l57500j57708J8859M8039Q4621J54518P2836j40491
38820c55325j59817J37177L81800K10422j76245k78429r707K12593J04815j04900
38810c7616q8208Q5637J33460M7023M7634J25329K0159k70651l60236m8101L04285
38799d1285K69131l3137j70760o5698n881q1279o1575J20575J92108L803j77097
38788e1095o8320J82784K12856m5480l03929l09249j02886J02355J67215J11470
38778a04279K2374o2587j54474k19953j81509m8201N8451P9677J00826J64305
38768c45370J56628K9880l5804R2335K18549Q9944j72829k41467j02997n3031
38758c64162j70982j82516O5964L34092L41055J33200o0868j43950j68076j76341
$$ plain form
38830 187779 203346 -78499 -435999 -593707 -574848 -526809 -442188 -287670 -214834 -355325
38820 -355325 -515142 -377965 3835 214257 38012 -240417 -250124 -37531 67284 -37616
38810 -37616 -125824 -40187 93273 140296 187930 313259 333418 62767 -297469 -345570 -41285
38799 -41285 227846 194709 23949 -41749 -47630 -128909 -190484 -69909 122199 126002 -51095
38788 -51095 -119415 63369 276225 230745 -73184 -382433 -485319 -382964 -215749 -104279
38778 -104279 -81905 -144492 -298966 -518919 -700428 -748629 -690178 -610501 -509675 -345370
38768 -345370 -188742 -158862 -194666 -102331 116218 206162 33333 -208134 -311131 -364162
38758 -364162 -535144 -717660 -651696 -317604 23451 156651 95783 -48167 -216243 -392584
38748c92584j48650l9262J55307L04145K04158j22274l18730j17001K43973L11874
38738H0956M5907j84234j63419k7139Q1855J61976J47520m1659k06035m0789L22580
38727A77519L82632j944l75208l43081o5978J04229J04333N4583K9k7054L8665
38716D8725J21222N7993q1271o4067N7943m287k06375j62509J44314K23234j04922
38705C0000l49344j59559J02959N3935l1267K04166M46393K18354k38248l10643
38695c3254K376J67327K8006n3372P9119J55774L3924q1116n2455J343j274j1423
38683B34975o2686k06373k61472k3353L10813L41945P4415j08496o8798n6179
38673A74791j83293k20872l4376J76697K15656J29953J0457j28689j88811m1808
$$ plain form
38748 -392584 -541234 -580496 -425189 -121044 83114 -39160 -357890 -474891 -230918 80956
38738 80956 126863 -57371 -220790 -247929 -166074 -4098 143422 101763 -104272 -145061 177519
38727 177519 560151 558207 182999 -160082 -226060 -121831 -17498 37085 37114 10060 48725
38716 48725 169947 227940 146669 82602 140545 136258 -70117 -232626 -88312 134922 30000
38705 30000 -319344 -478903 -375944 -322009 -353276 -149110 297283 515637 277389 -33254
38695 -33254 -30878 136449 164455 111083 190202 345976 379900 298784 246329 247672 246398 234975
38683 234975 172289 -34084 -295556 -318909 -8096 333849 408264 299768 230970 174791
38673 174791 -8502 -229374 -263750 -87053 128603 258556 269013 140324 -48487 -90295
38663i0295J69948J36062j28755k62256j35518m5822j47690j26074K45367N87418
38653B02385L98718j49528l78740l3825L84240L37814m2515k28197o2740Q8531
38643E16143m7354k41558j64178P0112R6313r3364j55758j5155j1149k70346l88291
38632g04585n8202L57415L15415r4479k96192o2258K59767L30126K00280N6221
38622C03508n9209j47813j44396l3935Q0696J05689M6295l8330p4262m037J27877
38611A62083J89757J38752O2040k0081j85549l48907k56217Q0854K68472J01678
38601A92882r3431k1588M8946k22882n59143m43671K8660L08582K58943K11845
38591b90857K33354L9840l02496l11256R1320L43874J11445j91037q6461K43988
$$ plain form
38663 -90295 79653 215715 86960 -175296 -310814 -356636 -504326 -630400 -385033 202385
38653 202385 601103 451575 72835 39010 423250 761064 718549 490352 427612 516143
38643 516143 468789 227231 63053 133165 229478 136114 -19644 -34799 -45948 -316294 -704585
38632 -704585 -762787 -405372 -89957 -184436 -480628 -542886 -283119 47007 247287 303508
38622 303508 244299 96486 -47910 -81845 -1149 104540 150835 112505 38243 34206 162083
38611 162083 351840 490592 552632 532551 347002 -1905 -258122 -177268 91204 192882
38601 192882 99451 77863 126809 -96073 -655216 -1098887 -1070227 -761645 -502702 -290857
38591 -290857 -57503 -17663 -320159 -631415 -540095 -196221 -84776 -275813 -362274 -118286
38581a18286L26510J08730q7350p0934Q5352K24831J89041o8140k83281q2644
38571B23829M38434O68606K69292l07709m13195m8571K42123J43841j45193l20491
38561G50966l19869k45774j81879j49241j25545p8054j0906N8246J64591L31869
38551A94404M43835L36813M6776j97157k51306j65171j5101J57216K34405J02806
38541H87520j17719j75706o5803l8729j82565k87695k10185p0731J0549Q0039
38531a71025J42553R2819k8374k5092R0646P3550r1195j02354J00403J46074j25479
38520A02526k90320k669L78250L18342m4800j42973J20055K79049P4146k12144
38510E79462k49267p9182O3804N7300o9750j90600j53204K6314J03378o4504k46574
$$ plain form
38581 -118286 208224 316954 229604 158670 244022 468853 657894 589754 306473 223829
38571 223829 662263 1330869 1600161 1292452 879257 830686 1072809 1216650 1071457 750966
38561 750966 431097 185323 3444 -145797 -271342 -349396 -360302 -302056 -137465 194404
38551 194404 638239 975052 1021828 824671 573365 408194 393093 550309 784714 887520
38541 887520 769801 594095 528292 489563 306998 19303 -190882 -261613 -251064 -171025
38531 -171025 -28472 64347 35973 10881 101527 175077 83882 -18472 81931 228005 102526
38520 102526 -187794 -190463 187787 506129 461329 318356 438411 717460 791606 579462
38510 579462 330195 251013 314817 372117 302367 111767 -41437 -15123 88255 23751 -222823
38499b22823j60774O7421J08480j3309J9849K26591K49495m0079k90886k10876
38489b66911Q988N4769k5601P439J40585J54239J1508r1096l8634P5691J49356
38478A80333J81215J37102q3061m15486n35916k11543L02721M66893J20002k86698
38468a44438k75433M8887K33313J53825P6679J00599J0350k04923j79334K02376
38458B1901M46611J48319l01723k53284J82187K85420j46184m97609l02434J05683
38448c11113K06448M5878k6127K3072J3857M638J45192K49829K6393l31982l03275
38437b57190J52390M31239J30930l60705m26700o4099K15908J63798M7877J28078
38427A61526K51977J47859j20673k40045j01716O2365L2280r9187j01026L6396
$$ plain form
38499 -222823 -383597 -316176 -207696 -221005 -201156 25435 274930 234851 -56035 -266911
38489 -266911 -257923 -203154 -228755 -221316 -80731 73508 85016 -6080 -44714 30977 180333
38478 180333 361548 498650 415589 103 -535813 -747356 -444635 22258 142260 -144438
38468 -144438 -419871 -370984 -137671 16154 92833 193432 203782 -1141 -180475 21901
38458 21901 468512 616831 315108 61824 244011 529431 383247 -114362 -416796 -311113
38448 -311113 -104665 -58787 -84914 -61842 -47985 -43347 101845 351674 378067 46085 -257190
38437 -257190 -104800 326439 457369 96664 -330036 -394135 -178227 -14429 33448 161526
38427 161526 413503 561362 440689 200644 98928 161293 193573 94386 -6640 29756
38417B9756J01915M749q9922m4706J8576o6143k06223j89543m3076J8519k0912
38406d87010M2182K10589J92754r8471k87124o7165K69671K23602j56729l44258
38396e01959j16200J81885K28239J52561J78100J98551J3510k44719k55898M431
38386a61499K15403J49276o1321j51520o4086M1178M8275K8715P8396J06192n4999
38375A74010l22255l65285o1955K57296K41004J3277n7379O0137Q9108k1222l7618
38364c0882N9605p196k69814l41293j3360L61148L57847M0153k35483k91914j56610
38353e27799J07845L38875L01123K6422j35745k6641Q1538j1659q5502L2272P4885
38342A75614j59921l32192j13086J63004K9532k44867o3608M15100M29714j53050
$$ plain form
38417 29756 131671 136420 46498 1792 20368 -45775 -251998 -441541 -484617 -466098 -487010
38406 -487010 -444828 -234239 -41485 -139956 -427080 -494245 -224574 -972 -157701 -501959
38396 -501959 -618159 -436274 -208035 -55474 122626 321177 334687 89968 -165930 -161499
38386 -161499 53904 203180 141859 -9661 -73747 -32569 15706 44421 122817 229009 174010
38375 174010 -148245 -513530 -575485 -318189 -77185 -63908 -121287 -61150 27958 6736 -30882
38364 -30882 28723 21527 -248287 -589580 -602940 -241792 116055 156208 -79275 -371189 -527799
38353 -527799 -419954 -81079 220044 246466 110721 84080 165618 153959 68457 100729 175614
38342 175614 15693 -316499 -429585 -266581 -237049 -481916 -545524 -130424 299290 146240
38332A46240n73084l20485J75524K94833O3408j20041j26472q0192k4224O0645
38322e03848J17156J23316J53640J93283J20843k4780l5966J03770J52664J7180
38312D17258r3166n1996k6075j27792j79751l8906J25298J04580k6151p0124M29
38301C3604Q4936J04401j0429k67413m49122k66250J94708M63257K91797j4781
38291A64708p2212P1150J44345J09753J00132R0715l8939k15023k31896o9779
38281E2954P6575P7565M463k1164L411l4025k14754m29300m12724n8104L50520
38270f04583M15000J34848q6271P147K09195J98879k2383j95952j53918M5981
38260e2057K31486K53010Q6967j28670k19476j48465p827J07026J20620j8855
$$ plain form
38332 146240 -426844 -747329 -571805 -276972 -213564 -333605 -460077 -540269 -564493 -503848
38322 -503848 -386692 -263376 -109736 83547 204390 179610 143644 247414 400078 417258
38312 417258 324092 272096 246021 118229 -61522 -100428 24870 129450 103299 33175 33604
38301 33604 118540 222941 212512 -54901 -504023 -770273 -575565 -112308 179489 164708
38291 164708 92496 163646 307991 417744 517876 608591 569652 354629 122733 52954
38281 52954 129529 207094 211557 190393 193804 159779 -54975 -484275 -896999 -955103 -604583
38270 -604583 -189583 -54735 -141006 -133859 75336 274215 251832 55880 -98038 -52057
38260 -52057 179429 432439 519406 390736 171260 22795 14968 121994 242614 223759
38250B23759k10920k13630J9715J83388N9498r2528M2063K32536M5062l40120
38240e1177l00651K01741M56040Q3338l61302k44504K24709M09592J85909n7993
38230E45702j18352j53723k49253k43798l7790K13119K88266J45072n7610j21412
38220B10221j3083R2564L8422j01576j60909j40400j34110j01795K4000J12153
38210a74513L2726k8684J57527L80045K39795j64846l26994j12562R2859O8153
38200A63506J4529L2025o6944k66242k56039j5643R9688K9954J25231L81720K91529
38189E33314k20027m57585j6464N15441M62950M4450j48680q5075o4357n2572
38179E11395Q9442J33496j14373l15796j19614J91858J84320J5242O1941J88719
$$ plain form
38250 223759 12839 -200791 -181076 2312 61810 -30718 11345 243881 288943 -51177
38240 -51177 -351828 -150087 305953 389291 27989 -216515 8194 417786 603695 545702
38230 545702 427350 273627 24374 -219424 -257214 -44095 244171 389243 331633 210221
38220 210221 197138 289702 328124 226548 65639 -74761 -208871 -310666 -286666 -174513
38210 -174513 -141787 -170471 -12944 367101 606896 442050 115056 2494 95353 163506
38200 163506 178035 210060 143116 -123126 -379165 -394808 -295120 -265166 -139935 241785 533314
38189 533314 313287 -144298 -160762 354679 817629 862079 713399 628324 563967 511395
38179 511395 600837 734333 619960 304164 184550 376408 560728 575970 637911 826630
38169H26630O3337j46626r8500K6538j27034l43387j97786J06262O0879k09181
38159c8868j70816J16712R9548k37342l14106K1414K53316J17313j0177J44287
38149a8719K93598J39316j62432l23402k86709j14989J09956K07956P7325o9665
38139a47765j3035O1884r4637k39302o396L36001K09305k73347l99267J1282L42781
38128b12496K00998n4785l8640P9652L3654o2502j9088R4454J70642K22511J65510
38117E79910j24805m18359k84109K17212M95683K57460j23876k37257j42524n1529
38107A67806K1129O9045j2291j44695q3093J38408J93172J1226j09127m3217l704
38096B04659n2475K0913J95100J46281j42912k59902m5824J50475J05186L3546
$$ plain form
38169 826630 889967 743341 644841 671379 544345 200958 3172 109434 170313 -38868
38159 -38868 -209684 -92972 6576 -230766 -544872 -523458 -270142 -152829 -163006 -18719
38149 -18719 274879 414195 251763 -71639 -358348 -473337 -363381 -155425 -78100 -147765
38139 -147765 -160800 -98916 -193553 -432855 -439251 -103250 106055 -167292 -566559 -555277 -212496
38128 -212496 -11498 -66283 -104923 -25271 8383 -54119 -73207 21247 191889 414400 579910
38117 579910 455105 36746 -247363 -30151 465532 722992 599116 361859 219335 167806
38107 167806 188935 257980 245689 100994 17901 156309 349481 360707 251580 208363 204659
38096 204659 152184 173097 368197 514478 371566 111664 65840 216315 321501 355047
38086C55047N2969o0246l10637l00967O4228K98618J22649o6228P6753K34440
38076D66626L3111k78069k86953j04741n7104q0335M8005K08002J65596K2419
38066A36557K889O2590P8119J15952J73207K5374l13701m12073j01128J35615
38056i6599o9312l03713o7183L31355K70646j36363k57005J3215J82620N6028
38046g6311l2451R5626J96206J25712P9608J65519J91534L2523j52736j98222
38036D27008j32582j6600J61587L51482M08699K58459l7864l51849n08363l51145
38026B08832L9767L14346K31747k7221j08616N4163K05177J22139j12088j47316
38016G80930L00739R95523J175801L82079p62707j124494m90036J72538Q8672
$$ plain form
38086 355047 408016 347770 37133 -263834 -199606 99012 221661 155433 232186 466626
38076 466626 499737 221668 -65285 -170026 -227130 -307465 -259460 -51458 114138 136557
38066 136557 139446 202036 280155 396107 569314 594688 280987 -131086 -232214 -96599
38056 -96599 -165911 -469624 -536807 -205452 65194 -71169 -328174 -314959 -132339 -76311
38046 -76311 -108762 -13136 183070 308782 388390 553909 745443 777966 625230 427008
38036 427008 294426 277826 439413 790895 1199594 1458053 1420189 1068340 559977 208832
38026 208832 248599 562945 794692 767471 658855 713018 918195 1040334 928246 780930
38016 780930 1081669 2077192 3252993 3635072 2872365 1747871 1257835 1430373 1519045
38007A519045l54397m07697r0588O9231m4395j30634r7965j00975j33422p1875
37997A56328L5544J03996K10275L24694J70490k76697n27252k48899J83738K73081
37987D05298J24579Q1432O5163j30243k84267j23007J09181P8119o447J70440
37977D90248L54979J91970m2880N1560J76636j25606m97198k95720K15005K46834
37967G65828j63051k70369L5050J18957j79765l11380p5935R8776M9167Q5305
37957A52583K20791J32821o2074M9393K67066M2438l86570k81212J99649J83000
37947E17885k84690k23666M69116P28300K00161j51512J63566L39360r4173l64305
37937A300042L9097M46340M04020M80347Q81520R00016N47759Q47162J633378
$$ plain form
38007 1519045 1164648 756951 666363 735594 691199 560565 462600 361625 228203 156328
37997 156328 191872 295868 506143 830837 1001327 724630 197378 -51521 132217 405298
37987 405298 529877 611309 676472 546229 261962 138955 248136 326255 319808 490248
37977 490248 845227 1037197 994317 1045877 1222513 1096907 599709 303989 518994 765828
37967 765828 602777 332408 367458 486415 306650 -4730 -80665 18111 67278 152583
37957 152583 373374 506195 444121 493514 760580 803018 416448 135236 334885 517885
37947 517885 233195 9529 478645 1206945 1407106 1255594 1419160 1758520 1664347 1300042
37937 1300042 1339139 1785479 2189499 2669846 3551366 4451382 4999141 5846303 7479681
37928G479681J487234J112713L613566Q859662J0762820M397491o033175j1206788
37920B0473204q143346k852329j176226k061944j802188l61540n2048q88995j021913
37911B112675k96791j43261o66842o02873J79146M74974l7172l65196m8719K48158
37901H54099J21326l3334k0657j52159m05490l48978j0324J28991L5558J13151
37891B82183L14106J82268k20223l34548p8731O7383k1832K1845K25764J56038
37881E94253k42528m72792l04068n9374L7744J26837K16526R1481j75755k40836
37871d28512q9395j7356m81K49514N89106N29671P9756k27676k19156k37212l39244
37860a10985j69435K18983K80247m1727j16019K63522M39174L48m92810m36774
$$ plain form
37928 7479681 8966915 10079628 13693194 22552856 33315676 37713167 31679992 20473204
37920 20473204 12329858 9477529 8301303 6239359 4437171 4075631 4023583 3134588 2112675
37911 2112675 1815884 1672623 1005781 402908 582054 1057028 1019856 654660 605941 854099
37901 854099 975425 942091 921434 769275 363785 14807 4483 133474 169032 282183
37891 282183 596289 778557 558334 223786 145055 212438 190606 212451 438215 594253
37881 594253 351725 -121067 -425135 -484509 -446765 -319928 -103402 -11921 -187676 -428512
37871 -428512 -517907 -535263 -535744 -286230 302876 832547 912303 684627 465471 228259 -110985
37860 -110985 -280420 -61437 218810 177083 61064 324586 763760 764108 271298 -165476
37850a65476r2577L0892L0154J89575K93733N6205k29078j49350R4413O9102j10859
37839A6734l7421K23368K56470J3188j70504j41100k6656R2120J79929Q9242j86988
37828C08382l14470q1857J79162Q6204j45249o3096K40661K87538O390k09290
37818B94375j70426p5404m8689m107K8131q5940k23578j07780J93909L02408J11685
37807B14584o9639l5057N1243J1557o7138n5187r057l5492j10722j34315n5374
37796b94597O8685P3998j42273l68833k20116K86981N80922K67718k57519l39763
37786c44797K0023K64671J48020l4435m1759Q721j2469m5479o1632j06069q3439
37775b88644J25026L25397K04676j22292k07106L3191J77328k3326k84192k81165
$$ plain form
37850 -165476 -258053 -227161 -197007 -7432 286301 342506 113428 -35922 58491 127593 16734
37839 16734 -20687 202681 459151 472339 301835 160735 134079 226199 406128 495370 308382
37828 308382 -6088 -87945 91217 177421 32172 -30924 209737 497275 503665 294375
37818 294375 123949 48545 -144 -4251 23880 -62060 -285638 -393418 -199509 102899 214584
37807 214584 144945 109888 161131 172688 105550 50363 41306 5814 -104908 -239223 -294597
37796 -294597 -225912 -151914 -294187 -663020 -883136 -596155 -15233 252485 -5034 -344797
37786 -344797 -324774 -60103 87917 53482 11723 20444 7975 -37504 -99136 -205205 -288644
37775 -288644 -163618 161779 366455 244163 37057 70248 247576 224250 -59942 -341107
37765c41107r4707M9617J25983J72272J19378k3296o9983O0386J87304J42217
37755C28064j2220j37473j68221n2140J82992K69306l7483m67011m33330J21401
37745d06115N31460L10271j77873k98665l1787J63551J01728l248m0719j45739
37735B864l15179k93127K2324L40893L29047L9144j81734j43280o665K865o3947
37724b66795J6374K38991L07193P3610j79227j20276J33106J91332k5122k02286
37714A66900j16902J06351K54353K59524J25900j11556k93973k51504o3074K7124
37704A03143k7789n6320j5506m9751j65557j78356n6754J1567j4932N1332K31597
37693a67326K69894P9472o2498K6628J26220Q664j70847j62311l1375J1068k7710
$$ plain form
37765 -341107 -435814 -386197 -260214 -87942 31436 8140 -61843 -1457 185847 328064
37755 328064 315844 178371 10150 -41990 141002 410308 372825 -94186 -527516 -406115
37745 -406115 125345 435616 257743 -40922 -72709 90842 192570 189322 148603 2864
37735 2864 -312315 -605442 -583118 -242225 86822 125966 -55768 -199048 -205713 -202848 -266795
37724 -266795 -250421 -11430 295763 369373 190146 69870 202976 394308 369186 166900
37714 166900 49998 156349 410702 670226 796126 684570 390597 139093 76019 103143
37704 103143 75354 19034 3528 -46223 -211780 -390136 -446890 -435323 -450255 -398923 -167326
37693 -167326 102568 182040 119542 146170 272390 281054 110207 -52104 -83479 -72411 -100121
37682a00121p209P9737J65864K49558K63288L1463l92604n90275k86034K05983
37672c80350L69137J53315p8403j27388j07145q8779J3235J77549K26363J13115
37662B70649N301M821L131r7121k00020j69871m3786K8665M062j295J05598K22223
37650A32357J52692r4964k34603n1516K68277L57684J66133j5605k6039k2683
37640F31733j20658j65155m5682M6496p4753k45899k00036k026O1717n9329j27265
37629c00857m359J64767K00136J16719L9081K0038K0134K954m655N1296J51463
37618D56717J68690J2817j94140k06348L9902L17601L65332J62275j00750k34650
37608G87446j93254q5278p2848j83939k49262j38480L093m8322k01519j31483
$$ plain form
37682 -100121 -107330 -27593 138271 387829 651117 682580 289976 -300299 -586333 -380350
37672 -380350 -11213 142102 63699 -63689 -170834 -259613 -246378 -68829 157534 270649
37662 270649 275950 280771 283902 186781 -13239 -183110 -226896 -198231 -194169 -195464 -89866 132357
37650 132357 285049 190085 -44518 -96034 172243 529927 696060 680455 654416 631733
37640 631733 511075 345920 300238 346734 271981 26082 -173954 -175980 -114263 -173592 -300857
37629 -300857 -305216 -140449 59687 176406 215487 235525 255659 258613 253958 305254 456717
37618 456717 625407 638224 444084 237736 277638 595239 960571 1122846 1022096 787446
37608 787446 594192 508914 436066 252127 2865 -135615 -132522 -180844 -382363 -513846
37598e13846K04319M31373K73122o5062k14973j28978k3275r234k8223m9543r0457
37587b14777q1720O8113K64508K64520j7942l59149m53669k45335L4767J47942
37577e92742R2494K9563M2008Q2172J14646J39237Q1792j13144k58597r2217K49302
37566b25486K96464l2131k14856M7494K69555m2653m89501l64884J51852K50719
37556c53427j64545l23702R3206M17301J29213k86453j66897K86678M19522J35932
37546A86828j21766j35231q7681j16238j40531q5738K5836J45664J86612P6101
37536f6144o7871l6460J08563Q5757j00684j16612R0707J24054j66645l31548
37526d76883l8573L33666K88303j1311q2012Q6431J39723K6627n837N3602j9620
$$ plain form
37598 -513846 -309527 121846 394968 329906 114933 -14045 -37320 -46554 -74777 -124320 -214777
37587 -214777 -296497 -228384 36124 300644 282702 -76447 -530116 -775451 -740684 -592742
37577 -592742 -500248 -470685 -428677 -346505 -231859 -92622 -10830 -123974 -382571 -474788 -225486
37566 -225486 70978 38847 -176009 -128515 141040 98387 -391114 -755998 -604146 -353427
37556 -353427 -517972 -841674 -748468 -331167 -201954 -488407 -655304 -368626 50896 186828
37546 186828 65062 -70169 -157850 -274088 -414619 -500357 -474521 -328857 -142245 -66144
37536 -66144 -134015 -170475 -61912 23845 -76839 -193451 -102744 21310 -145335 -476883
37526 -476883 -515456 -181790 106513 95202 13190 99621 239344 265971 260134 313736 294116
37515B94116k10957k52208o7968J35146J99563J27335o9835l28253m24609k10174
37505h07844J24178K80708K43233J76049Q6798j03287k78080k37700j7802J72047
37495c61700K46113K41628J40634n5007j88719j39617l4775m0777p8462J3230
37485b57452J65345J85205O5565m2933p1471n2771n440M7236O2403Q0826J73518
37474C50031K32663Q4069j33333o9323K39914L12707l8999l73234l00902m7790
37464B55803R164p2832p4065n6934j15374o5337J78868K94577O2430j92670j34872
37453H8758Q493q8804k25303q1609J33835P7760m5564J25163L50125J57114k71533
37442B28435l46388n3706O9820j24416k16587P398K55324K62968R1024j29412
$$ plain form
37515 294116 83159 -169049 -237017 -101871 97692 225027 155192 -173061 -597670 -807844
37505 -807844 -683666 -402958 -159725 16324 103122 -165 -278245 -515945 -533747 -361700
37495 -361700 -115587 126041 266675 211668 22949 -116668 -151443 -192220 -270682 -257452
37485 -257452 -92107 93098 158663 115730 44259 -8512 -13952 33284 95687 176513 350031
37474 350031 582694 666763 533430 464107 704021 1016728 977729 604495 303593 255803
37464 255803 264967 192135 118070 61136 -54238 -119575 59293 353870 416300 223630 88758
37453 88758 97251 8447 -216856 -298465 -164630 -86870 -132434 -7271 342854 499968 228435
37442 228435 -117953 -171659 -101839 -226255 -442842 -435444 -180120 82848 173872 44460
37432D4460k84303j84096J55641L00340l0246l96168k34395K21572L11224K1532
37422g4439r1232R0502J56930L1002N2084J80169p022m22332m48459R502K99016
37411b24279R6244j14500M3808K30837R5610j11573q6565k4862j65462k97206
37401e57948j67187N2235J04594P4523J29739J98315J91219J88751J72787l1442
37391C55586l33751l41834J6153K84913J59360q0154q7545L7661O0326J6221N397
37380I2333l8943j04294o593K16465K40555J5442q5138O3818N2534l25158n94566
37369d73545l24993J54807K97321J75369J97379L22343J97728j22542k23973k2361
37359A77533J33015L8338j41629k40221k69629k05181L3169L12804L32408M8899
$$ plain form
37432 44460 -239843 -423939 -268298 32042 1796 -394372 -628767 -407195 -95971 -74439
37422 -74439 -165671 -75169 81761 112763 164847 345016 337994 -84338 -532797 -523295 -224279
37411 -224279 -128035 -242535 -198727 32110 127720 16147 -70418 -95280 -260742 -557948
37401 -557948 -725135 -672900 -568306 -493783 -364044 -165729 25490 214241 387028 355586
37391 355586 21835 -319999 -303846 -18933 140427 60273 -27272 10389 70715 86936 92333
37380 92333 53390 -50904 -57497 158968 399523 414965 329827 393645 446179 121021 -473545
37369 -473545 -798538 -643731 -346410 -171041 26338 348681 546409 423867 199894 177533
37359 177533 310548 348886 207257 -32964 -302593 -507774 -474605 -161801 170607 219506
37349B19506j97762j22954J25898J83617m4344k65279j79108J34432L08459J49984
37339C12449j28898k05711l5103J79284K66666J83391m2110k69740k88133r9361
37329a27266J825j30088j92088R0162M15824K97251j62230m02712k47879o4614
37319e21815q2584j05028K7157J93268L10388M19583L91612N1090l48413l35356
37309i8P686J01665j66229k34729J29274L61969N7026l00735j32096K71303K53680
37298C48716j39745l16742j13523P9159O7868Q9244K49145K80171K0709k64503
37288C00499k54139j7282J08301k9796k27343k04896L5254K25954K05809J17720
37278B60081J29172J33111m3057k71723k79016q6237L8149K3514L8046J06349
$$ plain form
37349 219506 21744 -101210 24688 208305 163961 -101318 -280426 -145994 162465 312449
37339 312449 183551 -22160 -57263 122021 388687 572078 529968 260228 -27905 -127266
37329 -127266 -125441 -255529 -447617 -357455 58369 355620 193390 -209322 -457201 -521815
37319 -521815 -604399 -709427 -682270 -489002 -178614 240969 632581 683671 335258 -98
37309 -98 7588 109253 -56976 -291705 -162431 199538 256564 -44171 -176267 95036 348716
37298 348716 208971 -107771 -221294 -142135 -74267 14977 264122 544293 565002 300499
37288 300499 46360 29078 137379 107583 -119760 -324656 -289402 -63448 142361 260081
37278 260081 389253 522364 479307 207584 -71432 -157669 -119520 -96006 -57960 48389
37268D8389O9483n6923p0499L6394O5019Q170N3551J60470Q2160j32788j45478
37257A17948O7761J20611j20906k90453j41732P4226R7887N8221R9435N4184j83704
37246d6522l41556j64761J65201L01516J70365p2750k58920k23803Q1350L72068
37236a7812K81353o6052j55025J26678K98118O8682k28766k47951j35823j07687
37226a84285l4349J70731K33770k40k05876j01734Q2354O5304N140R0211Q5443
37215B06469k01208m02610j16969L70406M74533J73266q9298j58897k44851l60958
37205c50117k68407L4015K44120K15404J07068O0319M1579Q857l3416j27442k88194
37194c56214l86314k95503p8750J28434K90622L79350K93433N9223p9476K3515
$$ plain form
37268 48389 117872 60949 -9550 26844 91863 100033 153584 314054 396214 263426 117948
37257 117948 185709 306320 185414 -105039 -246771 -172545 -74658 -16437 82998 137182 -46522
37246 -46522 -388078 -552839 -387638 -86122 84243 11493 -247427 -471230 -389880 -17812
37236 -17812 263541 197489 42464 169142 467260 535942 307176 59225 -76598 -184285
37226 -184285 -218634 -47903 185867 185627 -20249 -121983 -39629 25675 30815 121026 206469
37215 206469 5261 -397349 -514318 -143912 330621 503887 414589 255692 10841 -350117
37205 -350117 -618524 -584509 -340389 -124985 -17917 42402 83981 92838 59422 -68020 -356214
37194 -356214 -742528 -1038031 -1116781 -988347 -697725 -318375 -24942 34281 -45195 -21680
37184b1680J86453J71631L255j58222k49117k37679o3673J67891J84434n1178
37174f7885j88354K6821L55121M01524J37582j54000k68174j92669j1050J18836
37164A57752N3944j29409k04087j40041j24490j73191p1971J79460K60921N3461
37154a37651j22204j9296J52495J17140l7788r7128p7409p7278l7939R8027K20028
37143a9003K27313J47375j4557k47391l22961k8746L42129K57210j93856l16406
37133a68893J07313M24584J47299k77881k28302J27350K08195m3547j99479n8219
37123C8420J80907K86482J79355o5641j65535J45405O46099P61387L59074m7169
37113B318784j14677j37513l79253n33626k97785M0884Q4016n9996j04852j02428
$$ plain form
37184 -21680 164773 336404 339659 181437 -67680 -305359 -369032 -201141 -16707 -67885
37174 -67885 -256239 -229418 125703 527227 664809 510809 242635 49966 38916 157752
37164 157752 211696 82287 -121800 -261841 -386331 -559522 -631493 -452033 -191112 -137651
37154 -137651 -259855 -279151 -126656 -9516 -47304 -144432 -221841 -299119 -337058 -239031 -19003
37143 -19003 208310 355685 341128 93737 -229224 -257970 84159 341369 147513 -168893
37133 -168893 -61580 363004 510303 232422 4120 131470 339665 296118 96639 38420
37123 38420 219327 505809 685164 619523 453988 599393 1245492 2006879 2365953 2318784
37113 2318784 2204107 2066594 1687341 1153715 855930 896814 980830 920834 815982 713554
37103G13554j80695j95771p6734o8698k21371j51001K42393M03097K923l99915
37093F7782k25543J72015J50480j27523p6471K30144K36537q2509k30404q2244
37083C2264j98j12258j62152o6697k4277o3791J9J61500K09323R8187j4205l6897
37071B0818J9124J33286J87348K8534j90889j04382K28184K62738j53877m28287
37061B597j48235K37020J79149j15565j90260j31068j94347j69268J68717M42892
37051H1632K53560o6268j5982J88176P1197j83614j07555J39472Q4518j56337
37041B88799j48126n71q7784k01933Q8677M84773L30136k23726m03970q5457Q9912
37030A30730j38406l12498j52913N7390J15965J70240K19816M8135k30966k10338
$$ plain form
37103 713554 532859 337088 260354 191656 -29715 -180716 61677 464774 467697 67782
37093 67782 -157761 14254 164734 37211 -39260 190884 427421 344912 114508 32264
37083 32264 32066 -80192 -242344 -309041 -333318 -397109 -397090 -235590 -26267 71920 57715 20818
37071 20818 39942 173228 360576 389110 198221 93839 322023 584761 430884 2597
37061 2597 -145638 91382 270531 154966 -35294 -166362 -360709 -529977 -361260 81632
37051 81632 335192 268924 252942 441118 512315 328701 221146 360618 445136 288799
37041 288799 140673 140102 52318 -149615 -60938 423835 753971 530245 126275 40818 130730
37030 130730 -7676 -320174 -473087 -415697 -299732 -129492 90324 138459 -92507 -302845
37020c02845J09155K48879j0142l49929m44968k92508l51L07022M04940K09475
37010a21272P105N6197J54217J6493j90450j68400k7399L738N2018K39378K56926
36999B78551r1861l69374j93534M3871j06021k66251M7219L84496R1619m09369
36989e90654k56260L19034L72635r3511k06886J57183K19467j91247l33450M3709
36979e59980K77823N6827j03587K9766q771l15748k81711K30423M72345R0804
36969a11809k28995K0075L07417Q8834k24041p2372K48861J90927p5652p3971
36959F9274Q7099n813k55912k32101O2670K14072P6663o1687L1635K30066K58851
36948D74817L4888k23334k20783L0521J82797N5852o4771Q2815K35394L3572l05249
$$ plain form
37020 -302845 -193690 55189 45047 -304882 -749850 -1042358 -1042709 -735687 -330747 -121272
37010 -121272 -114167 -57970 96247 112740 -77710 -246110 -273509 -269771 -217753 21625 278551
36999 278551 186690 -182684 -376218 -332347 -438368 -704619 -657400 -272904 -181285 -590654
36989 -590654 -846914 -527880 -155245 -248756 -455642 -298459 -78992 -270239 -603689 -559980
36979 -559980 -282157 -225330 -328917 -299151 -307922 -623670 -905381 -674958 -202613 -111809
36969 -111809 -340804 -320729 -13312 75522 -148519 -220891 27970 218897 143245 69274
36959 69274 156373 150560 -105352 -337453 -274783 -60711 15952 -45735 -14100 215966 474817
36948 474817 509705 286371 65588 96109 278906 334758 269987 352802 588196 621768 316519
36937C16519l01818j9924O0456j33766k08832k4751J45233J74663K13143K45458
36927D66381Q9528j49407j63293J3667N6807p7099j33874o2249k7316j1051R5270
36916I7364J27597r6009l18154j93028R1255J19980l4229k3473Q4575m052j59323
36905c07497o5599J11549R203k11453j50917P1979Q8109J2671J37169K24775m2985
36894a22996k84413j4381L56032J48623l17693k33897K40150K67382j36244j75640
36884b73077K23606L17638n0696k41222o3370K2589l703K85679O33413L10721
36874A161578m22525m89049J67857L84321k47553o88148k50699L25816K78795
36865B20393J5799J29701L29956J79985r830J86540N08807M98185J87462j70088
$$ plain form
36937 316519 14701 -5223 55233 -78533 -287365 -312116 -166883 7780 220923 466381
36927 466381 555909 406502 243209 256876 313683 236584 102710 40461 13145 2094 97364
36916 97364 224961 128952 -189202 -382230 -290975 -170995 -205224 -228697 -144122 -148174 -307497
36905 -307497 -373096 -261547 -252344 -463797 -614714 -542735 -454626 -441955 -304786 -80011 -122996
36894 -122996 -407409 -421790 -65758 82865 -234828 -468725 -228575 38807 -97437 -273077
36884 -273077 -49471 268167 217471 -23751 -87121 -64532 -68235 217444 850857 1161578
36874 1161578 739053 250004 417861 802182 554629 -133519 -384218 -58402 220393
36865 220393 236192 365893 695849 875834 866004 1052544 1561351 2059536 2246998 2076910
36855B076910m74981n66633k70380J23766J14372j68055j50425J20687M2697l68240
36845D79718m27098l2150J47161p4399j03415K20563K91922o1397k09836P3997
36835C05066J92179q7314j53120K72062N69125L40184P8809K39097N62348P25329
36825C043765P46963M74040l32325j155403j071874k15503K49665j08083m64674
36816A166571k81116o7973j93135k16165P8090J89325n2490j07211J67102J95451
36806H78449j33832j97465Q9324L9455l90389l61199K32931L98207j70322m54043
36796f8884Q1943N49870K58856j68615j03440L8026j37446j85524J37079K77168
36786F79033K7580j4996K61561J35677m30714m71222J63251L44364k53485m29703
$$ plain form
36855 2076910 1601929 1035296 764916 888682 1003054 834999 684574 805261 847958 479718
36845 479718 52620 20470 167631 93232 -10183 210380 502302 440905 231069 305066
36835 305066 497245 409931 256811 528873 1097998 1438182 1516991 1756088 2318436 3043765
36825 3043765 3790728 4264768 3932443 2777040 1705166 1489663 1739328 1631245 1166571
36816 1166571 885455 817482 624347 408182 486272 675597 623107 515896 682998 878449
36806 878449 744617 547152 636476 675931 285542 -75657 157274 555481 385159 -68884
36796 -68884 13059 562929 821785 653170 549730 587756 450310 264786 401865 679033
36786 679033 706613 691617 953178 1088855 658141 186919 350170 694534 441049 11346
36776A1346L06624O87768k6304o27646j38891M44725Q7169l87124N755M54871
36766H18293o5380p26103l01006N52773M56817k77819l76618R8677J12651l17365
36756b5080l00618J68922L08064O3838N0070K56450J47200k17182l13296j28817
36746I551k5573R576J34089J39418p9878j28106J48833K38781q9133k74446l1736
36735E1376P5385k11620k51336K07727L79487r7649l63412Q5697L92962n8262
36725B10355m46440o3040L33527k2024m33740q5730M12854K11007k32394j45312
36715b60937J32728L3997n3682K48692L26685k03820n04062J3202M92089J72126
36705C97018k31492J2424K33234k10752n33626k9452M60759J10016l12787K2145
$$ plain form
36776 11346 317970 1005738 979434 351788 212897 657622 744791 357667 363422 818293
36766 818293 752913 26810 -274196 278577 735394 457575 80957 179634 292285 -25080
36756 -25080 -325698 -156776 151288 215126 265196 521646 668846 451664 138368 9551
36746 9551 -16022 -6446 127643 267061 187183 59077 207910 446691 357558 83112 51376
36735 51376 126761 -84859 -336195 -128468 251019 153370 -210042 -124345 268617 210355
36725 210355 -236085 -299125 34402 12378 -421362 -507092 -94238 116769 -115625 -260937
36715 -260937 -128209 -94212 -147894 100798 427483 223663 -280399 -267197 224892 397018
36705 397018 165526 177950 411184 200432 -333194 -362646 98113 208129 -104658 -82513
36695h2513L70597o0408m54135L8865N52185J04351n15768k66455K14568K6019
36685g2694j65425L83931P24714m4538q07921l21246M55042J28330n33376j37986
36675c91169O35776L60388m15910k88529L24939J39322m43476k28501L41354J17234
36665A51428l80981J4511O87571L06611n84967n16240K30557L15176j22197r291
36655I2178L98021J49287l35963j08305L02300n9566n23657m4483O09116K23755
36645G02683m79623k05310M25304J74481l37303L3846N42614P3308m28269K33929
36635G35660Q89903J43004n97037M95899J906641J046979j136926j658231m48015
36626A377877Q6762m52011l73243L46561J33941p57800o04878L45108L24364m64664
$$ plain form
36695 -82513 288084 227676 -226459 -187594 364591 468942 -46826 -313281 -98713 -72694
36685 -72694 -238119 145812 870526 825988 18067 -303179 151863 280193 -253183 -391169
36675 -391169 244607 604995 189085 -99444 225495 364817 -78659 -307160 34194 151428
36665 151428 -229553 -215042 472529 779140 194173 -322067 -91510 223666 101469 92178
36655 92178 490199 639486 303523 195218 497518 437952 -85705 -130188 478928 702683
36645 702683 223060 17750 443054 617535 280232 314078 856692 930000 501731 735660
36635 735660 1625563 1768567 1171530 1667429 3574070 4621049 3484123 1825892 1377877
36626 1377877 1464639 1012628 639385 985946 1119887 362087 -242791 102317 426681 -37983
36616c7983k99665N77434M33944m57319l14055O12027M98082m86229n55575K20229
36606A90890K58976k72830K5598O74386J82006p44747l85223N22806J36724p50934
36596a62348j83951R29777L84388r23700n34454P94238M54785r38480o77437P87721
36586f9461P18163n99359n05173P62423O21119o43194m42429R04816P90191m54524
36576A082572k71200Q61885L49769j106640o84188Q28146L79011j195034o00952
36567c56631J291923Q64043j137240q43768J206982J087266p34162k93841J800335
36558B884907J252833j400311j501368P84764Q59155j206039r39061J324204R13982
36549B973066j591243j110068J694424J304341j614203j149439J964370J339128
$$ plain form
36616 -37983 -337648 239786 673730 216411 -97644 514383 1012465 526236 -29339 190890
36606 190890 449866 177036 202634 877020 1059026 314279 -70944 451862 588586 -162348
36596 -162348 -346299 583478 967866 44166 -490288 303950 758735 -179745 -857182 -69461
36586 -69461 648702 49343 -455830 306593 927712 284518 -157911 746905 1537096 1082572
36576 1082572 811372 1673257 2023026 916386 232198 1060344 1439355 244321 -356631
36567 -356631 935292 1799335 662095 -181673 1025309 2112575 1378413 1084572 2884907
36558 2884907 4137740 2737429 1236061 2020825 2879980 1673941 734880 2059084 2973066
36549 2973066 1381823 271755 1966179 3270520 1656317 506878 2471248 3810376
36541C810376k171912j508272K473043J967861k227581j507705L390447K929128
36533G155385k216114j386050M839998M553935j485709M89928R380203Q483194
36525B9814770p78760L180741J9635925K0049077M702807J9385131P8329873J13015874
36517B87335438N4911580n6283260j12240170p6113446j8049756m967470k0566182
36510E4026734j9360834k586156J051075q211645q695914J18146J323830n290197
36502A2375039n404730J250891K226767k920774l302294J580146K077167k281168
36494E601044k781592J071601J425354k080908k170754J406528J704405j619995
36486B555683j948802J243369J716777j248691j833154Q68616J528784q58832
$$ plain form
36541 3810376 1638464 130192 2603235 4571096 2343515 835810 4226257 7155385
36533 7155385 4939271 3553221 8393219 12947154 11461445 11951373 21331576 29814770
36525 29814770 29036010 32216751 51852676 71901753 76604560 95989691 174319564 287335438
36517 287335438 342247018 285963758 173723588 97610142 79560386 74592916 54026734
36510 54026734 34665900 32079744 33130819 24919174 16223260 16341406 17665236 12375039
36502 12375039 6970309 8221200 10447967 7527193 4224899 5805045 7882212 5601044
36494 5601044 2819452 3891053 5316407 3235499 1064745 2471273 4175678 2555683
36486 2555683 606881 1850250 3567027 2318336 485182 1353798 2882582 2023750
36478B023750j503401N49731J006334q56693j043101R01235J043695r68961j227423
36469g4834O74295R74878p32397q55713Q99912R37103j045058j383812M53943
36460a51683R76853n11842q42575O03481Q45678n90053p41851Q14924J069412
36451A472344n21292j025558K32798N62737o36619p95503N71684Q69600m07858
36442C22333o91930N59884Q38430m08567p06154N31576Q70126l30269p05255M27023
36432G07197P83088l52131p85089K30983O34598k86924n91886L18281N22428m67843
36422G12702o51103M34425O70598m80065q08670L84126Q72008k60392q89532R2231
36412G6328P81462K18n83290J51300O77164k4115m00396O47703J581976R70802
$$ plain form
36478 2023750 520349 1070080 2076414 1219721 176620 1077855 2121550 1152589 -74834
36469 -74834 599461 1574339 841942 -13771 886141 1823244 778186 -605626 -151683
36460 -151683 825170 313328 -529247 74234 919912 329859 -411992 402932 1472344
36451 1472344 951052 -74506 158292 721029 84410 -711093 -139409 730191 322333
36442 322333 -369597 190287 1028717 620150 -86004 445572 1315698 985429 280174 707197
36432 707197 1490285 1138154 353065 584048 1218646 931722 339836 658117 1180545 712702
36422 712702 61599 496024 1166622 686557 -122113 262013 1134021 873629 -15903 76328
36412 76328 857790 858008 274718 426018 1103182 1079067 678671 1326374 2908350 3879152
36402C879152j69897n14409n06286p50360o30219M4210J94775m74253p12475m7283
36392C12955L20286j37450l19203K18470L60332k74049m86755J35977L61866k80289
36382B12140n73231O341L18140j29368k44937L56812M88750k45784n64629N8978
36372c16788M03612q7785k49867M22782O77796r2967o26306j31739L24455l8429
36362B84764l13846J45593M25451q6889m71273q1283K69989J1981j35409J82040
36352B31118J37157m56551m58255M38604Q37220L1932o87621k97867L08232J67036
36342B51005j08609J73284L77255m7582l51905M4740L76452J4271l41369p9867
36332C07675J63229j38831l30390P9911M01763J06480j94128m7869k4063l87635
$$ plain form
36402 3879152 3709255 3194846 2688560 1938200 1307981 1352191 1546966 1072713 360238 312955
36392 312955 633241 495791 176588 395058 755390 481341 -5414 130563 492429 212140
36382 212140 -361091 -354750 -36610 -165978 -410915 -54103 434647 188863 -375766 -316788
36372 -316788 86824 -961 -250828 171954 849750 756783 130477 -1262 323193 284764
36362 284764 -29082 116511 541962 455073 -16200 -97483 172506 184487 49078 231118
36352 231118 368275 -88276 -546531 -107927 729293 761225 73604 -224263 83969 251005
36342 251005 142396 315680 692935 645353 293448 338188 714640 728911 387542 307675
36332 307675 470904 332073 1683 81594 483357 589837 395709 347840 323777 -63858
36322f3858l94433J92681M12454j47218m71319M8571M86176J16538k93255k8890
36312a42553K65276k2196k39095J78986N07041P5834m63202l59845k8859k9926
36302b58539r654L20350L85117q7014l42283J7826K28752j54566l56082Q3812
36292a72281L30589j32698m06077J47681N98016J10008m93975k25985L16501J49255
36282B21034l23279k16233J88026J58472m4154J51155L58707O397m20723k09785
36272a30383K53200K23320p3421m6593O8837j71272l48128N1993M80515J76296
36262D84364m29306l83139K20413N13856K77035n988j39747k65266k46528Q7754
36252A13448L95358K87610o76p8017r1038k97336m40967k30905L9595L78j43581
$$ plain form
36322 -63858 -458291 -265610 146844 -374 -471693 -423122 63054 179592 -113663 -142553
36312 -142553 122723 100527 -138568 40418 547459 623293 160091 -199754 -228613 -258539
36302 -258539 -268193 52157 437274 350260 7977 25803 254555 99989 -256093 -172281
36292 -172281 158308 25610 -380467 -232786 365230 475238 -18737 -244722 71779 221034
36282 221034 -102245 -318478 -130452 28020 -16134 135021 493728 500125 79402 -130383
36272 -130383 122817 346137 272716 226123 294960 123688 -224440 -172447 308068 484364
36262 484364 55058 -328081 -107668 406188 683223 677235 537488 272222 25694 113448
36252 113448 508806 796416 795740 717723 626685 329349 -111618 -342523 -302928 -302550 -446131
36241d46131o2453R1130P8542O0404J71093J55533r1013k02682o760J17803l8801
36230a73335j19177P1506J70835O730l3092K02438K70876J540j26076R4268J70113
36219E36626j38101l38274j44955J7027r4097q8424J55054J40472k16314k59043
36209d30029K04062M53071J41982j07410M3839K5269l79232m23559J75925M98034
36199B01952j428m23341L4090O54002M60463j58539k89435m4236o6272k47955
36189A19301j03667J98163K13650Q1759J20540J40146o8613j91262k9361K4216
36179E04872k11581k37182J62277L86857J05747j17876M0685J0681m43415n30522
36169c29457J27702N83126J25321m31190j75916L33757K07124j60295K0104L69062
$$ plain form
36241 -446131 -508584 -417454 -338912 -278508 -107415 48118 -42895 -245577 -252337 -134534 -173335
36230 -173335 -292512 -221006 -50171 -43441 -76533 125905 396781 398321 272245 366513 536626
36219 536626 398525 60251 -84704 -67677 -161774 -250198 -95144 45328 -170986 -430029
36209 -430029 -225967 227104 369086 261676 305515 330784 -48448 -472007 -296082 201952
36199 201952 200524 -222817 -188727 465275 925738 767199 477764 433528 367256 119301
36189 119301 15634 213797 427447 509206 629746 769892 701279 510017 480656 504872
36179 504872 293291 56109 218386 605243 710990 593114 633799 644480 201065 -329457
36169 -329457 -201755 381371 506692 75502 -100414 233343 440467 280172 300276 669338
36159F69338J05468m27094m08426k8402J2881j52224j470K20073L7557j78043
36149a50342J09104M77568L08933o726J45006L30752j04661o40788m14516J76190
36139B30520J53159l06671k99387J09257J22360k12331j58420K29486K21015j66805
36129g7817k26760Q2426J29470j35734j44843J48873K32295M3354l6518m1309
36119b6563k41926l45410O1036N32603L45619k12450k80277J11098K10960l8003
36109A16687j9329K62822J81907k51448l53683k8169J00169j19327j45680J63450
36099i2601K96314P2677p8750J7060K1679j73404k42138p3535P9670J33887K09283
36088A70142K03825k8789k37156j54093n9629k68707m09625j9401N08451M75717
$$ plain form
36159 669338 774806 347712 -60714 -89116 -76235 -228459 -229929 -9856 27701 -150342
36149 -150342 -41238 436330 745263 738537 883543 1214295 1109634 468846 54330 230520
36139 230520 383679 77008 -222379 -113122 9238 -203093 -361513 -132027 88988 -77817
36129 -77817 -304577 -222151 -92681 -228415 -373258 -224385 7910 51264 14746 -26563
36119 -26563 -268489 -613899 -552863 -20260 325359 112909 -167368 -56270 154690 116687
36109 116687 97358 360180 542087 290639 -63044 -91213 8956 -110371 -256051 -92601
36099 -92601 203713 276390 197640 214700 236379 62975 -179163 -252698 -173028 -39141 170142
36088 170142 373967 345178 108022 -46071 -105700 -374407 -784032 -803433 -294982 180735
36078A80735M6479r2587O6702j81k57883k02486J29423K38291R6434O7991R5651
36067C68569r4139k31129O2204L61877M0338n09394m07847J89301L46141l1781
36057I4140j35876K22224L49941L3374j24792P2793P4155k71208l63828P899K40742
36046A99564K50k38272j19445J3860j21714k11516K1055L05528L18465J44915
36036C12690j0446r9372p9596P2405J81652J24465J12516K66359K20231k44246
36026H56658n78642k59636K21393R1661l78610l62665N0032Q8224k14113r2887
36016e78585M36172N06199l8859l36997k3625K05708p8378l21979p1721K55801
36006d6264K02110q620m3369l033r059O1503J50039M882k30750j43147J40138
$$ plain form
36078 180735 227214 134627 201329 201148 -56735 -259221 -129798 108493 204927 272918 368569
36067 368569 274430 43301 105505 467382 507720 -1674 -409521 -220220 125921 94140
36057 94140 -41736 180488 530429 563803 439011 511804 585959 314751 -49077 -41178 199564
36046 199564 199814 -38458 -157903 -144043 -265757 -477273 -456218 -150690 167775 312690
36036 312690 302244 202872 123276 195681 377333 501798 614314 880673 1100904 856658
36026 856658 278016 18380 239773 331434 -47176 -409841 -359809 -271585 -485698 -578585
36016 -578585 -142413 363786 324927 -12070 -35695 170013 91635 -230344 -302065 -46264
36006 -46264 155846 147226 103857 100824 91765 153268 303307 308189 77439 -65708 74430
35995G4430P3826k87508k99665J19787L14067M9320j34014J6017M6137k29481
35985b57084l16691q62J99727k1412k12963j4638K36045J84910K0237m5761j50795
35974c79287k87043j42824K31470L15839j2207k30176p1401R5025O2922J38171
35964b79511L64004K63538k36613m75553j22223K40705J11116j29726J9797L19207
35954G4741K99053N0160p9857q3244q2465J3575K06281K11349n4520k45213j65758
35943A44102r0682k01035k31612m229K02237J40788k3163j00071j69541k50187
35933e83393j65759N5462J37761N5327N3655J12241q271j65714n582K56608P5752
35922a81913l44117k06077M69298O81959N2637n17574l08788J45185J05363k02710
$$ plain form
35995 74430 148256 -139252 -438917 -319130 -5063 44257 -89757 -73740 -27603 -257084
35985 -257084 -573775 -574637 -374910 -396322 -609285 -623923 -387878 -202968 -182731 -228492 -379287
35974 -379287 -666330 -809154 -577684 -261845 -274052 -504228 -575629 -480604 -417682 -279511
35964 -279511 84493 348031 111418 -364135 -486358 -245653 -134537 -264263 -244466 74741
35954 74741 373794 423954 344097 260853 178388 191963 398244 609593 555073 309860 144102
35943 144102 53420 -147615 -379227 -383456 -181219 -40431 -63594 -163665 -333206 -583393
35933 -583393 -749152 -693690 -555929 -500602 -446947 -334706 -342977 -508691 -514273 -257665 -181913
35922 -181913 -526030 -732107 -262809 419150 471787 -45787 -354575 -209390 -104027 -306737
35912c06737k27514q2726j04900j06491J55117L51659J51013j22049n5075J41814
35902b05889J15326K1999Q5070M7846k85940m94870j88133K76646L75780K43078
35892i087K55247K68556k5734l88800l85009j24048q297l6234M6744J94205K10899
35881a558J66629J58055O33l47957m58334p0590L38783K24900j68330k41253J9784
35870c79238J83719J55133J47339J19693r5676k85939j10608K63739L59940J14536
35860D72638j25179k13655k90051l33697j52395J96541M00693L18890J02776o1279
35850C15282q5082L1211J28704o020k74071k80626N7857K83008P7188k13858j43421
35839a09828J18156J15656j30792k22120m6766J42026J90508J54628N1999j15458
$$ plain form
35912 -306737 -534251 -616977 -721877 -828368 -673251 -321592 -170579 -292628 -347703 -205889
35902 -205889 -90563 -68564 16506 64352 -221588 -716458 -904591 -627945 -252165 -9087
35892 -9087 246160 514716 488982 100182 -284827 -408875 -417172 -453406 -406662 -212457 -1558
35881 -1558 165071 323126 323759 -24198 -482532 -553122 -214339 10561 -157769 -399022 -379238
35870 -379238 -195519 -40386 106953 226646 130970 -154969 -265577 -1838 358102 472638
35860 472638 347459 133804 -156247 -489944 -642339 -445798 -45105 273785 376561 315282
35850 315282 230200 261411 390115 384095 110024 -170602 -112745 170263 247451 33593 -109828
35839 -109828 8328 123984 -6808 -228928 -275694 -133668 56840 211468 263467 148009
35829A48009j95512p7089P4872P2066J8788P2597J02950n4850k07997p8821J73285
35818D8298J33557k15237m19118j74306K78265M69052K36349j32785k46820o4859
35808h7604O6462q4108k54948q2527K74228L24170J2664k03693j06418K821p8292
35797b17245j05779Q0675J98312K9095j57638n8840J57868J67072j0044j47532
35787f4056j83986j56878k9838J58500K24972J25452M2800M5209k1486j71871
35777c1182j90463m4372K2143n0255j9719J63749K24974Q0545j3594J9723l1598
35766A29951j16950Q8945M49028L53213k49335n77022j92329L08511K86445r287
35756D71170r6070j13168l12369l55807O9107M79779K88555j83909k42563P679
$$ plain form
35829 148009 -47503 -124592 -49720 22346 41134 113731 216681 161831 -46166 -124987 48298
35818 48298 181855 -33382 -452500 -626806 -348541 120511 356860 224075 -22745 -87604
35808 -87604 -21142 -105250 -360198 -442725 -168497 155673 168337 -35356 -141774 -138953 -217245
35797 -217245 -323024 -242349 -44037 -14942 -172580 -231420 -73552 93520 83476 -64056
35787 -64056 -248042 -404920 -434758 -276258 -51286 74166 116966 162175 140689 -31182
35777 -31182 -221645 -266017 -243874 -294129 -313848 -150099 74875 155420 141826 161549 129951
35766 129951 13001 101946 550974 904187 654852 77830 -114499 194012 480457 471170
35756 471170 375100 261932 -50437 -406244 -337137 142642 431197 247288 4725 12404
35746A2404p8733n00342n85657q7763M84319O48682M33483P5264k21814k47279
35736f7436K0466K36294J10090j36568j39234M801k9088j77539j33189P1385J48928
35725i1090Q8161R9754J60360R1674k8117M251R5597J1449j71472j94197o3856
35714B514L1490R5281K06041K17634K31k12754j52700J1220k7335j57163p8989
35703f4530J18242J28807L485J9057J15855O785k48615l07597j25517J7347K3704
35692c12977M6949R4769K2827j00872o0333R4206J05390l1316o2656O6383J28701
35681h929J7991r4061n5707O2443J04702R612j32038j19818J28620L44876J66054
35670D23745k89122m64398j47588K18700K43312J21061J27113R1735j54262k88498
$$ plain form
35746 12404 -66329 -566671 -1152328 -1240091 -755772 -107090 326393 401657 179843 -67436
35736 -67436 -46970 189324 299414 162846 23612 28413 -675 -178214 -311403 -240018 -91090
35725 -91090 -2929 96825 257185 348859 320742 324993 420590 432039 260567 66370 2514
35714 2514 34004 129285 335326 552960 553191 340437 187737 198957 171622 14459 -64530
35703 -64530 53712 182519 186004 205061 320916 327701 79086 -228511 -354028 -336681 -312977
35692 -312977 -266028 -171259 -148432 -249304 -309637 -215431 -110041 -141357 -204013 -137630 -8929
35681 -8929 9062 -84999 -140706 -78263 26439 36051 -95987 -215805 -87185 257691 423745
35670 423745 134623 -329775 -477363 -258663 -15351 105710 232823 324558 170296 -118202
35660a18202k4612K68154J02538k90361l22123P640K09594J63105J64778K16159
35650C76670J929l73737l32072K87383Q38259O76388j5405n17970m71002j80338
35640B90105p6764j25921K5109L74436M06304j36310o67835m81093J65397L90529
35630A63957M4275j40848J42386K84134p6712l59144q5828K47246O6982k63856
35620B2592j41450K04490J92455o9596r0554P7462O3019l4782R8745K66100Q5346
35609F73827k32155k02183Q4838J65547K637j10589j71239l13036l29852l1109
35599d63314K45829J49505k2509J41007L83514K68447M95k3582n015k40470l51974
35588H1933L3157L64585M456n17747k85289L94080M70892n5039k21711J66212
$$ plain form
35660 -118202 -142814 125340 227878 -62483 -384606 -376966 -167372 -4267 160511 376670
35650 376670 378599 4862 -327210 -39827 798432 1474820 1459415 941445 470443 290105
35640 290105 213341 87420 112529 486965 893269 756959 89124 -391969 -226572 163957
35630 163957 208232 67384 209770 493904 417192 58048 -27780 219466 286448 22592
35620 22592 -118858 85632 278087 208491 117937 195399 258418 223636 322381 588481 673827
35609 673827 441672 239489 324327 489874 492511 381922 210683 -102353 -432205 -463314
35599 -463314 -217485 -67980 -90489 50518 434032 702479 702974 679392 674377 433907 81933
35588 81933 115090 479675 484131 -33616 -318905 75175 546067 491028 269317 435529
35578D35529L13963m7900k96728j86900j84793l61484k07095K31469K49246k24079
35568b78772m12805m7224K39438J44734J40449L61991K64721k09728l19887J50022
35558C2939M13862N8155k49767k1039K03611n2365k98748l1307L35341K58696
35548F49378k4722j10379j68412l75050l63749M6169L03703K0728k94705j16100
35538d33139J89905Q7448j55751l1405K49828J90516p5949r9831M5051j0301j83738
35527b27366j16336J63054L36182L17061J98631k8200k83649k79743J5369J93071
35517B88074M6709q2119K5424K4581k93615m67108j12500L38876L03067l4033
35507C7356j27224J1283O69j35423p6895J38160J91518O0445q758L8326O0513
$$ plain form
35578 435529 749492 701592 404864 217964 33171 -328313 -535408 -303939 -54693 -278772
35568 -278772 -691577 -738801 -499363 -354629 -214180 147811 412532 202804 -117083 32939
35558 32939 446801 504956 255189 234150 437761 385396 86648 55341 390682 649378
35548 649378 624656 514277 345865 -29185 -392934 -346765 -43062 -22334 -317039 -433139
35538 -433139 -243234 -155786 -311537 -342942 -93114 97402 21453 -78378 -33327 -43628 -227366
35527 -227366 -343702 -180648 155534 472595 671226 643026 359377 79634 95003 288074
35517 288074 334783 252664 278088 302669 9054 -458054 -570554 -231678 71389 37356
35507 37356 -89868 -78585 -77916 -213339 -290234 -152074 39444 99889 91131 129457 189970
35496A89970K2948l9106j54803k45103j02481K09067K98536M7536j57467n9264
35486I833Q4231M2354R250J19353J20811q8034j62459M9354J62092l2654j42227
35475A71904P4783K07701k3556j82392P6062L04724O3993k45616j03755K07734
35465E51582J95778N7714J59729K23098p3590k83185M4322L87596J48311n3656
35455A357699P04812J821298J715112J52258j350488j607122j019673m94502k54132
35446A025262j54390k19655l51549k17639J59942L04781O4566j14654M7532K30677
35436G74873J18959j16068k14711k11747j75350k8895J52960J15278j21386k03395
35426I0518l770J80990J37560K2493M286J6431o373j1955l3617j53591k37586
$$ plain form
35496 189970 212918 173812 19009 -226094 -328575 -119508 179028 226564 69097 9833
35486 9833 94064 136418 145668 265021 385832 297798 135339 184693 346785 314131 171904
35475 171904 246687 454388 430832 248440 324502 629226 693219 447603 343848 551582
35465 551582 747360 805074 964803 1187901 1114311 831126 875448 1263044 1411355 1357699
35455 1357699 2062511 3883809 5598921 5751179 4400691 2793569 1773896 1279394 1025262
35446 1025262 870872 651217 299668 82029 241971 546752 611318 496664 544196 774873
35436 774873 893832 777764 563053 351306 175956 147061 300021 415299 293913 90518
35426 90518 86748 267738 405298 427791 432077 448508 442135 430180 396563 242972 5386
35415E386q5542J67906K22051J30462J74910K81485J25148k05512k73468o5790
35405D77036m2268k97531l54956p086K98401K11313J4339M8349J41693K2636j49263
35394C62663r5056Q6608J32250N0644M424q480n7907p9055j8768J7289l2681n0917
35382C11014J9136L2587q7949j85381j33705l2643O383K0690K0336p1048j79824
35371b80404r8338J27501J70999m5745j67877J7665K05053Q0763j35095o0276
35361a85754J94526J98907r8472k95461j57577Q0306J27312L7088K1439P6423
35351a263L0650j08491j09730J06170K60979J01216j53939q0203K59873L21205
35341F26467q9923m52252l11050K3550L4236j37197k1563K50195J32491l02332
$$ plain form
35415 5386 -80156 87750 309801 440263 615173 896658 1021806 816294 542826 477036
35405 477036 434768 137237 -217719 -224805 73596 284909 299248 347597 489290 511926 362663
35394 362663 267607 354215 486465 537109 541533 533053 475146 396091 377323 394612 361931 311014
35382 311014 330150 362737 274788 89407 -44298 -76941 -70558 -49868 -29532 -100580 -280404
35371 -280404 -378742 -251241 -80242 -125987 -293864 -276199 -71146 9617 -125478 -185754
35361 -185754 8772 207679 109207 -186254 -343831 -263525 -136213 -99125 -77686 -1263
35351 -1263 29387 -79104 -188834 -82664 178315 279531 125592 45389 305262 626467
35341 626467 536544 84292 -226758 -203208 -168972 -306169 -327732 -77537 54954 -247378
35331b47378l61790J03994L64820l1479n03742l37992K51029N51897M11836K22063
35321D23258J35767m1881k94827l28473r2339J09254J10627R4119J97262K54243
35311E67010R6341j44098k25831j41168q0515j28090j64738q5328K4224K2602
35301b59591m4087N975J72671J99423m7371k94031j88943J85028M09652L08015
35291D46741J16932N7122N1036k5583j01312p9663k4470j7054k4864m7010j74464
35280A77411l54383l30996k6264K39600J63537p9392q2926J95620L99445K97526
35270E99178M9647r3174j00267p6930n8941k4831o329n8098j50457j80548r6679
35259a97429L1987Q7181L0148o3215j03216q9188o9756l1024Q8629K59058L31053
$$ plain form
35331 -247378 -609168 -505174 -140354 -171833 -675575 -1013567 -762538 -210641 201195 423258
35321 423258 559025 517144 222317 -106156 -198495 -89241 21386 115505 312767 567010
35311 567010 663351 519253 293422 152254 71739 -56351 -221089 -306417 -282193 -259591
35301 -259591 -303678 -297703 -125032 74391 27020 -267011 -455954 -270926 138726 446741
35291 446741 563673 620795 671831 646248 544936 465273 440803 423749 398885 351875 177411
35280 177411 -176972 -507968 -534232 -294632 -131095 -210487 -293413 -97793 301652 599178
35270 599178 648825 555651 455384 378454 319513 294682 288353 230255 79798 -100750 -197429
35259 -197429 -165442 -78261 -48113 -111328 -214544 -303732 -373488 -404512 -315883 -56825 274228
35248B74228K14334J7210q1309o8062r7494k38051l26649j71113J56469L62059
35238D1622K83330P4736k2947K3329P6936M9714n6498k22368l57433k82816J6783
35227c75612K31439R5542j71385j45765J33909K24014K2139o5113J44451K54337
35217C47956k6673l45240k62754O3152K18392J87458J65438N4204k74491m86999
35207c59557k01697K83276L34894m6862k71563j17683M5187K0388N5018K12710
35197d5889J67207j44516k90406n2509J95125J27993l3988q688O3779j2263q3744
35186a17899L267N6680p2132j35199P4679K96270K25969K5695k9685o7030k83395
35175b2780m12118r3286M26435N50943J99228j26677j08712M8468P0384l7220
$$ plain form
35248 274228 488562 505772 424463 356401 258907 20856 -305793 -476906 -320437 41622
35238 41622 324952 399688 376741 400070 477006 526720 470222 247854 -109579 -392395 -375612
35227 -375612 -144173 -48631 -220016 -365781 -231872 -7858 14281 -50832 93619 347956
35217 347956 321283 -23957 -286711 -223559 -5167 182291 347729 401933 127442 -359557
35207 -359557 -561254 -277978 56916 10054 -261509 -379192 -334005 -313617 -258599 -45889
35197 -45889 121318 -23198 -313604 -366113 -170988 -42995 -76983 -85671 -21892 -34155 -117899
35186 -117899 -114632 -57952 -130084 -265283 -190604 105666 331635 357330 327645 260615 -22780
35175 -22780 -434898 -528184 -101749 449194 648422 521745 413033 461501 531885 494665
35165D94665j61066k47482k34015r3679M2514N1070L5655J15146J31579p6542
35155E7845k59300p4309K70636K34318j85197l70346j8140L95736L42946m3699
35145C50490l06183l11457k00323j6830K07951K49291j6230k75397j46480K23197
35135b41971L33134N9603j95947j29052P6544J13436n06l8098O8028J74373J47291
35124C66835j2593k05154k88676j65676R6571K78673K21189o248j96739k24192
35114a36010j26791k4357m456n4294p2057J3924J27278J20025j6104j24583j16762
35103d14187r4848j46869j59791J6K22587K75964J47063N0125R8409J75638J60798
35092C14905P3477n4066k31975l55331k21094J48800M00662K60093r7193k84119
$$ plain form
35165 494665 333599 86117 -147898 -241577 -199063 -147993 -112338 2808 134387 57845
35155 57845 -201455 -275764 -5128 229190 43993 -326353 -344493 51243 394189 350490
35145 350490 44307 -267150 -467473 -484303 -276352 -27061 -43291 -318688 -465168 -241971
35135 -241971 91163 150766 -45181 -174233 -97689 15747 15241 -22857 45171 219544 366835
35124 366835 354242 149088 -139588 -305264 -208693 69980 291169 284921 88182 -136010
35114 -136010 -262801 -287158 -291614 -345908 -417965 -404041 -276763 -156738 -172842 -297425 -414187
35103 -414187 -509035 -655904 -815695 -815679 -593092 -317128 -170065 -119940 -21531 154107 314905
35092 314905 388382 334316 102341 -252990 -474084 -325284 75378 335471 238278 -45841
35082d5841j86424M220J29615J86446J67388M1992j03781j40015j16245j83834
35072b46479k78012j48517K03010L91067J43621k69582l53615k9369K96804K87442
35062c630N6172p8586k7854M1429K2471J4823J17939K29158J71494l6464j78332
35051C28620j20999J8342L9526q9166k13999j84284r236J47169J23507m0424j01246
35040a02190P9233K72970J47298k04066k94732M9302L40737Q8429m42135n50360
35030f15514q2944L69358L09429o6388k80001k12542o1397P0688K06808K61342
35020a01161J13228j14150j34788R7049K97324K40668M1302o7419o9158j11434
35010A91461k14844k40583j43109o2525r4605j25308j5817J62029K29184J63169
$$ plain form
35082 -45841 -232265 -228045 -98430 88016 255404 297396 193615 53600 -62645 -246479
35072 -246479 -524491 -673008 -469998 -78931 64690 -204892 -558507 -587876 -291072 -3630
35062 -3630 52542 -26044 -53898 -12469 10002 24825 142764 371922 543416 506952 328620
35051 328620 207621 225963 265489 176323 -37676 -221960 -231196 -84027 39480 -944 -102190
35040 -102190 -22957 250013 397311 193245 -101487 -52185 288552 376981 -65154 -615514
35030 -615514 -698458 -329100 -19671 -86059 -366060 -578602 -639999 -569311 -362503 -101161
35020 -101161 12067 -102083 -236871 -139822 157502 398170 439472 372053 302895 191461
35010 191461 -23383 -263966 -407075 -469600 -564205 -689513 -705330 -543301 -314117 -150948
35000a50948Q4014K3373q5602j90727j30364P2711J61107J9084j10857J9214K54846
34989c4149K27617j20895m37606l87757j6855L43403M14338J94751p5029j58997
34979e1179n7851M0761L5620J2831M3123N0588j9992p1776k4104M0200L7571L6877
34967G2669R3334R7524k6509j41405j16669n0840n2096n301J62919K10061o0133
34956A83554l47745k20592J82547L12425M8434j50384q595J79351J15473k6490
34946B67978K2592J53993J09537q5915k19669k16438j20198N7240K43997K56051
34936D69168N7673j11860p9284J724m7337j02049M931J14941j0023k26455j90268
34925a18839P5354J96482L7528j21208p7814o426q8704j68634l1788J94354K15941
$$ plain form
35000 -150948 -66934 -43561 -129163 -319890 -450254 -377543 -216436 -197352 -308209 -288995 -34149
34989 -34149 193468 72573 -365033 -752790 -769645 -426242 -11904 182847 107818 -51179
34979 -51179 -109030 -68269 -32649 -19818 23305 73893 53901 -17875 -41979 -1779 35792 72669
34967 72669 166003 263527 237018 95613 -21056 -71896 -123992 -129293 33626 243687 183554
34956 183554 -164191 -384783 -202236 110189 158623 8239 -356 178995 294468 267978
34946 267978 290570 444563 554100 468185 248516 32078 -88120 -30880 213117 469168
34936 469168 526841 414981 335697 337421 290084 188035 192966 307907 297884 71429 -118839
34925 -118839 -43485 152997 190525 69317 -8497 -14923 -103627 -272261 -304049 -109695 106246
34914A06246K7143j09304r2995r1237j65974j04638J97325M31357K47707j89051
34904B56579l58190r7550J88975J45857n8691r9316k5734p4382j62001j4088K75233
34893b3308K87145n1863k92334j34824J15874M8988k18116k65484k7535J68996
34883c92461J40996M3539J6220j4251p8857k1581K06078L40903J46565j84109
34873B03042k44732J0942J98077N5734k00001k27431l8582R9441Q4311K6029l2746
34862f5916j38633k00248o5467J46618J34426q5152j36798R8535K29654j3865
34852i6846k77799j12871K76713L03395j24404m80822l68597L0559L03325K69161
34842b78186L5424j53973r5549J48579K58710R4130m0561J32666L37515J38872
$$ plain form
34914 106246 133389 24085 -68910 -160147 -326121 -430759 -233434 197923 445630 256579
34904 256579 -101611 -199161 -10186 135671 76980 -22336 -48070 -122452 -284453 -298541 -23308
34893 -23308 263837 211974 -80360 -215184 -99310 -50322 -268438 -533922 -561457 -392461
34883 -392461 -251465 -207926 -191706 -205957 -284814 -306395 -100317 240586 387151 203042
34873 203042 -41690 -30748 167329 223063 23062 -204369 -242951 -143510 -59199 -33170 -65916
34862 -65916 -204549 -404797 -470264 -323646 -189220 -274372 -411170 -312635 -82981 -96846
34852 -96846 -374645 -487516 -210803 92592 -31812 -512634 -881231 -850672 -547347 -278186
34842 -278186 -242762 -396735 -492284 -343705 -84995 9135 -31426 101240 438755 577627
34832E77627k94832l98510j22754J6288j27606o3575M01028O55328J99707m77585
34822C65116n48408k3528L50757J97420j12352j74291q0891q1916j42123r4159
34812c44375J7165J5090q1254n2157J65320L05886J22971j87654j77164J93909
34802b2263M02222R2363l44105l12607Q2127K07922j00113l24937j39375J18422
34792c40344R1851k6613N0489J47018k1042k76503k58052l0476N9502k3665j6914
34781f44749J33503K15949J64086J19161R0657n8456k57101k28914O3026L02628
34771a00210K72915J28927O5453j0484k35497m17758k34070K35822M86484K20437
34761D12019k28996l33794q0740Q1691k7604p0751J70313L39770P1215l27339
$$ plain form
34832 577627 282795 -115715 -238469 -222181 -349787 -413362 -12334 642994 842701 365116
34822 365116 -183292 -206820 143937 341357 229005 54714 -26177 -108093 -250216 -344375
34812 -344375 -327210 -312120 -393374 -445531 -280211 25675 148646 -39008 -216172 -22263
34802 -22263 379959 472322 128217 -184390 -102263 105659 5546 -319391 -458766 -340344
34792 -340344 -248493 -275106 -224617 -77599 -98641 -375144 -633196 -663672 -604170 -627835 -644749
34781 -644749 -511246 -295297 -131211 -12050 78607 20151 -236950 -465864 -402838 -100210
34771 -100210 172705 301632 367085 356601 121104 -296654 -530724 -294902 191582 412019
34761 412019 183023 -150771 -231511 -149820 -177424 -248175 -77862 261908 333123 5784
34751E784k78230J55550L56520J11218j34396p4833J2756j32811k64322q9559
34741c32323J93814K14908j5785k06896k05040m6780J70264K55368M2346k70088
34731b00212k34173J84931M62811K85951J6193M5411J61518J7277k02747j42016
34721C94944M7477j1512k17401j89382J4395O904k05866k28624K6825K19639J73060
34710C0459O9273J3319j08261k65630k28573L4471K66605K94154J78341P717j43121
34699A48754j13476J30927K78162N4692k83213k86818k2866P3183m2434m983K27822
34688A59750K61437k6609k63776k20131j14767j18588q9080J5633j0833j56496
34678e63460j04903J74446K95587J46205J17816L52166L87985k5045l70918j64728
$$ plain form
34751 5784 -272446 -116896 239624 350842 216446 141613 154369 21558 -242764 -332323
34741 -332323 -138509 76399 60614 -146282 -351322 -398102 -227838 27530 69876 -200212
34731 -200212 -434385 -249454 213357 499308 515501 560912 722430 739707 536960 394944
34721 394944 442421 430909 213508 24126 38521 45425 -160441 -389065 -362240 -142601 30459
34710 30459 99732 113051 4790 -260840 -489413 -454942 -188337 105817 284158 291875 148754
34699 148754 35278 166205 444367 499059 215846 -70972 -93838 -20655 -63089 -68072 159750
34688 159750 421187 394578 130802 -89329 -204096 -322684 -411764 -396131 -406964 -563460
34678 -563460 -668363 -493917 -198330 -52125 65691 417857 805842 780797 409879 245151
34668B45151K31372K23177l0543K7038L22327K66855k18872n55561m26495j85465
34658a01016j86860k65106j25567J60086L14472K39747L5807j67463k48146j33876
34648d77922P9745J95110J64242J23400J34785Q2742q9677k16955j16401J41623
34638B0692K87809J51259j49761l08924j43422J67768K30911r4908m68004m47160
34628g53740l6470L41903L89066K16320N9738m1156j41796j70693l1248J64532
34618c544J91517L9458n5091L7907J36396K0146k22123l05201j52877J6861L5148
34607b61403K270O1488J32465M7677j51518k53302j69191q152J28439K42765L11197
34596H2735K41148L2009j56204j85530j03540n1993q2940j30676j15021k0728
$$ plain form
34668 245151 476523 699700 669157 696195 1018522 1285377 1066505 510944 84449 -101016
34658 -101016 -287876 -552982 -678549 -518463 -203991 35756 71563 -95900 -344046 -477922
34648 -477922 -398177 -203067 -38825 84575 219360 302102 212425 -4530 -120931 20692
34638 20692 308501 459760 309999 1075 -142347 25421 256332 161424 -306580 -753740
34628 -753740 -790210 -448307 -59241 157079 216817 175661 33865 -136828 -168076 -3544
34618 -3544 187973 227431 172340 210247 346643 366789 144666 -160535 -313412 -296551 -261403
34607 -261403 -259133 -197645 -65180 -17503 -169021 -422323 -591514 -599666 -471227 -228462 82735
34596 82735 323883 355892 199688 14158 -89382 -141375 -224315 -354991 -470012 -490740
34586d90740R1778J29190N5339n1043p0688J8498J15261J03243l8032j99940k05352
34575e42486K0352K97642L27998O5587j85162j77066o0618r8556j97209n7881
34565f07399K65645L58861O9334k38139k21325k5851L6388l685Q5340K60871K46445
34554B26485p64k03529j87425r8988j02866j13141Q464J72044J87968P5855K7745
34543h152R4615J26195N1549K142N4879N6289j15785k75475j67531J05335J91121
34532A15182J6238j15263k2167Q3652n676j32002o4763Q2138M2960j42703j91961
34521c34365k0833J75638K45635K09486R7507o9045j49853j3430J95273J81772
34511E17785p1642k63129k02317l3335M2489K8684K0432K9108K3964L15n7187
$$ plain form
34586 -490740 -398962 -269772 -214433 -265476 -336164 -317666 -202405 -99162 -137194 -337134 -542486
34575 -542486 -522134 -224492 103506 169093 -16069 -193135 -253753 -352309 -549518 -607399
34565 -607399 -341754 17107 86441 -151698 -373023 -398874 -362486 -366171 -280831 -19960 226485
34554 226485 225721 22192 -165233 -264221 -367087 -480228 -471764 -299720 -111752 -35897 -8152
34543 -8152 86463 212658 264207 266349 321228 377517 261732 -13743 -181274 -75939 115182
34532 115182 131420 16157 -6010 77642 71966 -60036 -124799 -42661 299 -142404 -334365
34521 -334365 -355198 -179560 66075 275561 373068 304023 154170 140740 336013 517785
34511 517785 446143 183014 -19303 -52638 -10149 18535 38967 68075 92039 92354 35167
34500C5167j45173j65783m6669P9103K6939j19294j01975Q7712J88217J19759
34490d1997J11375K49561K59405l3181l29167k55172P5915K27979M2851k25089
34480H2480l14872k26223q9645N110K7053R120M1121J38024J58492N80j76941
34469c45701j26286J07958K05176K9547j46980l9682J98260J69101j73563m08065
34459e30235k22640J40097K40341O9946L50J58454K41137M9858j62630j10228
34449a25550O5579O4514o8648p1488N1460O1846n8867q1434L3210M2182j48760
34438b35956k90431j63253J09024K64697K33929J35209Q1894R1926J01320L1738
34428C60097q6796j11930j0860L1931r8694k02598n7572J83412K08129M2798l6210
$$ plain form
34500 35167 -110006 -275789 -322458 -243355 -216416 -335710 -437685 -349973 -161756 -41997
34490 -41997 69378 318939 578344 545163 215996 -39176 36739 264718 307569 82480
34480 82480 -232392 -458615 -548260 -543150 -516097 -506977 -465856 -327832 -169340 -168760 -345701
34469 -345701 -471987 -364029 -158853 -129306 -276286 -315968 -117708 51393 -122170 -530235
34459 -530235 -752875 -612778 -372437 -302491 -302141 -143687 97450 147308 -15322 -125550
34449 -125550 -59971 4543 -64105 -135593 -84133 -22287 -81154 -162588 -129378 -87196 -235956
34438 -235956 -526387 -689640 -580616 -315919 -81990 53219 135113 227039 328359 360097
34428 360097 273301 161371 150511 182442 83748 -118850 -176422 6990 215119 257917 221707
34417B21707K068l8447j17119M817K37879J89728j71310l80568j85890Q5106J00413
34406e1616J1645P0026J59166O1819j21719j66066q9399l4295J158N8938O6090
34395c4253N720Q229P5935l570k57179l55799j07792J84132J61770o7058j59749
34384e49614m7400R9049J93376K30068J51549k4821j43145j65769k34504l10323
34374h01534j20391L09737N04175K31703r1071p0015N5242o8283k38454j15663
34364d04554R9177L4905j48606q9664O2198l1356j53797J07490M90559L92411
34354C58763p4121k41595l5051k5676l11388l23552P5916K72874j2538k26174
34344e42542K1493K98076J81020k6601L2465Q9447j42004l09805m5694L00904
$$ plain form
34417 221707 223775 185328 68209 73026 310905 500633 329323 -51245 -237135 -152029 -51616
34406 -51616 -39971 30055 189221 251040 129321 -36745 -126144 -160439 -159281 -100343 -34253
34395 -34253 -28533 -20304 55631 52061 -205118 -560917 -668709 -484577 -322807 -389865 -549614
34384 -549614 -597014 -497965 -304589 -74521 77028 52207 -90938 -256707 -491211 -801534
34374 -801534 -921925 -612188 -108013 123690 32619 -37396 17846 -50437 -288891 -404554
34364 -404554 -305377 -270472 -419078 -508742 -446544 -477900 -631697 -524207 -33648 358763
34354 358763 284642 43047 7996 -17680 -329068 -652620 -576704 -303830 -316368 -542542
34344 -542542 -521049 -222973 -41953 -68554 -36089 53358 -88646 -398451 -444145 -143241
34334a43241K42574j1220q598R4922q8638l21407r8540L67902L84942q8800l67101
34323c7205j19394K23121K48774P0156j05082k85226l87126j88235J96223L06963
34313g7031L6973j61332n787J78860N8263j51845j10666N7346L4453j21215j23635
34302c85616K3924Q3450K8218M7119J70696K28400J45125O862j22606k08217j46569
34291a29214P8252K26181P5652j99773k37977k9393Q5640l4543j42106l5386J44861
34280a97806J89465J13940K9107m1059o7512K9160J86519J91865J8061p8753K3798
34269C96785P2209j40101l72183k87439M978J45177J07567J53489K67864J27368
34259D75714k98298n60070l28656J61983M73061M79551L23422J13203p4600r6887
$$ plain form
34334 -143241 99333 88113 79515 174437 85799 -235608 -334148 33754 418696 329896 -37205
34323 -37205 -156599 66522 315296 385452 280370 -4856 -391982 -580217 -383994 -77031
34313 -77031 -40058 -201390 -207177 -28317 29946 -121899 -232565 -175219 -140766 -261981 -385616
34302 -385616 -361692 -278242 -250024 -202905 -32209 196191 341316 348178 225572 17355 -129214
34291 -129214 -50962 175219 250871 51098 -186879 -216272 -130632 -165175 -307281 -342667 -197806
34280 -197806 -8341 105599 134706 93647 26135 55295 241814 433679 451740 372987 396785
34269 396785 468994 328893 -43290 -330729 -325751 -180574 -73007 80482 348346 475714
34259 475714 177416 -382654 -711310 -549327 -76266 403285 726707 839910 765310 668423
34249F68423P3167J85658o365l73699n39787l47174p390J92599J64898N638j42747
34238a26779j78632q3850P5948K06105K30131J11780q4668j74624l4567J85417
34228A26261K06201J5731r5739J6388J19945o832k01811j89040k8887J7133n1906
34217g2556j00J99807K99006J92813P7193P6037J5504k42050m80769m03097q2815
34206d21027J20627N9150m6936O993J03467L3978j19738p4535K06176L97644K42249
34195E08048j03274l06124k81857j71759l4062J55409K65552J14024j69330k26814
34185b50187o328J35408L549j24902Q459J94227J29955m1579J8831K44019K51027
34174E62479l5460k69493k10409n772J04621O5335p2171k35881k86506j28551
$$ plain form
34249 668423 741590 927248 920883 547184 7397 -339777 -347167 -154568 10330 15968 -126779
34238 -126779 -305411 -389261 -313313 -107208 122923 234703 150035 -24589 -59156 126261
34228 126261 332462 348193 252454 268842 388787 381955 180144 -8896 -37783 -20650 -72556
34217 -72556 -72656 127151 426157 618970 696163 772200 787704 545654 64885 -338212 -421027
34206 -421027 -300400 -241250 -288186 -281193 -177726 -143748 -263486 -338021 -131845 265799 508048
34195 508048 404774 98650 -183207 -354966 -389028 -233619 31933 145957 -23373 -250187
34185 -250187 -256515 -121107 -117558 -242460 -234001 -39774 90181 48602 67433 311452 562479
34174 562479 527019 257526 47117 41345 145966 211301 139130 -96751 -383257 -511808
34164e11808Q7039J05629n9156j49035q0602m6160j26228j17197J06729L37131
34154d53658L32981J61336L3541j6596p4560j12087m8920M0007Q661j04326j12407
34143c46028K2548J21020O1027m1597k5696O1642M8764p0253r7615P1634K64213
34132F9659K57339Q4671n1040r5809j57168k27004j61060J5881P1808m5632p4771
34121c13126J21855K76237J37588q9312o9747J11757J24731m1309j22627r6850
34111C9197j77570l17479k18619R7011K27770M6730p3199R1272K17804J4755k38385
34100b90713j57177P5933J4284k83296l29128L893K92938K40756P3943Q0088J37466
34089a41013j314k23492k10381L5943J70880L2210j18982p707K44852L28006J99780
$$ plain form
34164 -511808 -424769 -319140 -378296 -527331 -607933 -654093 -780321 -897518 -790789 -453658
34154 -453658 -120677 40659 74200 57604 -16956 -129043 -177963 -137956 -129295 -233621 -346028
34143 -346028 -323480 -202460 -141433 -183030 -208726 -147084 -98320 -168573 -266188 -194554 69659
34132 69659 326998 411669 360629 264820 107652 -119352 -280412 -264531 -192723 -238355 -313126
34121 -313126 -191271 84966 222554 133242 63495 175252 299983 258674 136047 39197
34111 39197 -138373 -455852 -674471 -577460 -349690 -302960 -376159 -284887 -67083 -52328 -290713
34100 -290713 -447890 -371957 -357673 -640969 -970097 -966204 -673266 -432510 -358567 -278479 -141013
34089 -141013 -142327 -365819 -576200 -540257 -369377 -337167 -456149 -463856 -219004 109002 308782
34078C08782P5053K8313q4075k68953k79944j1522K50760J99267o8734k36542
34068h7595k16538j39902m1960J15297J97693M0383j88498j40060J63267L03979
34058F066R0976j68782j75927n5170l7657m9821P7332K29002J73154l7684j43166
34047i1677o7213M1227R1187J09673O8478q1277k13382j22799J54429L41774K78568
34036E08988O7142j61189l77912m81963k77451J84104M72931K71157j45797k37833
34026a77823M7637K21852J4277k15252o3503K55284K37276j11116k86259q3073
34016a60700J17970J651j98132j44558L7942K2441j42344j31684R2394K15300
34006b89720N7625j90571k52550m9045K92776N09319L36969j85140o09527n33995
$$ plain form
34078 308782 383835 412148 328073 59120 -220824 -232346 18414 217681 148947 -87595
34068 -87595 -304133 -444035 -485995 -370698 -173005 -132622 -321120 -461180 -297913 6066
34058 6066 97042 -71740 -247667 -302837 -340494 -390315 -312983 -83981 89173 51489 -91677
34047 -91677 -158890 -117663 -26476 83197 151675 70398 -142984 -265783 -111354 230420 508988
34036 508988 576130 414941 37029 -444934 -722385 -538281 -65350 205807 60010 -177823
34026 -177823 -130186 91666 105943 -109309 -172812 82472 319748 208632 -77627 -160700
34016 -160700 -42730 -41079 -239211 -383769 -345827 -323386 -465730 -597414 -505020 -289720
34006 -289720 -232095 -422666 -675216 -724261 -431485 77834 414803 229663 -379864 -913859
33996i13859j03030K09276K32960J89382K07667J58485O841o4834J849J7500j09685
33985a67448k11685j67495p3821J0527J74488L65267L22067q53k54854j80597
33975a84404P490o732j32894o5633J81439K81713Q8125j69142k09550l5879J17972
33964a27495Q1763o0753r1337L0970Q8142n1946j61355J9326K95673K44991r5525
33953A72454k26156K6514K04223n2366m10382l55561L4196K57064J28986o1956
33943b82984n1971J04192K13693J60845l7198k13026j62439P3505J71935n4808
33933g8256l62584l95392j43678J33548K84505L19766K36404N4143p0800j1829
33923c4173J24890J61982J08573O3659J634j23737k00133j24197k3224o1366j41965
$$ plain form
33996 -913859 -1016889 -807613 -574653 -385271 -177604 -19119 -12278 -77112 -75263 -57763 -167448
33985 -167448 -379133 -546628 -620449 -609922 -435434 -70167 251900 251047 -3807 -184404
33975 -184404 -176914 -183646 -316540 -382173 -200734 80979 169104 -38 -209588 -245467 -127495
33964 -127495 -45732 -106485 -197822 -166852 -78710 -130656 -292011 -272685 22988 267979 172454
33953 172454 -53702 -27188 177035 124669 -285713 -641274 -607078 -350014 -221028 -282984
33943 -282984 -334955 -230763 -17070 143775 106577 -106449 -268888 -195383 -23448 -78256
33933 -78256 -440840 -836232 -979910 -846362 -561857 -242091 -5687 48456 -22344 -34173
33923 -34173 90717 252699 361272 424931 426565 302828 102695 -21502 -44726 -106092 -248057
33912b48057o0744J43418K44598J57181j6139j69403k20602q3070J69848K60477
33902A77507O6643j38150o4654J55733K12872J02665K1130l9918j85463k62380
33892D5985p1959J64927N1158l11809m02035p0086K45383K05001M620m4051M6209
33881a36657J21686J61318J61884N0798j04818r0631Q3332J01794j71684m19954
33871b42932l13424K2309K27489J94558Q2092l292q6627j63906j63217n0171J22005
33860c75116K33377J63886n2701j71018j5851K09702J60936j09780j95965J7553
33850a34977J58122r524j80080l7573J80045P2579k25526k37831Q4477K94806
33840c5482J67631L077P6848K01894R2761j35609j61536Q219M0217j93987l82078
$$ plain form
33912 -248057 -308801 -165383 79215 236396 220257 50854 -169748 -252818 -82970 177507
33902 177507 244150 106000 41346 197079 409951 512616 533746 493828 308365 45985
33892 45985 -25974 138953 190111 -121698 -523733 -593819 -348436 -143435 -138815 -182866 -136657
33881 -136657 -14971 146347 308231 359029 254211 163580 246912 348706 177022 -242932
33871 -242932 -556356 -534047 -306558 -112000 -29908 -33200 -119827 -283733 -446950 -497121 -375116
33860 -375116 -141739 22147 -30554 -201572 -217423 -7721 153215 43435 -152530 -134977
33850 -134977 23145 13621 -166459 -204032 -23987 48592 -176934 -414765 -330288 -35482
33840 -35482 132149 135226 212074 413968 506729 371120 209584 217803 258020 64033 -318045
33829c18045j91863K51201M89668K86847j08115k80547j17713J26851J72345O595
33819C17224j62697j71666o3092j569o5603j56976j27756L7023K09133K67067
33809H1088J91489K5750j68765l04358l00719j58813M9572K49884L52534K41910
33799B59572o9691l29468k93903o8545M1768m6L7936J77069J56594m2376n9831
33788a90921K13065L25338l9761m68716l90909P0488L43469K56343Q8569l6850
33778A70115k18071l40609j76440J20370J80764N5348J11215L21137K81601l3231
33768D72199j95455q7200n9368j86442q3462K98706M26280P0477k54335j49652
33758B51748M5600k9506r1172J53340L27310M1828k99205j30290K61822J87825
$$ plain form
33829 -318045 -509908 -258707 230961 517808 409693 129146 11433 138284 310629 317224
33819 317224 154527 -17139 -80231 -81800 -147403 -304379 -432135 -395112 -185979 81088
33809 81088 272577 298327 129562 -174796 -475515 -634328 -584756 -334872 17662 259572
33799 259572 189881 -139587 -433490 -502035 -460267 -460313 -422377 -245308 -88714 -131090 -190921
33788 -190921 22144 347482 307721 -160995 -551904 -481416 -137947 118396 206965 170115
33778 170115 -47956 -388565 -565005 -444635 -263871 -208523 -97308 223829 505430 472199
33768 472199 276744 189544 130176 -56266 -139728 158978 585258 655735 401400 251748
33758 251748 297348 267842 176670 330010 657320 699148 399943 269653 531475 719300
33748G19300k83315m68276j93288O4561P3272P1825J16686q407j88857o1011K19955
33737F2445R3863l66971l81633K67366P18002K85161m82344o41296j97330J18788
33727e23949M6169j3409J49788K46963J06449j2432P7243J30235j05702m09657
33717c08302l65070J2284K51663Q0026j70248k2711M12526N21996P4339l66473
33707A20030k16698K51972L06680j36877m16804j83086J03428N5j88108K0710
33697c38698M27088M51005M5734k78162k47438r6022l6554K2626J26966R6252
33687A72797j13805k29583o6190J56714J41365m9043j17817K6983J84801J61534
33677B67756r735j39255q4778R8899J91020M9453j75356j95218K3076J84061O0439
$$ plain form
33748 719300 435985 -32291 -225579 -161018 -87746 -15921 100765 92358 -96499 -157510 62445
33737 62445 156308 -210663 -592296 -324930 393072 678233 195889 -445407 -642737 -523949
33727 -523949 -477780 -491189 -341401 -94438 12011 -421 76822 207057 101355 -308302
33717 -308302 -673372 -661088 -409425 -329399 -499647 -522358 -109832 412164 486503 120030
33707 120030 -96668 155304 461984 325107 -91697 -274783 -171355 -171300 -359408 -338698
33697 -338698 88390 539395 585129 306967 59529 -36493 -73047 -50421 76545 172797
33687 172797 58992 -170591 -236781 -80067 61298 12255 -105562 -78579 106222 267756
33677 267756 258021 118766 33988 132887 323907 373360 198004 2786 25862 209923 270362
33666B70362j98830k83961j19026J05793K04138J49326K4843m9550L803J05232
33656B12130N6539j84131l65988k52622K4606J39852M5510K358J22625J85987
33646a3134L6660j14141j5893J85630J43467j39622k82855r8037J14939J9236
33636a63750k34787k18515J23060L51630J55383j91230k18387O4297K11335K4598
33626i6366j76208r0188J02868Q9382l2436N8812L07674L15070j5777k97702k48338
33615h3209o8993l2738n3464M6324J40764L6371j15740m5236J34422P2492k14929
33604a83936l12195k6970L31611M05953K00165q2208l03664l46473r9059L01575
33594a15201M56155J68359k55629l92556k24287m6294m410P210O9138J24733J28926
$$ plain form
33666 270362 71532 -212429 -331455 -225662 -21524 127802 152645 103095 106898 212130
33656 212130 268669 84538 -281450 -534072 -509466 -369614 -324104 -321746 -199121 -13134
33646 -13134 23526 -90615 -106508 79122 222589 82967 -199888 -297925 -182986 -163750
33636 -163750 -398537 -617052 -493992 -142362 13021 -178209 -396596 -332299 -120964 -96366
33626 -96366 -272574 -362762 -259894 -170512 -202948 -144136 163538 478608 462831 165129 -83209
33615 -83209 -152202 -184940 -238404 -192080 -51316 -14945 -130685 -175921 -41499 30993 -183936
33604 -183936 -496131 -523101 -191490 214463 414628 332420 28756 -317717 -416776 -115201
33594 -115201 340954 509313 253684 -138872 -363159 -409453 -413863 -406653 -337515 -212782 -83856
33583h3856R6986J5611j12724j67531m9924J01738O0627j20251j39070R2661K75296
33572c0437J54963q3729q3171J56285K72032N3231k75720l66366j73961N6049
33562c20824J36207J16848J23925J55203J15988l396q4895l5857P5941R6132j8052
33551C57220j32853j05065K9514J05205N1512k9516m4883n6531j46099k24961
33541a96457j37199Q1044K17880J73294N9477k0905j06063k02850j77949L1229
33531b78499K45431K52710Q5947o1970j04258r0293o3351m2278n7975p2663J8411
33520a68788J65748J25821j54359l23665r8867K40389K22588q6978k05989k9115
33510c13215M9631j16085j40545J90994M73153L15828q444k5767J54869O2782
$$ plain form
33583 -83856 13130 28741 -83983 -251514 -301438 -199700 -139073 -259324 -398394 -305733 -30437
33572 -30437 124526 40797 -42374 113911 385943 439174 163454 -202912 -376873 -320824
33562 -320824 -184617 -67769 56156 211359 327347 323951 239056 203199 279140 375272 357220
33551 357220 224367 119302 148816 254021 305533 276017 231134 174603 28504 -196457
33541 -196457 -333656 -252612 -34732 138562 198039 177134 71071 -131779 -309728 -278499
33531 -278499 -33068 219642 305589 243619 139361 49068 -14283 -56561 -114536 -187199 -168788
33520 -168788 -3040 122781 -31578 -355243 -454110 -213721 8867 -78111 -284100 -313215
33510 -313215 -263584 -379669 -520214 -329220 143933 459761 451317 425550 580419 643201
33500F43201l08516m66538k01192J13306J17347n3018q8217P145J6179q0520p4888
33489c75711J22999L22965L00593Q5807r4501j18856r0205j17324j16603K8945
33479e1891K07043J87613j3068j13525K1450J67719O6025k10661l65436k44306
33469c49037L3877K38882K30231N9240q7144j07360j14605k16932k59259m1620
33459f13727K61449K60297l9145j93384j0735J51400n247k42585k24524m4333
33449g00534N0592J07572K32317K32721l3823k43716n1098K90964K98822M0710
33439B24527m3030O6245J5663j65200q4344K13460K10920j70578l49928l4681
$$ plain form
33500 643201 334685 -131853 -333045 -219739 -102392 -155410 -243627 -236482 -220303 -300823 -375711
33489 -375711 -252712 70253 370846 456653 362152 243296 153091 35767 -80836 -51891
33479 -51891 155152 342765 329697 216172 237622 405341 471366 260705 -104731 -349037
33469 -349037 -315160 -76278 153953 213193 126049 18689 -95916 -312848 -572107 -613727
33459 -613727 -352278 -91981 -131126 -324510 -335245 -183845 -189092 -431677 -656201 -700534
33449 -700534 -649942 -542370 -310053 -77332 -111155 -354871 -405969 -115005 183817 224527
33439 224527 181497 247742 263405 98205 13861 227321 438241 267663 -82265 -116946
$$ [...]
##END NTUPLES=NMR SPECTRUM
##END=
