##TITLE=31Pdec_63-2021
 CDCl3, 24 sc
 4.08.2021
##JCAMPDX= 6.0         $$ Bruker NMR JCAMP-DX V2.0
##DATA TYPE= NMR SPECTRUM
##DATA CLASS= NTUPLES
##ORIGIN= UXNMR, Bruker Analytische Messtechnik GmbH
##OWNER= root
$$ XWIN-NMR		Version 3.5
$$ Wed Aug  4 10:41:14 2021 Russian Standard Time (UT+4h)  she@DPX200
##.OBSERVE FREQUENCY= 81.013821
##.OBSERVE NUCLEUS= ^31P
##.ACQUISITION MODE= SIMULTANEOUS
##.ACQUISITION SCHEME= undefined
##.AVERAGES= 24
##.DIGITISER RES= 16
##SPECTROMETER/DATA SYSTEM= spect
##.PULSE SEQUENCE= zgpg30
##.SOLVENT NAME= CDCl3
##.SHIFT REFERENCE= (INTERNAL, CDCl3, 0, 248.564)
##AUDIT TRAIL= $$ (NUMBER, WHEN, WHO, WHERE, WHAT)
$$ ##TITLE= Audit trail, XWIN-NMR		Version 3.5
$$ ##JCAMPDX= 5.01
$$ ##ORIGIN= Bruker BioSpin GmbH
$$ ##OWNER= she
$$ F:/spectra/data/she/nmr/P31/1/pdata/1/auditp.txt
$$ ##AUDIT TRAIL=  $$ (NUMBER, WHEN, WHO, WHERE, WHAT)
(   1,<2021-08-04 10:38:30.78 +0400>,<she>,<DPX200>,
      <created by zg, POWCHK disabled, PULCHK disabled
       configuration hash MD5:
       00 E9 B6 7A A2 85 ED C7 34 08 36 98 17 FE 4E 26
       data hash MD5: 32K
       EF 22 39 46 17 3D CD 63 F7 54 B5 54 D2 54 99 DE>)
(   2,<2021-08-04 10:38:33.84 +0400>,<she>,<DPX200>,
      <Start of raw data processing
       efp BC_mod = 2 LB = 1 FT_mod = 6 PKNL = 1 PHC0 = -7599.713 PHC1 = 597.8745 SI = 64K 
       data hash MD5: 64K
       42 04 17 EB FB 69 F4 07 F8 86 22 70 08 92 D3 CF>)
(   3,<2021-08-04 10:38:59.40 +0400>,<she>,<DPX200>,
      <pk PHC0 = -131.6244 PHC1 = 239.0001 
       data hash MD5: 64K
       DF 0B 95 9B F2 9D 09 DC 52 97 61 ED 87 57 45 DA>)
$$ ##END=
$$ 
$$ hash MD5
$$ D4 9E E9 B8 B6 8E 5D FC D9 43 41 3A A9 68 06 9E
##$RELAX= 
##$RELAX= 
##$RELAX= 
##$RELAX= 
##$RELAX= 
##$RELAX= 
##$RELAX= 
##$RELAX= 
$$ Bruker specific parameters
$$ --------------------------
##$DU= <F:/spectra>
##$EXPNO= 1
##$NAME= <P31>
##$PROCNO= 1
##$TYPE= <nmr>
##$USER= <she>
##$AMP= (0..31)
100 100 100 100 100 100 100 100 100 100 100 100 100 100 100 100 100 100 
100 100 100 100 100 100 100 100 100 100 100 100 100 100 
##$AQSEQ= 0
##$AQ_mod= 1
##$AUNM= <au_zg>
##$AUTOPOS= <>
##$BF1= 81.014009
##$BF2= 200.13
##$BF3= 200.13
##$BF4= 200.13
##$BF5= 200.13
##$BF6= 200.13
##$BF7= 200.13
##$BF8= 200.13
##$BYTORDA= 1
##$CFDGTYP= 0
##$CFRGTYP= 5
##$CHEMSTR= <none>
##$CNST= (0..31)
1 1 145 1 1 1 1 1 1 1 1 1 1 1 1 1 1 1 1 1 1 1 1 1 1 1 1 1 1 1 1 1 
##$CPDPRG= <waltz16>
##$CPDPRG1= <>
##$CPDPRG2= <waltz16>
##$CPDPRG3= <>
##$CPDPRG4= <mlev>
##$CPDPRG5= <mlev>
##$CPDPRG6= <mlev>
##$CPDPRG7= <mlev>
##$CPDPRG8= <mlev>
##$CPDPRGB= <>
##$CPDPRGT= <>
##$D= (0..31)
0 1 0 0 0 0 0 0 0 0 0 0.03 2e-05 3e-06 0 0 0 0 0 0 0 0 0 0 0 0 0 0 0 0 
0 0 
##$DATE= 1628059110
##$DBL= (0..7)
120 120 120 11 120 120 24 19 
##$DBP= (0..7)
150 150 150 150 150 150 150 150 
##$DBP07= 0
##$DBPNAM0= <>
##$DBPNAM1= <>
##$DBPNAM2= <>
##$DBPNAM3= <>
##$DBPNAM4= <>
##$DBPNAM5= <>
##$DBPNAM6= <>
##$DBPNAM7= <>
##$DBPOAL= (0..7)
0.5 0.5 0.5 0.5 0.5 0.5 0.5 0.5 
##$DBPOFFS= (0..7)
$$ [...]
##$SUBNAM2= <"">
##$SUBNAM3= <"">
##$SUBNAM4= <"">
##$SUBNAM5= <"">
##$SUBNAM6= <"">
##$SUBNAM7= <"">
##$SUBNAM8= <"">
##$SUBNAM9= <"">
##$SW= 501.771253377433
##$SWIBOX= (0..15)
0 1 3 0 0 0 0 0 0 0 0 0 0 0 0 0 
##$SW_h= 40650.406504065
##$TD= 32768
##$TD0= 1
##$TE= 0
##$TE2= 300
##$TE3= 300
##$TEG= 300
##$TL= (0..7)
0 120 53 12 22 120 120 120 
##$TP= (0..7)
150 150 150 150 150 150 150 150 
##$TP07= 0
##$TPNAME0= <>
##$TPNAME1= <>
##$TPNAME2= <>
##$TPNAME3= <>
##$TPNAME4= <>
##$TPNAME5= <>
##$TPNAME6= <>
##$TPNAME7= <>
##$TPOAL= (0..7)
0.5 0.5 0.5 0.5 0.5 0.5 0.5 0.5 
##$TPOFFS= (0..7)
0 0 0 0 0 0 0 0 
##$TUNHIN= 0
##$TUNHOUT= 0
##$TUNXOUT= 0
##$USERA1= <user>
##$USERA2= <user>
##$USERA3= <user>
##$USERA4= <user>
##$USERA5= <user>
##$V9= 5
##$VALIST= <valist>
##$VCLIST= <CCCCCCCCCCCCCCC>
##$VD= 0
##$VDLIST= <DDDDDDDDDDDDDDD>
##$VPLIST= <PPPPPPPPPPPPPPP>
##$VTLIST= <TTTTTTTTTTTTTTT>
##$WBST= 1024
##$WBSW= 4
##$XGAIN= (0..3)
0 0 0 0 
##$XL= 0
##$YL= 0
##$YMAX_a= 2301
##$YMIN_a= -2420
##$ZGOPTNS= <>
##$ZL1= 120
##$ZL2= 120
##$ZL3= 120
##$ZL4= 120
##$ABSF1= 0
##$ABSF2= 0
##$ABSG= 0
##$ABSL= 0
##$ALPHA= 0
##$AQORDER= 0
##$ASSFAC= 0
##$ASSFACI= 0
##$ASSFACX= 0
##$ASSWID= 0
##$AUNMP= <proc_1d>
##$AZFE= 0.1
##$AZFW= 0.5
##$BCFW= 0
##$BC_mod= 2
##$BYTORDP= 0
##$COROFFS= 0
##$CY= -3
##$DATMOD= 1
##$DC= 0
##$DFILT= <>
##$DTYPP= 0
##$F1P= 0
##$F2P= 0
##$FCOR= 1
##$FTSIZE= 65536
##$FT_mod= 6
##$GAMMA= 0
##$GB= 0
##$INTBC= 1
##$INTSCL= 5.30512e-09
##$ISEN= 30
##$LB= 1
##$LEV0= 0
##$LPBIN= 0
##$MAXI= 10000
##$MC2= 0
##$MEAN= 0
##$ME_mod= 0
##$MI= 50
##$NCOEF= 0
##$NC_proc= -7
##$NLEV= 6
##$NOISF1= 182.463
##$NOISF2= 159.3651
##$NSP= 0
##$NTH_PI= 0
##$NZP= 0
##$OFFSET= 248.5645
##$PC= 4
##$PHC0= -7731.337
##$PHC1= 836.8746
##$PH_mod= 1
##$PKNL= yes
##$PPARMOD= 0
##$PSCAL= 0
##$PSIGN= 0
##$REVERSE= no
##$SF= 81.014009
##$SI= 65536
##$SIGF1= 159.3651
##$SIGF2= -187.1042
##$SINO= 113.3802
##$SIOLD= 16384
##$SREGLST= <1H.CDCl3>
##$SSB= 0
##$STSI= 65536
##$STSR= 0
##$SW_p= 40650.406504065
##$SYMM= 0
##$S_DEV= 0
##$TDeff= 32768
##$TDoff= 0
##$TI= <>
##$TILT= no
##$TM1= 0
##$TM2= 0
##$TOPLEV= 0
##$USERP1= <user>
##$USERP2= <user>
##$USERP3= <user>
##$USERP4= <user>
##$USERP5= <user>
##$WDW= 1
##$XDIM= 65536
##$YMAX_p= 532150086
##$YMIN_p= -12324466
$$ End of Bruker specific parameters
$$ ---------------------------------
##NTUPLES= NMR SPECTRUM
##VAR_NAME=  FREQUENCY,     SPECTRUM/REAL,   SPECTRUM/IMAG
##SYMBOL=    X,             R,               I
##VAR_TYPE=  INDEPENDENT,   DEPENDENT,       DEPENDENT
##VAR_FORM=  AFFN,          ASDF,            ASDF
##VAR_DIM=   65536,         65536,           65536
##UNITS=     HZ,            ARBITRARY UNITS, ARBITRARY UNITS
##FACTOR=    0.620285442955139, 1,           1
##FIRST=     20137.2065510759, 0,            0
##LAST=      -20513.1999529892, 0,           0
##MIN=       -20513.1999529892, -12324466,   0
##MAX=       20137.2065510759, 532150086,    0
$$ Real data points
##PAGE= N=1
##DATA TABLE= (X++(R..R)), XYDATA
$$ [...]
##PAGE= N=2
##DATA TABLE= (X++(I..I)), XYDATA
39016 2363101 2850489 1429909 -232364 -568607 -100208 -2553 68593 1101558 2453343
39007 2453343 2462626 1230973 785059 2059897 3569185 3842604 3483156 3622191 3712936
38998 3712936 2438523 95730 -1475697 -1243617 -124258 369247 -185632 -1071564 -1565595
38989 -1565595 -1685125 -1866143 -2295518 -2930973 -3992657 -5676034 -7131138 -6638140 -3595421
38980 -3595421 261449 2503442 2447515 1214284 27323 -507292 -93647 939672 1449936
38971 1449936 927125 629342 1742817 2955971 1899609 -1119275 -3083087 -2399127 -900128
38962 -900128 -788921 -1490824 -940385 1292061 3637549 4674792 4531436 4346761 4867683
38953 4867683 5468486 4715472 2401548 475154 825513 2624372 3409613 2466587 1196381
38944 1196381 230102 -1393925 -3570132 -4081163 -1621628 1872682 3437182 2487995 859900
38935 859900 444003 1712930 3603467 4115538 2072404 -1122189 -2641239 -1577658 276732
38926 276732 1336814 2045049 3134862 4134915 4642909 5115685 5262088 3783661 1110751
38917 1110751 94883 2055332 4271508 3718758 1390307 230496 379601 -405148 -2517077
38908 -2517077 -3863472 -3289074 -1934158 -1031415 -535805 -44078 777928 2524313 4983545
38899 4983545 6151659 4383899 1176585 -423279 115496 727381 428163 197668 85580
38890 85580 -1282457 -3396629 -3323150 -255320 2194920 684322 -3001053 -4563408 -3225053
38881 -3225053 -2039379 -2766298 -3700933 -3194653 -2487027 -3349231 -4702229 -3756510 -8161
38872 -8161 3739746 4595936 2569492 -54307 -1229187 -374330 1903177 4114711 4390862
38863 4390862 2049577 -1175473 -2517739 -1105845 1270142 2458334 2025215 730129
38855 730129 -930084 -2812677 -4423697 -4949400 -3854357 -1295959 1595814 2960589
38847 2960589 1749916 -753766 -2039613 -1313939 -197157 -186927 -934401 -1652031 -2490138
38838 -2490138 -3364775 -3051609 -1054325 879428 857121 -465320 -970290 -44562 1246915
38829 1246915 2205668 2869650 2870639 1820640 585794 423747 1015716 1008783 331887 223120
38819 223120 951922 1243710 244664 -1349175 -2338937 -2024216 -239635 2290591 3752548
38810 3752548 2820285 392282 -1548294 -2465912 -3057524 -2998620 -1231533 1355246 2050161
38801 2050161 34120 -2134512 -1995404 -418147 95652 -984623 -1922655 -1288608 560469
38792 560469 2251680 2661028 1603886 -62123 -1124723 -1061437 -149526 1337935 3276970
38783 3276970 4993360 5415504 4304928 2569800 1104064 154820 22387 1210897 3227672
38774 3227672 4208582 2745954 -266723 -2374206 -2122154 -509351 203988 -903289 -2191050
38765 -2191050 -1288656 1914178 5046064 6255240 6008131 5140720 3042636 -367938 -2591035
38756 -2591035 -1330509 1585879 2309296 711840 461868 2905920 4720037 3248159
38748 3248159 660518 234582 1250323 732300 -1530711 -3015171 -2656628 -1967715 -2073020
38739 -2073020 -2168003 -1335907 -73966 530391 108286 -652452 -410487 1531091 3681275
38730 3681275 3282106 -29075 -2811325 -1883000 1332584 2765856 1218242 -650381
38722 -650381 -541870 1010078 2633280 3867573 4121979 2373160 -790290 -2810485 -2252789
38713 -2252789 -611540 261196 744056 1795305 2430922 1196806 -824999 -980801 1202047
38704 1202047 3391849 3684984 2540780 1238262 284735 -93255 397031 1210212 1261001
38695 1261001 929418 2112327 5147363 7375434 6440788 3640842 1966349 1896611 1561467
38686 1561467 411257 -115753 376184 504597 157354 1341422 4397587 5963202 3147400
38677 3147400 -1941730 -4464219 -2765378 362963 1857766 1533466 1039793 1572552 2951938
38668 2951938 3809490 2802057 579806 -246932 1504035 3326421 2251738 -610687
38660 -610687 -1548331 132844 1215686 -213900 -1905045 -1176527 1179279 2559402 2088922
38651 2088922 650133 -1033257 -2571131 -3373968 -3382673 -3190045 -2417215 325898 4521672
38642 4521672 6807262 5041777 1667469 551766 1696947 1839638 -338156 -2492631
38634 -2492631 -2270738 -203806 1718778 2522820 2500169 2266673 2284626 2582358 2625063 1975658
38624 1975658 980898 267465 -53043 -105261 112339 89849 -1152612 -3295232 -4174053
38615 -4174053 -2533608 -215659 245870 -820929 -1269760 -816403 -1013739 -2049252 -2491836
38606 -2491836 -2208482 -2513921 -3050653 -1707857 1392602 2964689 1196614 -1451027 -2019448
38597 -2019448 -1120656 -920462 -1255666 -611670 485638 61228 -1917853 -3336201 -2983431
38588 -2983431 -1768483 -993746 -1151578 -2245404 -3703254 -4215144 -3142199 -1703670 -1320115
38579 -1320115 -1465168 -912174 -278325 -998463 -2293428 -1897276 166650 1340760 526664
38570 526664 -474344 -355335 -307495 -1299284 -2083890 -1741250 -1673479 -2806823 -3163181 -1069250
38560 -1069250 1185614 357454 -2377916 -2953089 -895312 -141362 -2645784 -5084932 -3789328
38551 -3789328 120921 2924260 3328916 2657913 1621167 -126451 -1791898 -1559198 749585
38542 749585 3024844 3386790 2071123 514104 -282009 -155770 418988 542435 -365650
38533 -365650 -1742068 -2420175 -2160750 -2009407 -2913867 -4529636 -5666464 -5601162 -4797737
38524 -4797737 -4438142 -5084822 -5724211 -4680408 -1837394 775930 1324774 365748 -301051
38515 -301051 -279088 -603671 -1422796 -1385908 228668 2101224 2285540 344305 -2209411
38506 -2209411 -3000829 -547534 3961718 6823843 5310309 1167952 -1080535 243715
38498 243715 2061627 1209504 -1138194 -1643298 183254 1671815 1099242 -348882 -906533
38489 -906533 -523737 -235565 -633406 -1534346 -2187991 -1582934 399847 2077670 1560508
38480 1560508 -548416 -1664199 -932229 -516669 -2027409 -3628234 -2837871 -811140 -886060
38471 -886060 -3189126 -3963329 -1257285 1729217 1191147 -1596186 -2218547 305670 2382511
38462 2382511 1493064 -409376 -578243 313649 48385 -1000972 -614458 1169111 1691227
38453 1691227 -285902 -2626480 -2782720 -934531 826025 1136129 197937 -1056851 -1680779
38444 -1680779 -1173119 67052 1072859 1305768 839930 -290747 -1943059 -3104628 -2598996
38435 -2598996 -830329 492963 748410 1060800 2053519 2636806 2032054 1376179 1874210
38426 1874210 2662160 2162341 612670 -426451 -361021 297141 1456958 3303687 4942898
38417 4942898 5041342 3942227 3549467 4748286 6199679 6108295 4232661 1813341 250191
38408 250191 63714 608096 740969 59675 -889771 -1845104 -3244752 -4753392 -4803554
38399 -4803554 -3012052 -1646245 -2589428 -3983925 -2639932 794933 2305904 395409
38391 395409 -1859549 -1752866 -765683 -1442280 -3077487 -3196549 -1655025 -484148 -503881
38382 -503881 -590617 30919 905426 1662141 2416301 2874493 2599735 2157335 2579711 3700048
38372 3700048 4301807 3837173 2774758 1503259 283949 -4954 1260567 2943028 3270962
38363 3270962 2491308 2461228 3398073 3275029 1161387 -1099348 -1765256 -1660561 -2177101
38354 -2177101 -2777636 -2573732 -2696058 -4451191 -6273101 -5581830 -3255087 -2919486 -5279425
38345 -5279425 -6435521 -3438997 1166911 2732161 664307 -1523190 -1518431 -725699 -1161522
38336 -1161522 -2251295 -2029821 -206563 1472127 1576446 562356 -198958 -202192 -46921
38327 -46921 -149614 10719 954402 2067635 2268614 1661395 1471098 2057190 2101644 538465
38317 538465 -1591070 -2308308 -1240856 146840 661580 533266 327402 -147391 -1229493
38308 -1229493 -2401069 -2689912 -1952044 -1185331 -1356337 -2190750 -2543809 -2005392 -1519664
38299 -1519664 -1865116 -2113449 -757869 1789803 3315547 2808625 1876181 2375614 4033093
38290 4033093 5465923 6162854 6038735 4403461 1319473 -1012317 -466807 1887987 3042803
38281 3042803 2105527 908015 780120 1215730 1915615 3453654 5127323 4716525 1741366
38272 1741366 -1125621 -1418844 71071 1120730 1330552 1765967 2552396 2743448 2002338
38263 2002338 881464 -214888 -1184537 -1690775 -1392579 -428879 824437 1947601 2216110
38254 2216110 1172455 -216588 -292304 902348 1459818 486146 -590878 -500639 22798
38245 22798 194589 968499 3005947 4636512 4121873 2559159 2049581 2066735 432327
38236 432327 -2588911 -4004268 -2195047 938302 2510626 1752488 167163 -220980 1370628
38227 1370628 3538022 3756872 1284582 -1674268 -2766178 -2367515 -2123472 -1897975 -518184
38218 -518184 1282929 1458523 56266 -662345 158091 740386 -271012 -1838675 -2590932
38209 -2590932 -2847066 -3345364 -3514515 -2408266 -428992 1059937 1415090 1288085 1674126
38200 1674126 2572042 2577696 360454 -3120561 -4945048 -3683134 -1309043 -334980 -406174
38191 -406174 313971 1656855 1935137 1137864 844407 1289008 1282924 904480 1409850 2445976
38181 2445976 2332514 1333611 1501110 2760410 2468650 -155395 -2388531 -2141974 -777962
38172 -777962 -297616 -540458 -796739 -1456219 -2288251 -1730099 273892 1351418 489209
38163 489209 -72914 1123607 1848035 87553 -1962132 -1208278 1293335 2246402 1340742
38154 1340742 854871 1319996 1344465 971208 1564674 2740434 2793558 1950286 1934884 2461104
38144 2461104 1513811 -725305 -1592407 -163209 1323427 1106887 209582 154973 873199
38135 873199 1846739 3044551 3781504 2861176 788007 -330006 8606 -140786 -1778452
38126 -1778452 -3183573 -2958679 -2442979 -3159280 -3959758 -3085467 -1507014 -1615325 -3459023
38117 -3459023 -4737261 -4152667 -2601622 -1188429 -99872 442390 35544 -688073 -404708
38108 -404708 704707 621530 -1737506 -4656050 -5669646 -4586087 -3157970 -2290926 -1102161
38099 -1102161 1139541 3503771 4524261 4056507 3257019 3064715 3276508 2960985 1490143
38090 1490143 -557464 -1414853 228829 3209919 4485869 2637163 -116716 -666295
38082 -666295 995790 2226049 1674596 621557 267065 25508 -626673 -710315 435051
38073 435051 1512092 1097746 -43061 -159283 769073 1205306 576789 109224 1071503
38064 1071503 3157318 4759794 4510117 2787319 1723553 2912048 5092225 5447296
38056 5447296 3451210 1625461 1767199 2529116 2099923 1175053 1216438 1513956 495303
38047 495303 -1232147 -1766116 -1075848 -722591 -907188 -359844 1002996 1771978 1462776
38038 1462776 997562 676241 -125783 -1062809 -849504 458202 1325710 1295012 1576585
38029 1576585 2570712 2937395 1936597 737794 442619 535959 292883 129115 480838
38020 480838 740254 406938 121955 491397 833443 61940 -1880376 -4117665 -5650075
38011 -5650075 -5624337 -3656923 -427964 2645762 4558185 4998744 3830694 1438950 -580344
38002 -580344 -523133 1423023 3435324 4298367 4173160 3381326 2067164 1063005 1344980
37993 1344980 2378948 2549920 1382400 -132896 -1253159 -1779277 -983365 1521115 3976449
37984 3976449 4058006 2334326 1505451 2101193 2052084 937706 1037229 3014969 4241017
37975 4241017 3203585 2079944 2643775 3018473 1376762 -214536 900760 3268773
37967 3268773 3614539 2029794 1254082 2124500 3214431 3946315 4739195 4939115 3760004
37958 3760004 2390687 2074193 1244768 -1895851 -5070337 -4402538 -704639 1241879 -73542
37949 -73542 -1031177 654188 2204029 695542 -2158614 -3059124 -2129836 -1810039 -2634999
37940 -2634999 -3077997 -2533559 -1885309 -1545602 -926959 245442 1480364 2324576 2748572
37931 2748572 2891563 2940554 2991930 2842939 2353081 1871292 1590525 899251 -496342 -1385874
37921 -1385874 -638265 579938 344280 -658041 -65304 1825190 1996616 -199079 -1460737
37912 -1460737 212963 2109953 1239099 -785095 -594889 1444745 2318290 1479358 1047989
37903 1047989 1568487 1310383 -164624 -1107033 -700142 -134596 -12103 539000 1453397
37894 1453397 1205907 -234209 -518565 1551651 3826788 3825772 2145201 1049895 1062604
37885 1062604 844797 -370702 -1883979 -2664254 -2290840 -1161370 -375625 -705250 -1326696
37876 -1326696 -767557 552418 557453 -942409 -1281997 862315 2687695 1252301 -1699959
37867 -1699959 -2224991 -233829 770444 -430534 -1348419 -809542 -1104629 -3332908 -4454117
37858 -4454117 -1840457 2160793 3549768 2438268 1895046 2498540 2058104 338332 7873
37849 7873 2140920 4211966 3947187 2383242 1428875 749957 -866836 -2796659 -3442846
37840 -3442846 -2776442 -2039363 -1636614 -1127436 -737271 -1023698 -1315799 -330508 1574792
37831 1574792 2468915 1547566 269167 174588 866775 1032942 478036 64221 210875
37822 210875 551733 875011 1384725 1910309 1747212 731076 -150099 130852 1214090
37813 1214090 1750062 1169018 288105 -54313 -162653 -727995 -1593128 -2113859 -2296946
37804 -2296946 -2583817 -2762311 -2229177 -1310248 -1103402 -1778808 -2246233 -1929428 -1618871
37795 -1618871 -1876924 -1822690 -519206 1436614 2882638 3816754 4842259 5566074 5093992
37786 5093992 3824902 3201167 3630272 4046861 3714760 3084513 2465157 1206443 -1003295
37777 -1003295 -3041659 -3504156 -2333115 -471114 1561101 3726834 5322376 4913262
37769 4913262 1981467 -1842882 -3867549 -2816378 15657 2218555 2628587 1944438
37761 1944438 1297991 994764 857850 979382 1433943 1725389 1307714 451170 -84853
37752 -84853 -68681 158778 412042 610499 150378 -1614758 -4017870 -5153963 -3864887
37743 -3864887 -1028142 1637512 3441106 4695744 5320486 4604638 2649900 1146068
37735 1146068 1779518 4011235 5366533 4303845 1994318 524839 135465 -360212 -805874
37726 -805874 556975 3884116 6228923 4924762 1297546 -908810 -223920 1368569
37718 1368569 1751908 1142085 795553 1010713 1343532 1650155 1952447 1938140 1310995 234168
37708 234168 -881512 -1532827 -1062697 652938 2316727 2167972 319353 -1001430 -330941
37699 -330941 927479 399151 -1919641 -3519701 -2510194 163200 1938580 1458513 -210913
37690 -210913 -914165 397033 2837171 4680189 4920692 3780248 2205308 1130507 731304
37681 731304 91775 -1719678 -3858888 -4067178 -1716589 728487 822975 -371808 -35446
37672 -35446 1962808 3120042 2673249 2743134 4298811 5094160 3314383 639727 -496943
37663 -496943 -521517 -1084928 -1571282 -91740 3027943 5394930 5594381 3882570 712608
37654 712608 -2936877 -4583478 -2563428 924545 2040287 570647 -77126 1603427
37646 1603427 3184848 2877290 2650798 4644164 7230871 7435759 5471346 4046212 4194049
37637 4194049 4431659 3589721 2099855 510499 -1211064 -2601146 -2591684 -993936 1029782
37628 1029782 2315705 2642081 2213672 1179149 -49281 -761488 -595313 170242 1021650
37619 1021650 1549197 1502764 931223 139389 -751791 -1789109 -2422528 -1532516 1017440
37610 1017440 3546593 4297776 3494977 2562926 1849303 618539 -914047 -1299490 12134
37601 12134 1758747 2718365 3146710 3539983 3233307 1542581 -453638 -767159 942430
37592 942430 2839482 3150309 1997582 613623 -422073 -1294483 -1682857 -590632 2039003
37583 2039003 4431600 4823660 3867183 3819824 5176019 5732893 3886975 1268611 438712
37574 438712 1145503 1138693 167199 459237 2792607 4704687 3948324 1691475 502272
37565 502272 611036 188835 -1497756 -3214166 -3781287 -3320883 -2514039 -1975952 -2359437
37556 -2359437 -3811060 -5214621 -5095935 -3471634 -1897506 -1577432 -2228800 -2803042 -2508742
37547 -2508742 -1214766 302848 707807 -325774 -1173171 -127628 2009355 2726623 1192676
37538 1192676 -884059 -2055101 -2809537 -3671712 -3692387 -2353680 -1277360 -1987118 -3093381
37529 -3093381 -2046674 779932 2202028 678456 -1569383 -1782619 -218502 857779
37521 857779 503985 -180615 -133840 409684 821012 1056171 1301400 1398494 1165550 906643
37511 906643 1119384 1804864 2370078 2219536 1350538 414723 156558 595901 837361 82193
37501 82193 -1175110 -1585779 -796937 -38391 -264224 -632919 -6241 795046 25065 -1903984
37491 -1903984 -2535704 -1075801 278086 -57807 -347409 1452568 3785825 3559611 1210133
37482 1210133 332747 2073865 3246140 1338556 -1421373 -1245130 1714987 3534720
37474 3534720 1596920 -2586551 -5738308 -6438343 -5749833 -5038389 -4124076 -2002273 952282
37465 952282 2648496 1869893 156344 -305735 187167 -154360 -1058185 -329647 2233227
37456 2233227 3949545 3217016 1614913 744856 -177734 -1693914 -1913502 378289 2821666
37447 2821666 2815797 1812756 2822394 5162990 5565025 3596462 1926733 1472944 422026
37438 422026 -1564156 -2279256 -1130328 -526786 -1565543 -1850964 349564 2871055 2959477
37429 2959477 1244986 -90374 -889094 -2072409 -2943301 -2327294 -1207938 -1474050 -2794638
37420 -2794638 -3236172 -2456654 -1937767 -2340460 -2777026 -2561759 -1770921 -275670 1825844
37411 1825844 2951773 1330222 -2165731 -4370378 -3530395 -1073542 798243 1654102
37403 1654102 2194083 2516133 2221653 1472815 889959 696058 588785 207387 -651490
37394 -651490 -1920467 -2969765 -2770314 -871869 1803231 3505641 3221135 1672071 566626
37385 566626 709249 1134121 523297 -849407 -1470156 -840411 -199758 -557678 -1204686
37376 -1204686 -1058879 -457760 -410595 -841085 -961896 -873950 -1232000 -1532967 -469719 1707036
37366 1707036 2842235 1774626 346401 1247629 4424899 6916953 6314290 3394188
37358 3394188 893229 344124 893976 1038310 556076 276175 634690 1292009 1862389
37349 1862389 2168855 1948656 1218754 823040 1566285 2820883 3192121 2637090 2491972
37340 2491972 3139688 3340584 2484490 1694691 1745446 1793268 1495396 2310451 4716958 6095698
37330 6095698 4072381 513596 -888582 34559 515331 201463 1709740 5245053 6982409
37321 6982409 4753839 1704924 1557844 3153194 2994196 1043650 175470 979818 1047545
37312 1047545 -580666 -1821724 -1216848 -204486 -395746 -947792 -294083 1246665 2285055
37303 2285055 2548162 2670117 2737452 2528557 2427581 2649549 2264928 554681 -1271787
37294 -1271787 -1476180 -493781 -223082 -732118 -38996 2296866 3841310 2893024 1288390
37285 1288390 1623294 3263090 3504460 1774692 135304 -125578 165 -640691 -1827595
37276 -1827595 -2995230 -3994629 -4363981 -3514195 -2071219 -1384274 -1380672 -773157 291064
37267 291064 109873 -1339596 -1636783 298464 2208285 2110877 1458208 2262316 3234124
37258 3234124 1866756 -1049991 -2274202 -823368 1159077 1964503 1966426 1758873 1237759
37249 1237759 687375 522461 -31605 -1743042 -3066763 -1647042 1831290 4024944 3451279
37240 3451279 1881077 838095 -263580 -1647604 -1924892 -766787 -176327 -1454262
37232 -1454262 -3179441 -3742317 -3591870 -3316106 -1857614 1267182 3942034 3850578 1444622
37223 1444622 -1238772 -3118248 -3843644 -3056527 -1781746 -2383620 -4848327 -5383849 -1592321
37214 -1592321 3086321 3585449 193292 -2591012 -2982565 -3235195 -4363336 -4278954 -2153378
37205 -2153378 -432179 -727519 -1127894 301484 2165324 2205044 882289 86346 -45126
37196 -45126 -571238 -1158075 -456063 1361788 2405039 1435734 -850759 -2879743 -3617209
37187 -3617209 -3074961 -2101048 -1540723 -1304499 -711645 118978 135644 -1007220 -2202445
37178 -2202445 -2383759 -1803926 -1191057 -671303 -325984 -793416 -2302166 -3864990 -4326475
37169 -4326475 -3513544 -1684061 1097011 4065355 5365396 3919725 993335 -1265237
37161 -1265237 -2087628 -1823210 -571320 1280348 2109325 707079 -1594835 -2468395 -1938517
37152 -1938517 -2004566 -3027121 -3046734 -1298672 67737 -892790 -2938281 -3301743 -1076555
37143 -1076555 2350174 5124599 6009267 4810795 3040010 3083713 5324596 7069727 5840369
37134 5840369 2783652 1093111 1812626 3139900 3390844 2574720 1186462 -445602 -1386493
37125 -1386493 -618684 1239825 2454438 2692433 3121373 3672686 2594294 -290984 -2303316
37116 -2303316 -1584102 -31660 -420473 -2176759 -2538356 -941219 414367 76086 -1029095
37107 -1029095 -1597591 -1418174 -516333 1132302 2449127 1698359 -999395 -3110280 -2643633
37098 -2643633 -456885 1330071 2034760 2327638 2381071 1664713 449623 188785 1818282
37089 1818282 4228140 5158818 3838132 2211483 2719412 4934050 5730880 3445174 369380
37080 369380 -362903 851500 999568 -921122 -2767968 -2822292 -1883990 -1088695 -52978
37071 -52978 1583358 2797271 2806024 2399360 2292342 1785166 536503 -6795 1227526
37062 1227526 2817020 2947265 2378654 2949325 4002487 3009168 -335572 -3133773 -2979877
37053 -2979877 -786084 817809 574144 -633330 -1236950 -646032 204437 -20859 -1136877
37044 -1136877 -1331555 316289 2161813 2142835 848636 730958 2565796 4499524 4748823
37035 4748823 3626179 2457661 1840530 1611070 1628535 1955446 2594482 3201320 2997629
37026 2997629 1555397 9247 388182 2815558 4574003 3395414 618143 -666167
37018 -666167 381446 2223354 3836558 5148659 5212758 2974917 -70748 -968119 475184
37009 475184 1390871 421657 -436399 347777 1293803 943764 594039 1638652 2498841
37000 2498841 961849 -1966036 -3264863 -2062364 -256369 387968 -251257 -1504026
36992 -1504026 -2492103 -2354241 -1377471 -1216552 -2582385 -3692242 -2671143 -469578 525577
36983 525577 -117553 -936197 -1198747 -1188269 -499537 1432405 3364602 3339658 1804532
36974 1804532 1208314 2276683 3142110 2603986 1728984 1461286 1164763 669817 1301132
36965 1301132 3229286 3988524 1779228 -1353533 -1991266 -219 1606911 979242 -655916
36956 -655916 -1431238 -1173383 -739271 -541582 -532768 -681303 -725412 -69903 1467297 3179733
36946 3179733 4153951 4143242 3517051 2706524 2034955 1824779 2251893 3093988 3843375 4117274
36936 4117274 3909793 3492910 3123405 2793201 2262616 1481931 1018901 1759126 3795944
36927 3795944 5721612 5637694 3238318 477213 -401769 733013 2138466 2664678 2929923
36918 2929923 3699822 4263616 3526533 2088180 1769877 2937590 3607460 1968170 -1029337
36909 -1029337 -2639052 -1628505 399681 1220194 613204 46415 294945 588100 300410
36900 300410 257096 1412728 2982380 3201565 1799942 463689 629015 1927353 3178219
36891 3178219 3832409 3887581 3446661 3139695 4005494 5940810 7054423 5756422 3002153
36882 3002153 1272429 1602695 2769202 3282382 2984290 2449445 1784954 586227 -1238112
36873 -1238112 -2892097 -3091165 -1449075 533999 790984 -580801 -1051973 994263 3870928
36864 3870928 4944107 4266833 3884312 4234162 3712228 1898008 764501 1872364 4278646
36855 4278646 6148960 6753372 5908695 3218604 -673304 -3417059 -3192539 -867126 1362503
36846 1362503 2709639 3856583 4968679 5200111 4065314 2176155 596814 91350
36838 91350 665600 1270874 579819 -1235914 -2290845 -1421961 129545 684065 706763
36829 706763 1631151 2874066 2369023 65884 -1470368 -629459 1110684 1625148 900896
36820 900896 -1445 -1161550 -3105437 -4823414 -4512950 -2180451 106327 744458 165148
36811 165148 -267208 218741 1634508 3515552 4903284 4844159 3347026 1272058 -818517
36802 -818517 -2781714 -3752642 -2341443 1151928 3979476 3811474 1617612 222480 561738
36793 561738 1131067 919371 770682 1325785 1640567 1038295 719192 1911023 3520994
36784 3520994 3468441 1812168 716492 1356344 2521836 2619881 1657491 671528 284632
36775 284632 506766 1191066 2019963 2518930 2566251 2546237 2743239 2972525 2941832 2500711
36765 2500711 1474559 -103854 -1463189 -1547484 -328930 992639 1468619 1443680 1689652
36756 1689652 2126132 2010135 987983 -627892 -2345786 -3676927 -3971662 -2700478 -177849
36747 -177849 2233655 3085698 2323156 1586178 2399221 4034063 4156784 2041387 -116452
36738 -116452 -176066 930085 985853 316169 1173729 3440852 4017116 1555269 -925355
36729 -925355 -78805 3120036 5031259 4307968 2836042 2468577 3098153 3781979 3891890
36720 3891890 3161090 2126279 2347458 4602546 7043213 6926370 4279184 2049610 2221947
36711 2221947 3519581 3702048 2557593 1404125 676582 -501808 -2512845 -4105743
36703 -4105743 -3555185 -786845 2005609 2323945 94116 -2120103 -2041068 -187743 1177053
36694 1177053 914859 -136373 -633164 52190 1664181 3006788 2529150 230187 -1555132
36685 -1555132 -817245 1185323 1592095 260264 -34055 1903682 3580187 2471893 -300339
36676 -300339 -1661254 -554117 1387593 2150877 982431 -1354467 -2775412 -1372089
36668 -1372089 2042539 4040553 2682242 297137 321150 2465978 3489024 2297438
36660 2297438 1504566 3340998 6361117 7493075 5881061 3356365 1915758 1877925 2230370
36651 2230370 2058235 1604153 1948490 3378480 4443020 3491095 961325 -1000935 -1218080
36642 -1218080 -442564 506348 1821112 3167389 2938023 650420 -1324323 -561254 1713830
36633 1713830 2161339 324824 -692697 817452 2417604 1504690 -358931 112266 2564972
36624 2564972 3403966 1281813 -1147194 -1648959 -1398301 -1937647 -1960055 321660 3496879
36615 3496879 4540007 3029434 1062534 -272305 -1442454 -1945982 -533812 1733172
36607 1733172 1936634 -170169 -1121969 1232186 4402754 4915102 2886745 699603 -758034
36598 -758034 -1913341 -2344334 -1671600 -1285563 -2252408 -2653972 -243216 3163745 3698221
36589 3698221 1550854 931983 3271357 4692165 2115461 -1835141 -2818191 -878382
36581 -878382 643815 401829 -165961 -308495 -811525 -1451302 -633195 1721110 3233715
36572 3233715 2053570 -775141 -2824169 -2950143 -1658991 102663 1522782 1949788
36564 1949788 1309741 323843 -252179 -466377 -859447 -1468848 -1569955 -508209 1429099
36555 1429099 3187673 4014019 4120645 4085674 3892560 3136078 2079122 1681084 2283790
36546 2283790 2995781 2859431 2045738 1398179 1344872 1764406 2338753 2488982 1623156 120806
36536 120806 -616557 112240 1260021 1642631 1766204 2705487 3813894 3280143 841574
36527 841574 -1696281 -2782422 -2480057 -1403947 22871 929393 473373 -313816 937278
36518 937278 4299063 6190300 3520906 -1955814 -5523193 -5158319 -3199923 -2463716 -2885624
36509 -2885624 -2749923 -1529075 -185675 541465 945340 1589843 2490384 3184277 3346007
36500 3346007 3206530 3244193 3389315 2900564 1429618 -172053 -764075 -321481 408109
36491 408109 1314618 2709910 3729311 2673226 -270287 -2205970 -880221 2191435
36483 2191435 3658700 2753893 1772569 2257041 2946883 2265721 865713 324402 776442
36474 776442 1480869 2625221 4629703 6362563 6231286 4846280 4325189 4762697 3910951
36465 3910951 1200630 -569637 679566 2808160 2549528 439912 -379336 666219
36457 666219 1058887 -166153 -735701 923058 3096086 3677138 3098917 2587963 1811604
36448 1811604 402307 -202471 1077713 2604802 2449771 1742827 2662521 4258290 3686423
36439 3686423 1040947 -648356 -250999 299441 184142 1193379 3725322 4985306 3311831
36430 3311831 1152923 1189684 2210311 1710526 233166 -166805 83644 -763363 -1851478
36421 -1851478 -743033 2125173 3651590 2794170 1705968 1787224 1881824 1152154 616293
36412 616293 686085 58771 -1527725 -2118304 -818116 206746 -972248 -2851925 -2867554
36403 -2867554 -1266196 -212484 -289185 -314333 226323 934071 2089245 4102433 5602769
36394 5602769 4456744 1020252 -1656171 -1512282 241297 1247224 1002171 722656 1147273
36385 1147273 1653420 1362864 279439 -922690 -1867498 -2780652 -3736063 -4109985 -3356054
36376 -3356054 -1970888 -828954 186680 1705583 3149828 3111548 1741613 945719 1511683
36367 1511683 1995452 1560372 1797108 3945736 6225584 6243174 4563114 3339566 2655128
36358 2655128 1131946 -669516 -682536 1055532 2314488 2291147 2316162 2730657 2300342
36349 2300342 1367899 2161868 4703576 5750369 3701573 1479703 2072766 3887663 3546180
36340 3546180 1257035 10028 645303 1210812 863533 1095107 2575853 3580087 2766216
36331 2766216 1590986 2412578 5086331 6808899 5369563 1848179 -392071 614944
36323 614944 3354484 4942147 4561481 3498303 2365619 539196 -1413373 -1358641 1093398
36314 1093398 3152017 2445031 195589 -1050789 -1082175 -1223793 -1470442 -912566 120072
36305 120072 776215 1550291 3074283 4155098 3586258 2743101 3423182 4258568 2848444
36296 2848444 644622 1436065 4899300 6210402 3229728 -206118 -156648 2010748 2679583
36287 2679583 1370497 61504 -603932 -1338292 -1903192 -1571109 -973924 -1195254 -1767874
36278 -1767874 -1467675 -299662 948655 2134962 3121101 2886328 1130819 -303546 438687
36269 438687 2564418 3921848 3958952 3455964 2400439 487739 -1024432 -502625 1336558
36260 1336558 2262996 1924261 2040623 3240682 4190214 4232338 4445328 5258170 5218389 3371784
36250 3371784 1151776 462394 1036449 1108836 77165 -740545 135558 2608131 5091678
36241 5091678 5990504 4980543 2915240 798846 -679283 -929498 46531 848615 -67553
36232 -67553 -1747968 -1219174 2231546 5291078 4977462 2761924 1821803 2052985 1190554
36223 1190554 -456972 -506974 737898 469892 -1278685 -1069904 1802841 3183117 527613
36214 527613 -2561903 -1687040 1707769 3023700 1511687 288229 690836 974555 336994
36205 336994 225518 1111356 1388682 512127 415683 2463649 5132936 6131922 5281240
36196 5281240 4057578 3459425 3440223 3651744 3859527 4066794 4608969 5635272 6480092
36187 6480092 6307311 5334944 4512852 4067663 3445142 2642511 2309572 2359018 1789703 275352
36177 275352 -1249918 -2022568 -2367596 -2752818 -3010069 -2976793 -2857462 -2456248 -1158078
36168 -1158078 724132 1706703 1046391 -41010 89066 1532921 3116993 3844492 3338855
36159 3338855 1725347 -71580 -735975 -147526 294581 -158015 -216984 1327427 3206289
36150 3206289 3293793 1937831 1393399 2079472 1940294 144680 -1103885 83451 2195563
36141 2195563 2651318 1730567 1676786 2685901 2654849 1062680 244602 1671324 3348326
36132 3348326 2737678 500289 -897834 -1091254 -1692523 -2748569 -2219069 466177 2924606
36123 2924606 3156090 2276115 2293774 2917240 2653782 1808676 1879389 2512585 1693067 -825759
36113 -825759 -2726964 -2560285 -1809353 -2238253 -2966520 -1979315 593536 2653461 3062946
36104 3062946 2582497 2032425 1296674 454812 299163 999782 1484004 1031274 516633
36095 516633 1029427 1966738 1693488 -249637 -2739692 -4688380 -5846904 -5948805 -4436228
36086 -4436228 -1653337 780980 1682952 1670784 2004235 2775703 3270911 3498645 4015193
36077 4015193 4480498 3848167 2163425 820286 560805 412929 -668953 -2079271 -2375670
36068 -2375670 -1212371 351629 1084091 478995 -1189491 -3055092 -4105092 -3934474 -2981941
36059 -2981941 -1904047 -1087896 -847355 -1425825 -2459554 -2975665 -2260566 -403541 1905023
36050 1905023 3474217 2946194 394373 -1603375 -418191 2752053 3655987 578633
36042 578633 -3113708 -3527306 -1100002 1197838 2404745 3433807 3948182 2811373 1052482
36033 1052482 1019690 2536616 2988849 1592380 609457 1605940 3268169 3965792 4009008
36024 4009008 4143213 3950975 3045558 2111650 1714892 1645748 2037942 3206328 3865395
36015 3865395 1950469 -1875057 -4089258 -2931438 -626258 388104 678117 1409048
36007 1409048 1583827 260892 -888690 -150254 1079763 678116 -464942 -284574 490593
35998 490593 -183542 -1324696 73831 4036754 7218895 7655741 6694745 5983883 5618321
35989 5618321 5589843 6038546 5632322 2750963 -1121875 -2306240 -92447 2091820 1791592
35980 1791592 634769 779314 1396824 946907 307801 970176 2096425 2101992 1647599
35971 1647599 2293158 3256298 2351572 -306330 -2161370 -1808140 -499539 210348 380031
35962 380031 672083 987827 883045 354786 -385497 -1210034 -1748807 -1448797 -401052
35953 -401052 427173 305614 -178800 337588 2299731 4394027 4718801 2769345 -94916
35944 -94916 -2233430 -3189155 -3188183 -1938267 1014149 4938887 8009415 8938110 7886506
35935 7886506 5834533 3811971 2606265 2255082 1774834 264424 -1695849 -2561182 -1637952
35926 -1637952 446888 2772683 4558159 4977959 3934275 2750333 2636532 2813324 1872947
35917 1872947 546310 800113 2308981 2602419 1198151 659680 2444234 4542531 4855488
35908 4855488 4237410 4096687 3420117 842828 -2145382 -2916898 -1490789 -32936 495732
35899 495732 712018 615719 -404970 -1717083 -1898884 -937086 -58577 366470 923958
35890 923958 1531246 1607582 1548169 2163284 2992595 3091460 3110694 4453316 6529741 7098722
35880 7098722 5535403 3697872 3146871 3319389 2962844 1887291 838861 711345 1885339
35871 1885339 3353896 3090851 685294 -1268434 -349467 2033203 2678042 1524162 1320577
35862 1320577 2515586 2249147 -558708 -2679768 -1154973 2279483 3681299 2001696
35854 2001696 -466361 -1446211 -576424 1115998 2043460 1028683 -1387938 -3228684 -3322845
35845 -3322845 -2332426 -1147154 235260 1554335 1746263 639724 -323560 -153464 347443
35836 347443 277156 24537 -96569 -755430 -1806249 -1483984 929972 3378647 3762210
35827 3762210 2741910 1980882 1416127 485382 241151 1531316 2596524 1529244 -37263
35818 -37263 979718 4072903 5742181 4928171 4183988 4969321 5385000 3832644 1813626
35809 1813626 1364886 2150140 2844430 3343235 3813067 3321065 1286103 -1053082 -2288412
35800 -2288412 -2716065 -2992634 -2297420 204355 3115737 4224891 3646855 3438921 4279236
35791 4279236 4678482 3800286 3019100 3730903 5160742 5660802 5237511 5284746 6071785
35782 6071785 5977324 3763709 660347 -817895 91286 1516514 1408555 53549 -613506
35773 -613506 302162 1729119 2400318 2447909 2707277 3259297 3524983 3438797 3620688 4293831
35763 4293831 4695963 3919088 2071902 343086 -35186 1176623 3083713 4430151 4603369
35754 4603369 4023091 3561107 3550397 3467135 2720930 1602717 1059255 1484742 2256803 2768386
35744 2768386 3316474 4277353 4885864 3961083 1840205 400556 740372 1868295 2323044
35735 2323044 2146199 2347542 3125766 3690145 3503517 2777278 1941164 1368131 1334420 1513373
35725 1513373 906077 -835221 -2419747 -2365551 -1176538 -773976 -1749922 -2611074 -2158538
35716 -2158538 -1243068 -1297012 -2191806 -2747180 -2780092 -3286158 -4518984 -5076899 -3607256
35707 -3607256 -839911 1012227 950934 459171 1485326 3724133 4913885 3779188 1589459
35698 1589459 446231 1011290 2487884 3880688 4456516 3820653 2576335 2259968 3555397
35689 3555397 5136902 5359385 4474818 3935547 4144981 4406792 4534817 4660053 3779430
35680 3779430 765021 -2899223 -3702510 -440025 3823802 5319694 3731799 1683910
35672 1683910 1354866 2849335 4888998 5824418 4684537 2283143 603691 299989 -135044
35663 -135044 -1717215 -2831933 -1423370 1606249 3203920 2097741 72141 -755656
35655 -755656 -234250 626483 1263098 1632169 1692013 1579025 1737796 2313045 2718543 2139637
35645 2139637 368286 -1787644 -2791635 -1564183 1106204 2895655 2498635 1326944
35637 1326944 1599357 3218504 4000098 2867361 1165053 480957 739343 1094915 1270304
35628 1270304 1113910 113609 -1549894 -2517409 -1956469 -790385 -52411 881949 2829974
35619 2829974 4576387 4266853 2535223 1770915 2162308 1191603 -1964773 -4197179 -2615829
35610 -2615829 1021173 2607019 1267834 -184988 388 347398 -605962 -1576252 -616481
35601 -616481 1856489 3855612 4502938 4282584 3484701 2140563 1065521 1240433 2143586
35592 2143586 2183924 1056211 391708 1566862 3803152 5014847 3974233 1259672 -1464731
35583 -1464731 -2799625 -2599421 -1851792 -1461605 -1347700 -1031237 -630532 -523924 -362524
35574 -362524 586273 2161914 3340283 3625309 3542212 3705274 4335573 5699535 7785672
35565 7785672 9252204 8063988 3993143 -481446 -2642356 -2223365 -929316 -27430
35557 -27430 646557 1727538 3272668 4601503 4762968 3426538 1565768 750041 1442213
35548 1442213 2579825 3109937 3120731 3051527 2811883 2415650 2471027 3019555 2801506 992665
35538 992665 -977389 -857298 1404094 3493445 3641512 2426501 1439498 1269766 1274566
35529 1274566 624070 -757078 -1813895 -991394 2013611 5195570 5924846 3906381 1532810
35520 1532810 942589 1644553 1656212 245191 -1287238 -1202115 1012785 4402176 7277898
35511 7277898 8113776 6357038 2931404 -139033 -1208945 -561885 -189240 -1436886 -3125893
35502 -3125893 -2991390 -996652 221568 -1080065 -3204409 -3461955 -2009772 -1191670 -1589286
35493 -1589286 -1178809 1231486 4033309 5309172 5394032 5588723 5891965 5665701 5320910
35484 5320910 5445833 5127004 3242836 997583 908477 3101572 4735615 3747532 1323544
35475 1323544 -240796 -422978 9674 856320 2195527 3188518 2870644 1673786 750121
35466 750121 252711 -296484 -471995 487767 1874891 2188018 1614700 1814323 2954250
35457 2954250 3197987 1915103 1126689 2372560 4131658 4174806 2897791 2281871 2757635
35448 2757635 3241062 3394646 3700301 3926460 3614394 3538670 4576593 5667617 5185897
35439 5185897 3895371 3993787 5410047 5776268 4209601 2347604 1286004 420484 -16253
35430 -16253 1605134 5085236 7490876 7040699 5342563 4251216 3200381 1473363 409551
35421 409551 1112921 2357160 2980457 3893224 5375488 5176541 2264222 -244773 604216
35412 604216 2860388 3123060 2251707 2971574 4009533 2307254 -297078 890202 4816697
35403 4816697 5047852 107044 -3409686 -969885 2971761 2552162 -302046 150019 4004227
35394 4004227 6379895 5544558 4334608 4035433 2522489 -656410 -2154312 307589
35386 307589 4380420 6501415 6389088 6005908 5871335 4865948 3053170 2490927 4683233
35377 4683233 8339622 10500328 9654180 7111161 5191812 4754021 5016127 5068416 4499723
35368 4499723 3095175 1373189 1049149 3106583 5530037 5261099 2710729 1619245
35360 1619245 3527507 5434453 4748703 3465554 4479236 6322617 5537170 2795474
35352 2795474 2231661 4878799 7083878 6338443 4803299 5231617 6594769 6345091 4889070
35343 4889070 4909255 7129915 9281138 9224581 7221757 4761505 2552789 420763 -1531291
35334 -1531291 -2527248 -1983889 -354250 1302498 2528730 3681691 4769360 4933674 3861311
35325 3861311 2967272 3861090 5864521 6512227 4797308 2567998 2022048 2960413 3615072
35316 3615072 3465323 3764471 5173384 6219165 5118884 2607350 1607101 3663761
35308 3663761 6796592 7908123 6567669 4904270 4132640 3273101 1782622 1204449 2677496
35299 2677496 4486616 4167781 2099797 852343 1423757 2296237 2227152 1880463 2220606
35290 2220606 3103320 4183725 5661207 7223142 7613196 6397185 5141598 5556907 7092429
35281 7092429 7674242 6591336 5363775 5472227 6238859 5688042 3078285 -168848 -2006735
35272 -2006735 -1554779 732356 3764676 6055782 6135646 4010547 1908618 2176642 4364088
35263 4364088 5746654 4926766 3390592 3029181 3715158 4150566 3685161 2402329 754945
35254 754945 -96058 835968 2324956 1768059 -824924 -2111378 -424171 1237742 -60912
35245 -60912 -2094228 -930277 2412406 3373311 1103816 -554982 429446 1620614 1106087
35236 1106087 588806 1458110 1840388 342841 -611598 1519886 4817348 5438722 3158264
35227 3158264 1112472 971154 1429239 1208029 877460 1381760 2635212 3955681 4678485
35218 4678485 4271061 2815064 1314759 807217 1377214 2447850 3408791 3585658 2631277
35209 2631277 1560627 2180230 4600387 6515181 6030449 4093153 2937776 3168165 3683927
35200 3683927 3633876 3106368 2474494 2154442 2508625 3236751 3564613 3566856 4216889 5528468
35190 5528468 6022914 4840105 2915241 1233730 -341090 -1501720 -858125 1602735
35182 1602735 3450279 3071874 2108493 2636456 3921282 4323825 4373355 5066543 5019420
35173 5019420 2748439 270937 574037 2499134 2285115 -255584 -1470387 40711
35165 40711 1528406 1255531 1236021 3016269 4526319 3582255 1553784 960962 1692930
35156 1692930 2037027 1601049 967154 55277 -1082874 -1313970 -207656 711765 423776
35147 423776 515492 2563064 4872360 4596756 2323487 1703714 4484168 8299500 9893926
35138 9893926 8721126 6696370 5678331 5909898 6275776 5648563 4143860 2915219 2656936
35129 2656936 3008572 3671656 4961229 6578706 7142491 6064289 4709806 4353572 4163502
35120 4163502 2882079 1381544 1399707 2475123 2558783 1393532 759361 1227159 1321771
35111 1321771 610729 1001625 3583451 6411753 7250434 6688465 6407011 5898651 3636271
35102 3636271 696680 109568 2290721 3969883 2808921 697556 648205 2227506 2478836
35093 2478836 465000 -1696537 -2270345 -1891156 -1423147 -65844 2881706 5847515 6466109
35084 6466109 4678296 2796363 2644077 3838476 4773372 4194944 1928502 -809548 -1872945
35075 -1872945 -194396 2535014 3453764 2108163 1117175 2621290 5360921 6440635
35067 6440635 5108488 3292916 2644928 2599755 1888752 799428 782005 2180249 3613012
35058 3613012 3972200 3965065 4762099 5917951 6058794 5245729 4800903 4639974 3060123
35049 3060123 220335 -535665 2982053 7825222 9056210 6053266 2763689 1945460
35041 1945460 2307975 1934657 1467365 2334119 4038145 4998884 4656407 3315192 1175634
35032 1175634 -1161301 -2378651 -1895307 -696029 219727 1088448 2239785 3152214 3748721
35023 3748721 5077435 7262970 8274397 6548431 3702486 2742925 4382039 6843481
35015 6843481 8475590 8766363 7598486 5518259 4193504 4618355 5291728 4144725 1833387
35006 1833387 922717 2048274 3317304 3670979 4285447 5881253 6999265 6285552 4705543
34997 4705543 3948188 3871833 3108752 1495315 445714 1061331 2855250 4411632 4775555
34988 4775555 4169907 3622908 3925807 4970669 6147246 7056752 7509441 7222966 6111034
34979 6111034 4663653 3587703 3314001 4031410 5447131 6183159 4685903 1626665 -14732
34970 -14732 1331359 3434141 3476932 2224031 2342632 3683540 3687736 2256750 2387057
34961 2387057 5100326 7348802 6634304 4587781 3832939 4022860 3526890 2784213 3133714
34952 3133714 4019709 4246326 4644230 6499571 8372453 7652344 4731876 2491784 1862101
34943 1862101 1152896 11308 581307 3598933 6356074 6316371 4513955 3544338 3966849
34934 3966849 4521459 4466953 3884593 2785489 1595972 1500890 2652647 3086763 1295104
34925 1295104 -1006369 -801053 2075280 4879901 5756794 5281571 4294861 2843622 1825026
34916 1825026 2929001 5610768 6595725 4336422 1860187 2702406 5659578 6664441
34908 6664441 4983840 4047813 5930463 8430671 8840390 7694820 6890745 6386043 5152582
34899 5152582 3872981 4133870 5678681 6741910 6735776 6539390 6373016 5537389 4384640
34890 4384640 4461328 6159248 7988035 8799225 9064105 9183706 8231811 5610396 2663015
34881 2663015 1226524 1387821 1927642 2298185 2850748 3584958 4062257 4415753 5126600
34872 5126600 5670136 4678008 2022872 -285023 -277508 1399497 2289416 1568530 1338794
34863 1338794 3526599 6538736 6893581 4075234 1490945 1657342 2725500 1867278 242846
34854 242846 1363748 5199225 7567497 5992788 2823780 1202591 1057658 1092962 1823063
34845 1823063 3746430 4795472 3139271 1115461 2549437 6691969 8714478 6574988
34837 6574988 3664908 3495266 5139658 5827719 5268483 4990358 5363182 5758277 6330081
34828 6330081 7318506 7603072 6225585 4587071 4834320 6536831 7267249 6286446 5335074
34819 5335074 5641724 6419365 6765625 6892265 6835210 6093781 5401719 6588209 9365230
34810 9365230 10505168 8160448 5098352 5177322 7940920 9451313 7797587 5049904
34802 5049904 3934738 5091975 7620847 9857981 9532454 5843880 1743047 1262992
34794 1262992 3913958 4928614 2293525 -23685 1867733 5850779 7269952 5780648
34786 5780648 4777668 5600457 6468908 6414829 6177147 5370479 2792868 -120146 -99607
34777 -99607 2892915 5187652 5080990 5071512 6753984 7513348 5069235 1910917 1691815
34768 1691815 3606176 4025381 2182028 680338 1220851 3026202 5061186 6975635
34760 6975635 8079192 7855031 7270605 7427128 7438974 5910942 3790015 3118812 3602297
34751 3602297 3414884 2979146 4445255 7275082 8147316 6235985 4879578 6260939 7852122
34742 7852122 6641397 4008589 3261828 4398819 4803787 3991414 4092212 5828820 7313812
34733 7313812 7440555 7609412 8811632 9256250 6817315 2663923 499385 2285224 6012479
34724 6012479 8020080 6818574 4259836 3265384 4800304 7164531 8051772 6928761
34716 6928761 5194100 4363336 4732611 5861369 7543852 9561710 10850297 10043704 7295477
34707 7295477 4737815 4261182 5215355 5259862 3353548 849009 -464709 -220894 1015771
34698 1015771 2829184 4684473 5655732 5619976 6011075 8092292 10890085 12109535 10916226
34689 10916226 8673006 7053105 6538159 6715741 6931192 6537858 5448466 4521715 4615224
34680 4615224 5375348 5795505 5675220 5531147 5479869 5444395 5963884 7178356 7474581 5326515
34670 5326515 2452658 2543743 6125939 9267911 8773021 6275804 5222246 5897877 6130608
34661 6130608 5479083 5508145 6323985 6102586 4695931 4811005 8027790 11720542 12030949
34652 12030949 8811172 5528105 4671826 5335341 5626170 5460505 5758584 6284170 6083971
34643 6083971 5480932 5715258 6621271 6668431 5813508 6130671 8342944 9850575 8357851
34634 8357851 5797396 5785477 8128762 9192402 7613293 6072765 6549495 7317832 6479682
34625 6479682 5408296 6062568 7236345 6628616 5164327 5888636 9060312 11455874 10799843
34616 10799843 8319849 6350217 5587593 5529047 5829639 6201993 6200650 5959726 6237273
34607 6237273 7170046 7915590 8038110 8274521 9258679 10312751 10345176 9509943 9196630
34598 9196630 10366225 12276256 13054520 11661665 9207835 7855834 8329467 9319537 9732557
34589 9732557 10316502 11983918 13695265 13799642 12789859 12568028 13159888 12584901 10448841
34580 10448841 9159630 10320093 12072121 11838289 10038980 8953221 9114303 9279871
34572 9279871 9265223 10059430 11115126 10368241 7832704 6582727 8513459 11244049 11493294
34563 11493294 9962259 9955860 11845793 12300740 9680843 7014209 7658176 10285508 10874896
34554 10874896 8540121 6531237 7495808 10198879 11595506 10366312 7609074 5387278
34546 5387278 5341131 7595458 10327379 11355928 10674518 10388920 11719813 13361856 13505486
34537 13505486 12149231 10445515 9029323 8233384 8853190 11173628 13899794 15463425
34529 15463425 15934666 16409875 17026807 16957435 16056429 15168999 14870225 14981923 15231412
34520 15231412 15442963 15294295 14798715 14694505 15387994 15940551 15217967 13634303 12539081
34511 12539081 12247286 11978387 11413998 10936649 10642154 10577993 11542124 13822488 15443521
34502 15443521 13992625 10503532 9093007 11737473 15568999 16834353 15710166 15199785
34494 15199785 16420395 17272257 15677941 12386543 10079313 10574333 13250104 15813061
34486 15813061 16527090 15809727 15390001 15922999 16219091 15186023 13619861 13234512 14465574
34477 14465574 16107432 16842432 16395504 15368284 14576506 14481334 14869915 15235608 15612831
34468 15612831 16471904 17487067 17341303 15658901 14375436 15778309 19342345 21945319
34460 21945319 21582025 19646141 18840417 19812835 20903842 20683520 19533187 18673778 18639247
34451 18639247 19159613 19925386 20874033 21936971 22941571 23748697 24318242 24736822 25228187
34442 25228187 25880120 26323898 26113205 25517200 25309941 25528862 25299406 24453537 24311100
34433 24311100 25783824 27587319 27863831 27029012 27178619 28796442 30019865 29531500 28351214
34424 28351214 28117945 29186239 31036867 32956598 33722425 32469957 30652414 31048521
34416 31048521 33730931 35340520 33992624 32486303 34230017 38059603 40206544 40065047
34408 40065047 40568538 43277486 46362339 47780241 47766264 47588152 47971113 49286118 51517262
34399 51517262 53716074 55100691 56726425 60310765 65451029 69957741 73014322 75989715
34391 75989715 79953289 84497412 89393143 95252856 101806663 107431940 111412091 115234779
34383 115234779 120598827 126913407 131318724 130557674 122493382 105932164 78880207 38207855
34375 38207855 -15689442 -72746174 -115853190 -134042956 -131798857 -122157874 -112883419
34368 -112883419 -103692349 -94175740 -86856505 -81859705 -75577128 -67121094 -60595269 -58254121
34360 -58254121 -56494978 -51841606 -46289386 -43067133 -41216944 -38429921 -35723844 -34942577
34352 -34942577 -34404985 -31406888 -26938709 -23870470 -22257463 -20276960 -18145375 -17260809
34344 -17260809 -16836829 -15145795 -13029422 -12617993 -13439016 -13136972 -11302844 -9472520 -8072223
34335 -8072223 -6391616 -4929449 -4855925 -5627967 -5677911 -4871159 -4027327 -2939859 -1176994
34326 -1176994 216380 144375 -516311 -451836 -38911 194677 1336726 3782985 5234623
34317 5234623 4022722 2527768 4015836 7784300 10802987 12483584 14223244 15709038
34309 15709038 15475557 14146090 13704946 14429119 15391198 16631224 18097465 18357545 17265031
34300 17265031 17535921 20509483 23152422 22854216 22027347 23863689 26985601 28930059
34292 28930059 31147265 35161903 37724655 36018828 33901743 36219680 40786992 43284911
34284 43284911 45735320 51583725 56890985 56519536 55069906 60315559 69197862 72851616
34276 72851616 72624700 77274667 86552978 92837056 97412786 108186782 122235500 129803685
34268 129803685 135386949 152513943 176860499 192166561 205916061 240875842 274575046
34261 274575046 230359935 69114048 -136180044 -264632785 -276498600 -235707580 -210614016
34254 -210614016 -203188150 -186444541 -161918765 -148657161 -145096973 -135405110 -119335727
34247 -119335727 -109189858 -105887630 -100061888 -91034141 -85970547 -84409732 -79961498 -74073300
34239 -74073300 -73323206 -75565175 -72519408 -64509718 -59844228 -60351612 -59495230 -54975487
34231 -54975487 -52124447 -53592959 -55296554 -54231585 -52110546 -49802430 -45582998 -40346695
34223 -40346695 -37941523 -38987232 -40108051 -39995467 -40583185 -41772964 -40768966 -37375924
34215 -37375924 -34634388 -33623214 -32701061 -32101379 -33873869 -36865639 -37294482 -35078997
34207 -35078997 -34199909 -35777602 -36169966 -33375878 -30175423 -29011036 -28385797 -26492450
34199 -26492450 -24412455 -23581861 -23456749 -23458041 -24192263 -25441518 -25951122 -26104569 -27557223
34190 -27557223 -29515166 -29036396 -25924195 -23509910 -23500179 -23967593 -23659333 -24035850 -25269471
34181 -25269471 -24552622 -20946871 -18117951 -19279230 -22519420 -24080425 -23563266 -22972516
34173 -22972516 -22983573 -23095039 -23533525 -24255784 -23723315 -21174026 -18556303 -17858548 -18069210
34164 -18069210 -17191672 -15851015 -16286805 -18620274 -20489152 -20053417 -17707460 -15221014
34156 -15221014 -14368528 -15749106 -17982720 -18834619 -17757568 -16236092 -15297620 -14432160 -13490803
34147 -13490803 -13432189 -14219647 -14304356 -13456780 -13684787 -15768854 -17409510 -16837339 -15825339
34138 -15825339 -16634607 -18134968 -17854118 -16229328 -15770226 -17038517 -18298743 -18500063 -18094628
34129 -18094628 -17392377 -16286166 -15146063 -14194388 -12746492 -10719206 -9736592 -10917364
34121 -10917364 -12941745 -14273653 -15518604 -17120780 -16858783 -13199251 -9519816 -10610190
34113 -10610190 -15539584 -18488312 -16921700 -14497920 -14812708 -16536637 -16778462 -15693165
34105 -15693165 -15070458 -14875980 -13927317 -12406309 -11350704 -10690420 -9632602 -8202895 -7056893
34096 -7056893 -6578437 -7113920 -8982647 -11334141 -12301838 -11321161 -9980983 -9606735 -9592679
34087 -9592679 -9337097 -9949655 -12104259 -13740025 -12377843 -8946188 -6858217 -7531074 -9103692
34078 -9103692 -9691490 -9636404 -9888773 -10216780 -10258341 -10815095 -12444772 -13593408 -11995771
34069 -11995771 -8042663 -5196150 -6225865 -9935384 -12670790 -12609136 -11296787 -10924168
34061 -10924168 -11497462 -11464996 -10102980 -8180239 -6838171 -6840763 -8448638 -10926031 -12526445
34052 -12526445 -12116490 -10579161 -9560246 -9296133 -9074630 -9360033 -11452701 -14860553 -17001384
34043 -17001384 -16227102 -13554472 -10741020 -8338805 -6575654 -6418164 -8223752 -10432264
34035 -10432264 -11079609 -9998214 -8488501 -7549136 -7392397 -7885248 -8443084 -8260141 -7595291
34026 -7595291 -7899658 -9587357 -10750199 -9568552 -7149375 -6208810 -7353029 -8437566
34018 -8437566 -7628491 -5543718 -4046912 -4114892 -5304294 -6488328 -6760717 -6099245 -5278841
34009 -5278841 -4939131 -5067600 -5605073 -6718390 -7876367 -7730975 -6044602 -4765762 -5640572
34000 -5640572 -7456532 -7540412 -5726669 -4767929 -6445270 -9162723 -10297041 -9494269 -8430003
33991 -8430003 -8158535 -8007204 -6989331 -5363327 -4336959 -4468751 -4923239 -4719532 -4287363
33982 -4287363 -4762479 -5794280 -5616116 -3975929 -3302892 -5465507 -8717220 -9855065 -8524283
33973 -8524283 -7128432 -6937572 -6782001 -5769101 -4878084 -5067010 -5710176 -5911563 -5969819
33964 -5969819 -6652959 -8035346 -9567354 -10348195 -9259851 -6170781 -3059827 -2301481 -3640358
33955 -3640358 -4660146 -4451924 -4573472 -5757298 -6229098 -4746764 -3140139 -3908618 -6782213
33946 -6782213 -9429084 -10357807 -9574704 -7657491 -5817475 -5649513 -7098786 -7823730 -6327812
33937 -6327812 -4504077 -5027976 -7314438 -8465148 -7562438 -6466729 -6500827 -6858904 -6726276
33928 -6726276 -6761464 -7540451 -8117041 -7246952 -5219368 -3658763 -3872924 -5779698 -8254468
33919 -8254468 -10345190 -11937746 -12872699 -11971699 -8426417 -4154768 -2612299 -4356900
33911 -4356900 -6013499 -5123239 -3645811 -4372317 -6158635 -5996364 -4229695 -3867037 -5373790
33902 -5373790 -6063596 -4757630 -3332229 -3050261 -2870523 -2377235 -3066642 -5347787 -7203131
33893 -7203131 -7322930 -6922221 -7050217 -6826057 -5894943 -5807380 -7054686 -7489143 -5932926
33884 -5932926 -4718571 -5999191 -7930030 -7571386 -5613668 -4879594 -5597702 -5657360 -4649927
33875 -4649927 -4155314 -4354494 -3703782 -2183347 -1903094 -3882485 -6607077 -8353204 -8940311
33866 -8940311 -8761947 -7938859 -6825862 -5801948 -4513280 -2864833 -2319026 -4076442 -6292152
33857 -6292152 -5728225 -2372767 261481 26842 -1311434 -1361674 -409756 -70410 -778955
33848 -778955 -2108470 -3751326 -4783966 -3801769 -1374124 -631067 -3575534 -8211873 -11113919
33839 -11113919 -11504799 -10907554 -10064775 -8492505 -6313658 -4352055 -2878689 -2160593 -3543486
33830 -3543486 -7678576 -12076069 -13026704 -10185561 -6839487 -5177061 -3891726 -1571425
33822 -1571425 138415 -1023135 -3893257 -4862083 -2561492 460495 968864 -1546012
33814 -1546012 -5031401 -7205424 -7150074 -5474191 -3639182 -2788794 -2846694 -2975935 -2912765
33805 -2912765 -3224870 -4123468 -4911091 -5138118 -5430568 -6253899 -6603168 -5300083 -3264264
33796 -3264264 -2815086 -4411259 -5703583 -4649467 -2208162 -831550 -1428142 -3148212
33788 -3148212 -5124178 -6685966 -6568195 -4025103 -729833 367220 -1503333 -4096955
33780 -4096955 -5042186 -4041574 -2006422 127408 1138895 -11579 -2488077 -4008683
33772 -4008683 -3875826 -3739971 -4335432 -3855902 -1482546 -135625 -2654384 -6729524 -7235960
33763 -7235960 -3268297 570956 341646 -2818506 -5374991 -5808303 -4948268 -4002492 -3830234
33754 -3830234 -4743772 -5757170 -5240307 -3280797 -2071331 -3008623 -4794073 -5406833 -4558540
33745 -4558540 -3189665 -2069384 -2041597 -3991859 -7114947 -8802817 -7879259 -6399080 -6522769
33736 -6522769 -7379024 -7168954 -6464862 -6524287 -6012807 -3127860 -2182 -686307 -4688399
33727 -4688399 -6898210 -4896815 -2077966 -1756045 -2363249 -1339467 -162731 -1647273
33719 -1647273 -4682050 -5810673 -4675397 -3923346 -4476366 -4839910 -4912634 -6455487 -9117526
33710 -9117526 -9742084 -7072677 -4057543 -3687169 -5101440 -5791004 -5443259 -5334122 -5597921
33701 -5597921 -5491124 -5201321 -5121611 -4253073 -1665557 1077025 1376687 -735051 -2747969
33692 -2747969 -3458663 -3995043 -4561459 -3080979 1177466 4885865 4198804 13569 -2902485
33683 -2902485 -1949683 449428 568571 -2078510 -5105545 -6674078 -6844460 -6172401 -4769243
33674 -4769243 -3043415 -2120807 -2827979 -4751173 -6649117 -7408019 -6510262 -4264569 -1955730
33665 -1955730 -1165349 -2375474 -4536424 -6328065 -7367768 -7808643 -7497215 -6409030 -5446586
33656 -5446586 -5661703 -6701665 -7089593 -6300628 -5569801 -6087248 -7218638 -7414109 -6470163
33647 -6470163 -5820293 -6413317 -7234682 -6672599 -4900436 -3825157 -4440433 -5302214 -4546083
33638 -4546083 -2673833 -1884170 -2805992 -3615141 -2881598 -1577508 -1160554 -1195072 -557708
33629 -557708 78735 -976660 -3634712 -6028748 -7238075 -8056557 -8864853 -8732422 -7242000
33620 -7242000 -5414783 -3970620 -2265117 20187 1579246 1140214 -671186 -2362506
33612 -2362506 -3530855 -4524106 -4992092 -4277633 -2849832 -1924638 -1676938 -998281 735102
33603 735102 2509605 2709287 925242 -1603280 -3321464 -3906579 -4157010 -4414794 -4014030
33594 -4014030 -2904282 -2706200 -4654699 -7166800 -7375004 -4883588 -2007970 -355232
33586 -355232 478989 582075 -1081270 -4117695 -5994148 -5391500 -4000793 -3517318 -3290241
33577 -3290241 -2647434 -2816471 -4233513 -4655881 -2840703 -1553199 -3466192 -6372358 -6514803
33568 -6514803 -4721373 -4503805 -5402985 -3652691 733826 3089613 1237840 -1596155
33560 -1596155 -2561459 -2986189 -4173037 -4043957 -1240553 1124246 -467607 -4697292 -7679832
33551 -7679832 -8406662 -8579567 -8675182 -7602534 -5404014 -3341756 -1754164 -158176 1026949
33542 1026949 894128 -327212 -1745313 -3177238 -4525395 -4826035 -3631324 -2334551
33534 -2334551 -2402136 -3277072 -3624020 -3388520 -2867910 -1238923 1781612 4161636 3942075
33525 3942075 2331179 1841705 2307751 1590904 -422776 -1613537 -1304538 -1194260 -2234492
33516 -2234492 -3142206 -2653827 -1192349 234282 1014947 539344 -1386350 -3475277 -4021286
33507 -4021286 -3218610 -2820906 -3488392 -4170606 -4057054 -3335761 -2078768 -244598 1250382
33498 1250382 1308079 360584 -498940 -1571004 -3495539 -4840119 -3744090 -1713765 -2325163
33489 -2325163 -5776148 -8299336 -7840935 -6570178 -6254567 -5057842 -1568146 1290667
33481 1290667 -103829 -4505129 -7241087 -6138010 -3151509 -872265 -69484 -382871
33473 -382871 -1173727 -1613131 -1461068 -1626371 -2829819 -4220036 -4412769 -3260537 -1599553
33464 -1599553 -96979 685508 215830 -879849 -849922 760763 2082266 1730882 1088644
33455 1088644 1923069 3215223 2672291 335778 -1745567 -2717614 -3393392 -4040026 -4124061
33446 -4124061 -4047464 -4806778 -5891323 -5638106 -3813273 -1957881 -1119867 -1045452 -1527422
33437 -1527422 -2610147 -3485980 -3184394 -2383989 -2535653 -3242700 -2777074 -1267933 -820588
33428 -820588 -2023131 -2975106 -2606653 -2326679 -3162133 -3813915 -3196940 -2582690 -3192607
33419 -3192607 -3674946 -2366176 -547046 -861872 -3410303 -5865768 -6885449 -6970024 -6251160
33410 -6251160 -4044655 -970637 882984 871243 933965 2537587 4034640 2844736 -584093
33401 -584093 -3015189 -2682038 -1447645 -1819143 -3266691 -3250543 -1332984 -61635 -1156354
33392 -1156354 -2849586 -2618506 -1071375 -766331 -1857248 -1754614 503217 2379680 1758553
33383 1758553 343435 874550 2577900 2262377 -587249 -2808331 -2261863 -951040 -1850220
33374 -1850220 -4363886 -5169530 -3015313 -439749 -186636 -1658993 -2224604 -994948 439801
33365 439801 804066 773462 1196339 1329417 168327 -1572451 -2422838 -2424478 -2670474 -2952028
33355 -2952028 -1919358 215876 1240012 6723 -1868787 -2531901 -2502450 -3235576 -4333371
33346 -4333371 -4138731 -2565468 -1424666 -1804254 -2617987 -2231475 -514355 1293595 2147700
33337 2147700 2031368 1366399 58522 -2402329 -5660225 -7835373 -7106576 -3999089 -1086853
33328 -1086853 -74192 -131428 427759 1875949 3170746 3349017 2029314 -535929 -3022945
33319 -3022945 -3606066 -2047123 -447442 -892501 -3100569 -5283487 -6207579 -5247328 -1871069
33310 -1871069 2971871 6058441 4920599 1249356 -994507 -575417 334619 352084 879564
33301 879564 3174372 6071281 8002875 9204560 10340148 10625139 9099514 6677674
33293 6677674 5290759 5534553 6200924 5515126 2214046 -3486861 -9165001 -11674863 -10425921
33284 -10425921 -8033758 -6740870 -5731117 -3445840 -908130 -453213 -2088507 -3559242
33276 -3559242 -3729991 -3656975 -4294713 -5246334 -6044277 -6705560 -6624804 -4901096 -2456849
33267 -2456849 -1901982 -4177596 -6939527 -7585320 -6519654 -5904951 -6360958 -6846715 -7144531
33258 -7144531 -8169937 -9573876 -9164762 -5866670 -1861937 -264422 -1315269 -2451725
33250 -2451725 -2013389 -1208901 -1819475 -3404473 -4056169 -3100424 -1572438 -351782 621975
33241 621975 1195397 634747 -1022203 -2545554 -3206881 -3815148 -5241248 -6901982 -7633493
33232 -7633493 -7193590 -5984821 -4224375 -2421655 -1677897 -2234176 -2642246 -1794755 -830408
33223 -830408 -1319273 -2464295 -2240429 -724271 108028 -344749 -827093 -1115652 -2528000
33214 -2528000 -4813788 -5396221 -3155052 -522114 -35947 -918987 -1075499 -607070 -998115
33205 -998115 -2233245 -3178236 -3833361 -4868671 -5757204 -5713344 -5710062 -7022486 -8379445
33196 -8379445 -7408660 -4679686 -3236743 -3829086 -3786128 -1548372 778103 979837 144016
33187 144016 416914 1475331 1523113 228359 -1531908 -3486974 -5341935 -5696033 -4068645
33178 -4068645 -2792220 -4004272 -5671921 -4033596 276193 2396636 260195 -2418734
33170 -2418734 -1943911 121924 312284 -1034113 -1153510 -206495 -1054354 -4072958 -6178423
33161 -6178423 -5677089 -4557871 -4607405 -4382551 -2156977 546685 946289 -1012575 -3151849
33152 -3151849 -4461377 -5475003 -5963883 -5020260 -3450647 -3463256 -5334072 -6580229 -5361838
33143 -5361838 -2836149 -1104851 -580278 -644272 -1210976 -1894674 -1016464 2304741 5740767
33134 5740767 5805204 2391864 -873696 -1355405 -478551 -980957 -2854674 -3926665 -3556792
33125 -3556792 -3440744 -4506562 -5096210 -3444839 -605989 804611 204287 -452023 216343
33116 216343 1335522 1888735 2560882 3961705 4611854 3002764 809300 1298826 4461607
33107 4461607 6489618 4992876 2162527 1115762 1315664 52714 -2905000 -4975119
33099 -4975119 -4782326 -3949176 -4317337 -5292884 -4929233 -2560108 448373 1968495 743923
33090 743923 -2600071 -5739241 -6251701 -3492158 919159 4168965 3968871 297903 -3925492
33081 -3925492 -4941158 -2018712 1499979 2090951 27389 -1948825 -2789460 -3657163 -4768012
33072 -4768012 -4487752 -2182386 290936 945753 -163736 -1947616 -3768462 -5022075
33064 -5022075 -4912239 -3758077 -3027308 -2972015 -1838386 1215196 4015607 3961300 1481598
33055 1481598 -929232 -2062260 -2343513 -1726985 288995 2680796 3272407 1588815 -421604
33046 -421604 -1059578 -760708 -728719 -1109959 -1381071 -1478902 -1608855 -1615026 -1337307 -1122552
33036 -1122552 -1332393 -1697884 -1684283 -1181693 -375436 732158 2070178 2886791 2056103
33027 2056103 -637770 -3747548 -5112903 -3754777 -742509 1864961 2753433 2003479
33019 2003479 510169 -770361 -1303383 -1301774 -1424324 -1701776 -1215906 412807 1843334
33010 1843334 1596324 373151 82324 682856 134618 -2049418 -3500418 -2395723 -143081
33001 -143081 834323 203314 -1080900 -2917615 -5264658 -6631851 -5763208 -3834154 -2720792
32992 -2720792 -2123224 -853803 160602 -751227 -2348624 -1727689 770252 1519894 -853557
32983 -853557 -3436731 -3789746 -3383118 -4358457 -5777647 -5545500 -3886099 -2444281 -1633416
32974 -1633416 -1195624 -1819215 -3737095 -5029267 -3895002 -1622960 -721946 -936707 29998
32965 29998 2251639 3130447 1576674 -208546 -103685 1152804 1860295 2042309 2546758
32956 2546758 2894785 1984631 293596 -423769 415675 1522719 1740667 1546500 1948939
32947 1948939 2748336 2766388 1439120 -650811 -2700656 -4271039 -4863146 -3972860 -2165699
32938 -2165699 -1209610 -2159327 -3823458 -4125175 -2585155 -431059 1277344 2253235 2010422
32929 2010422 42535 -2712101 -4161730 -3466063 -1952960 -1125615 -989450 -919292 -896976
32920 -896976 -1092041 -1228550 -1055965 -635912 90939 959424 891639 -759342 -2226640
32911 -2226640 -1091219 1568633 1766503 -1469815 -4035274 -2772496 -379786 -1097287
32903 -1097287 -4117942 -5331890 -3929730 -2852239 -3421590 -3962242 -3819199 -4467903 -5848329
32894 -5848329 -5519025 -2789343 -291695 96617 -155910 625077 1452129 869947 -485225
32885 -485225 -1538161 -2772893 -4520818 -5271203 -3883272 -1818867 -1090256 -1487067 -1753084
32876 -1753084 -1852597 -1973766 -1021406 1388759 2950269 1519924 -1194984 -1859769 -657952
32867 -657952 -878217 -3487387 -5564192 -4909231 -3153355 -2813568 -3626778 -3641809 -2403865
32858 -2403865 -1247728 -1222235 -2071770 -2790551 -2311804 -231537 2387108 3533329 2318217
32849 2318217 6424 -1626961 -2295883 -2790945 -3272603 -3156740 -2495674 -2305993 -3236908
32840 -3236908 -4691526 -5638822 -5762152 -5478727 -5311496 -5603201 -6328241 -6660384 -5283854
32831 -5283854 -2019966 1207502 2199277 1211580 468381 722509 108202 -2622930 -5584905
32822 -5584905 -6279631 -5196894 -4571026 -4545975 -3380750 -1091566 178724 -283698 -874150
32813 -874150 -1009099 -2120091 -4018545 -3661378 146529 3705627 3004106 -860017 -3903914
32804 -3903914 -4947973 -5553144 -5767886 -4061180 -1136741 74879 -1331530 -3203895
32796 -3203895 -3990341 -4329923 -4442538 -3183342 -820900 195929 -1260364 -3182560 -3535230
32787 -3535230 -2855455 -2347086 -1806134 -1192179 -1947630 -4586375 -6881289 -6753566 -5358143
32778 -5358143 -4901333 -4825289 -2934100 511531 2661874 1970610 -107795 -1494138 -1628171
32769 -1628171 -989058 -162315 230411 -45894 -265115 343882 1174925 908052 -556999
32760 -556999 -2119234 -3247125 -4225922 -4676310 -3579891 -1224942 444036 142154 -1342593
32751 -1342593 -2722029 -3895540 -5119853 -5661767 -4651807 -2724150 -1517740 -1666392
32743 -1666392 -2286180 -2460747 -2322575 -2443425 -2914419 -3466932 -4006752 -4505967 -4630253
32734 -4630253 -4017608 -2855427 -1677145 -627084 393873 734017 -833343 -4144355
32726 -4144355 -6674663 -5905348 -2501158 179016 -122661 -2490487 -4739758 -5864475
32718 -5864475 -5893064 -4795007 -2827359 -1067742 -335706 -162422 152941 208428 -564173
32709 -564173 -1318735 -648601 1281127 2842986 3025623 2114225 518726 -1548801 -3161306
32700 -3161306 -3050914 -1433855 -194654 -565279 -1567668 -1436096 120821 1682233 1667739
32691 1667739 -245101 -2836543 -4271745 -3711362 -2053593 -767780 -380651 -744083 -2071829
32682 -2071829 -4306270 -5834898 -4725586 -1565552 692726 396939 -916003 -1173020
32674 -1173020 -647152 -834743 -1824930 -2503058 -2527451 -2407289 -2145962 -1448914 -938573 -1478581
32664 -1478581 -2380450 -2011660 -450986 140357 -1508259 -3837433 -4511660 -3413246 -2387505
32655 -2387505 -2539311 -3022096 -2525810 -991857 553077 1366023 1698507 2144035 2533298
32646 2533298 1841331 -446707 -2993671 -3389669 -841494 2380938 3098024 812277 -1777455
32637 -1777455 -2128273 -706059 221487 -342967 -1571633 -2746189 -4004901 -5086160 -5131355
32628 -5131355 -4370447 -4301280 -5153812 -4849043 -2074424 1044803 1486327 -396055 -1570564
32619 -1570564 -847608 -36844 -431150 -851412 -53429 1269361 2033494 2247286 1755538
32610 1755538 -352543 -3534858 -5072938 -3518085 -1044496 -198809 -108080 1382338 3374973
32601 3374973 3133719 841897 -495666 107370 498788 -302126 -355659 1220608 2012126
32592 2012126 377345 -1127977 543418 3775375 4280438 1330579 -1378464 -1100407
32584 -1100407 764541 1614206 1254117 1114504 1518645 1446394 395415 -847805 -1276382
32575 -1276382 -791320 -160989 -128411 -632044 -988672 -936074 -1166104 -2409406 -4275858
32566 -4275858 -5608551 -5851464 -5457621 -5049023 -4819255 -4694464 -4405816 -3458022 -1760028
32557 -1760028 -242181 8858 -704977 -935274 -70339 889979 913950 347482 182991
32548 182991 726134 1624718 2536048 3117699 2967474 2210249 1603419 1556705 1718357 1943242
32538 1943242 2594909 3192543 2191759 -509212 -2215948 -694096 2124588 2334632 -239794
32529 -239794 -1495401 1025233 4473740 4678114 1643105 -1152333 -1620522 -905704 -942860
32520 -942860 -2236571 -4015659 -5070040 -4459046 -2587196 -1377603 -2241716 -4218189 -5313291
32511 -5313291 -5176871 -4953370 -4906313 -4038125 -2089495 -151120 957055 1295487 608278
32502 608278 -1615031 -4356111 -5270715 -3698656 -1898024 -2096436 -3624050 -4245126 -3222852
32493 -3222852 -1644000 -465862 329188 946116 1253162 989995 -48455 -1743586 -3261805
32484 -3261805 -3527099 -2416398 -844729 428070 1090979 438684 -2102418 -5184254 -6179019
32475 -6179019 -4519629 -2538699 -1902410 -1385676 168756 1035403 -657748 -3200160 -3452751
32466 -3452751 -1639593 -703031 -1428110 -1654268 -477434 150702 -1087597 -2663462 -2771974
32457 -2771974 -1892264 -1513542 -2065504 -3129909 -4127756 -4069156 -2307325 -142567 220577
32448 220577 -1054033 -1340284 446329 2077322 1413191 -788517 -2970131 -5269358 -7890573
32439 -7890573 -9177241 -7889753 -5837877 -5572358 -6529821 -6052904 -3468836 -648781 940535
32430 940535 1297694 417671 -1689068 -3565716 -3383934 -1766005 -1292543 -2706519 -3739559
32421 -3739559 -2495665 -99690 1093317 454745 -879660 -1855237 -2295311 -2470101 -2630371
32412 -2630371 -2604793 -1629645 765980 3543005 4701374 3446775 1131501 -282211 -103917
32403 -103917 882185 1380621 570742 -1164822 -2320069 -1749214 -191274 397748 -853914
32394 -853914 -2824443 -3869236 -3427403 -2095820 -984424 -1161036 -2799857 -4535384 -4494397
32385 -4494397 -2427405 -195409 237607 -1207495 -2945905 -3354127 -1977794 252369
32377 252369 1683529 1257517 -562462 -2358499 -3128267 -2814602 -1925791 -1285765 -1725764
32368 -1725764 -3135534 -4165956 -3847001 -3096870 -3409347 -4406732 -4237774 -2335738 -146053
32359 -146053 1050098 1374621 1107271 -27896 -1713645 -2830669 -3125594 -3484161 -3840279
32350 -3840279 -2723877 31934 2200729 2423239 2577590 4596246 6555660 5012886
32342 5012886 587891 -2077494 -447017 2602410 2807264 -256820 -3544177 -4671936
32334 -4671936 -3891082 -2614977 -1685853 -1217418 -1048440 -924047 -667461 -387603 -330579
32325 -330579 -537968 -841032 -1109765 -1281487 -1231365 -919481 -672801 -949164 -1600940 -1702130
32315 -1702130 -596071 996550 1588255 856251 243133 1053393 2574676 3015202 1942520
32306 1942520 637428 45038 -363595 -1261230 -2100092 -1875077 -626974 515737 446525
32297 446525 -1131944 -3472939 -4919918 -3949501 -781570 2416523 3492826 2204092
32289 2204092 -153999 -2389452 -4044762 -4880753 -4677792 -3683276 -2751986 -2749495 -3749258
32280 -3749258 -4752956 -4434713 -2571431 -572740 -22044 -804470 -1340372 -548272 1166825
32271 1166825 2634152 2691672 690633 -2321561 -3312293 -317142 3997978 4343966 -598699
32262 -598699 -6018180 -7005065 -4413046 -2402822 -2238087 -1816407 -338040 253837 -1124116
32253 -1124116 -2725331 -2766983 -1959898 -1819028 -1996683 -911297 1626447 3741070 3547548
32244 3547548 1342747 -514785 -50988 2090363 3421062 2703593 1278761 809771 953918
32235 953918 382267 -899123 -1604671 -882958 1098620 3385200 4037939 1199234 -3983890
32226 -3983890 -7075787 -5322726 -1592618 -578769 -2212533 -2343510 498537 3029698
32218 3029698 2570185 779049 525133 1974803 3515327 4224268 3806547 2069863 -146734
32209 -146734 -1335401 -1593826 -2466698 -3757064 -3217627 -607799 1018008 -79195 -1477595
32200 -1477595 -759823 431315 -449037 -2237262 -2240853 -1019774 -992867 -1615303 -207632
32191 -207632 2871548 4021158 1736280 -1379350 -2610653 -2096648 -1099452 -168257 94826
32182 94826 -971274 -2393606 -2247833 -887357 -995599 -3317835 -4895872 -3203416 152927
32173 152927 1894864 1584455 1418830 2442082 3198443 2164751 -40305 -1374359 -721583
32164 -721583 755733 713620 -1670342 -4432556 -5031182 -3484634 -2082745 -2072160 -2192343
32155 -2192343 -907397 1362641 2950778 2790924 1013157 -1217189 -1995891 -80822
32147 -80822 3321281 5284269 4325659 1774272 -474172 -2085835 -3322471 -3492005 -1826008
32138 -1826008 991966 3480060 4924169 5294345 4384630 2223673 -203928 -1759402
32130 -1759402 -2328629 -2403295 -2051490 -1212696 -492679 -672036 -1681199 -2726593 -3048936
32121 -3048936 -2119220 118516 2540266 3324370 2051902 412029 -160032 -394622 -1350120
32112 -1350120 -1908129 -289858 2529733 3464542 1605249 -555478 -1050042 -1313034 -3425812
32103 -3425812 -6170135 -6339547 -3587924 -1441423 -2580372 -4963622 -4438106 -402167
32095 -402167 3300718 3488411 1586776 1045126 2305383 2674765 778323 -1486714 -2156776
32086 -2156776 -2088130 -3127007 -5000718 -5893590 -5198033 -3880791 -2648814 -1516934 -948786
32077 -948786 -1622076 -2862790 -2934898 -1455078 -217092 -795386 -2248170 -2213885 72332
32068 72332 2800913 3804956 3082208 2388149 2458890 1848838 -562278 -2985743 -2652964
32059 -2652964 -139311 734361 -1819345 -4794953 -4588534 -1821982 324584 801701 770464
32050 770464 257864 -1726364 -4059976 -4151742 -2263455 -1768135 -3942340 -5706654 -4312909
32041 -4312909 -1417451 -169802 -604707 -672666 -92509 -107098 -397158 626184 2633065
32032 2633065 3346334 2142172 1217033 2238496 3819285 3654726 1837458 536545 980422
32023 980422 2159259 2611061 2441910 2851603 3973523 4162815 2054935 -1218445 -2956597
32014 -2956597 -2019300 103358 1560417 2109309 2172006 1424176 -314188 -1823566 -1775686
32005 -1775686 -783277 -619866 -1640819 -2450619 -2104601 -1272946 -1030313 -1599594 -2508258
31996 -2508258 -3133639 -3032729 -2414865 -2008880 -1740887 -334001 2477436 4268705 2600450
31987 2600450 -1039047 -2576917 -925931 586023 -587278 -2362181 -1404467 1795633
31979 1795633 3875774 3402897 2022605 1296546 920199 231154 -595265 -1265441 -1648683
31970 -1648683 -1071674 1021038 3349869 3509629 1154422 -1079080 -847943 983207 1875278
31961 1875278 1007374 -234332 -488114 276066 1413033 2295274 2325742 1296409 -89378
31952 -89378 -819156 -803227 -822725 -1236888 -1561340 -1481725 -1402226 -1590241 -1570425 -966381 -302847
31941 -302847 -211792 -290427 340309 1497371 1924786 1047289 -76613 -88899 868057 1330384
31931 1330384 344303 -1469695 -2802593 -3125007 -2849751 -2221004 -745993 1748503 3887455
31922 3887455 3663437 1058651 -1167547 -438151 2297931 3601872 2042235 14357
31914 14357 159533 1443517 627801 -2899664 -5819134 -4912649 -924896 2536730 3054980
31905 3054980 1316470 -572039 -1527956 -1933452 -2264310 -2060827 -643943 1465342 2704330
31896 2704330 2390179 1616204 1417753 896794 -1377873 -4550214 -5958039 -4686929 -2774884
31887 -2774884 -2142429 -2123471 -1251701 123936 684325 392983 39913 -592259 -2107559
31878 -2107559 -3639773 -3800134 -3259599 -4059639 -6070229 -6477524 -3736563 -92126 1169109
31869 1169109 -382631 -2465650 -3077202 -2035121 -263085 1186385 1646926 1201882 421040
31860 421040 -461965 -1529677 -2315218 -2120550 -1522695 -2084759 -3807831 -4458776 -2706486
31851 -2706486 -482615 -481488 -2346641 -3301873 -2025426 -20051 656417 -590249 -2925636
31842 -2925636 -4609785 -3763987 -250672 3380193 4406362 3140108 1947209 1549751
31834 1549751 602257 -1149034 -1976840 -1053014 267299 927334 1520156 2088058 1160856
31825 1160856 -1395277 -3033819 -2115288 -629734 -933134 -1853099 -990188 845255 1003601
31816 1003601 -295448 -427651 878837 1212530 183321 388478 2520833 3408148 999608
31807 999608 -2027195 -2287012 -558727 411831 672366 1923929 3063429 1079481 -3633641
31798 -3633641 -6728584 -5693105 -3048556 -2221418 -2851392 -2415840 -712992 -16637 -1303083
31789 -1303083 -2769665 -2581873 -1365197 -992371 -1893837 -2745419 -2529838 -1804938 -1627734
31780 -1627734 -2011044 -2059303 -1161123 616676 2840033 4457880 3730669 36333 -4136749
31771 -4136749 -4963556 -1994354 711566 -319727 -3397771 -4359044 -2545275 -1145328
31763 -1145328 -1925659 -2859647 -1805651 272761 1284870 1057440 628555 134187 -723438
31754 -723438 -1286698 -876964 -302007 -747227 -1804684 -2136360 -1475864 -487728 669265
31745 669265 2007936 2611426 1719527 440049 398429 1014213 355802 -1300392 -1262456
31736 -1262456 1552802 4670539 5341097 3971304 2843597 2754766 2488274 907250 -1681286
31727 -1681286 -3900742 -4374548 -2930659 -1082814 -513596 -914130 -565725 754471 1311388
31718 1311388 548312 453055 2230195 3673826 2202885 -969431 -2483724 -1847923 -1817696
31709 -1817696 -3784020 -5648336 -5064219 -2530815 -214850 632486 193375 -519514 -52764
31700 -52764 2227136 4573878 4193986 1003631 -1721770 -1682700 -697380 -1647629 -3847884
31691 -3847884 -4068993 -1530088 956448 1224521 638279 1455692 3098213 2968443 356694
31682 356694 -2280656 -2282696 139552 2505775 3134071 2665497 2515650 2747930 2239321
31673 2239321 589357 -1127658 -1770841 -1532036 -1370349 -1526919 -1315038 -267606 1143004
31664 1143004 2075444 2210004 1863271 1417337 825287 -320043 -2225832 -4375484 -5674631
31655 -5674631 -5340450 -3739151 -2209694 -1857523 -2497544 -2997164 -2764874 -2531234 -3206388
31646 -3206388 -4278175 -4232954 -2666821 -951182 -306999 -274847 17714 124821 -736986
31637 -736986 -1708960 -1197884 344283 562140 -1374406 -3338572 -3241783 -1921164 -1692577
31628 -1692577 -3136192 -4815053 -5494864 -5153350 -4142740 -2803752 -1921208 -2259725 -3245436
31619 -3245436 -3027859 -502647 3027680 4702621 2860272 -971657 -3154694 -1565722
31611 -1565722 1989482 3770080 2413646 57803 -1015193 -1135846 -1651797 -2233524 -1666061
31602 -1666061 -445130 -434600 -1998181 -3318321 -2927734 -1449024 -316492 15515 -29355
31593 -29355 -99318 -73229 186908 755873 1594145 2637289 3531857 3478728 2096291 373510
31583 373510 -144626 712431 1442069 731415 -1148726 -3092838 -4508932 -5377706 -5500145
31574 -5500145 -4434402 -2338034 -595509 -1044147 -3902307 -6609320 -5953540 -1930477
31566 -1930477 1785590 2275960 935163 886120 2110890 1871293 -394159 -1786613 -414384
31557 -414384 1706712 1925852 878258 865960 1833140 1590486 -442707 -2163224 -1824005
31548 -1824005 -366577 75014 -1053069 -2308040 -2232731 -1095752 -436188 -1042915 -1948024
31539 -1948024 -1924407 -1411993 -1763386 -2765747 -2603718 -775003 723014 232647 -1088890
31530 -1088890 -1199945 -349136 -386571 -1635346 -2499671 -1973250 -663775 692382 1958968
31521 1958968 2670597 2135662 893408 446744 1003582 1083563 49483 -690936 -96852
31512 -96852 552445 -252593 -1480781 -945292 1169562 2369756 1464292 -19856 -660799
31503 -660799 -1381068 -3476726 -5843171 -6124698 -4143319 -2264107 -2113295 -2591564 -1897050
31494 -1897050 -176847 1031824 1135979 829035 466738 -360785 -1442194 -1578303 -372676
31485 -372676 645489 -214501 -2420206 -3730813 -3046085 -1683513 -1410518 -2034314 -1849361
31476 -1849361 -263879 1099722 534511 -1212779 -1722677 -258802 1013264 16798 -2110064
31467 -2110064 -2426841 -330602 1554230 1049981 -696511 -1167186 -147901 192508 -1395549
31458 -1395549 -3452008 -3837402 -2513233 -1379343 -1729291 -2875251 -3536337 -3678815 -4066744
31449 -4066744 -4459788 -3696674 -1884171 -1013619 -2358584 -4446053 -5067378 -4364448 -4071204
31440 -4071204 -4348486 -3705083 -2017737 -1109971 -1710684 -2243309 -1717906 -1500343 -2583022
31431 -2583022 -3176843 -1214406 2205273 4185088 3866898 2677341 1550255 339290
31423 339290 -387698 480091 2372968 3164441 2024519 299269 -958553 -2425307 -4595396
31414 -4595396 -6171049 -5756965 -4116830 -3311247 -3969022 -4534438 -3308304 -612868 1381682
31405 1381682 967285 -1168328 -2761583 -2729219 -2176278 -2184408 -1935612 -456256 849106
31396 849106 -328873 -3352082 -4640142 -2259682 1437623 2911643 1645061 -126830
31388 -126830 -747903 -520133 -217335 146484 741107 1098787 479239 -1144839 -2754397
31379 -2754397 -3069551 -1772778 136977 1387630 1667568 1548572 1460296 1258770 679957
31370 679957 -292471 -1422104 -2156377 -1815741 -408992 954500 1050595 -225664 -2002374
31361 -2002374 -3332034 -3457347 -1961163 458722 2097618 2182513 1930972 2476126 2767721
31352 2767721 1320477 -854753 -1427050 -420872 -83204 -1024266 -1282330 146348 1584830
31343 1584830 1585920 1033669 905233 314702 -1371147 -2528268 -1546615 454850 1330582
31334 1330582 1052656 1006652 1200519 430248 -1376855 -3012256 -3808478 -3941780 -3409186
31325 -3409186 -2310280 -1584312 -1849117 -2133907 -1443287 -801128 -1701756 -3170022 -2795694
31316 -2795694 -565620 819204 -137179 -1714075 -1666965 -151215 946346 319146 -1737463
31307 -1737463 -3525487 -2954300 280337 3380612 3024135 -347724 -2713254 -1688997
31299 -1688997 416252 49966 -2837900 -5284385 -5362377 -3801021 -2171921 -1310742 -1449644
31290 -1449644 -2384122 -3286241 -3399166 -2992039 -2707717 -2098495 -81432 2897912 4476456
31281 4476456 3005106 -224114 -2364858 -2235111 -1144703 -612207 -450158 286056 1341514
31272 1341514 1424494 177510 -1154727 -1434312 -1162223 -1624784 -3022119 -4194719 -4020948
31263 -4020948 -2525092 -747919 56943 -617998 -1873761 -2025840 -477029 1377691 1829800
31254 1829800 1062230 715533 1487560 2352232 2244651 1285692 -36101 -1658176 -3201944
31245 -3201944 -3564719 -2385210 -1183144 -1691804 -3313454 -3616603 -1606775 750214 1030299
31236 1030299 -477345 -1242331 83349 1932786 1995232 186861 -1582040 -2218368 -2648778
31227 -2648778 -3807130 -4705984 -3767131 -1504636 -327042 -1411439 -3100803 -3189373 -1819918
31218 -1819918 -958770 -1529300 -2450759 -2533038 -1930327 -1213167 -323734 531332 117851 -2032311
31208 -2032311 -3726372 -2214164 1585356 3246289 353851 -4083559 -5481450 -3399117
31200 -3399117 -1153396 -748583 -966353 -384042 481857 757673 646886 278389 -931726
31191 -931726 -2647989 -3136908 -1708746 -21462 431584 539232 1627043 2762686 2064626
31182 2064626 -224760 -1995079 -2056444 -917536 694921 2316397 3095772 2367320 739657
31173 739657 -682010 -1706837 -2424004 -2078019 -392839 856399 -93210 -1909229 -1755584
31164 -1755584 226007 930381 -850656 -2604963 -2216905 -1117561 -1617900 -3348322 -4365787
31155 -4365787 -4137113 -3420396 -2493784 -1488530 -1437857 -2970912 -4662087 -4587803 -3033620
31146 -3033620 -1844775 -1503489 -798810 690451 1738889 1416292 201599 -1267646 -2896233
31137 -2896233 -3926411 -2795164 471079 3035382 2220108 -894951 -2664830 -1572821
31129 -1572821 162746 161151 -872205 -816091 441021 1274988 1264617 1464833 1704937 168548
31119 168548 -3308663 -5735307 -4540797 -1166989 878706 520928 -434045 -668000 -817827
31110 -817827 -1558871 -2349982 -2564524 -2191674 -960054 1588743 4509747 5531879 3759755
31101 3759755 1137528 104522 598213 552420 -997683 -2457557 -1669433 1151770 3217484
31092 3217484 2341858 -201121 -1232112 -109848 244856 -2243121 -5369649 -5649792 -3175559
31083 -3175559 -773856 627922 2472573 4637344 4650934 1751722 -1368677 -2271102 -1642400
31074 -1642400 -1023159 -186317 1326478 2170969 917374 -1561497 -3265543 -3506896 -2716268
31065 -2716268 -1131560 779206 1817713 1488866 835396 641156 248043 -551158 -266682
31056 -266682 1812811 3593238 2845471 581083 -538289 -86892 171506 -623983 -1677625
31047 -1677625 -2203264 -1701582 621191 4348961 6522109 4569167 347308 -1489083
31039 -1489083 612401 3366188 3350230 1110016 -415992 189257 1623811 1650099 -558030
31030 -558030 -3322893 -3829475 -1273313 1950370 3202983 2798028 2745641 3392669 3472117
31021 3472117 2749066 2128213 1496348 46242 -1390968 -1079570 421228 658775 -666356
31012 -666356 -1063947 431441 1355486 -230009 -2573916 -3029420 -1872517 -1197057 -1617824
31003 -1617824 -2124246 -2016634 -1245331 88849 1140090 563497 -1167744 -1302129 1426160
30994 1426160 4122302 3223604 -467528 -2901125 -2228583 -267855 1285123 2946192
30986 2946192 4908455 5281510 2792246 -467467 -1165070 1016207 3057409 2524950 301160
30977 301160 -1141139 -1076191 -992774 -1986275 -2965796 -2209050 -1551 1498216 1067676
30968 1067676 -92097 -250176 448895 502568 -521919 -1277076 -464276 1546693 3318019
30959 3318019 3928774 3427928 2131544 271477 -1541738 -2230586 -1283172 324820 900728
30950 900728 -185278 -2000777 -3344692 -3832537 -3569243 -2716023 -1877186 -1918364 -2591264
30941 -2591264 -2299543 -342078 1491896 1024469 -1254759 -2931548 -3083902 -2986986 -3347145
30932 -3347145 -2978038 -1031030 1198376 1871210 878813 -493064 -1229156 -996045 185081
30923 185081 1589705 1757635 -74055 -2745760 -4206085 -3685569 -2337874 -1841306 -2733411
30914 -2733411 -4095290 -4767518 -4807497 -5270185 -6237672 -6002409 -3376277 -87431 944467
30905 944467 -425027 -1389242 -381157 740826 -203942 -2368262 -3356846 -2748830 -2175459
30896 -2175459 -2490840 -2750652 -2051545 -892077 -214553 -21724 347720 832165 242972
30887 242972 -2184430 -5002876 -5424771 -2692726 433184 793577 -1444185 -3745186 -4856941
30878 -4856941 -5124469 -3935588 -210628 4262678 5547717 2894649 132401 69758 799471
30869 799471 -138367 -1298978 -389442 1040551 136869 -1916532 -1625953 731180 1440032
30860 1440032 -314741 -1087746 948464 2983534 2142633 -375932 -1789623 -1581292 -738244
30851 -738244 532434 2088136 2651016 1507301 85199 -44432 458216 55576 -1165903
30842 -1165903 -2164478 -2962088 -4001564 -4458190 -3423221 -2141103 -2605966 -4001518 -3109399
30833 -3109399 956833 4620155 3991927 -131302 -3176001 -2278515 741765 2193041
30825 2193041 993122 -710780 -901737 -290066 -947502 -3193915 -5025888 -4670650 -2715152
30816 -2715152 -1182949 -1090579 -1616659 -1556375 -963038 -948703 -1916394 -2492541 -945819 2179100
30806 2179100 3786257 1567868 -2824441 -5238524 -3752232 -658313 788331 309252
30798 309252 115799 1330484 2621113 2579736 1915434 2189139 3154912 2898787 854614
30789 854614 -700531 701999 4236708 6417369 5273219 2474702 762598 657878
30781 657878 866106 858584 1338846 2453694 3208507 2968400 2298363 1864232 1498746 879479
30771 879479 287939 47454 -186083 -870279 -1635885 -1559426 -388935 909693 1042953
30762 1042953 -220617 -1740604 -2298996 -2060110 -2231471 -3256789 -4147511 -3985161 -3206736
30753 -3206736 -2661406 -2201906 -1269985 -285931 -215542 -1071022 -2048608 -2926514 -4068846
30744 -4068846 -5189719 -5501657 -5169232 -5225463 -5739928 -5356042 -3158956 -25494 2295317
30735 2295317 2680127 1176293 -936855 -1687531 -310992 1351849 844759 -1405358 -2389811
30726 -2389811 -730343 1441165 1689729 327641 -1051040 -2131768 -3165545 -3324816
30718 -3324816 -1963568 -422762 -381444 -1203570 -1097081 -185308 32463 -165725 1061580
30709 1061580 3525547 4471476 2596627 123420 -540908 -88756 -501884 -1719895 -2240044
30700 -2240044 -1825032 -1330879 -554720 1356876 3526261 3757707 1774174 -50522 8387
30691 8387 849051 722238 -158830 -663222 -896529 -1415289 -1412090 49643 1625726 1087274
30681 1087274 -884763 -1032842 1623995 3936681 3087124 509043 -774060 -723323 -1355463
30672 -1355463 -2522766 -2052773 -28471 434889 -2206775 -5163789 -4865874 -1583852 1227780
30663 1227780 1156533 -1130733 -3397745 -4022938 -2981887 -1625156 -1274692 -1547381 -723772
30654 -723772 1596250 3156971 1566317 -2386260 -5288273 -4938919 -2469623 -434115
30646 -434115 155066 236653 768029 1338644 959921 -304860 -1225964 -1025457 -380230 -246410
30636 -246410 -300336 471928 1926412 2669822 1910932 391095 -683476 -677879 541440
30627 541440 2503614 3783860 3142590 1397022 669949 1252806 997294 -1218045 -3387325
30618 -3387325 -3401031 -2394547 -2712196 -3768734 -2908325 -100922 1365639 -240592 -2181573
30609 -2181573 -951302 2855010 5473779 4943077 3006994 1999592 1739535 543264
30601 543264 -1766028 -3338950 -2742869 -741306 863272 1330331 1192317 1025582 1051185
30592 1051185 1619549 2900178 4090854 4067984 2969591 2070170 1973403 2092590 1985038
30583 1985038 1752823 978259 -884349 -2582197 -1725884 1561077 3881608 3008465 880557
30574 880557 143546 32928 -1361553 -2719775 -1323759 1673417 2170324 -440703 -2006812
30565 -2006812 -64941 2328274 1450060 -1541644 -2805697 -1441945 141891 325544
30557 325544 -133892 -249107 -158165 -178856 -215088 -335673 -764145 -1243543 -1322505 -1093762
30547 -1093762 -815415 -189833 1023009 2074800 1960478 797750 -466705 -1349589 -1821917
30538 -1821917 -1478125 -15917 1651796 2095946 1236447 326089 -10071 -488754 -1649337
30529 -1649337 -2782242 -2861546 -1670467 354276 2484345 3570543 2669946 482437 -818197
30520 -818197 -73109 1336145 1433307 369563 -127207 392862 418081 -1112941 -3190554
30511 -3190554 -4295742 -4481101 -4804870 -5358963 -5138302 -3756647 -2153091 -1347986 -1392000
30502 -1392000 -1929806 -2992147 -4563858 -5880879 -5956681 -4725756 -3104971 -1901569 -1087244
30493 -1087244 -236862 658001 1067075 611552 -246211 -468689 375575 1448644 1635955
30484 1635955 1003228 518925 397347 -189773 -1432475 -2176256 -1730535 -1205723 -1733066
30475 -1733066 -2298644 -1161908 1003091 1531857 -301406 -1814279 -523847 2240116
30467 2240116 2918195 242593 -3367900 -4871933 -3762965 -1760325 -330359 564644
30459 564644 1483058 2258846 2330282 1853186 1550706 1346359 130325 -2482423 -4898171
30450 -4898171 -4961935 -2325400 1241750 3475641 3021924 169693 -2677751 -2228537 2174823
30441 2174823 6718796 6884717 3000777 -242347 -143322 833686 -493665 -2979331 -2989811
30432 -2989811 187464 3500941 4321944 3138960 1833486 1170154 754410 310011 122283
30423 122283 518890 1208820 1146159 -492186 -2833320 -3555117 -1478370 1631556 2914171
30414 2914171 1722358 -33312 -622966 -289303 -124810 -311784 -68448 1200972 3083074
30405 3083074 4267032 3588319 1385958 -404593 -141479 1635649 2773466 1857076 -474502
30396 -474502 -2297366 -1991796 453261 3003835 3007171 49563 -3089066 -3490836 -1611550
30387 -1611550 -259814 -503017 -688377 211287 621743 -998341 -3321248 -3748951 -1918374
30378 -1918374 75020 500734 -427427 -1561196 -2036364 -1449036 10111 1373876 1721136
30369 1721136 1323401 1204471 1561984 1581947 953743 478996 728560 1106552 949119 683752
30359 683752 969159 1345736 855874 -378573 -1376178 -1888014 -2450760 -2812497 -1861377
30350 -1861377 288431 1613120 670711 -1357583 -2398988 -2264509 -2094763 -1870126 -626998
30341 -626998 1049378 1136704 -651259 -1981915 -1260325 89120 188615 -222050 592950
30332 592950 1869473 1079754 -2013463 -4457020 -3890314 -1426037 174427 -101928 -1046250
30323 -1046250 -1366546 -1150869 -1297306 -2198379 -3225557 -3413451 -2577636 -1567433 -1280109
30314 -1280109 -1726560 -2357490 -2924924 -3519839 -4058764 -4306553 -4197598 -3625257 -2223245
30305 -2223245 4961 2096777 2893585 2322810 1386878 1019318 1381720 1986916 2073191
30296 2073191 1296999 483228 944848 2404865 2587357 14965 -3657595 -5548948 -5094381
30287 -5094381 -4018010 -3326282 -2410267 -1154098 -825449 -2177832 -4162915 -5220448 -4809443
30278 -4809443 -3367498 -1850366 -1439293 -2491544 -3687611 -3403513 -1760239 63509
30270 63509 2031140 4691586 6759227 5944511 2558853 -377795 -1264518 -1414364 -1690954
30261 -1690954 -957227 596601 55991 -3682281 -6884721 -5692493 -1639008 928151
30253 928151 1094804 1258088 2000641 1291312 -1271001 -3181488 -2672013 -734028 1071334
30244 1071334 2220901 2158305 250923 -2381594 -3311199 -1974036 -465221 -483880 -1384209
30235 -1384209 -1868988 -1675464 -927854 263499 901956 -253247 -2478986 -3524071 -2921044
30226 -2921044 -2640824 -3580957 -3924527 -2481116 -1251609 -2503077 -5063247 -5907365 -4332086
30217 -4332086 -2330848 -1499948 -1600734 -1875185 -2045846 -2025325 -1869162 -1953311 -2379366 -2595694
30207 -2595694 -2320077 -2093229 -2032375 -1018364 1535564 3900965 3720785 1240801 -750738
30198 -750738 -422663 969542 1002364 -703573 -1946139 -542748 2948186 5545271 5071292
30189 5071292 2508277 441420 -244143 -770521 -1860700 -2611336 -2435911 -2333291 -3226153
30180 -3226153 -4418331 -4735222 -4064442 -2935713 -1793075 -1397488 -2418047 -3746774 -3018975
30171 -3018975 -44269 2157137 1329843 -865481 -1594787 -906804 -664969 -1033850 -860008
30162 -860008 -450681 -998416 -1866753 -1317251 464218 1845001 2820441 4564733 6109542
30153 6109542 4910225 1257168 -1180546 -341223 1551282 1612375 27561 -1355690 -1885861
30144 -1885861 -1838507 -1100856 217425 1226097 1542152 1763647 1773624 376094 -2274587
30135 -2274587 -3881507 -3170385 -2029000 -2702899 -4405020 -4659188 -2847706 -567697 635581
30126 635581 271034 -1441124 -3343116 -3621308 -1796086 346534 1030088 638651 356988
30117 356988 61227 -781250 -1450898 -1147927 -639072 -684183 -16198 2700450 5867676
30108 5867676 6642732 5119806 4066722 4665736 5309393 4836633 4195248 4187278 3978751
30099 3978751 2788147 1097550 -582092 -2290377 -3340365 -2491077 -213581 1185621
30091 1185621 639782 -345445 -303286 290759 745798 1546735 2638011 2608462 1373083
30082 1373083 1356327 3666890 5305209 3303134 -11284 332657 4684589 8059868 6982021
30073 6982021 3365089 563980 -983460 -2333071 -3141777 -2667702 -1723754 -1233372 -317081
30064 -317081 1823470 3417171 2192760 -859325 -2577404 -2172389 -1841672 -2662481 -2818970
30055 -2818970 -897492 1651154 2875023 3073470 3413489 3483619 2287335 545325 -85753
30046 -85753 508344 1019015 883239 686681 774744 1028789 1644543 2550659 2513065 661399
30036 661399 -1399623 -1080252 1549009 3652837 3422581 1941431 879848 458889 366775
30027 366775 589320 430412 -1240762 -3715671 -4506520 -2945051 -1579040 -2397352 -3853110
30018 -3853110 -3704856 -2711526 -2792785 -3183716 -1706108 939573 1530853 -937908 -3796279
30009 -3796279 -4516370 -3535012 -2546927 -2130277 -2011554 -2016815 -1863045 -1260486 -739634 -1071443
29999 -1071443 -1543099 -419503 2278672 4053030 2922811 -62895 -2206335 -2094673
29991 -2094673 -404007 1316793 1875064 1098322 -93548 -637399 -441182 16758 892062
29982 892062 2582936 4209130 3998195 1602929 -1241342 -2795884 -2860260 -1968893 -552350
29973 -552350 526059 111821 -1649147 -3038386 -2913681 -2060201 -1720760 -2001422 -2489130
29964 -2489130 -3105022 -3385178 -2284882 80615 1757038 1431542 484124 938413 2290208
29955 2290208 2328694 697291 -423926 512124 2229078 2369212 442744 -1724925 -2040988
29946 -2040988 -130404 2510488 3992864 3637283 2212175 809910 -168303 -901296 -1498992
29937 -1498992 -1797154 -1642149 -1145468 -578526 37578 1030135 2263883 2427218 332103
29928 332103 -2701031 -3362200 -457413 2992656 3507082 1622068 348168 469950 480715
29919 480715 406240 1875125 4211586 4457090 2327963 1266716 2860643 4022267 2179593
29910 2179593 -258409 152942 2385435 3082797 2061725 1748046 2510765 2452568 1205122
29901 1205122 421072 694559 979938 897286 964712 862047 -714 -697728 -180955 216160
29891 216160 -1414039 -3834450 -3999204 -1852045 -411507 -963264 -1565414 -812386 203007
29882 203007 441137 349174 -108405 -1856349 -4157766 -4580902 -2675187 -927682 -913814
29873 -913814 -1325204 -1096581 -1457526 -3062772 -3893816 -2290062 162501 1035901 511747
29864 511747 290690 669950 803890 585265 421560 256400 262270 1178500 2616330 2603069
29854 2603069 329201 -2197102 -2776063 -1753514 -661942 113834 621764 124995 -1372302
29845 -1372302 -1991235 -505351 1413414 1585078 573602 353973 1053556 1382776 1218966
29836 1218966 1391294 1773205 1807400 2065994 3165952 4086258 3697861 2885949 2901547 2852510
29826 2852510 1422666 -163113 83435 1177933 576546 -1287802 -1498680 409775 1699195
29817 1699195 1078476 553161 1618431 2798205 2334011 619244 -1385144 -3651124 -5624893
29808 -5624893 -5702593 -3794727 -2335594 -3095024 -4792573 -5379936 -4823418 -3926150 -2197908
29799 -2197908 958428 4141534 5181445 3947279 2309284 1699675 2007592 2539852 2939100
29790 2939100 3238461 3595061 3768919 2858543 392739 -2309760 -3201832 -2197380 -1252014
29781 -1252014 -1316863 -1103033 202492 1029538 -120914 -1903446 -1803162 388542 2640457
29772 2640457 3528507 3220744 2112620 335274 -1399381 -2009746 -1347075 -263175 636686
29763 636686 1354411 1681158 1065642 -480140 -2062192 -2729144 -2259151 -1149474 -119042
29754 -119042 497604 1029190 1893637 2752611 2793824 1881061 649426 -620823 -2224666
29745 -2224666 -3931319 -4863318 -4883373 -4848776 -5010711 -4629580 -3831909 -4047360 -5420104
29736 -5420104 -5654221 -3281410 -526514 -532975 -2668836 -3221803 -592006 2665046 3423751
29727 3423751 1641591 -318511 -593287 731723 2155482 2153574 552217 -1310715 -2119191
29718 -2119191 -1864978 -1083028 248258 1839899 2100211 -52846 -2817844 -3146045 -883205
29709 -883205 891314 201003 -1287817 -1071689 798520 2633713 3847871 4853030 5141381
29700 5141381 3605306 693381 -1575677 -2209904 -2432993 -3492678 -4424820 -3332772 -444414
29691 -444414 1694974 1509303 473789 799425 2134701 2412341 1509565 1647985 3597203
29682 3597203 4931521 3611141 1269315 689581 1456175 892115 -1292570 -2268968 -386670
29673 -386670 2325329 2945162 1144857 -1110417 -1989277 -1051935 783956 1749475 580917
29664 580917 -2068436 -4295973 -5152472 -5194311 -4926876 -4173260 -3180601 -2723568 -2644311 -1881791
29654 -1881791 -498520 29475 -688588 -928778 566744 2524802 2915588 1468480 -811335
29645 -811335 -3309272 -5578298 -6629474 -6015102 -4806204 -4128761 -3498731 -1886149 350451
29636 350451 1880076 2079473 1212334 -265755 -1566228 -1745816 -1089250 -1066508 -1729144
29627 -1729144 -811305 2821962 6589641 7516850 6652922 7081899 8508380 7540925 3403426
29618 3403426 -389043 -1064801 -9802 375570 228707 462354 -29139 -2476475 -4982178
29609 -4982178 -4269709 -486879 2312504 1086800 -2547529 -4463881 -2775684 482066
29601 482066 2002050 717311 -1545750 -2505585 -1845740 -916628 -662963 -764840 -700787
29592 -700787 -614024 -791171 -1086428 -1328004 -1693809 -2194179 -2211113 -1049136 1174735 3377526
29582 3377526 4192143 3005110 662038 -1064569 -1126027 -79431 985763 1728495 2102687
29573 2102687 1570397 101985 -748979 433196 2405106 2456085 261600 -1532441 -1153607
29564 -1153607 -87628 -566828 -2437820 -3919346 -4170111 -3677175 -3004144 -2397493 -1985341
29555 -1985341 -1539810 -838736 -758730 -2618951 -5667188 -7005377 -5403948 -3431051 -3840249
29546 -3840249 -5389731 -4804822 -1915012 121246 -384408 -1459348 -734482 1451813 3308003
29537 3308003 4134798 4276887 3744360 2280816 323627 -1057481 -1058127 306314 2122366
29528 2122366 2921870 1790224 -565448 -2471016 -3270861 -3934765 -5247961 -6167624 -4917581
29519 -4917581 -1535648 1635617 2483380 1603945 1383868 2673029 3597990 2385543 78487
29510 78487 -1143098 -1352986 -2165903 -3023807 -1435741 2279920 3967593 1430031 -1825365
29501 -1825365 -1615897 754736 1181795 -395391 -573048 920483 416596 -3237164 -6283338
$$ [...]
##END NTUPLES=NMR SPECTRUM
##END=
