##TITLE=31Pdec_61-2021
 CDCl3, 24 sc
 30.07.2021
##JCAMPDX= 6.0         $$ Bruker NMR JCAMP-DX V2.0
##DATA TYPE= NMR SPECTRUM
##DATA CLASS= NTUPLES
##ORIGIN= UXNMR, Bruker Analytische Messtechnik GmbH
##OWNER= root
$$ XWIN-NMR		Version 3.5
$$ Fri Jul 30 09:29:32 2021 Russian Standard Time (UT+4h)  she@DPX200
##.OBSERVE FREQUENCY= 81.013821
##.OBSERVE NUCLEUS= ^31P
##.ACQUISITION MODE= SIMULTANEOUS
##.ACQUISITION SCHEME= undefined
##.AVERAGES= 24
##.DIGITISER RES= 16
##SPECTROMETER/DATA SYSTEM= spect
##.PULSE SEQUENCE= zgpg30
##.SOLVENT NAME= CDCl3
##.SHIFT REFERENCE= (INTERNAL, CDCl3, 0, 248.564)
##AUDIT TRAIL= $$ (NUMBER, WHEN, WHO, WHERE, WHAT)
$$ ##TITLE= Audit trail, XWIN-NMR		Version 3.5
$$ ##JCAMPDX= 5.01
$$ ##ORIGIN= Bruker BioSpin GmbH
$$ ##OWNER= she
$$ F:/spectra/data/she/nmr/P31/1/pdata/1/auditp.txt
$$ ##AUDIT TRAIL=  $$ (NUMBER, WHEN, WHO, WHERE, WHAT)
(   1,<2021-07-30 09:28:18.57 +0400>,<she>,<DPX200>,
      <created by zg, POWCHK disabled, PULCHK disabled
       terminated by command 'halt'
       configuration hash MD5:
       00 E9 B6 7A A2 85 ED C7 34 08 36 98 17 FE 4E 26
       data hash MD5: 32K
       EC AF 30 07 C3 B9 F3 C8 07 1E E1 27 FD 14 72 BA>)
(   2,<2021-07-30 09:28:25.26 +0400>,<she>,<DPX200>,
      <Start of raw data processing
       efp BC_mod = 2 LB = 1 FT_mod = 6 PKNL = 1 PHC0 = -7447.987 PHC1 = 269.8744 SI = 64K 
       data hash MD5: 64K
       D0 4D BF DB F5 E9 D6 DA C2 98 63 B7 F1 89 1A 76>)
(   3,<2021-07-30 09:28:52.25 +0400>,<she>,<DPX200>,
      <pk PHC0 = 85.71904 PHC1 = -212.6 
       data hash MD5: 64K
       95 E9 65 7F 5F EA 1E F5 D9 22 38 54 D1 76 1C 90>)
(   4,<2021-07-30 09:28:55.68 +0400>,<she>,<DPX200>,
      <abs ABSG = 5 
       data hash MD5: 64K
       03 7C DD 59 F3 2C 40 D5 DE 0C 64 7E 85 95 67 9F>)
(   5,<2021-07-30 09:29:08.96 +0400>,<she>,<DPX200>,
      <abs ABSG = 5 
       data hash MD5: 64K
       E8 23 04 E8 38 78 8A 2E 02 E6 D5 0A 70 11 03 DB>)
$$ ##END=
$$ 
$$ hash MD5
$$ A8 2E 90 6F FD 83 47 D3 F5 4D D2 66 2E D9 6D 29
##$RELAX= 
##$RELAX= 
##$RELAX= 
##$RELAX= 
##$RELAX= 
##$RELAX= 
##$RELAX= 
##$RELAX= 
$$ Bruker specific parameters
$$ --------------------------
##$DU= <F:/spectra>
##$EXPNO= 1
##$NAME= <P31>
##$PROCNO= 1
##$TYPE= <nmr>
##$USER= <she>
##$AMP= (0..31)
100 100 100 100 100 100 100 100 100 100 100 100 100 100 100 100 100 100 
100 100 100 100 100 100 100 100 100 100 100 100 100 100 
##$AQSEQ= 0
##$AQ_mod= 1
##$AUNM= <au_zg>
##$AUTOPOS= <>
##$BF1= 81.014009
##$BF2= 200.13
##$BF3= 200.13
##$BF4= 200.13
##$BF5= 200.13
##$BF6= 200.13
##$BF7= 200.13
##$BF8= 200.13
##$BYTORDA= 1
##$CFDGTYP= 0
##$CFRGTYP= 5
##$CHEMSTR= <none>
##$CNST= (0..31)
1 1 145 1 1 1 1 1 1 1 1 1 1 1 1 1 1 1 1 1 1 1 1 1 1 1 1 1 1 1 1 1 
##$CPDPRG= <waltz16>
##$CPDPRG1= <>
##$CPDPRG2= <waltz16>
##$CPDPRG3= <>
##$CPDPRG4= <mlev>
##$CPDPRG5= <mlev>
##$CPDPRG6= <mlev>
##$CPDPRG7= <mlev>
##$CPDPRG8= <mlev>
##$CPDPRGB= <>
##$CPDPRGT= <>
##$D= (0..31)
$$ [...]
##$SUBNAM3= <"">
##$SUBNAM4= <"">
##$SUBNAM5= <"">
##$SUBNAM6= <"">
##$SUBNAM7= <"">
##$SUBNAM8= <"">
##$SUBNAM9= <"">
##$SW= 501.771253377433
##$SWIBOX= (0..15)
0 1 3 0 0 0 0 0 0 0 0 0 0 0 0 0 
##$SW_h= 40650.406504065
##$TD= 32768
##$TD0= 1
##$TE= 0
##$TE2= 300
##$TE3= 300
##$TEG= 300
##$TL= (0..7)
0 120 53 12 22 120 120 120 
##$TP= (0..7)
150 150 150 150 150 150 150 150 
##$TP07= 0
##$TPNAME0= <>
##$TPNAME1= <>
##$TPNAME2= <>
##$TPNAME3= <>
##$TPNAME4= <>
##$TPNAME5= <>
##$TPNAME6= <>
##$TPNAME7= <>
##$TPOAL= (0..7)
0.5 0.5 0.5 0.5 0.5 0.5 0.5 0.5 
##$TPOFFS= (0..7)
0 0 0 0 0 0 0 0 
##$TUNHIN= 0
##$TUNHOUT= 0
##$TUNXOUT= 0
##$USERA1= <user>
##$USERA2= <user>
##$USERA3= <user>
##$USERA4= <user>
##$USERA5= <user>
##$V9= 5
##$VALIST= <valist>
##$VCLIST= <CCCCCCCCCCCCCCC>
##$VD= 0
##$VDLIST= <DDDDDDDDDDDDDDD>
##$VPLIST= <PPPPPPPPPPPPPPP>
##$VTLIST= <TTTTTTTTTTTTTTT>
##$WBST= 1024
##$WBSW= 4
##$XGAIN= (0..3)
0 0 0 0 
##$XL= 0
##$YL= 0
##$YMAX_a= 27283
##$YMIN_a= -29443
##$ZGOPTNS= <>
##$ZL1= 120
##$ZL2= 120
##$ZL3= 120
##$ZL4= 120
##$ABSF1= 248.5645
##$ABSF2= -253.2056
##$ABSG= 5
##$ABSL= 3
##$ALPHA= 0
##$AQORDER= 0
##$ASSFAC= 0
##$ASSFACI= 0
##$ASSFACX= 0
##$ASSWID= 0
##$AUNMP= <proc_1d>
##$AZFE= 0.1
##$AZFW= 0.5
##$BCFW= 0
##$BC_mod= 2
##$BYTORDP= 0
##$COROFFS= 0
##$CY= -3
##$DATMOD= 1
##$DC= 0
##$DFILT= <>
##$DTYPP= 0
##$F1P= 0
##$F2P= 0
##$FCOR= 1
##$FTSIZE= 65536
##$FT_mod= 6
##$GAMMA= 0
##$GB= 0
##$INTBC= 1
##$INTSCL= 5.30512e-09
##$ISEN= 30
##$LB= 1
##$LEV0= 0
##$LPBIN= 0
##$MAXI= 10000
##$MC2= 0
##$MEAN= 0
##$ME_mod= 0
##$MI= 50
##$NCOEF= 0
##$NC_proc= -3
##$NLEV= 6
##$NOISF1= 182.463
##$NOISF2= 159.3651
##$NSP= 0
##$NTH_PI= 0
##$NZP= 0
##$OFFSET= 248.5645
##$PC= 4
##$PHC0= -7362.268
##$PHC1= 57.27438
##$PH_mod= 1
##$PKNL= yes
##$PPARMOD= 0
##$PSCAL= 0
##$PSIGN= 0
##$REVERSE= no
##$SF= 81.014009
##$SI= 65536
##$SIGF1= 159.3651
##$SIGF2= -187.1042
##$SINO= 113.3802
##$SIOLD= 16384
##$SREGLST= <1H.CDCl3>
##$SSB= 0
##$STSI= 65536
##$STSR= 0
##$SW_p= 40650.406504065
##$SYMM= 0
##$S_DEV= 0
##$TDeff= 32768
##$TDoff= 0
##$TI= <>
##$TILT= no
##$TM1= 0
##$TM2= 0
##$TOPLEV= 0
##$USERP1= <user>
##$USERP2= <user>
##$USERP3= <user>
##$USERP4= <user>
##$USERP5= <user>
##$WDW= 1
##$XDIM= 65536
##$YMAX_p= 336381588
##$YMIN_p= -1479094
$$ End of Bruker specific parameters
$$ ---------------------------------
##NTUPLES= NMR SPECTRUM
##VAR_NAME=  FREQUENCY,     SPECTRUM/REAL,   SPECTRUM/IMAG
##SYMBOL=    X,             R,               I
##VAR_TYPE=  INDEPENDENT,   DEPENDENT,       DEPENDENT
##VAR_FORM=  AFFN,          ASDF,            ASDF
##VAR_DIM=   65536,         65536,           65536
##UNITS=     HZ,            ARBITRARY UNITS, ARBITRARY UNITS
##FACTOR=    0.620285442955139, 1,           1
##FIRST=     20137.2065510759, 0,            0
##LAST=      -20513.1999529892, 0,           0
##MIN=       -20513.1999529892, -1479094,    0
##MAX=       20137.2065510759, 336381588,    0
$$ Real data points
##PAGE= N=1
##DATA TABLE= (X++(R..R)), XYDATA
$$ [...]
46526 158752 183665 221428 170354 40072 -29944 -302 26653 32729 124952 283347 307862
46515 307862 136220 -4257 85305 292304 389611 346807 269033 176555 42993 -59236
46505 -59236 -48024 10742 4736 -39384 -33202 -12900 -77699 -201329 -271553 -269832 -251973 -197620
46493 -197620 -49887 123498 179580 107195 33540 23226 15378 -29566 -60790 -43018 -12779
46482 -12779 3493 27757 59485 59213 33007 48805 129787 199563 178962 93605 40732 65887
46470 65887 110181 95358 40578 40947 109382 120826 -2667 -129105 -83898 69222 108212
46459 108212 5543 -30893 82551 157529 59799 -62769 -49839 -3710 -76990 -171953 -101708
46448 -101708 89253 217604 256677 284973 250070 65743 -134661 -138290 -3906 19123 -100670
46437 -100670 -150218 -56471 14770 -10176 9218 129494 189026 97491 6740 46824 112460
46426 112460 71980 -3054 9956 58085 17985 -80140 -99284 -3581 108926 143113 91332
46415 91332 14172 -18476 -4362 -26319 -127345 -201474 -122975 49454 145779 133608 116813
46404 116813 108899 27455 -76712 -31381 160718 277815 213368 121448 131814 159430 123774
46393 123774 121937 221836 292473 216913 93163 52360 50659 10828 -7003 41872 39118 -91445
46381 -91445 -194724 -115461 28180 27154 -89330 -135320 -70006 7870 71839 149504 174319
46370 174319 73367 -66598 -120623 -131207 -193630 -235461 -136720 17644 45056 -44492 -99163
46359 -99163 -92396 -96705 -71258 52807 143937 28177 -166322 -144526 84220 207487 115085
46348 115085 54725 189565 331687 271569 97140 5555 15240 36966 52092 63972 21451
46337 21451 -81185 -164332 -211111 -294750 -386457 -339795 -163433 -81098 -179919 -229110 -36105
46326 -36105 226271 276394 137505 42368 47668 10130 -115150 -203903 -181983 -112247 -54896
46315 -54896 -4668 28816 18406 -3723 14882 48723 46736 45320 102645 160059 113620 -1154
46303 -1154 -48107 -7083 1509 -76872 -147291 -126161 -56882 -12841 6675 22629 6049 -66467
46291 -66467 -138528 -118382 15399 176347 230481 106879 -123129 -294950 -312912 -237031 -172606
46280 -172606 -126767 -46201 50718 84607 44976 6938 8605 3094 -46164 -103280 -123812 -115593
46268 -115593 -104636 -93424 -83380 -99102 -164351 -273784 -388709 -441118 -371240 -208448 -83938
46257 -83938 -95873 -185636 -223501 -189238 -166018 -169939 -116188 18714 128482 129626 73325 32855
46245 32855 -16937 -110891 -172148 -104137 44233 128151 98851 29667 -37323 -139705 -265230
46234 -265230 -301119 -183754 -12058 71641 59377 54465 106989 161760 165485 142019 132193 115701
46222 115701 38517 -102921 -242601 -314435 -324000 -336343 -386309 -416496 -340172 -173636 -55757
46211 -55757 -92020 -216644 -274952 -221798 -154768 -146451 -139676 -54219 80413 167082 166646 114421
46199 114421 46415 -24397 -81291 -114331 -141386 -168681 -156576 -79596 10197 43319 24102
46188 24102 -9096 -73460 -193778 -297746 -283952 -188068 -145302 -171974 -136173 6383 112926
46177 112926 91129 81853 243003 455905 447038 171610 -114211 -184611 -82159 24725 68649
46166 68649 73930 39135 -42216 -102521 -67706 10499 -1047 -127500 -235505 -208642 -95167
46155 -95167 -23231 -30011 -56895 -80858 -146282 -251358 -300659 -227755 -97705 -19176 -6503
46144 -6503 -7490 -22104 -87586 -163409 -151258 -49244 25209 6090 -34363 -27051 -24407 -84154
46132 -84154 -127705 -44645 109723 158475 40173 -115645 -163717 -90241 35865 153121 204242
46121 204242 140080 2011 -64609 36404 217170 297279 212629 65035 -25823 -41546 -19996
46110 -19996 30470 113744 184238 172022 67105 -71695 -191377 -274131 -289500 -197155 -41717
46099 -41717 29648 -71477 -238651 -291291 -207809 -129402 -136364 -152548 -110953 -81573 -144642
46088 -144642 -232265 -204360 -29531 195397 354079 364827 203257 -26282 -117408 7788
46078 7788 154505 93156 -109928 -189583 -88999 -38376 -176354 -327125 -282119 -108946 -5490
46067 -5490 5989 36476 82582 44056 -52290 -62617 32541 91389 50484 20088 75018 114560
46055 114560 30196 -115152 -187960 -171367 -143303 -139085 -140061 -143784 -148500 -115736 -39791 -2769
46043 -2769 -59488 -118426 -58897 67298 89805 -30287 -146520 -145460 -79680 -34188 3670
46032 3670 57267 61097 -34624 -136478 -111655 17995 103270 76270 23094 39275 110451 168239
46020 168239 186902 176951 132784 39643 -81168 -166077 -154521 -45367 83038 126638 55808
46009 55808 -50771 -98956 -85635 -75020 -92605 -101207 -74714 -30542 19882 88197 152429 142910
45997 142910 28679 -116797 -177704 -109969 24524 114654 78989 -73166 -230542 -260941
45987 -260941 -141220 7816 42550 -61123 -203937 -275471 -241267 -142803 -54198 -33556 -79578
45976 -79578 -131080 -134609 -111492 -126841 -188137 -214950 -137269 4106 98949 100731 65905 46435
45964 46435 5334 -104865 -223765 -235812 -141365 -76352 -122883 -193700 -178515 -124392 -155853
45953 -155853 -256311 -265099 -108602 82654 138846 47819 -74441 -147253 -185266 -224076 -255102
45942 -255102 -243991 -182321 -106983 -66211 -62509 -43926 30197 138128 239781 334100 416507
45931 416507 422182 308149 171108 157841 240020 212942 -21070 -291034 -369277 -241177 -55786
45920 -55786 95367 206311 231922 114423 -67442 -138709 -56929 31655 13742 -40506 -23107
45909 -23107 32380 29180 -15507 -4553 63220 85109 26474 -24841 -13393 -10824 -82496 -153576
45897 -153576 -120006 -41262 -88516 -295264 -481380 -471597 -294618 -103949 15194 74952 84745
45886 84745 32196 -51284 -97063 -78812 -27429 23625 52590 34703 -17456 -29649 32279 69362
45874 69362 -29177 -192123 -232733 -116341 -8209 -16077 -48793 -10581 26644 -25495 -83293
45863 -83293 -21885 93034 87974 -43046 -124555 -62982 36086 44167 -32064 -112218 -143744 -89173
45851 -89173 80407 303509 417270 312863 68937 -123352 -141816 -13050 138000 177187
45841 177187 53071 -138568 -215167 -95673 90641 145970 42098 -56583 -15843 105977
45831 105977 164662 127175 75033 47797 -2735 -87288 -123648 -72566 -36032 -116506 -236015
45820 -236015 -218212 -31262 172432 263172 260507 229236 172068 83115 6773 -27410 -50232
45809 -50232 -70092 -24125 116031 261580 309404 270830 226231 209813 212024 234651 262550
45798 262550 240062 162192 128192 202307 275682 190458 -23882 -162872 -102312 59960 136002
45787 136002 46758 -122521 -206345 -98554 138052 310205 290546 153238 64798 82199
45777 82199 130803 142023 121108 96644 88716 119896 185992 226349 185443 86608 -6195 -61111
45765 -61111 -60595 22198 150332 198806 106268 -13562 -22440 49680 85035 69796 54081 6302
45753 6302 -98431 -116876 92088 364365 370750 88495 -144064 -118602 -19193 -59563 -134936
45742 -134936 -52859 105649 124272 18517 -7419 89266 135283 33889 -100483 -130968 -53992
45731 -53992 69525 196846 276267 256884 169300 101598 67413 -3012 -113343 -158743 -92531
45720 -92531 -30221 -94435 -228685 -274758 -195586 -101199 -59483 -15856 53659 46345 -94640
45709 -94640 -212868 -118975 98509 147875 -48437 -226707 -173853 -36533 -61643 -206668
45699 -206668 -254596 -197685 -214823 -310596 -283387 -84487 78311 76246 35989 69872 79124
45688 79124 -25537 -132479 -136388 -140107 -250483 -342585 -248527 -50873 34725 -31891 -136850
45677 -136850 -243358 -369558 -412000 -245192 28916 168687 128023 80123 99259 57306
45667 57306 -108517 -246616 -209069 -50656 86118 142335 110205 -28405 -216081 -285869
45657 -285869 -146720 60521 112893 -16100 -127554 -50911 144060 223217 59090 -208609
45647 -208609 -321637 -207110 -56787 -62693 -169185 -190568 -98246 -37386 -84270 -153453 -167853
45636 -167853 -166595 -188196 -178302 -90694 18174 68402 52324 -5467 -99377 -191070 -190180 -67331
45624 -67331 72586 105402 34979 -31876 -16540 72933 168995 187948 97974 -16384 -21726
45613 -21726 85461 144918 46305 -104065 -133412 -57188 -45304 -146350 -194439 -48865 181623
45602 181623 255505 99830 -101768 -134457 8217 157071 192529 155937 132086 109681 23437
45591 23437 -115135 -213893 -214969 -140462 -30390 83683 138894 71479 -75032 -155206 -91738
45580 -91738 23740 57767 3602 -45799 -44518 -33125 -56814 -116266 -186023 -223296 -181063 -76389
45568 -76389 -19318 -94375 -231500 -287190 -245764 -226511 -273401 -272103 -147321 -18986 -36189
45557 -36189 -135901 -123689 30486 139086 65855 -98951 -196302 -204567 -193462 -174542 -119559
45546 -119559 -62669 -56210 -61751 -11626 44089 -10361 -154689 -224480 -139089 -7249 48253
45535 48253 47008 56152 53108 -12740 -103252 -144272 -136336 -113786 -52878 66114 153261 100022
45523 100022 -36757 -76041 39534 155667 118018 -21294 -84176 -28 124306 162035
45513 162035 124198 117402 169081 166243 13580 -197405 -272433 -165904 -39923 -34331 -89515
45502 -89515 -77005 -5474 23736 1503 12205 71619 94444 33612 -57050 -119487 -155549 -166738
45490 -166738 -114762 14337 161410 245274 232600 148288 49643 -10552 -27219 -40218 -66133
45479 -66133 -69617 -37139 -19902 -41991 -31826 65134 166031 155735 63115 1195 -30545 -126436
45467 -126436 -265514 -295337 -164662 -21094 -13290 -118228 -225789 -279999 -272390 -206194 -139630
45456 -139630 -162271 -251539 -251145 -79632 127706 181732 73692 -49117 -81826 -37421 29402
45445 29402 69600 32798 -89792 -209973 -203124 -47266 133405 179289 43852 -160315 -263282
45434 -263282 -201925 -71710 7507 37038 88660 151076 137032 40187 -32270 -9430 64723
45423 64723 129994 181230 209385 184382 137333 143561 180353 133582 4815 -35720 106236
45412 106236 293185 355655 308650 235226 97135 -152849 -373020 -363210 -156663 8818
45402 8818 837 -94115 -160116 -182463 -166531 -84716 39392 106999 59653 -50987 -131034 -124342
45390 -124342 -36110 55421 41831 -79710 -162438 -104441 -20560 -73200 -190727 -152389 59909
45379 59909 213261 164454 37127 -14539 -12998 -16211 38027 186826 289509 203160 15007
45368 15007 -76013 -45158 -41350 -140008 -256843 -297561 -255101 -157150 -38193 30462 -8839
45357 -8839 -109736 -170901 -169033 -152585 -125525 -54102 21501 17166 -40908 -29451 73906 146876
45345 146876 124637 95223 115139 86934 -50956 -148056 -30597 218035 351962 292044 172403
45334 172403 82128 -26567 -146116 -150824 -19850 66046 -16812 -136163 -122912 -55589 -123606
45323 -123606 -289354 -317618 -133631 63937 92845 6817 -48785 -43929 -27247 -7706 13124
45312 13124 -17869 -117787 -189136 -141393 -42341 -37527 -149408 -261395 -284203 -237156 -169551
45301 -169551 -100675 -50868 -43311 -47705 5570 123705 221806 224002 144073 42208 -42253 -83643
45289 -83643 -56627 15590 44773 -22783 -113029 -101253 21966 135216 152134 125818 140996
45278 140996 171266 129359 25183 -30921 8825 62054 48453 -363 -23048 -39896 -97136
45267 -97136 -160058 -161754 -123123 -123671 -172239 -204120 -194035 -174789 -154228 -115959 -93458 -130291
45255 -130291 -172231 -128173 -41402 -49527 -150678 -180284 -76708 11205 -23279 -66405 1557
45244 1557 78707 12955 -128244 -171611 -131632 -160844 -253587 -239264 -77742 63232 71356
45233 71356 31822 41243 63632 60753 99121 210366 281443 217589 112422 115512 201306 214147
45221 214147 109313 10213 18569 83074 96215 43878 3313 26615 77308 87351 48717
45210 48717 20832 46850 95250 106841 68406 1420 -90808 -204107 -279300 -240859 -95172
45199 -95172 72713 204050 301268 356739 333243 239865 144022 72178 -19382 -131393 -171547
45188 -171547 -89190 21995 49046 19132 19855 13731 -113970 -320269 -383467 -196206 44019
45177 44019 61869 -142702 -305662 -250010 -85616 -16013 -68939 -114671 -72910 21674 128739
45166 128739 248017 343307 337382 226220 105241 34404 -30206 -112444 -129061 -25282 89117
45155 89117 70582 -40242 -72170 21123 104424 80394 27556 56505 135430 149899 78370
45144 78370 18666 53024 151012 218663 209842 162615 124447 72300 -44840 -187121 -225831
45133 -225831 -108872 46103 93294 31029 -52856 -140738 -264372 -364984 -329261 -176472
45123 -176472 -67737 -89385 -150327 -144608 -97405 -77668 -67859 -14560 57565 76077 33135 -7697
45111 -7697 -7265 -249 -39086 -107166 -108144 22376 187720 189465 -22344 -238284 -234993 -62365
45099 -62365 54725 42685 24290 65309 92628 88114 141690 244632 242258 86530 -66497
45088 -66497 -118603 -177431 -308038 -360676 -236224 -116531 -191065 -325188 -274034 -93786 -35160
45077 -35160 -111313 -100526 39751 91605 -41482 -172215 -148740 -78101 -101539 -164199 -156759
45066 -156759 -110611 -98432 -80714 -3960 57216 3038 -124497 -204978 -205390 -169106 -99625 26637
45054 26637 165788 228616 187106 91199 -1481 -60166 -74684 -65324 -72313 -96654 -85373 -11763
45042 -11763 68430 81189 23756 -43523 -70307 -58718 -51542 -81375 -113963 -71858 43642 104857
45030 104857 11948 -153821 -238758 -231564 -228763 -224376 -119926 54312 132638 71274 12302
45019 12302 31289 35982 2600 73701 275113 364345 160603 -163555 -331530 -322613 -250329
45008 -250329 -74500 257540 529874 482962 252213 209762 381750 411948 159430 -67913
44998 -67913 -22802 107260 62533 -60059 -27649 107408 124945 31137 15146 81491 34898
44987 34898 -163090 -297339 -226097 -86334 -69165 -150457 -169288 -76955 18070 19191 -45067
44976 -45067 -88035 -80926 -62888 -61300 -56839 -40219 -44512 -74121 -60492 28564 85121 -14002
44964 -14002 -204123 -297120 -248697 -201502 -237110 -262847 -204396 -127298 -76702 17954 160737
44953 160737 204311 103417 61960 223118 386294 285164 11933 -121241 -52677 1654
44943 1654 -57140 -108813 -110696 -177944 -311058 -338742 -218757 -121484 -116598 -56323 101861 143523
44931 143523 -47376 -240688 -195440 -25705 20544 -34920 258 119268 144623 57782 16050
44920 16050 61990 74315 15110 -9396 40161 79979 91379 156892 259281 251478 105985
44909 105985 2381 59226 148199 108289 4591 14409 149588 259997 268494 243115 238213
44898 238213 209423 129088 72208 108612 175788 152084 36418 -38955 3242 73079 56237
44887 56237 -1869 28531 127115 114249 -76209 -252838 -204779 5885 123887 31811 -132852
44876 -132852 -191209 -130321 -57127 -34053 -26176 19535 90801 114999 43169 -82879 -173106
44865 -173106 -194724 -191358 -197475 -201082 -204451 -234239 -256802 -184353 -26750 66438 3567 -103439
44853 -103439 -94943 20725 122764 166946 186922 177808 122981 81164 102018 108475 12822 -107907
44841 -107907 -118430 -48973 -25725 -34411 25420 90220 -1398 -188743 -218616 -50461 54744
44830 54744 -44126 -141169 -40314 119852 116305 6693 -7329 69965 78248 6365 -6828
44819 -6828 68509 120940 106115 86340 69432 -4600 -110604 -145728 -105663 -93948 -137483 -151297
44807 -151297 -115690 -124984 -201928 -216932 -86933 63106 54138 -100027 -215307 -184608 -101353
44796 -101353 -111690 -210237 -246467 -130151 36052 86444 17694 -15554 59372 118289 34370
44785 34370 -120259 -185607 -157807 -177817 -293812 -377227 -309199 -143414 -26349 -19560 -54959
44774 -54959 -36792 49009 122142 96208 -22804 -145248 -203107 -199672 -146737 -34478 88344
44763 88344 94182 -68369 -260356 -303784 -210455 -143458 -169747 -181365 -83841 53474 92843
44752 92843 4401 -106797 -118011 -8364 115397 112142 -45587 -228663 -289620 -218020 -113845
44741 -113845 -44216 3081 48330 82807 98547 90350 39102 -44370 -81566 -9878 112199
44730 112199 165164 121913 58711 28446 18233 24662 63401 94592 47525 -53843 -90993
44719 -90993 -13973 84390 98159 32562 -41937 -86288 -101482 -104190 -130065 -205268 -292616 -327696
44707 -327696 -318548 -329001 -350427 -291476 -129051 35731 125032 187243 284650 370635 362867
44696 362867 268575 158243 76636 48947 102347 200996 233385 158408 94067 151689 245977
44685 245977 204231 25494 -119450 -143483 -146642 -225242 -310681 -276956 -122562 37616 114089
44674 114089 108980 70958 42477 40936 52167 44023 3747 -46931 -80073 -85255 -60836 -12053
44662 -12053 28102 6429 -95071 -221946 -281996 -217283 -49815 127266 216496 206070 183772
44651 183772 219508 246411 129884 -130498 -351083 -369636 -235596 -122127 -99850 -94804 -48257
44640 -48257 -5424 -21262 -69534 -92187 -76882 -43784 -9559 -2940 -58042 -145129 -166126 -79359
44628 -79359 22319 27746 -41845 -77137 -40208 10312 31559 35216 17435 -49531 -138139 -169085
44616 -169085 -123860 -76151 -81108 -107142 -108771 -92762 -75424 -46798 -16886 -24525 -58018 -46637
44604 -46637 14944 19249 -98412 -229394 -215064 -55747 101596 157978 147196 132345 112839
44593 112839 63491 4332 -12289 28596 67711 18681 -130043 -273658 -294420 -201412 -107493
44582 -107493 -68774 -33791 26237 39965 -51586 -189190 -270667 -262196 -176687 -27545 121622
44571 121622 152727 37590 -88137 -95241 -30143 -6748 -11999 42920 138993 169579 113420
44560 113420 48509 19356 24903 104118 275704 408233 325144 64123 -124572 -83916 76015
44549 76015 152853 79563 -68962 -185367 -193570 -94973 5362 -4786 -101709 -160930 -135463
44538 -135463 -91345 -63450 -12073 46912 12290 -134778 -251346 -202179 -24816 138727 199867
44527 199867 163240 88413 61702 130593 220702 191500 14997 -174987 -247127 -209472 -149511
44516 -149511 -118720 -115498 -110276 -53774 75460 213756 268313 230483 158363 68157 -53663
44505 -53663 -155272 -167539 -130024 -123498 -99321 43564 223221 238139 92336 14641 87029
44494 87029 110521 -41112 -188774 -142762 -7771 14896 -53561 -71467 -44963 -58434 -56903
44483 -56903 58173 196593 177399 11004 -125047 -151060 -130511 -90265 6598 126125 179165
44472 179165 160666 125933 66811 -35122 -90357 -17175 77410 35090 -73302 -29289 176967
44461 176967 304742 215363 53372 6713 69314 128821 143161 138070 131877 131073 127820 79495
44449 79495 -27771 -104055 -54665 55838 66714 -55225 -188817 -250740 -265298 -237346 -119138
44438 -119138 63208 198305 243534 259996 271250 228790 144271 109291 147671 183564 181409
44427 181409 179135 170596 110098 40895 45100 63187 -31077 -166959 -135924 45780 116680 413
44415 413 -50325 106232 228226 89813 -126908 -137786 -24391 -47729 -163815 -115019 83731
44404 83731 154479 45438 16127 165588 248842 106510 -55622 -24052 62845 -25020 -195548
44393 -195548 -185731 -15346 25454 -168129 -353864 -303181 -96882 51105 87338 89639 72961
44382 72961 2359 -62832 -18225 99349 138441 66937 16533 42926 17749 -132752 -248857
44371 -248857 -167868 -4011 17584 -78620 -76590 46308 78193 -44220 -107835 702 69323
44360 69323 -88969 -289267 -239528 3654 131176 49016 -41134 -9029 38620 6255 -26642
44349 -26642 8906 15827 -109755 -292354 -372647 -311937 -208315 -161210 -184171 -213457 -170975
44338 -170975 -59204 9275 -53870 -165507 -166547 -61382 -20987 -116024 -202999 -153576 -50430
44327 -50430 -34430 -73806 -37215 72867 119046 42055 -63097 -94695 -56407 1747 59948
44316 59948 105030 98988 23588 -73545 -116132 -76983 -3600 33773 16498 -9935 -11138 -29928
44304 -29928 -129016 -275328 -355984 -331473 -292280 -315197 -343846 -288402 -177106 -110107 -106270
44293 -106270 -102746 -83601 -98248 -153578 -192472 -191394 -182487 -163299 -85636 37610 115861 113540
44281 113540 102598 129671 129172 42674 -65837 -109504 -120007 -178664 -259880 -269396 -213783 -198127
44269 -198127 -244129 -239732 -120658 2756 -16898 -159474 -259504 -217796 -114469 -88228 -151956
44258 -151956 -182087 -91441 46059 97685 65406 79244 180173 226823 102665 -78234 -105953
44247 -105953 30269 128899 55158 -110760 -232707 -287860 -315856 -314242 -266338 -194047 -115865
44236 -115865 -23264 51674 36880 -50043 -77290 8898 69938 -31998 -211702 -266846 -149715
44225 -149715 643 57188 7184 -105840 -207929 -196685 -62035 24506 -96797 -310683
44215 -310683 -345572 -164982 -31414 -125268 -311766 -388370 -362003 -330432 -265724 -114914 10037
44204 10037 -31668 -148121 -110683 102900 265463 223230 80094 8104 29634 62577 62097
44193 62097 36724 7066 9950 71767 135972 99486 -37100 -145658 -143806 -94880 -78739 -73484
44181 -73484 -48917 -65199 -158042 -217495 -128294 29785 80226 13549 -14884 58201 128550
44170 128550 132212 145502 207466 213930 99591 -17497 -8762 64195 73066 47177 91846 147252
44158 147252 42517 -206890 -359814 -269505 -81454 -24306 -126354 -237003 -241459 -158223
44148 -158223 -78400 -81780 -169887 -235107 -154509 43933 184145 160882 65152 20428 -2243
44137 -2243 -88841 -185781 -157711 -15967 70764 20430 -42438 29006 199216 307203 266527
44126 266527 129893 -13400 -123881 -189706 -185516 -102313 2788 42689 3851 -29896 8644
44115 8644 74983 87830 57373 51185 57769 599 -106373 -146826 -81495 -8444 12093 51486
44103 51486 142867 163047 17668 -177537 -257937 -249778 -272282 -291848 -190673 -31375 -13911
44092 -13911 -157849 -251293 -163716 -6776 82120 119390 143744 90163 -69010 -198130 -161871
44081 -161871 -20462 68207 61104 21450 -26742 -96589 -135326 -63638 84248 170669 123304
44070 123304 17883 -27279 12711 58719 27448 -70990 -140172 -115489 -55172 -63812 -137413
44059 -137413 -162953 -85246 13046 37755 10665 11414 49403 59215 -2514 -100187 -149467 -97296
44047 -97296 8220 51691 -736 -35718 36642 109476 30340 -111613 -66338 177909 317018
44036 317018 163165 -72369 -105090 9886 28620 -58618 -43301 111179 185320 54517
44026 54517 -113463 -109031 42700 163997 162408 82752 3622 -23998 17295 94092 135314
44015 135314 103795 32129 -30006 -67891 -85844 -80263 -49705 -4369 42865 70395 43590 -41371
44003 -41371 -118221 -109794 -31168 19172 -14823 -77176 -78885 -10488 53789 48659 -9252 -44766
43991 -44766 -13867 44873 64456 37335 6994 -19912 -82714 -163903 -154477 10224 224082
43980 224082 299043 177081 -3122 -64832 10675 66270 -46447 -273132 -394965 -296354
43970 -296354 -128434 -110252 -218975 -231007 -67410 86973 69742 -33372 -61797 -25328
43960 -25328 -29133 -74288 -97271 -118571 -181006 -205192 -84381 109669 183898 79229 -75150
43949 -75150 -155859 -160330 -136645 -129432 -189441 -309492 -359152 -216114 39610 197554 187058
43938 187058 138392 160669 203753 184219 121643 83876 82019 76297 36470 -27781 -61813 -7558
43926 -7558 106553 165143 117433 57694 69315 84575 24302 -29399 27162 103721 55725 -36932
43914 -36932 11558 137080 83563 -166093 -322342 -228369 -76476 -66527 -122451 -110814 -96149
43903 -96149 -178427 -271675 -253044 -181152 -170368 -175766 -89744 54209 142945 152044 109578 4472
43891 4472 -127284 -152107 -29277 75486 27012 -63714 -34183 63056 88517 71578 110589
43880 110589 140465 49745 -71507 -62471 16853 2648 -40755 79359 288609 290609 37429
43869 37429 -169703 -124318 38383 133467 177010 216327 175414 30051 -85518 -101026 -130216
43858 -130216 -220687 -210827 -21546 130302 44252 -122158 -91662 89481 138669 -6417 -114950
43847 -114950 -45560 64689 50448 -55024 -127624 -132386 -107150 -68920 -11333 59852 123794
43836 123794 142691 78892 -34529 -84671 -20649 47074 -5959 -123714 -154458 -88546 -52902
43825 -52902 -84609 -85659 -20916 17364 -5976 11104 123192 221978 204864 131755 104807 102829
43813 102829 55864 -5857 -6275 35834 40905 -842 -37637 -53725 -62822 -49215 -11629 -15565
43801 -15565 -94522 -146780 -55165 118067 182157 55025 -160933 -325648 -369890 -277074 -93204
43790 -93204 41683 7562 -132052 -204732 -172077 -150250 -176659 -144935 -34423 -6043 -144606
43779 -144606 -274832 -201046 -5531 76207 -7556 -103709 -120274 -118367 -144981 -154344 -123997
43768 -123997 -98289 -78576 -6505 95766 99599 -41618 -181061 -145507 48018 220413 237410
43757 237410 125885 7371 -30281 8000 69688 138695 239272 341099 328887 147083
43747 147083 -67877 -112478 32394 190625 244865 270048 357862 433862 360155 150677 -34612
43736 -34612 -94547 -92287 -141719 -249814 -307013 -221679 -39953 96405 122276 130431 222973
43725 222973 325875 261383 7489 -237287 -295523 -209942 -131252 -107146 -86523 -61837 -77416
43714 -77416 -115180 -90540 15573 104882 80879 -27309 -96648 -49963 57758 101782 41586
43703 41586 -10454 78399 266867 358058 247699 72932 37340 144277 206479 106284 -56574
43692 -56574 -108035 -20607 63943 15057 -124880 -182907 -62117 124985 176998 49398 -91651
43681 -91651 -84160 40993 143126 169905 179564 207046 215463 180268 132488 103727 98332 127892
43669 127892 196985 240221 162909 -9744 -101969 18934 261182 400020 337153 195109
43659 195109 142323 190830 210891 112441 -43106 -120583 -70871 9487 -18861 -179702 -337358
43648 -337358 -333756 -173812 -35054 -56135 -153064 -121861 83188 274225 272440 129601 26944
43637 26944 30345 58752 50511 30582 18990 -4017 -26660 -12518 1731 -66166 -187370 -220242
43625 -220242 -119100 -14813 -9304 -22081 44653 110178 43539 -93116 -112960 9101 96178
43614 96178 34334 -81151 -116494 -82032 -65240 -81591 -85996 -71496 -65407 -57702 -14861 41160
43602 41160 38314 -41128 -108080 -56523 104834 242531 233795 97468 -30145 -43595 32133
43591 32133 88947 51416 -63114 -170775 -194796 -136831 -79629 -91028 -133448 -118418 -42897
43580 -42897 7929 4359 14137 53642 12758 -171813 -361939 -375844 -248492 -180451 -240537
43569 -240537 -280651 -178633 -15700 61483 35866 -17773 -74380 -150281 -208438 -187839 -110894
43558 -110894 -64354 -74876 -88404 -76079 -72403 -90611 -91719 -77349 -122087 -243686 -320786 -241214
43546 -241214 -77275 10443 13888 70428 204466 252916 129623 231 45534 168584 127736
43535 127736 -95138 -262084 -217096 -68599 10136 -3926 -43417 -85805 -130068 -137607 -93734
43524 -93734 -62071 -102865 -193608 -282355 -349124 -364920 -277468 -110631 -4493 -73440 -265980
43513 -265980 -419556 -413091 -241822 -13084 106872 31803 -128060 -185310 -126316 -105977 -167133
43502 -167133 -156271 -2968 120491 65816 -44974 -23713 86959 129333 112833 147467 195619
43491 195619 141350 43249 62538 172030 188955 84772 7638 -8139 -83794 -204366 -163425
43480 -163425 94903 319061 278737 67352 -63140 -19313 111755 223991 244457 130877
43470 130877 -61181 -187618 -180644 -122358 -91178 -48244 42591 100597 42319 -77698 -139066
43459 -139066 -99674 3178 113980 158756 81729 -49058 -78825 18576 83349 15929 -57695
43448 -57695 3637 108860 73902 -71426 -108330 57624 275626 360038 289848 165784 72545
43437 72545 30546 20076 9716 -15256 -38573 -36752 -4112 57624 146485 239695 297816 304742
43425 304742 269976 188416 49563 -107700 -210090 -228212 -183404 -91991 13354 34615 -85859
43414 -85859 -214189 -144900 95438 247901 196494 147168 302072 535333 579333 404052
43404 404052 203412 85689 -8328 -110722 -154035 -114399 -70628 -81376 -108140 -84280 10749
43393 10749 136789 190931 70382 -173912 -310507 -179054 77574 172165 35784 -125259
43383 -125259 -123084 18390 181527 310278 387458 379159 285042 176423 121557 111660 91935
43372 91935 28364 -70691 -159055 -171737 -79441 69091 184218 207434 137729 29981 -13619
43361 -13619 76167 218291 229835 61856 -105191 -97278 16559 49524 -27420 -94116 -104555
43350 -104555 -121929 -154741 -138036 -85987 -98482 -190700 -261162 -254600 -221787 -198411 -162400 -131344
43338 -131344 -159201 -210983 -186547 -98049 -71781 -137784 -177525 -127976 -70798 -57274 -20209
43327 -20209 55838 56136 -57215 -128864 -44695 65585 27188 -99223 -119313 -3137 102788
43316 102788 110380 63534 5298 -64984 -106815 -57094 51042 103500 55259 -24062 -55513
43305 -55513 -23771 38303 59498 -40541 -236442 -350733 -239784 156 139234 107430
43295 107430 39683 31673 17328 -65542 -142480 -119852 -19742 88008 188588 266714 243955
43284 243955 89178 -69613 -68262 80973 204881 188840 86038 6410 -9490 15695 46224
43273 46224 39783 -31665 -124422 -138874 -42857 60566 44842 -84960 -204869 -225249 -171986
43262 -171986 -118022 -98937 -113012 -144466 -154148 -97640 8178 82870 90350 95583 148716 168505
43250 168505 47738 -148165 -219476 -98484 45109 34763 -78994 -117176 -32923 55940
43240 55940 71895 80369 151092 218675 157984 -40717 -237975 -289931 -195767 -87023 -76123
43229 -76123 -133121 -134909 -29235 97195 133601 75987 -180 -49166 -69280 -42421 53955
43218 53955 178863 250623 246700 216110 192342 165822 139899 126852 86881 -22311 -122999
43207 -122999 -78721 77629 128758 -22696 -184543 -148509 1731 44953 -19030 -6819 92308
43196 92308 68212 -152953 -348724 -309448 -113471 36164 81835 68908 -17730 -189689 -325816
43185 -325816 -295159 -156113 -68746 -54461 -7397 88816 129567 70989 -15341 -77919 -128547
43174 -128547 -141519 -64452 44069 43591 -71600 -129115 -19278 147877 204184 130506 17634
43163 17634 -82492 -168992 -223756 -226629 -206466 -211788 -250126 -286481 -272891 -175254 -21598 83226
43151 83226 63292 -17211 -35560 14611 42782 35265 59294 96289 52040 -39604 -24757 97554
43139 97554 124944 -25203 -160489 -123524 -43267 -88597 -167059 -105240 24900 22975 -101285
43128 -101285 -168542 -136558 -109787 -97372 -24238 49225 -11885 -142771 -135964 9761 68854
43117 68854 -42034 -152509 -168503 -227680 -397715 -487884 -346633 -131189 -71017 -128489 -113752
43106 -113752 -14182 19636 -49430 -97656 -57842 -8824 -27961 -82447 -97188 -47219 36546
43095 36546 100339 104819 63481 24701 -6463 -78523 -190286 -244586 -171235 -45308 -3908
43084 -3908 -68889 -123898 -66895 65964 144034 90613 -28702 -82059 -31839 31169 37796 44503
43072 44503 113810 173885 122035 9616 -29670 -1821 -30036 -121270 -145686 -68569 -7442
43061 -7442 -15758 -9581 28979 -11681 -138628 -172222 -29754 111349 93752 31728 88314 171248
43049 171248 84515 -135609 -275472 -262907 -209876 -184532 -147409 -87281 -36648 25148 121839
43038 121839 173001 101983 562 6133 68152 41715 -29669 35777 227107 309214 172721
43027 172721 -11867 -70352 -50517 -66386 -96664 -72245 -30934 -44413 -75297 -30833 85002
43016 85002 162650 108466 -68918 -265224 -358348 -319615 -240726 -200628 -148667 -13668 123957
43005 123957 121991 21323 19322 166026 268201 171815 -22237 -130420 -139594 -159369 -215197
42994 -215197 -223956 -138124 -15953 42247 -14703 -135035 -191573 -116665 -174 33413 22280
42983 22280 99340 226810 192605 -59080 -286881 -270038 -105370 -26314 -57010 -40536 65652
42972 65652 123867 34513 -136731 -264323 -290132 -245025 -221026 -299429 -441352 -501360 -419640
42961 -419640 -318096 -308953 -311417 -204744 -71603 -95861 -265843 -385446 -368746 -314388 -274342
42950 -274342 -175490 -32485 -12546 -167892 -295912 -223304 -74833 -74015 -190832 -200631 -39311
42939 -39311 116137 129282 73900 68480 100319 103396 95016 126222 164922 136447 53571 14454
42927 14454 68472 148242 148482 36624 -115138 -180067 -77639 128931 249582 145398 -102830
42916 -102830 -266360 -227949 -105192 -80814 -178491 -270694 -257088 -151120 -14391 105007
42906 105007 164502 135874 46266 -39932 -91388 -117448 -113309 -63261 3525 39761 68448 149791
42894 149791 240634 205923 31503 -92817 -11064 164936 194984 38048 -104275 -71104
42884 -71104 63287 115634 15552 -149582 -247751 -218709 -119791 -75789 -141325 -212503 -139992
42873 -139992 64251 219129 205622 116875 112446 196797 238440 171188 67991 9247 -21640
42862 -21640 -65243 -85946 -27892 58964 46193 -91655 -200998 -126825 70799 167797 49745
42851 49745 -148671 -211474 -78428 131723 266750 243930 70750 -143314 -231745 -129951
42841 -129951 21780 28996 -110402 -214194 -173643 -80872 -59772 -88157 -66487 20199 97517
42830 97517 110942 70017 18706 9339 63002 121577 102398 33441 39888 140943 181349 69145
42818 69145 -41180 36334 214834 251022 120928 45601 124523 183428 73606 -90548 -128212
42807 -128212 -53445 19961 94095 223624 338043 321604 211121 133123 95706 32351 3426
42796 3426 121481 281646 228913 -40990 -205609 -68897 147684 157717 44995 80276
42786 80276 240188 233441 -12982 -210007 -130828 82177 176327 148975 164115 249801 288882
42775 288882 246550 208269 200241 147140 38228 -14417 53442 143641 132919 48604 22346
42764 22346 109846 231679 279005 225013 136643 107075 164548 229664 193611 62541 -24312
42753 -24312 30131 135571 125550 -11817 -118902 -96822 -37268 -66932 -155990 -185453 -149187
42742 -149187 -158265 -246327 -300705 -234144 -114872 -45413 -2457 86553 166127 104135 -77095
42731 -77095 -174866 -73232 88876 111795 -458 -88853 -78337 -21365 59232 200791 358082
42720 358082 396015 291286 203193 251062 335645 292860 132227 -4052 -50140 -50007 -31069
42709 -31069 14268 47799 26910 13050 94287 202193 166059 -22418 -157741 -90873 91296
42698 91296 222136 250119 198134 73499 -68653 -96911 30506 168022 173872 102564 79077
42687 79077 88419 50417 9447 58212 134625 99065 -16517 -43553 44951 100245 61762 44367
42675 44367 108248 141318 56780 -63314 -118969 -140252 -188437 -238650 -250140 -234696 -186042
42664 -186042 -78144 2003 -104988 -358256 -474770 -306082 -74419 -43394 -120561 -32918
42654 -32918 218655 361644 267294 92737 -9617 -79417 -180408 -249893 -216231 -127873 -76546
42643 -76546 -86240 -133094 -189100 -209969 -163322 -91783 -68645 -89770 -99758 -106702 -149116 -164019
42631 -164019 -44112 155196 228967 96510 -81538 -125151 -44053 44747 83242 71718 7516
42620 7516 -87203 -154252 -178704 -202546 -223477 -186054 -111842 -106768 -180805 -203851 -120518 -58805
42608 -58805 -121528 -219842 -240456 -226681 -236732 -171713 50584 266901 252208 69713 -3174
42597 -3174 122693 253717 232563 123943 34246 -44359 -130588 -173556 -166489 -189679 -253069
42586 -253069 -241394 -110871 1804 -18848 -83429 -45334 75346 155945 169784 167440 128096
42575 128096 2645 -122213 -81895 114792 240965 126442 -119381 -231413 -82988 194373
42565 194373 350248 242096 -45263 -280039 -301917 -166523 -51210 -37694 -49094 -1672
42555 -1672 65425 59580 -24779 -104695 -126224 -116861 -113896 -97596 -32912 50636 74010 15362
42543 15362 -42951 -17570 51018 45773 -49771 -108139 -42301 47805 11350 -120181 -165466 -56769
42531 -56769 66662 73539 21220 32790 92514 85092 -12731 -102758 -115548 -86472 -74195 -84467
42519 -84467 -87388 -51233 38613 141191 165425 84395 8036 44261 123266 93373 -25432
42508 -25432 -54045 52778 114176 8540 -127296 -120422 -33017 -33567 -105022 -86816 43007
42497 43007 130283 84148 -25096 -121498 -210882 -283251 -284034 -229115 -210059 -238985 -226806 -164784
42485 -164784 -171684 -279409 -328904 -205380 -47847 -64872 -224532 -298194 -179507 -779
42475 -779 72432 23725 -68317 -148427 -187776 -149758 -30558 96137 137969 89430 38008 48647
42463 48647 75199 34100 -42568 -9862 181463 355492 302975 70392 -81438 -20660 101019
42452 101019 94172 -12604 -70642 -50046 -35753 -49183 -26769 35441 47751 -38305 -152333
42441 -152333 -193243 -140426 -60908 -40718 -106575 -190728 -197029 -124291 -74986 -106984 -147624 -116554
42429 -116554 -57387 -56621 -98271 -109128 -93734 -95595 -61082 109657 374018 545873 510579
42418 510579 332472 128618 -54165 -207784 -313949 -369141 -381498 -326412 -191412 -67012
42408 -67012 -75853 -188671 -235286 -140318 -23506 -8409 -56042 -66265 -29443 14275 61801
42397 61801 94167 41187 -82221 -103514 90807 334719 356242 150810 -789 78277 219155
42386 219155 149038 -133912 -353768 -298765 -65866 73468 1247 -123497 -90014 79848
42376 79848 167772 71429 -51651 -25463 77781 56808 -94137 -161076 -27421 154054 185028
42365 185028 85809 19060 36013 41805 -11127 -35409 47462 172291 203537 94552 -82055
42354 -82055 -231262 -305036 -290538 -196437 -73016 253 -11978 -54806 -41663 45161 136854
42343 136854 160124 115237 67268 73510 124213 149542 89664 -35137 -135475 -145786 -90994
42332 -90994 -43045 -32733 -38554 -48774 -87054 -166138 -248049 -265195 -171255 16971 205386
42321 205386 273591 188056 55476 12493 68880 119232 103323 70659 67243 53723 -5218
42310 -5218 -48777 -6015 68302 39613 -126458 -305978 -358935 -282008 -196896 -213472 -324388
42299 -324388 -427139 -438621 -375706 -311693 -274501 -233297 -181481 -164402 -193331 -193736 -97898 45994
42287 45994 117685 65136 -43725 -101152 -59615 36362 94859 70431 26003 64973 186452
42276 186452 264848 209063 83036 18026 61846 171189 287854 346172 271661 78331 -78420
42265 -78420 -63947 47496 69073 -31631 -103512 -62797 -22992 -112747 -282723 -377268 -322135
42254 -322135 -172696 -38081 -12667 -120359 -272818 -338706 -296538 -254830 -283369 -309890 -243097
42243 -243097 -112573 -7871 47768 78850 82971 67662 94600 181193 220070 119808 -25970
42232 -25970 -52728 27635 59051 11201 22601 128374 148597 -27753 -212279 -155099 79384
42221 79384 180837 18505 -201169 -248725 -164690 -124773 -141758 -74864 98259 193412 62675
42210 62675 -188172 -319296 -237017 -57645 83166 172498 244489 266494 190970 78457 64959
42199 64959 185716 305432 275731 121655 4784 7885 33640 -40260 -167318 -185033 -50121
42188 -50121 87842 92422 20624 5782 36047 -15147 -164255 -273240 -252716 -170371 -106366
42177 -106366 -37033 53112 69415 -58522 -226321 -268900 -167939 -27713 93231 190878
42167 190878 215070 128396 40436 100512 244024 230630 -12895 -261989 -292749 -159881 -65527
42156 -65527 -76087 -102251 -73312 4233 110623 217081 259772 207668 124569 79525 41471
42145 41471 -42456 -114581 -75033 40586 80203 -18296 -150497 -198167 -159948 -98294 -49315
42134 -49315 -34525 -83836 -180479 -233992 -176679 -60550 3775 -8354 -16990 28833 69521 35752
42122 35752 -23448 -5524 66641 53596 -68423 -120039 18718 176069 109319 -107854 -163149
42111 -163149 21426 164649 65462 -99579 -90209 23298 40275 -5358 43721 117210 10794
42100 10794 -214470 -264905 -74844 83658 32461 -68738 -38494 38472 17049 -42820 -27795
42089 -27795 -11164 -112857 -244904 -228691 -91634 -27647 -96774 -164101 -132649 -57453 -6072
42078 -6072 40610 104766 148029 143537 128266 137393 143367 98459 6292 -72144 -74588 -2811 65877
42065 65877 56965 -12396 -65592 -79497 -92430 -103297 -72040 -41738 -123529 -296419 -362825 -208054
42053 -208054 19871 115782 89759 83967 115110 81984 -23425 -94823 -87261 -58374 -40676
42042 -40676 -11608 17630 14915 14581 61768 94388 25563 -81313 -85227 -2491 13322 -66254
42030 -66254 -99886 -34182 -5856 -105906 -222180 -224132 -150583 -94354 -36156 67740 138535
42019 138535 70230 -82816 -149279 -55264 100363 177535 138265 65667 70931 162825 213032
42008 213032 106525 -87190 -189544 -158831 -131807 -193226 -253720 -222846 -154083 -118945 -75543
41997 -75543 14170 62636 -369 -70332 -21476 65214 12694 -164285 -276650 -254461 -232175
41986 -232175 -311846 -409585 -397365 -267475 -95436 51216 109933 33498 -124465 -213570 -145394
41975 -145394 10480 137748 208019 243809 225742 133325 33316 18328 61352 31418 -117851
41964 -117851 -260757 -259814 -154699 -105922 -169608 -226218 -161691 -29593 39859 29500 28355
41953 28355 56992 21358 -125519 -275479 -285758 -149024 17511 109354 105046 36522 -48581
41942 -48581 -108243 -132749 -144438 -156741 -162534 -173848 -219807 -276146 -256305 -123321 35146
41931 35146 99260 55067 -3648 15426 121471 230293 215040 25865 -214414 -310915 -232057
41920 -232057 -151035 -194343 -265201 -223067 -128097 -146555 -276721 -349211 -287594 -197209 -170460
41909 -170460 -157637 -84457 25204 106030 136572 116477 42288 -50000 -98572 -109553 -152237
41898 -152237 -225448 -230722 -135456 -57432 -98595 -181221 -160074 -40430 37866 12953 -22436
41887 -22436 24943 117035 154675 115206 60051 34986 22442 -5508 -36412 -48192 -60851 -110965
41875 -110965 -178157 -188410 -112003 -14286 26536 15900 12469 31646 36352 10196 -16473 -14180
41863 -14180 14794 52078 74822 59258 5268 -54741 -97091 -128551 -140072 -91246 11845
41852 11845 88676 104897 144193 252830 291711 106774 -192790 -321271 -195398 -33029
41842 -33029 -24266 -101825 -130917 -132116 -165917 -157453 -27016 115216 108282 6166 -1331 101594
41830 101594 139040 40500 -58812 -67813 -85713 -191575 -259875 -143229 72606 171375 109246
41819 109246 39049 38251 -4602 -163778 -289595 -191458 60682 182743 43727 -152265 -129753
41808 -129753 110797 326929 362940 297166 248907 190626 45169 -129707 -188133 -102274 -890
41797 -890 20152 29012 140113 323144 414253 323198 163141 120764 218812 281280 163553
41786 163553 -52985 -173079 -148731 -110615 -136460 -127301 12635 185063 208927 68857 -72149
41775 -72149 -97045 -61001 -76779 -165194 -258453 -293895 -267250 -226344 -233855 -310259 -401435 -423942
41763 -423942 -346193 -208195 -69468 42825 146467 277811 425708 487944 362661 117510
41753 117510 -26202 36677 129542 29596 -196397 -268495 -91704 116582 141145 27238
41743 27238 -63281 -88796 -93805 -70700 -7376 21241 -34886 -69225 37219 191781 191882 36467
41731 36467 -50808 61451 244309 318105 276479 212726 153932 84462 41094 60290 87945
41720 87945 56922 14242 55994 158064 192326 120243 57806 106192 206198 225974 140840
41709 140840 54939 60014 133416 190807 200216 204043 229623 224228 127466 -5589 -28739 110235
41697 110235 270807 277724 142344 36801 54109 95054 28614 -122670 -224679 -203247 -100237
41686 -100237 7460 67292 44848 -58516 -168157 -186851 -114870 -64930 -118830 -216748 -242058
41675 -242058 -181108 -129164 -147586 -191065 -196462 -173511 -159238 -136457 -69714 3901 2877 -75205
41663 -75205 -137346 -128947 -109181 -143826 -189741 -160443 -60957 30742 90801 158209 219214 193615
41651 193615 72478 -27112 -7060 83963 135682 128968 125367 148948 164585 150878 116795 62566
41639 62566 -2865 -26908 19423 57133 -14567 -146856 -172954 -42479 91339 80159 -25616
41628 -25616 -76306 -34417 15706 15518 -16897 -55665 -89244 -87073 -30625 29998 27178 -28617
41616 -28617 -77896 -110672 -143962 -129884 -11118 135100 149897 20458 -83474 -52756 21968
41605 21968 30539 15749 44544 36748 -110041 -303820 -344997 -199353 -27306 40853 10095
41594 10095 -76946 -171030 -150381 81610 385360 461423 229972 -31282 -47678 100470 139877
41583 139877 5299 -110064 -61319 68672 112941 15653 -147313 -255951 -230806 -95274
41573 -95274 31177 47090 -27947 -103152 -137756 -149470 -133037 -58789 47319 101351 60338
41562 60338 -26168 -75818 -48782 34879 116167 138184 94796 30507 -20909 -65739 -105058 -117130
41550 -117130 -113047 -138652 -178822 -145732 -24202 69272 59324 37097 94248 140557 50753 -94403
41538 -94403 -113328 -17560 18597 -35005 -22832 104208 192022 152381 107803 155593 183044
41527 183044 62808 -122830 -208673 -180942 -137521 -108293 -56829 10153 60545 103489 134710
41516 134710 89503 -41386 -128441 -62688 62784 62053 -90830 -240573 -263260 -194787 -149202
41505 -149202 -182873 -240001 -204431 -42180 99269 26018 -235335 -426286 -375871 -201889
41495 -201889 -106919 -118077 -153449 -203089 -275785 -281128 -152576 -2187 32621 13279 69612
41484 69612 127242 10605 -221189 -310304 -192456 -92252 -154959 -225266 -120332 70266
41474 70266 119852 -21874 -201456 -274612 -219584 -83164 72629 174660 166855 59503 -66039
41463 -66039 -114957 -65973 -12237 -68031 -203802 -247148 -112040 60261 94541 32613 45904
41452 45904 159027 236537 219828 190564 187931 146058 55590 21836 98957 203574 252379
41441 252379 259341 241432 156425 4565 -115900 -123106 -37491 85318 210835 282702 235582
41430 235582 100304 -578 -4342 31890 42662 24514 -18052 -80809 -101638 -23962 66769
41419 66769 15530 -167062 -294894 -267792 -185481 -158132 -169461 -182740 -211825 -220113 -121668
41408 -121668 41645 100073 14470 -49212 4753 52067 -8052 -64873 -6168 72076 43597
41397 43597 -25475 -18051 18037 -12699 -55133 -18933 30394 -6229 -64402 -43661 -19616 -114850
41385 -114850 -258942 -297439 -247011 -214918 -157648 25858 230592 246877 90540 -31539
41375 -31539 -60356 -112373 -174219 -75994 170406 293372 136841 -118814 -233505 -203911 -155917
41364 -155917 -120420 -62175 1639 45881 101263 171956 187509 125251 78637 114562 161733
41353 161733 134642 78453 90734 168500 225087 206350 115869 -22630 -157649 -210279 -148112
41342 -148112 -30956 56935 85918 67286 10266 -72532 -152525 -201379 -196302 -118536 10984
41331 10984 115909 142295 123480 100746 31770 -118126 -248503 -235255 -139732 -135346 -230892
41320 -230892 -259162 -164721 -89979 -107886 -90839 34494 114580 25933 -77602 1339 153479
41309 153479 106221 -143007 -303077 -212519 -43916 -11963 -80994 -86021 -592 64000 52823
41298 52823 25416 40347 81787 105904 95422 60689 28175 26996 54454 66784 40890 25702
41286 25702 74752 135246 82790 -103474 -271561 -263907 -109444 22684 37040 4320 45694
41275 45694 195864 386360 500772 443802 228482 7517 -55140 38639 141702 162476
41265 162476 148442 153869 149530 119809 128138 199308 239218 170392 60551 17140 37107 63266
41253 63266 101668 166500 194424 144775 103883 145882 170861 52027 -121203 -142917 -2349
41242 -2349 104353 74856 20798 60076 161676 238276 246931 168837 29733 -46285 41368
41231 41368 184380 179506 47070 28976 213975 385166 347903 206135 161556 205444 193141
41220 193141 112393 88819 173159 274726 290973 203502 67155 -26928 -13829 68055 114316
41209 114316 102821 118318 184561 188075 55643 -96476 -103139 32261 168125 215507 197976
41198 197976 167810 160695 205538 297181 373935 375010 301912 201392 130722 145194 243209 315531
41186 315531 251688 111691 64038 129019 147157 56380 4607 75621 101430 -77254 -325586
41175 -325586 -398510 -290219 -180164 -123365 -32859 85056 127254 115835 186387 330444 371221
41164 371221 245115 99871 42239 -12138 -135694 -221166 -161160 -54568 -64974 -159168 -159143
41153 -159143 -21920 94029 61644 -45321 -73796 6697 106419 173220 243846 324729 324319
41142 324319 183104 5983 -52422 -12311 -38580 -166838 -221316 -88732 80121 86373 -16910
41131 -16910 -26026 80817 123611 27581 -58154 -5160 103360 117537 29417 -63864 -113269
41120 -113269 -132005 -115512 -44134 53991 108031 72679 -26772 -100889 -58885 85698 190738
41109 190738 149384 62442 121271 304311 356802 157040 -62801 -21593 204604 292743 137912
41098 137912 -28106 -13057 71976 41855 -50748 -14752 163246 295011 263240 150296 71198
41087 71198 24044 -29706 -46879 43275 220099 380069 438472 381101 251650 128542 76855
41076 76855 82703 70068 12737 -23287 10167 56116 42237 3547 31281 132007 218975 223836
41064 223836 149128 39288 -30041 23118 179210 270342 154189 -82752 -214379 -162634
41054 -162634 -67814 -56514 -77723 -26588 83266 154505 145986 108225 114441 191729 290255 318189
41042 318189 252741 194845 239044 321164 308245 216741 189635 247829 240664 100356 -29847
41031 -29847 -22770 32339 -8454 -104873 -113215 -25818 32261 10539 -5561 64310 204030 354116
41019 354116 469211 516372 482913 395890 298868 219946 181769 202779 258754 290812 283732
41008 283732 282101 299412 283833 218605 177939 220389 294515 315964 277188 219964 165452 137632
40996 137632 188115 321392 452085 506826 511615 513012 484425 395922 314035 331772 434956
40985 434956 524466 544250 513872 462125 400778 350222 336691 369798 442078 523976 559647
40974 559647 525433 489968 533246 606938 586085 470100 395062 414068 421766 357662 316698
40963 316698 362987 398786 345734 305465 387665 506610 516389 448601 448773 553800 686647
40952 686647 803285 904772 978207 1060923 1276783 1667574 2087563 2423232 2804875 3399248
40942 3399248 4086730 4589120 4886583 5269816 5952944 6818839 7572399 7992380 8029064 7815994
40932 7815994 7599689 7504010 7341574 6794863 5802356 4642874 3636309 2892918 2360314
40923 2360314 1968531 1681925 1503344 1453212 1484997 1458404 1291785 1092752 1014728 1028504
40913 1028504 978445 829687 697117 640052 595426 531960 513938 569149 621958 607322 552039
40902 552039 501208 447114 372561 308860 317207 426933 582439 653048 557859 393516 342632
40891 342632 430808 505609 500107 541533 703479 840926 819879 733386 712060 693800 593554
40880 593554 537174 671781 870070 891395 744135 628434 607042 603569 649045 838815 1088091
40869 1088091 1210138 1207389 1223015 1252116 1184798 1090765 1148576 1308469 1344467 1247627 1244960
40858 1244960 1401203 1530696 1558764 1640133 1829695 1957990 1965321 2068294 2424779 2861525
40848 2861525 3104600 3120031 3104045 3270459 3715961 4345126 4874962 5061718 4959668 4826091
40838 4826091 4791963 4786557 4727784 4572181 4233405 3700543 3191853 2928734 2809550 2591662
40828 2591662 2325750 2268228 2415189 2512661 2517589 2632817 2854972 2922616 2797160 2771807
40818 2771807 2983801 3221425 3343866 3485988 3693213 3762627 3642724 3610599 3832755 4088820
40808 4088820 4141065 4059056 3983989 3894219 3804190 3879717 4148865 4389722 4489189 4623311 4924313
40797 4924313 5287150 5667303 6228736 7012243 7802149 8531797 9491728 10910762 12637375
40788 12637375 14475194 16575839 19286932 22863057 27582172 34004307 42855774 54556063
40780 54556063 68898067 85474501 104684708 127642881 153657667 177926168 194504485
40773 194504485 203804744 215316874 239174826 274576487 309203911 330692624 336381588
40766 336381588 331863947 323978305 316890750 310683943 299678192 274784379 232661775
40759 232661775 182333008 138762954 109532548 90850739 76087875 63513047 54349730
40752 54349730 47870796 41961188 36277882 31717848 27925898 23821185 19752491 16918836
40744 16918836 15189910 13416600 11484229 10268655 9803616 9155447 8058701 7203912
40736 7203912 6850338 6450312 5768367 5229305 4991902 4667351 4121801 3695181 3488011
40727 3488011 3205676 2807669 2591266 2565393 2424467 2175385 2117973 2193690 2039604 1705683
40717 1705683 1620990 1804253 1807681 1525310 1365675 1496915 1588753 1471870 1421254 1580488
40707 1580488 1687537 1596969 1547427 1694516 1872240 2016628 2327587 2792249 3042650 2951050
40697 2951050 2915736 3265995 3777528 4065051 4101337 4065164 3996286 3881604 3803978 3748254
40687 3748254 3515993 3060030 2639611 2423904 2232202 1928748 1780622 2069011 2541463
40678 2541463 2632806 2165899 1522523 1130225 1037370 1030006 959845 853682 788423 754278 666541
40667 666541 500750 360199 354439 454706 545938 576364 566484 528061 482585 493331 555159
40656 555159 535097 371437 235301 307141 486480 544471 476975 445843 438732 292118 34661
40645 34661 -105609 -61238 7343 40131 159040 353552 409023 268333 163658 239511 328256
40634 328256 274930 211792 290005 375944 275263 85586 55339 198554 302799 263397 183053
40623 183053 154619 140759 97352 74793 145510 300127 444454 477666 387074 278793 277878
40612 277878 387188 493117 512577 466943 406665 345336 288565 255463 250546 266093 302541
40601 302541 328918 265768 98502 -41339 -27480 73527 105554 67790 83539 152055 134823
40590 134823 4306 -95582 -82831 -43144 -43908 -25188 47560 95857 86817 119867 245180 333496
40578 333496 249660 52455 -91144 -108729 -42090 58906 159244 203517 151663 44255
40568 44255 -15199 48322 199672 295563 216670 32217 -43103 82213 251497 294302 255100
40557 255100 245903 218379 97100 13277 131329 323254 322632 165099 144282 321430 429017
40546 429017 328090 214142 247273 302558 248903 179897 179090 123145 -69709 -225303 -167256
40535 -167256 4762 93718 88455 77690 51197 -19996 -58790 -18430 4088 -46282 -47778 82020
40523 82020 212016 218810 204753 306656 462025 553267 595655 590188 417419 120664 55141
40512 55141 435847 928328 1040644 775427 528454 465602 409877 284524 235938 286366
40502 286366 256533 114359 57465 150867 197746 86486 -24756 -3844 42108 3208 -20649
40491 -20649 81304 211749 224109 154071 128801 158335 161884 115395 54081 -2982 -43188
40480 -43188 -41484 -10301 4687 12760 67577 144874 153055 101230 119208 253387 377994 381866
40468 381866 318588 291045 300902 297726 278507 255820 208963 134143 72033 46613 56947 136239
40456 136239 295949 406913 311173 93294 38660 234969 428927 420817 389775 608462
40446 608462 990155 1184089 1050859 789417 605602 491918 378283 298803 314322 394578
40436 394578 464322 494976 495845 467390 399937 288112 143284 18580 -12672 45737 85358
40425 85358 35734 -22282 12247 73432 17805 -124772 -160867 -20731 129370 131742 52605
40414 52605 52834 150242 225167 196009 85179 -43673 -122335 -90921 35477 136950 104448
40403 104448 -31551 -149784 -183883 -152339 -85551 -13132 6558 -52371 -105352 -46314 87735
40392 87735 152828 106568 56194 70863 84043 45980 35765 116730 196261 164716 87961 108058
40380 108058 208269 243565 181437 138179 164512 170059 108891 72461 112727 123422 19106
40369 19106 -87618 -38208 118817 187467 105582 11922 24801 93915 115453 81553 47183
40358 47183 24642 -11819 -52167 -46891 26456 126287 176487 125862 -4060 -123206 -149838
40347 -149838 -96154 -53812 -82330 -140188 -146332 -81408 4010 63202 96715 126153 160256 192093
40335 192093 200438 152860 51290 -13555 79950 314091 474672 368206 85664 -71280
40325 -71280 38651 223268 235323 105723 58330 167929 284984 292753 254448 250216 227687
40314 227687 115850 -24350 -75965 -22290 69571 160437 239291 267966 230876 199754 239061
40303 239061 273652 170953 -45520 -187074 -138771 -3662 51441 14243 8381 98210 204160
40292 204160 222735 160299 100424 72956 25708 -59107 -88870 32523 250717 394924 371511
40281 371511 251048 147804 93866 70027 80170 127049 167477 159023 115838 67517 9622
40270 9622 -50754 -60510 -8293 9137 -91344 -226199 -226624 -66705 98152 136485 86706 65129
40258 65129 111525 176230 206813 198840 184240 192537 208901 180010 96028 41957 98774 204947
40246 204947 210841 92771 12403 99354 255898 277834 131228 -6555 2982 76088 47446
40235 47446 -73375 -107731 21899 153373 103133 -64089 -122544 -10478 100005 88535
40225 88535 62142 140115 220528 136252 -52593 -127350 -38409 42155 10225 -31156 13792
40214 13792 66817 36159 -5202 53713 158916 171187 94209 73829 184201 340933 433295
40203 433295 437415 381938 293714 208172 163733 152908 126807 68878 21361 24369 70440 130789
40191 130789 184331 209251 188623 140477 107837 109445 131458 160174 172293 103519 -89451
40180 -89451 -316588 -397070 -268421 -73945 27808 60334 133448 218678 173222 -15803 -164279
40169 -164279 -121658 48903 192182 263737 318288 368480 366269 296208 194606 90382 4555
40158 4555 -10908 75837 187405 191002 67302 -47117 -21749 120006 255349 320106 358915
40147 358915 429875 506946 504396 392433 256446 207902 250228 287141 267115 245656 273329
40136 273329 303127 271747 204501 162909 146327 126459 119333 131522 100652 3395 -38386 102094
40124 102094 351415 516692 541148 528857 548010 586251 684221 916325 1238948 1576848
40114 1576848 2072351 2964454 4106320 4866941 4723595 3808543 2709818 1875884 1377344
40105 1377344 1094820 902109 711040 516499 393915 369170 357788 304686 268354 274421
40095 274421 230373 109292 61412 183818 330341 333043 264378 270184 287375 176275 15755
40084 15755 -5480 94330 157289 192263 313841 432099 340232 108628 45138 210585 310713
40073 310713 168952 -15908 -30496 29808 -6373 -70785 2936 186648 312443 310682 236058
40062 236058 155959 138782 246710 424922 502672 403602 245438 152561 108845 79953 111781
40051 111781 189324 170026 8448 -109505 -26936 129928 144224 33385 -20546 29963 81307
40040 81307 98986 143134 202501 199491 155387 171182 234251 211902 65951 -77212 -116540
40029 -116540 -106804 -137918 -186866 -167993 -71847 20528 48205 46619 95481 203474 281711 264605
40017 264605 225182 296969 483756 630857 606554 437105 241004 107322 60044 61575 33080
40006 33080 -47955 -74953 53147 238551 283764 194001 187312 350256 490743 434152 269938
39995 269938 172233 154221 149819 173358 235368 250809 193171 186848 281890 310541 161487 16006
39983 16006 84022 290160 489776 796133 1326724 1767441 1640649 1001260 442460 338339
39973 338339 467107 495612 445504 470870 502183 393212 212199 122258 111014 69167 28663
39962 28663 100252 239735 280427 180998 82776 114764 250782 366624 370666 281691 209095
39951 209095 226943 262565 183407 4484 -100102 -30876 110008 184508 188590 174200 124764
39940 124764 27213 -26690 51836 192603 242958 170985 85580 73416 112611 141479 129784
39929 129784 77373 4628 -49949 -65083 -66678 -90696 -127383 -130272 -68941 43331 154521
39918 154521 198548 147244 45004 -45996 -133289 -267692 -421753 -470946 -334918 -81568
39908 -81568 147338 267174 279265 228979 181990 197149 269934 323668 293993 210591 174322
39897 174322 259114 436046 588597 634295 659660 881206 1395905 1997291 2328169 2217248
39887 2217248 1801780 1342943 1009752 826468 717814 579648 380340 203213 133019 134132
39877 134132 127152 134656 220416 322496 311969 212021 182843 265406 315796 240232 124258
39866 124258 62637 23297 -35409 -56391 13361 124222 199004 204498 117713 -43530 -138140
39855 -138140 -30721 162734 175845 1724 -51538 167690 395715 351069 142406 38218
39845 38218 40009 -30416 -172878 -238034 -214488 -199661 -157553 8739 190850 172969 -10501
39834 -10501 -89561 46029 217346 260647 223094 192326 145092 51725 -36091 -77958 -94645
39823 -94645 -85557 -26048 35497 19647 -33889 -6203 105077 185419 195907 193149 161038 25895
39811 25895 -138948 -140425 42866 194307 157279 19460 -71368 -96364 -91311 -54537 -13643
39800 -13643 -29619 -67451 -23072 72498 70279 -19213 3493 186824 308008 228900 119171
39789 119171 142423 170369 52331 -53087 81497 339974 421855 321701 314144 492979
39779 492979 662329 725584 863102 1198886 1536976 1596791 1359858 1038427 802313 660872
39769 660872 548725 420799 284345 192968 190721 246451 283177 276096 263683 255433 200908
39758 200908 80840 -26694 -15928 124800 280571 307107 178720 31826 12444 85314
39748 85314 84532 -28351 -89317 10989 135641 100719 -50579 -144665 -157000 -187880 -213022
39737 -213022 -96223 140764 290835 257382 172692 151729 132128 60131 35204 121220 182518
39726 182518 88983 -43612 -17192 132025 191398 104881 35022 81842 137807 82597 -40040
39715 -40040 -127863 -176171 -222493 -226380 -125532 31901 124351 117777 94923 114712 132504 99725
39703 99725 69605 131021 266316 349278 293952 153642 51838 52898 124360 192816 202799
39692 202799 142432 49843 -10775 -7648 26363 39271 28176 38072 97740 178147 213212 154358
39680 154358 23399 -76748 -41534 106818 203288 115061 -77075 -144083 23697 275324
39670 275324 370369 252005 89161 55632 137217 199561 200194 241214 387304 521234 476102
39659 476102 276688 130123 156504 242540 224285 117845 69630 136575 228251 252284 221548
39648 221548 205171 237688 291554 305803 247675 166116 149930 208641 255294 244970 241063 273744
39636 273744 242885 87623 -47364 6322 155931 158972 4032 -57697 92873 256034
39626 256034 233658 124781 133027 238733 263108 162724 60703 30410 31926 54712 158257
39615 158257 343587 510045 577272 563364 522695 485407 472154 494547 529785 561492 644809
39604 644809 855268 1179490 1556456 2036665 2766138 3726661 4582045 4910123 4583737 3846235
39594 3846235 3025863 2277101 1624268 1127319 863082 767328 647217 419516 237765 282520
39584 282520 487547 599332 491944 295293 187429 176993 152695 62949 -34461 -64655
39574 -64655 -17595 53456 94657 119292 190135 300430 326039 182409 -19642 -102454 -71627
39563 -71627 -72943 -114455 -48480 126166 187834 39201 -94578 5647 215948 277021 184605
39552 184605 125965 139737 108111 28050 23833 104310 149367 136513 151330 174216 98981 -22663
39540 -22663 -12920 114172 133281 -16484 -105336 15815 173280 164418 64280 37686 39035
39529 39035 -66116 -218885 -249615 -161241 -108927 -144699 -178862 -163239 -131551 -79445 22185
39518 22185 103338 53639 -81004 -113039 41521 255820 363883 332046 223115 88876
39508 88876 -42861 -131990 -133942 -40793 90080 154716 94647 -12909 -21687 93396 195142
39497 195142 185867 149589 203555 303310 315443 213561 80590 -19706 -52592 29333 192933
39486 192933 262669 120679 -90362 -146381 -64945 -34532 -70329 -12404 125720 114312 -92304
39475 -92304 -206494 -30592 218047 230111 62035 11049 155624 293159 285088 207570 152004
39464 152004 100719 47727 55492 119254 122662 12737 -91598 -52787 96613 192942 124165
39453 124165 -76928 -282280 -369658 -305396 -160845 -34925 40419 92888 128321 115814 53362
39442 53362 -15719 -65436 -108908 -144138 -139947 -98699 -70758 -71751 -42415 61637 182971 217686
39430 217686 133591 -9419 -135597 -208234 -225000 -202505 -164225 -115996 -41145 54727 112171
39419 112171 75549 -18858 -61489 2018 98748 120906 65301 29449 71614 136969 154273
39408 154273 147844 182532 226795 169502 -7067 -164694 -176696 -84847 -12894 14806 64576
39397 64576 139935 164857 130194 132331 214846 274148 201867 52448 -18008 56720 197912
39386 197912 294846 304900 254936 205862 212472 266483 280574 174328 -22701 -190224 -237202
39375 -237202 -173691 -78055 -31782 -73048 -167319 -226285 -196574 -126390 -106293 -153233 -199954
39364 -199954 -195009 -160845 -143823 -150986 -151121 -109075 -15373 90372 132491 71639 -41500 -118192
39352 -118192 -123011 -77401 -4189 70041 85260 4214 -109613 -153595 -121372 -87701 -65526
39341 -65526 4323 103468 110045 -19380 -162066 -203960 -197135 -246419 -332106 -362767 -337323 -327568
39329 -327568 -334754 -284199 -157148 -33556 1828 -64387 -177151 -240923 -180030 -29559 75509
39318 75509 60667 6186 15058 60019 55414 10764 -4011 7187 -11715 -57537 -95081 -142514
39306 -142514 -201733 -168898 25555 242258 283317 180992 133944 178723 157465 24636 -65136
39295 -65136 -34256 -4880 -58485 -109468 -124455 -219505 -390715 -396310 -113558 200456 245704
39284 245704 101426 52532 144458 202452 186263 206454 235184 123287 -84467 -159424 -68316
39273 -68316 -48907 -207954 -321872 -196200 11956 38802 -86573 -118473 19504 148557
39263 148557 118949 -4277 -74044 -48236 14072 64883 112258 178488 254695 303491 298545
39252 298545 254380 211542 197571 208762 217733 188857 105500 -4371 -93866 -156903 -219311
39241 -219311 -258934 -208301 -78258 6431 -28248 -82446 -25097 105546 165947 123300 70713
39230 70713 54877 34535 3499 5310 11170 -69012 -218352 -292545 -217865 -92054 -40740 -84233
39218 -84233 -186970 -316469 -400017 -346850 -184923 -68320 -79332 -125314 -96279 -13005 56591
39207 56591 113105 164471 154549 57758 -41390 -62115 -39486 -33283 -19643 24836 31789 -43444
39195 -43444 -108057 -69968 -3584 -24972 -80242 -36614 70696 80686 -24091 -92179 -59802
39184 -59802 -32476 -66119 -65401 13238 39162 -81497 -214955 -178766 -19691 55770 -12427
39173 -12427 -64518 34293 210553 294792 226313 81856 -47351 -137486 -201541 -232360 -204312
39162 -204312 -120883 -35952 -9407 -41968 -71368 -43511 25034 71406 66935 51581 78881 141713
39150 141713 175126 134623 48286 -24358 -61040 -68321 -20160 129038 339830 453112 333143
39139 333143 39631 -205670 -244451 -130589 -30993 -26424 -64076 -80592 -91311 -131241 -170624
39128 -170624 -149164 -68364 8455 38581 28742 -7440 -54150 -59949 13364 93230 51704 -95373
39116 -95373 -156951 -20904 163217 177681 31430 -85011 -78485 -14764 63477 178362 265666
39105 265666 197215 21343 -22683 154835 317565 218786 -51703 -215029 -188701 -122751
39095 -122751 -111573 -85752 -682 54074 -1999 -107975 -137425 -40964 118072 220449 183215
39084 183215 50484 -26454 34328 124774 95032 -18654 -47619 41091 92385 15115 -77654
39073 -77654 -70999 -50206 -158782 -339022 -379906 -214298 -27854 -31451 -218103 -398298 -417255
39062 -417255 -284817 -129153 -76748 -160007 -289488 -314758 -158175 93723 262476 258392
39052 258392 159957 95700 91000 77620 18604 -50800 -102627 -158961 -228662 -262606 -215937 -120698
39040 -120698 -58607 -78374 -156844 -218623 -186194 -48412 102410 135377 4636 -209262 -378359
39029 -378359 -418122 -321542 -165810 -76937 -113011 -181807 -154629 -56702 -34360 -120928 -173187
39018 -173187 -95234 10410 5173 -87677 -152990 -154838 -129650 -98277 -95882 -196017 -378503
39007 -378503 -466683 -346143 -163810 -139257 -246391 -278080 -183242 -116781 -149376 -154407 -45940
38996 -45940 67255 63056 -9361 -29502 23492 92658 145734 179948 201785 252847 366120
38985 366120 457373 378343 138149 -56174 -66419 -6010 -45174 -150932 -169891 -85805 -21096
38974 -21096 -15525 22748 127970 190227 117510 -23045 -100610 -91870 -86018 -153713 -272778 -373095
38962 -373095 -408763 -383156 -333144 -293693 -256695 -164968 21118 238389 340502 242571 25711
38951 25711 -147003 -199564 -170918 -98746 23560 158328 205938 137831 56472 50301 74283
38940 74283 55405 23671 31859 34541 -22024 -70251 -36033 -11902 -128251 -294911 -283197 -65629
38928 -65629 136306 169021 102300 27598 -70505 -157291 -92278 129990 277332 182032 -12994
38917 -12994 -75705 -3826 59439 89282 145072 178909 112633 40969 117967 267096 244988
38906 244988 10612 -196862 -201790 -105804 -73689 -91631 -60875 9597 45523 53297 89526
38895 89526 134422 115033 37648 -161 63245 180823 263911 275792 240795 189922 127130
38884 127130 53213 17 4292 42401 39314 -25289 -69997 -28067 34221 2144 -107660 -157271
38872 -157271 -86828 3953 15013 -12471 13545 80688 105113 80342 87132 152141 190784 129242
38860 129242 17594 -36047 -10255 13343 -25746 -84218 -80594 -4344 79143 114011 101888
38849 101888 64932 2304 -93129 -191443 -225088 -148561 -7954 66600 -13300 -161342 -173706
38838 -173706 25399 253833 277784 107201 -36301 -32812 6984 -38271 -113469 -115705 -73544
38827 -73544 -60935 -32940 89489 230911 234849 113417 53464 145765 256899 226256 72572
38816 72572 -59192 -65008 58376 235501 342112 294949 163691 113304 186712 239038 151663
38805 151663 8566 -35360 26861 81509 72133 28220 -30924 -92390 -93144 -7013 46326 -59637
38793 -59637 -224898 -214451 -6814 147746 87315 -42028 -46587 21251 6168 -60915 -37039
38782 -37039 57675 71968 -4220 -25494 48810 99105 82405 111034 230149 318378 301807
38771 301807 278554 316236 305324 159145 926 -19182 36627 20903 -39782 -11931 92826
38760 92826 136493 85511 32433 11084 -28034 -73027 -61674 -31125 -75335 -150282 -110445 40238
38748 40238 126843 73529 1211 -9455 -57688 -219417 -372796 -363187 -224382 -105429 -62120
38737 -62120 -35636 25540 118680 213107 255680 202430 92855 29989 50113 85919 82137 50770
38725 50770 -10229 -126972 -237344 -210364 -45137 88462 89157 63818 132338 239336 283809
38714 283809 298285 346225 354735 221570 14395 -99938 -77331 -8535 41803 73912 74842
38703 74842 34314 9554 62316 161560 237457 275675 270044 168353 -18952 -149415 -130306
38692 -130306 -83567 -166538 -305132 -293573 -109650 65873 118567 93248 28476 -95551 -218445
38681 -218445 -203660 -40581 113089 148065 126071 134809 151383 111426 8843 -121896 -233025
38670 -233025 -251530 -143213 -3560 30652 -24896 -25634 64813 112084 38829 -33790 33966
38659 33966 189765 265731 203549 114352 137894 288086 427027 397873 213717 69261 95528
38648 95528 171636 105245 -63308 -120767 -22072 46160 -20053 -83480 -12194 109640 142928
38637 142928 105375 83790 68220 20006 -1793 71795 188067 259156 299185 348464 349723
38626 349723 247518 135481 138778 199617 153706 -1452 -94464 -53110 -18539 -122509 -283114
38615 -283114 -314439 -162328 53001 187881 200144 140564 75512 33211 8264 -4322 -2602
38604 -2602 -2819 -31720 -74730 -75001 -20745 8490 -62471 -192737 -274308 -276676 -270816 -305990 -334506
38591 -334506 -286781 -166232 -29526 90254 193626 265047 263321 174458 47152 -43720 -63655
38580 -63655 -44357 -50799 -120671 -221015 -268845 -224355 -163410 -202871 -328352 -367516 -205779
38569 -205779 31454 120205 25616 -87381 -120353 -147796 -215524 -216772 -80164 71075 95918
38558 95918 57580 108258 238546 310092 276429 204330 122555 16378 -65136 -65464 -53385 -128413
38546 -128413 -224485 -192372 -52910 33473 34907 63022 117867 68396 -71153 -107401 3586
38535 3586 49501 -92681 -248069 -236941 -143315 -94868 7642 285113 561091 536257 215767
38524 215767 -89751 -165310 -78992 14942 50850 13368 -90120 -173153 -125987 29249 145864
38513 145864 140238 75047 37826 32075 16673 -21950 -65374 -84047 -54900 9447 64949 97237
38501 97237 138103 189463 196046 142412 98389 102146 87900 17397 -15309 67824 162466 113190
38489 113190 -49170 -159811 -167320 -159250 -162352 -104444 986 11169 -132957 -282888 -256965
38478 -256965 -56001 155721 218277 88444 -139438 -283703 -216224 1036 169368 167963
38468 167963 61620 -19183 -31567 -18204 -17406 -29004 -39445 -42623 -44582 -53780 -54731 -11485 72295
38455 72295 129422 117093 93349 131854 190770 166392 70039 35638 120770 206765 159599 12496
38443 12496 -88290 -75912 -29181 -60295 -186532 -314034 -325496 -189639 4852 134086
38433 134086 157075 129547 111784 110430 119181 157242 226216 269721 232896 146368 92518 84848
38421 84848 43509 -76801 -191441 -186910 -89348 -39919 -89423 -115174 2024 200720 321599
38410 321599 304463 204724 66326 -98015 -225542 -237952 -163167 -100418 -57213 45596 190321
38399 190321 238734 143200 33471 18501 39555 8832 -39584 -46106 -52981 -113014 -172601 -169620
38387 -169620 -154172 -183359 -186671 -80398 58629 87021 10912 -38853 -9119 37316 54486
38376 54486 50287 15916 -55174 -101916 -69781 -21078 -49183 -118134 -121994 -71654 -71905 -127533
38364 -127533 -130229 -48037 22964 24545 18732 65262 134026 182468 218698 243684 215054 109188
38352 109188 -43163 -201653 -334321 -385968 -300835 -94883 139826 300313 315024 174202
38342 174202 -20016 -95187 10699 159671 192243 132383 110214 150107 167844 126714 60888
38331 60888 -10676 -60120 -450 184920 321983 240123 47382 11242 177885 316463 257232
38320 257232 87669 -22905 -16633 70455 157117 124597 -64492 -247315 -231078 -73755 2400
38309 2400 -40170 -39901 23626 -26104 -205632 -266528 -87963 105962 101950 14596 30083 60854
38297 60854 -78280 -311743 -396640 -279353 -113229 12828 133032 229439 211252 74484
38287 74484 -72579 -143323 -123657 -29653 75169 78141 -48305 -170561 -166270 -96628 -81123
38276 -81123 -91077 -26437 76046 89812 10005 -53741 -68309 -96615 -146135 -160576 -153623 -190389
38264 -190389 -232878 -165035 2975 102299 22434 -153730 -271890 -269658 -189519 -112705 -102465
38253 -102465 -144862 -143017 -34144 109980 176958 168849 160140 142898 51428 -76347 -116731
38242 -116731 -56091 -21529 -79023 -140488 -125332 -80323 -63630 -32696 51941 109499 46389
38231 46389 -78175 -115671 -36397 34798 220 -83295 -96018 -16356 61036 47683 -43973
38220 -43973 -135063 -176082 -181222 -181077 -176622 -147536 -81264 14028 102931 128852 63810 -37330
38208 -37330 -74561 -17141 57566 66151 23005 7778 57351 126356 141792 76120 -20904 -59028
38196 -59028 -992 84656 101717 46260 -7262 -24598 -31463 -16470 73495 208176 259436 175877
38184 175877 71232 61915 110060 116498 78553 45309 -6609 -121004 -233449 -231363 -129368
38173 -129368 -63885 -107335 -190862 -226053 -210417 -180987 -134326 -39709 93985 195147 186888
38162 186888 83713 11668 72725 192121 190845 33043 -107646 -81894 50800 152854
38152 152854 204139 248082 250571 170788 102687 173437 329400 383785 270604 105834 -1532
38141 -1532 -52552 -64115 -23644 26185 -5501 -111055 -157478 -65374 77458 135330 77432
38130 77432 -34500 -130927 -156239 -81280 43766 103088 38413 -79485 -143426 -132713 -100572
38119 -100572 -78148 -49738 -13845 -13852 -78437 -150074 -120207 33700 181100 176353 56122 9101
38107 9101 126060 281571 320791 261540 219386 218710 196128 134857 75238 27413 -16184 -16661
38095 -16661 50986 108679 67858 -17235 -19360 57217 82464 10923 -56669 -44873 -3704 1310
38083 1310 -17783 -34776 -65966 -115446 -144127 -130884 -97689 -58224 -13872 -190 -47280 -96876
38071 -96876 -65696 8566 11116 -47221 -20306 130924 236731 152258 -27552 -102706 -33966
38060 -33966 49259 60604 54972 114273 225617 305704 304407 250311 197071 150000 77356 -10843
38048 -10843 -54071 -36437 -22136 -48165 -59877 -23733 -13365 -80395 -135811 -101324 -83579 -205344
38036 -205344 -334376 -222861 98271 322954 301738 208868 202735 189991 69086 -36725
38026 -36725 13422 127873 149061 116716 148350 186910 102050 -50474 -110306 -91706 -139914
38015 -139914 -242578 -236756 -114279 -70243 -183109 -270767 -174728 -6928 24546 -91378 -191928
38004 -191928 -177864 -99180 -45911 -57673 -118068 -158347 -88788 100883 290212 345298 274793
37993 274793 202948 198548 210731 186092 162474 194403 248270 247773 193682 157203 159882 145328
37981 145328 89125 51341 75254 111940 108897 99583 119791 106971 4111 -87035 -14978 163460
37969 163460 207601 27752 -166349 -153589 -3988 50137 -43521 -117986 -69700 -9075 -72458
37958 -72458 -202797 -217444 -54068 139337 178396 59515 -40427 20426 177966 244230 137757
37947 137757 -27649 -94739 -45205 11046 -3301 -36949 16583 179109 351256 428350 434880
37936 434880 501154 694568 923433 1045453 1027383 945117 867778 813830 792924 804093 795547
37925 795547 704647 548411 415939 369539 402010 471422 516736 470878 340268 240688 257362
37914 257362 299915 214836 21852 -100116 -63923 33372 85818 94920 74584 -4661 -112836
37903 -112836 -142092 -65535 9730 15327 17739 71922 119131 115789 120147 151293 113917 -11262
37891 -11262 -56227 91623 268093 245837 69513 -30481 8370 35891 -23963 -63613 -4186
37880 -4186 70412 64782 22195 40748 121412 168886 108847 -24873 -106577 -41236 109149 179536
37868 179536 121914 79798 164419 267700 234779 127149 125652 222255 224714 77163 -36626
37857 -36626 25813 162435 200798 134723 78800 89272 132968 158081 108052 -63607 -303379
37846 -303379 -443604 -372366 -179440 -53405 -69253 -155547 -231712 -273972 -254149 -127937 70474
37835 70474 203825 175140 57216 5256 54912 90691 32855 -35446 3662 114452 153080
37824 153080 76212 -12659 -35241 -36535 -66910 -79460 -23388 48653 60632 37436 53114 100332
37812 100332 107381 57649 4481 -14729 -1659 47535 132057 200565 186410 90989 -16375
37801 -16375 -73254 -61661 3097 78073 115012 114894 125883 160383 173468 156719 169306 221356
37789 221356 224442 139045 69664 106622 173485 164442 136462 195181 264956 178221 -33198 -149872
37777 -149872 -89654 -21317 -92497 -218313 -235643 -137130 -44832 -31590 -60493 -61722 -12729
37766 -12729 40924 38606 3438 45420 198668 317032 250836 80230 16888 94422 140357
37755 140357 75713 45194 170957 346436 393049 306708 233362 272972 396727 504166 503832
37744 503832 390524 271833 252381 291936 281874 254301 358353 601882 799016 846679
37734 846679 873195 1011431 1209795 1410935 1735064 2275928 2838832 3117282 3075927 2943428
37724 2943428 2848413 2674067 2299609 1804299 1365236 1070710 889509 744928 588800 459957
37714 459957 458816 593159 688511 566753 293241 111919 130835 214537 217600 174370 183320
37703 183320 231520 241395 206052 166588 110380 4136 -100248 -105356 -20541 21527 -65276
37692 -65276 -205179 -264158 -221689 -177733 -205439 -259251 -247231 -155226 -68018 -77560 -184642
37681 -184642 -284177 -251180 -69717 122684 166425 70578 7204 75596 157070 97869 -35475
37670 -35475 -35196 128567 241819 154998 2831 7841 174454 311655 299336 201367 136653
37659 136653 152944 232436 332693 406240 438032 465736 518946 559083 533731 461774 398140
37648 398140 343813 268659 192526 146301 76522 -86553 -262750 -268274 -79511 85804 48969
37637 48969 -71948 -12140 289296 617603 739466 614528 357662 114213 -3329 29808
37627 29808 105024 76458 -49221 -111057 -35521 38586 -19107 -99654 -11208 202866 307093
37616 307093 224375 124251 117605 94293 -22389 -83124 31926 141467 4519 -265771
37606 -265771 -315332 -60692 189432 175254 -3464 -119486 -135245 -131385 -90604 53266 240001
37595 240001 326944 267980 130326 -14950 -108349 -71680 102738 267651 255807 86830
37585 86830 -70182 -120106 -108560 -80139 -13107 76448 101895 48908 46794 198095 398199
37574 398199 437921 278080 119247 157954 348229 484031 485186 494130 659374 923599 1111476
37563 1111476 1161678 1160217 1177281 1196375 1201179 1201636 1152272 975503 709021 503676 419275
37552 419275 348917 210793 75061 9242 -56095 -180007 -263908 -207460 -96159 -59268 -46486
37541 -46486 50027 141035 55445 -130096 -145401 68018 263304 262987 180201 162534 154116 74398
37529 74398 32842 154466 323072 318113 139004 -6710 -5481 55733 78924 76833 73208 29159
37517 29159 -66491 -137288 -121235 -66757 -60246 -96292 -83639 23638 147527 167669 72458
37506 72458 -14083 10492 82728 62982 -47339 -94230 -7041 86861 73200 57326 214988
37495 214988 514044 763819 919190 1141842 1514937 1876272 2049520 2124873 2366395 2876767
37485 2876767 3466731 3859546 3947602 3830279 3652852 3449376 3145423 2694344 2170314 1698066
37475 1698066 1324645 1017840 769015 614669 549649 503242 428526 343579 261490 164768
37465 164768 85207 113359 263451 408124 420826 318298 198513 114820 83926 127496 207761
37454 207761 209899 105816 48112 159081 310479 292094 135138 52980 88639 67070 -74238
37443 -74238 -162293 -87215 8567 -22068 -92217 -57686 30391 37934 -12725 -12478 18605 -14503
37431 -14503 -74197 -39631 62424 69042 -65226 -188072 -152818 20070 204454 289258 231326
37420 231326 81473 -40842 -71249 -69654 -96564 -97586 -25561 13077 -95106 -242760 -226141
37409 -226141 -69194 1179 -84014 -133024 -12390 152748 204019 184702 208824 240596 163312
37398 163312 -12837 -147101 -138284 -19504 83728 53419 -107459 -243412 -202421 -27363
37388 -27363 103269 113642 77419 39865 -24708 -58517 61366 278963 350454 192401 31555
37377 31555 61065 147652 72037 -111112 -182886 -108872 -37537 -17533 51843 203141 326356
37366 326356 325266 214253 65285 -37309 -26141 63777 94384 5822 -85754 -77844 -50477
37355 -50477 -100502 -137900 -43868 79393 50120 -79890 -104686 -10114 20251 -71864 -155832
37344 -155832 -180240 -231382 -282624 -167753 99613 240037 83101 -181245 -273301 -166270
37334 -166270 -10440 118727 222658 249170 136566 -64637 -228981 -268805 -155417 74054
37324 74054 272047 271486 104769 1483 76489 166292 91429 -74408 -154331 -145043 -148069 -132807
37312 -132807 5980 206415 278780 184181 79040 63904 67632 20043 -26284 -13177 16414
37301 16414 2602 -40766 -82343 -131434 -180634 -171646 -80713 28828 94209 128814 158611 155262
37289 155262 100060 48758 49515 47827 -31280 -141263 -163824 -92805 -51714 -101706 -145826 -88305
37277 -88305 8132 23490 -25939 -18332 71890 132111 90287 15479 -12500 -28518 -94416 -165314
37265 -165314 -147611 -48580 33493 51309 47499 55161 50108 19022 -2813 6813 15482 -10705
37253 -10705 -54529 -78128 -75591 -68990 -71897 -78109 -79004 -80601 -98181 -126075 -122862 -58567 26267
37240 26267 60006 46856 64698 129690 149531 68066 -32741 -59885 -53705 -92584 -126953 -54899
37228 -54899 75520 99348 -29182 -180875 -251671 -278607 -317386 -335561 -291974 -222607 -181248
37217 -181248 -165039 -145983 -117198 -81929 -56059 -83863 -173277 -225385 -135819 33715 112022
37206 112022 62186 28549 103195 192209 179095 85129 -11971 -93803 -151512 -142295 -87759 -97176
37194 -97176 -193988 -240410 -146848 -30314 -25001 -54679 30751 181589 212681 99948 10623
37183 10623 34133 70992 32297 -15205 15353 69526 25945 -125883 -263604 -272176 -162232
37172 -162232 -49991 -32617 -88122 -117173 -84957 -69683 -139089 -239457 -270303 -222896 -167512
37161 -167512 -133664 -86441 -9647 66857 125895 183079 239695 267988 252513 207352 149716
37150 149716 87055 26620 -23751 -50004 -14818 113714 288221 383390 317683 144401 -10434
37139 -10434 -64544 -13543 87894 142725 79709 -48265 -106724 -64214 -36136 -82632 -90553
37128 -90553 31418 166569 161649 83857 105541 197064 169907 18237 -30493 133122 320247
37117 320247 319866 168814 18605 -101978 -229768 -301317 -233922 -102164 -51148 -68861 -23418
37106 -23418 80761 76115 -87360 -210463 -109834 106081 175113 36417 -110922 -104191 -18766
37095 -18766 -13909 -101044 -171589 -176863 -153496 -109093 -21805 48123 -6243 -150006 -193208 -45348
37083 -45348 142263 200109 195018 304081 502145 564707 387633 133608 7315 20363 55379
37072 55379 56436 57476 82669 110290 112714 75375 2588 -52049 -3857 153129 287778 257613
37060 257613 83400 -69894 -84895 7486 126856 248749 355975 368894 233253 45068
37050 45068 -34435 4179 15490 -47001 -26190 176868 372893 308668 55550 -52636 118749
37039 118749 329617 325461 166568 65099 63732 54859 7897 -15743 -20359 -70368 -143945 -146555
37027 -146555 -73890 -29122 -64157 -115753 -116215 -72958 -24573 1003 -20766 -87496 -144852 -152472
37015 -152472 -150649 -184790 -203494 -134886 -31159 -14311 -91590 -151373 -143621 -137315 -181981 -233175
37003 -233175 -245393 -234448 -218996 -191161 -159785 -132667 -60960 88251 214906 182268 37429
36992 37429 -22054 68502 158351 135619 86727 108432 129037 53387 -44638 -30061 77995
36981 77995 143280 105644 11622 -94066 -183647 -196157 -96654 35984 88013 63436 64800
36970 64800 136026 211775 216830 143957 41037 -23033 -749 73365 95699 17431 -86848
36959 -86848 -123339 -89516 -19290 98366 247692 310987 198721 9928 -73892 -26796 28485
36948 28485 41630 85030 174911 218007 190981 209732 327287 401515 289440 74082 -40541
36937 -40541 1788 85327 131542 180992 253603 270142 180797 73516 62084 117994 108666 -11180
36925 -11180 -136997 -163920 -121385 -105116 -127900 -119512 -63761 -46792 -130905 -242003 -245291 -107791
36913 -107791 72268 188084 218255 194171 137029 64202 17808 34015 90284 122449 98373
36902 98373 43706 -10830 -69194 -132419 -156002 -95544 11895 66899 27144 -36336 -34253 24538
36890 24538 54174 6155 -86087 -166819 -211105 -215050 -182442 -141306 -138598 -191479 -259596 -282985
36878 -282985 -238781 -154156 -75747 -33524 -26102 -33614 -40237 -37467 -15127 23737 41149 -826
36866 -826 -73825 -103575 -76801 -62726 -90188 -82689 13074 110799 102611 37221 50472 145299
36854 145299 182220 94612 -21768 -60733 -23274 51289 151017 241810 263411 222455 183517
36843 183517 134764 -440 -167470 -165226 64438 286054 260430 66037 -38488 19555
36833 19555 87173 57832 -11584 -47612 -51543 -29797 20757 43609 -24882 -121770 -114948 -9104
36821 -9104 55013 35550 59869 196372 315060 280022 152525 77098 62075 12877 -76172
36810 -76172 -109171 -56884 -14333 -64606 -167320 -218017 -173768 -92035 -61704 -106475 -158207
36799 -158207 -138710 -58764 4542 26047 60547 131532 173537 141925 106253 147624 214024
36788 214024 183326 51468 -50915 -42969 3284 -15858 -88638 -121038 -72217 3886 39356
36777 39356 31514 34869 88720 158383 161004 66681 -44796 -68559 -7585 32961 -9590 -78215
36765 -78215 -87335 -28786 53773 135797 197468 191636 108991 44289 101703 236229 283193 167329
36753 167329 -1676 -78755 -51831 -7832 5074 9645 29035 52045 57479 27830 -45652 -132888
36741 -132888 -162710 -94790 24051 114418 151075 152317 114637 21491 -94898 -161728 -140067
36730 -140067 -54814 36428 69924 7189 -103191 -133641 -25661 101814 87852 -48367 -135225
36719 -135225 -93609 -20951 -5823 -2381 44001 78624 46501 12887 52529 97647 33072 -103760
36707 -103760 -158884 -85044 1213 -3258 -69606 -122327 -139495 -125090 -69567 4504 21773 -60422
36695 -60422 -184916 -258917 -251877 -193860 -119314 -59996 -54789 -102783 -125917 -45611 104527 207920
36683 207920 218572 214319 258386 277197 155998 -77580 -262454 -302418 -262229 -231577 -186519
36672 -186519 -63035 95977 169415 115456 12533 -57226 -90422 -120694 -161414 -204109 -223237
36661 -223237 -181050 -80063 -738 -20001 -100844 -141118 -124880 -129238 -174969 -181315 -101559 107
36649 107 50572 51384 20661 -42362 -87378 -30007 89587 93266 -87432 -270193 -257636 -108583
36637 -108583 -21558 -37458 -42393 -13342 -54976 -185881 -275114 -237060 -140331 -73312 -33559
36626 -33559 -2308 -1345 -12798 37323 139331 156245 16444 -144376 -149394 -23984 52062
36615 52062 4103 -53987 -7975 96652 136193 81358 20888 38618 126400 219855 268210
36604 268210 242896 118572 -96953 -317944 -423904 -375907 -257338 -174487 -147313 -126113
36594 -126113 -84626 -55057 -81846 -170042 -274198 -326096 -289980 -200696 -129460 -112735 -140719
36583 -140719 -196820 -252660 -242829 -133129 -14102 -18835 -127747 -178785 -112240 -61299 -122065
36572 -122065 -186296 -127333 -15850 9490 -23912 327 59694 39107 -46549 -76495 -46068
36561 -46068 -69352 -163968 -219478 -189567 -141427 -104559 -43406 11460 -15144 -77900 -51148 54734
36549 54734 112324 117348 179800 253675 147776 -120424 -266968 -164252 -41999 -92023 -148001
36538 -148001 -346 208828 208418 51241 19870 165957 255580 152628 -19498 -117141 -142197
36527 -142197 -131143 -74715 3645 40397 33418 28158 8451 -66111 -134658 -98431 4387 43205
36515 43205 2426 -18437 -1596 -28199 -90699 -75363 34047 114510 115103 138634 247269 347807
36503 347807 351506 305397 277688 241247 164879 109608 135848 198268 214839 168835 80526 -43643
36491 -43643 -172078 -232359 -193477 -105237 -22844 40440 71999 61399 54955 103814 150606 95652
36479 95652 -16432 -37131 33843 29626 -88287 -128427 21646 191548 195424 116274 121440
36468 121440 153658 48766 -148017 -243641 -217842 -226421 -301925 -301936 -179538 -70209 -49185
36457 -49185 -11848 119365 252785 295134 302055 340564 334273 189433 -11115 -86761 2123
36446 2123 114818 125858 65977 47818 114220 200271 227106 192016 138133 59018 -94119
36435 -94119 -288009 -377803 -275506 -81172 43460 69817 65877 37331 -44751 -108001 -52943
36424 -52943 53438 54861 -19805 13953 150563 141700 -88070 -232640 -25552 330373 423609
36413 423609 200014 -19481 -32127 29959 -699 -79557 -95388 -58186 -24050 22398 101259
36402 101259 163938 179436 195404 229494 202201 74981 -40019 -26457 52049 46717 -38595
36391 -38595 -46000 96433 261969 296903 210188 127084 115697 137320 144440 147123 162081 155695
36379 155695 89072 -3683 -39739 3679 53755 36268 -35855 -95376 -101100 -49661 49142 154514
36367 154514 186215 102529 -25764 -80896 -32550 44519 72639 33098 -54415 -141539 -153713
36356 -153713 -66430 25582 7460 -83616 -91224 31899 143907 118487 23868 10960 97726
36345 97726 161751 108976 -30356 -153757 -181003 -122660 -89404 -186077 -359965 -422401 -277349
36334 -277349 -54313 63111 65442 68804 102044 83809 -3079 -56396 -5523 91907 151219
36323 151219 173411 201147 224045 192120 100701 16896 17977 110204 207560 209469 114783 24519
36311 24519 1328 -20352 -117305 -219720 -179191 11684 181864 195913 107352 45607 36451
36300 36451 16842 -24850 -21910 57268 141781 135708 32225 -78720 -109805 -59705 12816 75269
36288 75269 143186 216196 246004 200602 119640 62372 30980 -10035 -68258 -124637 -168671 -182015
36276 -182015 -127659 -19514 42953 -4798 -77454 -49993 48460 77682 9560 -40252 -19670
36265 -19670 -14860 -59578 -35374 126512 278824 240901 59217 -67335 -65590 -33134 -31328
36254 -31328 -463 93004 169439 159847 112985 105941 122990 101842 49077 23515 25566 -9403
36242 -9403 -91860 -128281 -44475 85065 108752 -3682 -117067 -119589 -73179 -97454 -170918
36231 -170918 -172641 -98455 -84552 -180707 -245929 -156688 -2485 42339 -41350 -133706 -173401
36220 -173401 -197965 -214020 -172803 -85149 -32640 -36984 -31798 3460 -1925 -69190 -96149 -4327
36208 -4327 130118 188255 182911 213022 286060 306623 240759 180686 208696 275938 270463 160237
36196 160237 16398 -81940 -116732 -109302 -76127 -29998 -1292 -18916 -63137 -71914 -21323 29297
36184 29297 19621 -5911 47860 158293 169417 8305 -165992 -137509 82757 266826 256728
36173 256728 121512 11172 -17681 21702 118913 222632 221917 85106 -50935 -46391 44866
36162 44866 71448 24206 20780 72369 49461 -86947 -193940 -161181 -68800 -33419 -22373
36151 -22373 60590 198189 287885 280638 191156 43021 -92741 -88011 81037 228435 162004
36140 162004 -50559 -172699 -129261 -76904 -134967 -214350 -173230 -16285 134340 184222 126945
36129 126945 20130 -61671 -93790 -125482 -190714 -229416 -183091 -126732 -175431 -277435 -256139
36118 -256139 -78484 74047 53168 -76382 -166850 -170340 -122966 -62548 -31808 -56025 -60009
36107 -60009 68470 268162 303996 78333 -194769 -254497 -116282 10264 24329 -6500
36097 -6500 -21090 -32300 -43198 -32286 -16153 -26833 -44729 -37216 -28671 -50589 -68668 -44353
36085 -44353 -15036 -24045 -30875 12926 60169 39803 -31536 -106601 -196254 -294527 -313044 -222472
36073 -222472 -154187 -201176 -229979 -93573 73992 34181 -151281 -193847 -50617 1704 -165090
36062 -165090 -310716 -225010 -61647 -54675 -123283 -26458 221642 365134 287632 138001 64215
36051 64215 26262 -62294 -154576 -132396 15880 164191 194010 125252 70097 66492 22611
36040 22611 -126152 -275802 -278908 -170263 -118107 -151159 -111052 69799 223187 190400 64760
36029 64760 43479 144417 225093 206826 121844 -9031 -178750 -293089 -230609 -26075 138096
36018 138096 161417 137826 191373 290785 298181 156303 -36589 -132953 -84337 23092 68967
36007 68967 15658 -84859 -170296 -209990 -191056 -133616 -112340 -175985 -240982 -170929 14767
35996 14767 133563 90105 4060 10164 62449 51024 -2513 -7575 23302 9171 -56116 -127118
35984 -127118 -206238 -288389 -288145 -177255 -110692 -227112 -393273 -366519 -167477 -43849 -71390
35973 -71390 -63210 74404 169091 77992 -79898 -133238 -102852 -78341 -24621 107849 215720
35962 215720 172079 31001 -57117 -52158 -6238 64126 136852 111748 -52590 -210294 -208746
35951 -208746 -123523 -131463 -219155 -224319 -122451 -48764 -43611 -1348 99739 131669 41501 -48079
35939 -48079 -41919 -13267 -58737 -156852 -253222 -351028 -430000 -403067 -250512 -89453 -18657
35928 -18657 6334 57985 99204 57958 -46363 -145500 -219599 -270325 -267246 -198683 -116037 -70667
35916 -70667 -71029 -129858 -251393 -342698 -277399 -100158 -8812 -61614 -87067 11153 70452 -49399
35904 -49399 -210429 -236967 -219914 -313976 -395047 -242552 41886 148271 44256 -11299 57463
35893 57463 30169 -176557 -324852 -246358 -101333 -72242 -77972 4953 81847 27186 -67083
35882 -67083 -59474 -9409 -35907 -73705 -1854 105303 87905 -31748 -110149 -127992 -159168
35871 -159168 -173565 -100060 -28663 -110750 -282138 -319662 -181669 -73810 -138759 -270800 -295925
35860 -295925 -185437 -35398 52070 32739 -43061 -55266 41274 136690 133977 121513 220877
35849 220877 334620 257383 10269 -164080 -150675 -77496 -45773 13981 130484 163144 22687
35838 22687 -153679 -195599 -138211 -130230 -207087 -282669 -288754 -219715 -109436 -41967 -101618 -242855
35826 -242855 -308669 -248561 -198049 -250331 -283732 -153985 50634 113525 -11649 -166901 -224583
35815 -224583 -206809 -174921 -136880 -91594 -62234 -49314 -21428 19611 21177 -44254 -124662 -139382
35803 -139382 -71713 6969 14208 -40905 -56264 34338 159749 194068 119943 34722 2798
35792 2798 -8039 -33902 -53907 -49814 -41894 -36303 -14686 6239 -6645 -14305 53867 153848 153725
35779 153725 41755 -38624 -16299 5650 -43131 -65281 7478 49078 -58319 -190978 -151640
35768 -151640 22701 126490 95994 45407 28794 -19532 -104854 -135963 -101916 -100917 -142200
35757 -142200 -92601 99900 278374 276976 142099 48165 65909 115806 110450 50373 -17331
35746 -17331 -70104 -115322 -145212 -117433 -11721 99905 102386 -9817 -97206 -55721 30976
35735 30976 9919 -119768 -213491 -184937 -92915 -30686 -29432 -71185 -105643 -61215 66924
35724 66924 157522 102627 -13214 -12724 94303 94962 -117202 -372795 -449775 -337634 -180995
35713 -180995 -67051 17307 89489 141317 164492 131751 3659 -181746 -295315 -271902 -211350
35702 -211350 -236143 -316400 -341403 -301792 -271826 -252696 -178253 -63589 754 14194 71798
35691 71798 162953 124152 -113241 -361459 -394730 -239174 -101446 -73339 -74715 -63680 -110350
35680 -110350 -217774 -245074 -109296 66615 126184 97383 105635 152630 141085 73976 59962
35669 59962 127010 187802 199247 202323 189755 105770 11079 55931 218494 271165 118899
35658 118899 -32064 552 83284 15947 -108625 -76239 46304 16151 -131890 -101581 157597
35647 157597 318725 174052 -61865 -126886 -96153 -148765 -196462 -55529 170890 218479
35637 218479 99056 86437 265576 402333 328239 182676 149551 173922 102895 -47618
35627 -47618 -140114 -133607 -95993 -55760 13428 84344 81470 3662 -53448 -17550 82827 174784
35615 174784 221166 227176 207708 171269 121124 62082 7596 -27309 -42142 -47274 -50088 -67053
35603 -67053 -130200 -231397 -277503 -183541 -16752 51613 -31509 -136770 -160096 -161765 -204005
35592 -204005 -194594 -55633 67333 -13767 -195830 -181504 79242 295204 252674 92332
35582 92332 42079 79412 37623 -95609 -175965 -119973 25432 166312 201047 67030 -135529
35571 -135529 -177470 6416 180669 125253 -46097 -86833 -5122 11804 -34649 25083 168990
35560 168990 172685 -228 -111676 -45471 6102 -107277 -224664 -142290 61756 174045
35550 174045 155489 112195 88969 75679 111431 210097 269713 206009 89985 20632 -34927
35539 -34927 -133320 -198871 -138859 -21734 22950 -2001 -28307 -89420 -235118 -352704 -278869
35528 -278869 -59785 88013 67867 -11502 -37928 -27705 -39111 -78417 -112401 -94644 5526
35517 5526 134772 171129 82668 -10956 -21378 -19616 -62774 -35412 156553 359148 359292 209197
35505 209197 124864 132390 76983 -54982 -104224 -38727 -15879 -99744 -164570 -142822 -137318 -210016
35493 -210016 -274168 -277496 -287247 -311216 -242205 -75909 21679 -25115 -75042 -30445 -22899 -174972
35481 -174972 -352238 -348266 -192549 -80209 -79510 -92636 -56586 -14100 1706 18408 52252
35470 52252 77294 75961 65969 77950 129622 199542 220923 146448 17861 -86220 -153767 -209196
35458 -209196 -211693 -108310 24657 42280 -55095 -121428 -98545 -81935 -116490 -110896 -24587
35447 -24587 38616 11344 -34308 -60744 -161214 -355558 -462628 -339843 -114027 -4187
35437 -4187 -24117 -31019 21711 60853 69303 116214 219943 303709 292886 189159 66529 26850
35425 26850 103852 191236 157416 46870 32280 136812 183355 91688 25188 116899 241033
35414 241033 220387 91808 -14849 -100090 -191842 -172329 44954 273954 252841 20978
35404 20978 -147475 -145866 -124142 -188033 -252313 -225059 -132960 -20959 100434 172971 114431
35393 114431 -38947 -147090 -141886 -68608 32910 142597 175738 61004 -91133 -79987
35383 -79987 96634 222880 178298 91980 110096 175799 149397 23280 -99969 -161605 -173863
35372 -173863 -145604 -70939 29199 113219 160441 182912 205442 234515 234799 161111 38185
35361 38185 -34911 -3524 66737 82856 35782 -36616 -120028 -178964 -130961 24821 135232
35350 135232 79417 -45804 -72713 -25479 -62283 -200218 -289279 -251888 -164702 -89609 1567
35339 1567 103700 141323 99458 56274 49015 30008 -22500 -76172 -140438 -254849 -367946
35328 -367946 -372141 -278916 -210951 -199540 -153296 -63001 -59575 -196413 -333270 -329401 -224665
35317 -224665 -140437 -110180 -92023 -60648 -19087 10592 -19210 -112530 -158713 -55517 105062
35306 105062 139383 64261 78473 213544 249542 88434 -35787 91856 306734 296170
35296 296170 63236 -100008 -50299 43440 -5284 -146877 -212623 -152724 -63224 -32671 -39789
35285 -39789 -8731 69802 115460 72455 -7197 -54628 -98090 -176989 -196606 -39326 189230
35274 189230 232185 49261 -96973 -20236 129633 133356 41429 44517 140621 164672 85349
35263 85349 48977 130860 223998 204477 80866 -48636 -103746 -76829 -31398 -25958 -15904
35252 -15904 89529 236073 226566 9055 -186548 -153442 -17409 -42220 -225865 -327039
35242 -327039 -246611 -135312 -112929 -111544 -50560 28012 69603 93402 104667 62123 -10423
35231 -10423 -14707 66229 131753 127431 107429 89364 4632 -137277 -193960 -95997 34243 74798
35219 74798 78300 134072 188977 155705 94558 121923 206997 219561 135831 51305 24231 41505
35207 41505 101929 192257 215357 94731 -72360 -123672 -73459 -66458 -98657 -4756 225120
35196 225120 347209 208914 789 -7760 154742 240152 143180 -13729 -112715 -163506 -192486
35185 -192486 -175450 -112729 -49272 744 45820 36222 -89639 -275685 -388734 -392346 -351952
35174 -351952 -276758 -126726 9820 -44497 -265539 -383806 -254975 -82922 -107921 -246442
35164 -246442 -257654 -134346 -66615 -84852 -20665 164913 278217 197472 64671 55310 122352
35153 122352 108109 -5291 -103783 -133632 -147928 -181509 -196466 -170162 -152180 -186914 -223784
35142 -223784 -168263 -27736 55675 -25819 -182096 -223058 -113167 -8947 -14918 -46428 -14234
35131 -14234 6339 -71146 -153895 -118053 -48601 -111624 -246408 -233800 -67056 5044 -134905
35120 -134905 -281073 -210274 12560 165597 156827 48162 -86991 -199805 -244495 -227695
35110 -227695 -212461 -204014 -121273 51842 194674 210275 152858 111775 78561 23639 -7541
35099 -7541 12429 6845 -74522 -131317 -55740 73752 85396 -46284 -185967 -228731 -184179
35088 -184179 -97705 -7058 35540 4154 -42604 -31650 8412 -11914 -95651 -141755 -83183
35077 -83183 30402 106270 113370 90379 75113 51524 -16731 -101777 -112599 -25809 46929 12707
35065 12707 -44255 1195 69317 -35249 -288249 -430735 -348411 -231046 -247153 -296884 -248155
35054 -248155 -192872 -251002 -306993 -196502 -17831 11429 -89477 -126560 -84483 -131284 -284502
35043 -284502 -349710 -227401 -42349 84065 178085 271068 306392 261402 203905 168944 121707
35032 121707 77332 100865 153565 109457 -25869 -86023 178 90539 49993 -65336 -137074
35021 -137074 -153647 -146080 -82694 54443 182437 212083 160113 96268 56792 60733 107871
35010 107871 109444 -44270 -269097 -290865 7959 371298 453109 226863 -43812 -165098
35000 -165098 -166590 -139957 -115001 -109359 -141157 -153371 -53707 128772 240604 202248 102247
$$ [...]
##END NTUPLES=NMR SPECTRUM
##END=
