##TITLE=31Pec_60-2025-Bay
 CDCl3, 24 sc
 9.6.2025
##JCAMPDX= 6.0         $$ Bruker NMR JCAMP-DX V2.0
##DATA TYPE= NMR SPECTRUM
##DATA CLASS= NTUPLES
##ORIGIN= UXNMR, Bruker Analytische Messtechnik GmbH
##OWNER= root
$$ XWIN-NMR		Version 3.5
$$ Mon Jun  9 14:10:42 2025 Russian Standard Time (UT+4h)  she@DPX200
##.OBSERVE FREQUENCY= 81.013821
##.OBSERVE NUCLEUS= ^31P
##.ACQUISITION MODE= SIMULTANEOUS
##.ACQUISITION SCHEME= undefined
##.AVERAGES= 24
##.DIGITISER RES= 17
##SPECTROMETER/DATA SYSTEM= spect
##.PULSE SEQUENCE= zgpg30
##.SOLVENT NAME= CDCl3
##.SHIFT REFERENCE= (INTERNAL, CDCl3, 0, 198.062)
##AUDIT TRAIL= $$ (NUMBER, WHEN, WHO, WHERE, WHAT)
$$ ##TITLE= Audit trail, XWIN-NMR		Version 3.5
$$ ##JCAMPDX= 5.01
$$ ##ORIGIN= Bruker BioSpin GmbH
$$ ##OWNER= she
$$ F:/spectra/data/she/nmr/P31/2/pdata/1/auditp.txt
$$ ##AUDIT TRAIL=  $$ (NUMBER, WHEN, WHO, WHERE, WHAT)
(   1,<2025-06-09 14:09:20.45 +0400>,<she>,<DPX200>,
      <created by zg, POWCHK disabled, PULCHK disabled
       configuration hash MD5:
       00 E9 B6 7A A2 85 ED C7 34 08 36 98 17 FE 4E 26
       data hash MD5: 32K
       F0 DF B4 F7 D2 F8 FD 34 BC 91 C8 3D 7A A2 26 9A>)
(   2,<2025-06-09 14:09:26.12 +0400>,<she>,<DPX200>,
      <Start of raw data processing
       efp BC_mod = 2 LB = 1.5 FT_mod = 6 PKNL = 1 PHC0 = 1511.071 PHC1 = -278.9066 SI = 64K 
       data hash MD5: 64K
       23 A6 6C 6C 8D EF 90 6C 7F 0B 31 D0 E9 08 CD 79>)
(   3,<2025-06-09 14:09:50.70 +0400>,<she>,<DPX200>,
      <pk PHC0 = 31.04629 PHC1 = 0 
       data hash MD5: 64K
       85 18 A6 B5 6B 1F CE E0 94 0D 58 98 FC E0 5B AD>)
$$ ##END=
$$ 
$$ hash MD5
$$ B4 93 AA E9 23 33 03 42 7D 61 FB 50 17 8F 04 FD
##$RELAX= 
##$RELAX= 
##$RELAX= 
##$RELAX= 
##$RELAX= 
##$RELAX= 
##$RELAX= 
##$RELAX= 
$$ Bruker specific parameters
$$ --------------------------
##$DU= <F:/spectra>
##$EXPNO= 2
##$NAME= <P31>
##$PROCNO= 1
##$TYPE= <nmr>
##$USER= <she>
##$AMP= (0..31)
100 100 100 100 100 100 100 100 100 100 100 100 100 100 100 100 100 100 
100 100 100 100 100 100 100 100 100 100 100 100 100 100 
##$AQSEQ= 0
##$AQ_mod= 1
##$AUNM= <au_zg>
##$AUTOPOS= <>
##$BF1= 81.014009
##$BF2= 200.13
##$BF3= 200.13
##$BF4= 200.13
##$BF5= 200.13
##$BF6= 200.13
##$BF7= 200.13
##$BF8= 200.13
##$BYTORDA= 1
##$CFDGTYP= 0
##$CFRGTYP= 5
##$CHEMSTR= <none>
##$CNST= (0..31)
1 1 145 1 1 1 1 1 1 1 1 1 1 1 1 1 1 1 1 1 1 1 1 1 1 1 1 1 1 1 1 1 
##$CPDPRG= <waltz16>
##$CPDPRG1= <>
##$CPDPRG2= <waltz16>
##$CPDPRG3= <>
##$CPDPRG4= <mlev>
##$CPDPRG5= <mlev>
##$CPDPRG6= <mlev>
##$CPDPRG7= <mlev>
##$CPDPRG8= <mlev>
##$CPDPRGB= <>
##$CPDPRGT= <>
##$D= (0..31)
0 1 0 0 0 0 0 0 0 0.06 0 0.03 2e-05 3e-06 0 0 0.0002 0 0 0 0 0 0 0 0 0 
0 0 0 0 0 0 
##$DATE= 1749463759
##$DBL= (0..7)
120 120 120 11 120 120 24 19 
##$DBP= (0..7)
150 150 150 150 150 150 150 150 
##$DBP07= 0
##$DBPNAM0= <>
##$DBPNAM1= <>
##$DBPNAM2= <>
##$DBPNAM3= <>
##$DBPNAM4= <>
##$DBPNAM5= <>
##$DBPNAM6= <>
##$DBPNAM7= <>
##$DBPOAL= (0..7)
0.5 0.5 0.5 0.5 0.5 0.5 0.5 0.5 
##$DBPOFFS= (0..7)
$$ [...]
##$SUBNAM3= <"">
##$SUBNAM4= <"">
##$SUBNAM5= <"">
##$SUBNAM6= <"">
##$SUBNAM7= <"">
##$SUBNAM8= <"">
##$SUBNAM9= <"">
##$SW= 400.765351723535
##$SWIBOX= (0..15)
0 1 3 0 0 0 0 0 0 0 0 0 0 0 0 0 
##$SW_h= 32467.5324675325
##$TD= 32768
##$TD0= 1
##$TE= 0
##$TE2= 300
##$TE3= 300
##$TEG= 300
##$TL= (0..7)
0 120 53 12 22 120 120 120 
##$TP= (0..7)
150 150 150 150 150 150 150 150 
##$TP07= 0
##$TPNAME0= <>
##$TPNAME1= <>
##$TPNAME2= <>
##$TPNAME3= <>
##$TPNAME4= <>
##$TPNAME5= <>
##$TPNAME6= <>
##$TPNAME7= <>
##$TPOAL= (0..7)
0.5 0.5 0.5 0.5 0.5 0.5 0.5 0.5 
##$TPOFFS= (0..7)
0 0 0 0 0 0 0 0 
##$TUNHIN= 0
##$TUNHOUT= 0
##$TUNXOUT= 0
##$USERA1= <user>
##$USERA2= <user>
##$USERA3= <user>
##$USERA4= <user>
##$USERA5= <user>
##$V9= 5
##$VALIST= <valist>
##$VCLIST= <CCCCCCCCCCCCCCC>
##$VD= 0
##$VDLIST= <DDDDDDDDDDDDDDD>
##$VPLIST= <PPPPPPPPPPPPPPP>
##$VTLIST= <TTTTTTTTTTTTTTT>
##$WBST= 1024
##$WBSW= 4
##$XGAIN= (0..3)
0 0 0 0 
##$XL= 0
##$YL= 0
##$YMAX_a= 15184
##$YMIN_a= -5303
##$ZGOPTNS= <>
##$ZL1= 120
##$ZL2= 120
##$ZL3= 120
##$ZL4= 120
##$ABSF1= 0
##$ABSF2= 0
##$ABSG= 0
##$ABSL= 0
##$ALPHA= 0
##$AQORDER= 0
##$ASSFAC= 0
##$ASSFACI= 0
##$ASSFACX= 0
##$ASSWID= 0
##$AUNMP= <proc_1d>
##$AZFE= 0.1
##$AZFW= 0.5
##$BCFW= 0
##$BC_mod= 2
##$BYTORDP= 0
##$COROFFS= 0
##$CY= -3
##$DATMOD= 1
##$DC= 0
##$DFILT= <>
##$DTYPP= 0
##$F1P= 0
##$F2P= 0
##$FCOR= 1
##$FTSIZE= 65536
##$FT_mod= 6
##$GAMMA= 0
##$GB= 0
##$INTBC= 1
##$INTSCL= 9.790993e-09
##$ISEN= 30
##$LB= 1.5
##$LEV0= 0
##$LPBIN= 0
##$MAXI= 10000
##$MC2= 0
##$MEAN= 0
##$ME_mod= 0
##$MI= 50
##$NCOEF= 0
##$NC_proc= -8
##$NLEV= 6
##$NOISF1= 182.463
##$NOISF2= 159.3651
##$NSP= 0
##$NTH_PI= 0
##$NZP= 0
##$OFFSET= 198.0616
##$PC= 4
##$PHC0= 1542.117
##$PHC1= -278.9066
##$PH_mod= 1
##$PKNL= yes
##$PPARMOD= 0
##$PSCAL= 0
##$PSIGN= 0
##$REVERSE= no
##$SF= 81.0140089999434
##$SI= 65536
##$SIGF1= 159.3651
##$SIGF2= -187.1042
##$SINO= 113.3802
##$SIOLD= 16384
##$SREGLST= <1H.CDCl3>
##$SSB= 0
##$STSI= 65536
##$STSR= 0
##$SW_p= 32467.5324675325
##$SYMM= 0
##$S_DEV= 0
##$TDeff= 32768
##$TDoff= 0
##$TI= <>
##$TILT= no
##$TM1= 0
##$TM2= 0
##$TOPLEV= 0
##$USERP1= <user>
##$USERP2= <user>
##$USERP3= <user>
##$USERP4= <user>
##$USERP5= <user>
##$WDW= 1
##$XDIM= 65536
##$YMAX_p= 509036203
##$YMIN_p= -120879048
$$ End of Bruker specific parameters
$$ ---------------------------------
##NTUPLES= NMR SPECTRUM
##VAR_NAME=  FREQUENCY,     SPECTRUM/REAL,   SPECTRUM/IMAG
##SYMBOL=    X,             R,               I
##VAR_TYPE=  INDEPENDENT,   DEPENDENT,       DEPENDENT
##VAR_FORM=  AFFN,          ASDF,            ASDF
##VAR_DIM=   65536,         65536,           65536
##UNITS=     HZ,            ARBITRARY UNITS, ARBITRARY UNITS
##FACTOR=    0.49542278885378, 1,            1
##FIRST=     16045.7642231865, 0,            0
##LAST=      -16421.768244346, 0,            0
##MIN=       -16421.768244346, -120879048,   0
##MAX=       16045.7642231865, 509036203,    0
$$ Real data points
##PAGE= N=1
##DATA TABLE= (X++(R..R)), XYDATA
$$ [...]
$$ plain form
42567 4823531 2434913 98000 -1794859 -3241027 -4106642 -4424988 -4475981 -4176352 -3165331
42558 -3165331 -1749783 -736618 20893 1624184 4012880 5230079 3943034 1572234
42550 1572234 515110 1059700 1526769 885026 -306946 -1189070 -1278048 -62929 2456402
42541 2456402 4764711 4968171 3275651 1896467 2051311 2620423 2459284 2435644 3835729
42532 3835729 5916938 6725559 5828598 4612852 3946967 3090173 1331619 -567123 -1404105
42523 -1404105 -1271896 -1369949 -2386806 -3834628 -4940681 -5510421 -5662605 -5188097 -3681669
42514 -3681669 -1326846 764676 1270682 -195013 -2701235 -4804984 -5636513 -5087435 -3230321
42505 -3230321 -230629 2921399 4340511 2858902 -372412 -2772148 -3016090 -2051089
$$ packed form
42567D823531k388618k336913j892859j446168q65615l18346n0993K99629J011021
42558c165331J415548J013165P57511J603291K388696J217199j287045k370800
42550A572234j057124N44590M67069o41743j191972q82124q8978J215119K519331
42541B456402K308309K03460j692520j379184J54844N69112j61139k3640J400085
42532C835729K081209Q08621q96961j215746o65885q56794j758554j898742q36982
42523a404105J32209r8053j016857j447822j106053n69740j52184M74508J506428
42514c681669K354823K091522N06006j465695k506222k103749q31529N49078J857114
42505c230321K999692L152028J419112j481609l231314k399736k43942R65001
$$ plain form
42497 -2051089 -1179938 -216044 1598659 3691518 4526516 3661782 2191149 1050385 80023
42488 80023 -876771 -1102153 4686 1806849 3105464 3512107 3501019 3469056 3418387 3369471
42478 3369471 3486585 3839472 4430352 5343187 6515474 7486457 7717731 7139790 6225425
42469 6225425 5634380 5801440 6518345 6793190 5579490 2962025 311826 -970374 -570562
42460 -570562 911241 2617541 3671065 3516406 2599348 2138090 2606060 2958106 2036514
42451 2036514 251929 -935190 -839953 -32813 697842 951751 472243 -702676 -1775490
42442 -1775490 -1762614 -734292 244587 569234 710421 1102790 1247692 539649 -544850
42433 -544850 -840797 27352 1116691 1180802 -165715 -2386268 -4705065 -6497317 -7280231
$$ packed form
42497b051089Q71151R63894J814703K092859Q34998q64734j470633j140764r70362
42488H0023r56794k25382J106839J802163J298615M06643j1088l1963n0669m8916
42478C369471J17114L52887N90880R12835J172287R70983K31274n77941r14365
42469F225425n91045J67060P16905K74845j213700k617465k650199j282200L99812
42460e70562J481803J706300J053524j54659r17058m61258M67970L52046r21592
42451B036514j784585j187119R5237Q07140P30655K53909m79508j174919j072814
42442a775490J2876J028322R78879L24647J41187L92369J44902p08043j084499
42433e44850k95947Q68149J089339O4111j346517k220553k318797j792252p82914
$$ plain form
42424 -7280231 -6960689 -6195572 -5853570 -5794191 -4917714 -3023088 -1715568 -2314657 -3640143
42415 -3640143 -3602714 -2557917 -2797435 -4493322 -4790694 -2096695 1203412 2231379 1755325
42406 1755325 2390281 4225923 5131713 4509268 3684410 2849764 702713 -2499574 -4359236
42397 -4359236 -3659642 -1880591 -467598 1147601 3630374 5914412 6743071 6453312 5934615
42388 5934615 5281170 4669380 4991851 6186500 6364376 4196844 1027216 -905982 -1256682
42379 -1256682 -1046515 -468806 930981 2591242 3312500 3061026 2943361 3561102 4517556
42370 4517556 5243578 5357932 4718676 3988068 4352787 5731000 6337892 5229945 3951796
42361 3951796 4011168 4161000 2522309 259821 183677 2127950 2902364 1177883 -627285
$$ packed form
42424g280231L19542P65117L42002N9379Q76477J894626J307520n99089j325486
42415c640143L7429J044797k39518j695887k97372K693999L300107J027967m76054
42406A755325O34956J835642R05790o22445q24858q34646k147051l202287j859662
42397d359236O99594J779051J412993J615199K482773K284038Q28659k89759n18697
42388E934615o53445o11790L22471J194649J77876k167532l169628j933198l50700
42379a256682K10167N77709J399787J660261P21258k51474j17665O17741R56454
42370D517556P26022J14354o39256p30608L64719J378213O06892j107947j278149
42361C951796N9372J49832j638691k262488p6144J944273P74414j724481j805168
$$ plain form
42352 -627285 -253511 1407583 2608074 3512514 4784241 5422390 4256611 2286048 1336107
42343 1336107 1242381 462148 -1090832 -1990076 -1940740 -2318373 -3588771 -4087538 -2461983
42334 -2461983 -50292 558741 -1203759 -3298371 -3621504 -1991123 561550 3195916
42326 3195916 5119628 5114774 2819034 215772 43217 2273493 3884846 3017406 1545056
42317 1545056 1906925 3031958 1933988 -1496778 -4246437 -4772663 -4859868 -5954362 -6420571
42308 -6420571 -4328156 -1010095 464375 -603617 -2006570 -1754672 -18400 1872742
42300 1872742 2894737 2739519 1938035 1732382 2964736 4993586 6361990 6474808 5958594
42291 5958594 5470248 4902284 3885016 2516067 1350440 863902 1011490 1347608 1701088
$$ packed form
42352f27285L73774J661094J200491R04440J271727O38149j165779j970563r49941
42343A336107r3726p80233j552980q99244M9336l77633j270398m98767J625555
42334b461983K411691O09033j762500k094612l23133J630381K552673K634366
42326C195916J923712m854k295740k603262j72555K230276J611353q67440j472350
42317A545056L61869J125033j097970l430766k749659n26226q7205j094494m66209
42308f420571K092415L318061J474470j067992j402953K51898J736272J891142
42300A872742J021995j55218q01484k05653J232354K028850J368404J12818n16214
42291E958594m88346n67964j017268j368949j165627m86538J47588L36118L53480
$$ plain form
42282 1701088 2491613 3903938 5042411 4818053 3609519 2903708 3148343 3301327 2867904
42273 2867904 2758033 3264024 2839523 330028 -2846561 -4393679 -4088924 -3401665 -2963037
42264 -2963037 -2222967 -1095043 -78997 1032121 2838943 4820460 5720883 5371250 4610593
42255 4610593 3581509 1786962 -286636 -1473014 -1930827 -2946015 -4531533 -5227809
42247 -5227809 -4688387 -4346016 -4807922 -4733710 -3376389 -2226723 -2715017 -3974152 -4396897
42238 -4396897 -3903424 -3074900 -1485615 1220653 3691550 4256195 3253918 2285292 1867114
42229 1867114 1529919 1465163 2107294 2632257 1996288 1213485 2390243 5367271 7469886
42220 7469886 7104539 5703813 5401665 6459138 7777107 8376977 7445900 4435364 359250
$$ packed form
42282A701088P90525J412325J138473k24358j208534p05811K44635J52984m33423
42273B867904j09871N05991m24501k509495l176589j547118L04755O87259M38628
42264b963037P40070J127924J016046J111118J806822J981517R00423l49633p60657
42255D610593j029084j794547k073598j186378m57813j015188j585518o96276
42247e227809N39422L42371m61906P4212J357321J149666m88294j259135m22745
42238d396897M93473Q28524J589285K706268K470897N64645j002277r68626m18178
42229A867114l37195o4756O42131N24963o35969p82803J176758K977028K102615
42220G469886l65347j400726l02148J057473J317969N99870r31077l010536m076114
$$ plain form
42211 359250 -2198558 -1750044 210736 1209216 961275 1206513 2860583 4834403 5760593
42202 5760593 5655111 5398721 5318303 4846548 3376595 1144771 -828969 -1774231 -2058593
42193 -2058593 -2659772 -3710416 -4157898 -3130140 -970352 1538531 4187075 6705864
42185 6705864 7777334 6087835 2457888 -326163 -420156 1093491 1759672 709994 -743640
42176 -743640 -1227729 -1070297 -1568167 -3047200 -4348014 -4301996 -3201806 -2396519 -2613043
42167 -2613043 -3154065 -2816735 -1185395 1135049 3093855 3661647 2224624 -757991 -3585878
42158 -3585878 -4536543 -3493431 -1890023 -841058 102677 1891219 4159185 5292700
42150 5292700 4359412 2302996 870137 758184 1255062 1464205 1330885 1402897 2040228
$$ packed form
42211C59250k557808M48514J960780R98480k47941K45238J654070J973820R26190
42202E760593j05482k56390q0418m71755j469953k231824j973740r45262k84362
42193b058593o01179j050644m47482J027758K159788K508883K648544K518789
42185F705864J071470j689499l629947k784051r3993J513647O66181j049678j453634
42176g43640m84089J57432m97870j479033j300814M6018J100190Q05287k16524
42167b613043n41022L37330J631340K320444J958806N67792j437023k982615k827887
42158c585878r50665J043112J603408J048965R43735J788542K267966J133515
42150E292700r33288k056416j432859j11953M96878K09143j33320P2012O37331
$$ plain form
42141 2040228 3131899 4357790 5443786 6208021 6517308 6209860 5099032 3226463 1093047
42132 1093047 -668267 -1920739 -2955973 -3709530 -3658378 -2880871 -2483887 -3099317 -3472588
42123 -3472588 -1845709 1256070 3033419 1784138 -918843 -2342215 -1951383 -1437439
42115 -1437439 -1973565 -2892785 -3059727 -2228471 -711357 1174280 2773825 3153993 2283564
42106 2283564 1542017 2227444 3918395 5089876 5107955 4756548 4761131 4618275 3301567
42097 3301567 721233 -1892402 -2949627 -1785368 740437 2800593 3021037 1546087
42089 1546087 -364133 -1668601 -2126749 -1693732 -176789 1994411 3280486 2291230 -404032
42080 -404032 -2421980 -1835044 1000364 3953115 5053325 3812492 1111936 -1794712
$$ packed form
42141B040228J091671J225891J085996P64235L09287l07448j110828j872569k133416
42132A093047j761314j252472j035234p53557N1152P77507L96984o15430l73271
42123c472588J626879L101779J777349j249281k702981j423372L90832N13944
42115a437439n36126r19220j66942Q31256J517114J885637J599545L80168q70429
42106B283564p41547O85427J690951J171481J8079l51407M583j42856j316708
42097C301567k580334k613635j057225J164259K525805K060156K20444j474950
42089A546087j910220j304468m58148M33017J516943K171200J286075r89256k695262
42080d04032k017948N86936K835408K952751J100210j240833k700556k906648
$$ plain form
42072 -1794712 -4223477 -6150310 -7454648 -7531915 -6205429 -4668644 -4477598 -5483079 -5872973
42063 -5872973 -4712859 -3287479 -3119012 -3780662 -3881827 -3282241 -2776376 -2227994 -838366
42054 -838366 985739 1938884 2036717 2547485 3401047 2872642 709547 -627363 633032
42045 633032 2709464 2690601 545439 -1229637 -1056237 525543 2371013 3556358 3283104
42036 3283104 1852478 1204909 2522378 3851447 2401967 -1157061 -3313376 -2595566
42028 -2595566 -945479 230229 2138366 5332483 7361879 5995575 2721408 636188
42020 636188 363557 379223 92515 78252 47581 -902762 -2291236 -2633156 -1684787 -470642
42010 -470642 670234 2171017 3565035 3691534 2599341 1472162 753308 225810 747534
$$ packed form
42072a794712k428765j926833j304338p7267J326486J536785J91046j005481l89894
42063e872973J160114J425380J68467o61650j01165N99586N05865N48382J389628
42054h38366J824105R53145R7833N10768Q53562n28405k163095j336910J260395
42045F33032K076432j8863k145162j775076J73400J581780J845470J185345k73254
42036C283104j430626o47569J317469J329069j449480l559028k156315P17810
42028b595566J650087J175708J908137L194117K029396j366304l274167k085220
42020F36188k72631J5666k86708j4263l0671r50343j388474l41920R48369J214145
42010d70642J140876J500783J394018J26499j092193j127179p18854n27498N21724
$$ plain form
42001 747534 3525493 7401084 9340852 8365423 6671301 5958853 5161890 3263076 1845171
41992 1845171 2566438 4007028 3763920 2526738 3150403 6007943 8051068 6937639 3833336
41983 3833336 1307119 271336 69649 167901 416102 448966 130710 284956 1848646
41974 1848646 4196276 5196579 3463333 199607 -1766249 -883158 1518657 2720744
41966 2720744 1422668 -1231658 -3054580 -2652925 -161272 2923524 4544843 3674269
41958 3674269 1507373 365179 1087999 2314353 2644818 2414674 2618781 3150695 3188699
41949 3188699 2575684 1690460 534472 -915799 -1946574 -1900670 -1383451 -1508459 -2247836
41940 -2247836 -2727035 -2858571 -3316333 -3980161 -3824403 -2559809 -1197202 -719139 -1140846
$$ packed form
42001G47534K777959L875591J939768r75429j694122p12448p96963j898814j417905
41992A845171P21267J440590k43108j237182O23665K857540K043125j113429l104303
41983C833336k526217j035783k01687R8252K48201L2864l18256J54246J563690
41974A848646K347630J000303j733246l263726j965856Q83091K401815J202087
41966B720744j298076k654326j822922M01655K491653L084796J621319q70574
41958C674269k166896j142194P22820J226354L30465k30144K04107N31914L8004
41949C188699o13015q85224j155988j450271j030775M5904N17219j25008p39377
41940b247836m79199j31536m57762o63828J55758J264594J362607M78063m21707
$$ plain form
41931 -1140846 -1936873 -2409530 -1744121 119349 1792693 1962854 1447190 2075514 3602253
41922 3602253 3860791 2402453 1626590 3201573 5535333 6374785 6029573 6070355 6375227
41913 6375227 5753638 4499828 4015844 4467787 4961799 5578709 6954253 8043065 6794005
41904 6794005 3487069 1185008 2035171 4884185 7357021 8553724 8616092 7244029 4222627
41895 4222627 560481 -2242527 -3585782 -3548083 -2017496 835789 3708122 4972418
41887 4972418 4300498 2728959 1254345 43557 -1085806 -2050253 -2422315 -1686724 214346
41878 214346 2327625 3097144 1805973 -633767 -2631967 -3275404 -2513388 -763725 1016211
41869 1016211 1574052 671289 -241070 320274 1754657 2000542 260162 -2015934 -3110431
$$ packed form
41931a140846p96027m72657O65409J863470J673344J70161n15664O28324J526739
41922C602253K58538j458338p75863J574983K333760Q39452l45212M0782L04872
41913F375227o21589j253810m83984M51943M94012O16910J375544J088812j249060
41904F794005l306936k302061Q50163K849014K472836J196703O2368j372063l021402
41895D222627l662146k803008j343255L7699J530587K853285K872333J264296
41887D972418o71920j571539j474614j210788j129363r64447l72062P35591J901070
41878B14346K113279P69519j291171k439740j998200o43437P62016J749663J779936
41869A016211N57841r02763r12359N61344J434383K45885j740380k276096j094497
$$ plain form
41860 -3110431 -2915563 -2250375 -1195411 932594 4197077 7383284 8872728 7982331 5531925
41851 5531925 3201087 2068115 1587372 285704 -2297493 -4718149 -5108342 -3320985
41843 -3320985 -1019766 353164 1022647 1969848 3213161 3826145 3513024 3138434 3228016
41834 3228016 2817200 790408 -2061619 -3577511 -2896239 -1336715 -185347 1018853
41826 1018853 2929014 4270390 3018271 -616476 -4070641 -5507416 -5531926 -5399745 -5063699
41817 -5063699 -4032846 -2989471 -3094244 -4189737 -5041805 -5218258 -5490886 -6242633 -6608537
41808 -6608537 -5644373 -3504075 -929127 1730626 4318162 6224064 6820735 6439935 6168983
41799 6168983 6554926 7108681 7265576 7160897 6980720 6153987 4115260 1749429 1026675
$$ packed form
41860c110431J94868O65188J054964K128005L264483L186207J489444q90397k450406
41851E531925k330838j132972m80743j301668k583197k420656l90193J787357
41843c320985K301219J372930O69483R47201J243313O12984l13121l74590Q9582
41834C228016m10816k026792k852027j515892O81272J559524J151368J204200
41826A018853J910161J341376j252119l634747l454165j436775k4510J32181L36046
41817e063699J030853J043375j04773j095493q52068j76453k72628p51747l65904
41808f608537R64164K140298K574948K659753K587536J905902N96671l80800k70952
41799F168983L85943N53755J56895j04679j80177q26733k038727k365831p22754
$$ plain form
41790 1026675 2711039 5119725 5829754 4215941 1658045 -342425 -1316306 -1283783 -249096
41781 -249096 1349994 2566431 2914238 2841008 2777250 2416596 1599657 1201629 2108076 3670838
41771 3670838 4306697 3595453 2725535 2703902 3178533 3437727 3572008 3916983 4107591 3638968
41761 3638968 2967588 3085686 4096260 5076589 5411768 5395477 5226592 4283551 2099919
41752 2099919 -480219 -2051442 -2471021 -3049530 -4635680 -6258252 -6306036 -4630198 -2670170
41743 -2670170 -1550973 -881903 218586 1559460 2040833 1228588 121156 72605 1205448
41734 1205448 2222798 1889731 525196 -304548 318304 1480401 1587505 388442 -877289
41725 -877289 -1265638 -1110412 -959810 -561787 384774 1278714 1338844 717605 -12816 -899159
$$ packed form
41790A026675J684364K408686P10029j613813k557896k000470r73881L2523J034687
41781b49096J599090J216437L47807p3230o3758l60654q16939l98028R06447J562762
41771C670838O35859p11244q69918k1633M74631K59194J34281L44975J90608m68623
41761C638968o71380J18098J010574R80329L35179j6291j68885r43041k183632
41752B099919k580138j571223m19579n78509j586150j622572m7784J675838J960028
41743b670170J119197O69070J100489J340874M81373q12245j107432m8551J132843
41734A205448J017350l33067j364535q29744O22852J162097J07104j199063j265731
41725h77289l88349J55226J50602L98023R46561Q93940O0130o21239p30421q86343
$$ plain form
41715 -899159 -2023040 -2438105 -1187428 807535 1517320 654463 116766 1099412 2425130
41706 2425130 2621330 2094057 1961946 2033561 1528599 879216 1082738 1815972 1929175 1552488
41696 1552488 2000525 3593173 5219533 6224269 7045496 7571321 6598373 3809112 852838
41687 852838 -684222 -1325967 -2568387 -4565159 -6205847 -6888784 -6900699 -6339569 -4932872
41678 -4932872 -2940018 -1196735 -125833 499343 777103 512194 -48589 -162425 420593
41669 420593 1081608 1255689 1136284 1135490 1221407 1225790 1333665 1729664 2008392 1404951 -445533
41658 -445533 -3147784 -5689996 -6808279 -5737831 -3108029 -746320 5603 -416309 -741878
41649 -741878 -772777 -1391806 -2669875 -3176757 -1860551 259196 1262010 689278 -331294
$$ packed form
41715h99159j123881m15065J250677J994963P09785q62857n37697R82646J325718
41706B425130J96200n27273j32111P1615n04962o49383K03522P33234J13203l76687
41696A552488M48037J592648J626360J004736Q21227N25825r72948k789261k956274
41687H52838j537060o41745j242420j996772j640688o82937j1915N61130J406697
41678d932872J992854J743283J070902O25176K77760k64909n60783j13836N83018
41669D20593O61015J74081j19405p94Q5917M383J07875L95999K78728o03441j850484
41658d45533k702251k542212j118283J070448K629802K361709P51923m21912l25569
41649g41878l0899o19029j278069n06882J316206K119747J002814n72732j020572
$$ plain form
41640 -331294 -1018257 -1661925 -2259465 -1848867 -34797 1835074 2155176 1180431 525295
41631 525295 837081 1168348 687758 -170137 -622315 -610447 -419587 -23844 567010 962676
41621 962676 1059404 1482847 2628761 3764902 3964054 3568053 3710005 4525889 4954427
41612 4954427 4471595 3901853 3964592 3941889 2660554 293075 -1708304 -2289630 -1652903
41603 -1652903 -522660 649400 1584163 1996357 1939153 1879782 1995511 1728389 534929
41594 534929 -1142549 -2232123 -2320176 -1984993 -1697104 -998364 756931 3192833 5023068
41585 5023068 5363005 4562011 3713266 3624850 4279959 5027754 5249722 5030886 5145404 6151155
41575 6151155 7572546 8299262 7761850 6369530 4859722 3733816 3377171 4033594 5240647
$$ packed form
41640c31294o86963o43668n97540M10598J814070J869871L20102r74745o55136
41631E25295L11786L31267m80590q57895m52178J1868J90860L95743N90854L95666
41621I62676R6728M23443J145914J136141J99152l96001J41952Q15884M28538
41612D954427m82832n69742O2739k2703j281335k367479k001379n81326O36727
41603a652903J130243J172060R34763M12194n7204n9371J15729k67122j193460
41594E34929j677478j089574q8053L35183K87889O98740J755295K435902J830235
41585E023068L39937q00994q48745q8416O55109P47795K21968k18836J14518J005751
41575F151155J421391P26716n37412j392320j509808j125906l56645O56423J207053
$$ plain form
41566 5240647 5812249 4999440 3462641 2574943 2862437 3573945 3699423 2925196 1558955
41557 1558955 13579 -1361408 -2179039 -2073252 -1003790 450533 1243035 679586 -745003
41548 -745003 -1674249 -1333620 -304994 488069 1072596 1977759 2830681 2491713 783884
41539 783884 -926449 -1440954 -1232992 -1470829 -2134084 -2131503 -1094163 37772 451220
41530 451220 565765 1175621 2174259 2904157 3409498 4396926 5832696 6435731 5175844
41521 5175844 2857188 1439870 1747053 2531034 2188131 849656 21947 333056 641243
41512 641243 -178168 -1435266 -1632051 -858400 -794173 -2002944 -2613343 -834289 2062327
41503 2062327 2877886 596854 -2104397 -2019198 1000319 4374786 5864638 5324701 3928256
$$ packed form
41566E240647N71602q12809j536799q87698K87494P11508J25478p74227j366241
41557A558955j545376j374987q17631J05787J069462J454323P92502n63449j424589
41548g45003r29246L40629J028626P93063N84527R05163Q52922l38968j707829
41539G83884j710333n14505K07962k37837o63255K581J037340J131935M13448
41530D51220J14545O09856R98638P29898N05341R87428J435770O03035j259887
41521E175844k318656j417318L07183P83981l42903j338475q27709L11109L08187
41512F41243q19411j257098j96785P73651O4227j208771o10399J779054K896616
41503B062327Q15559k281032k701251Q5199L019517L374467J489852n39937j396445
$$ plain form
41494 3928256 2777116 2281303 2074360 1314909 -507475 -2989137 -5210020 -6440490 -6233963
41485 -6233963 -4485629 -2083673 -860559 -1799784 -3596011 -4123228 -3101969 -2003062
41477 -2003062 -1433213 -329104 1792226 3473798 3264452 1810691 827595 872030 1322793
41468 1322793 1867631 2737124 3843167 4802169 5577661 6198100 6200580 5345007 4554764 5043826
41458 5043826 6625931 7896196 8047279 7597115 7383974 7737588 8536475 9087317 8016664
41449 8016664 4490595 -162484 -3111323 -2870891 -834135 462908 41805 -942844 -864467
41440 -864467 594797 2247086 2877523 2834032 3653544 5818405 7643239 7228092 4932218
41431 4932218 2791564 1855068 1389007 596601 -240165 -515521 -43299 1112673 2472803
$$ packed form
41494C928256j151140m95813k06943p59451j822384k481662k220883j230470K06527
41485f233963J748334K401956J223114r39225j796227n27217J021259J098907
41477b003062N69849J104109K121330J681572k09346j453761r83096M4435M50763
41468A322793N44838Q69493J106043R59002P75492O20439K480q55573p90243M89062
41458E043826J582105J270265J51083m50164k13141L53614P98887N50842j070653
41449H016664l526069m653079k948839K40432K036756J297043m21103r84649P8377
41440h64467J459264J652289O30437m3491Q19512K164861J824834m15147k295874
41431D932218k140654r36496m66061p92406q36766k75356M72222J155972J360130
$$ plain form
41422 2472803 2803682 1255178 -1041312 -1923791 -977194 139361 401443 636478 1411418
41413 1411418 1673153 664956 -532027 -802289 -791059 -1256161 -1069039 1094008 4069556
41404 4069556 5386868 4559055 3154351 2054940 867664 -95301 327747 1843480 2443850
41395 2443850 1364544 489243 1643752 3984449 5488235 5955420 6903470 8915031 10598832
41386 10598832 10376216 8330511 5913999 4331659 3547809 2702764 1295487 -110538
41378 -110538 -431372 650005 2031311 1973774 -285728 -3556193 -5468811 -4621961 -2001823
41369 -2001823 123594 708212 678682 1113144 1718291 1729749 1309916 980445 427554 -765497
41359 -765497 -1627227 -590560 2156573 4469366 4690631 3193686 1275620 -245521 -882180
$$ packed form
41422B472803L30879j548504k296490q82479R46597J116555K62082K35035P74940
41413A411418K61735j008197j196983k70262J1230m65102J87122K163047K975548
41404D069556J317312q27813j404704j099411j187276r62965M23048J515733O00370
41395B443850j079306q75301J154509K340697J503786M67185R48050K011561J683801
41386A0598832k22616k045705k416512j582340p83850q45045j407277j406025
41378a10538l20834J081377J381306n7537k259502l270465j912618Q46850K620138
41369b001823K125417N84618k9530M34462O05147J1458m19833l29471n52891j193051
41359g65497q61730J036667K747133K312793K21265j496945j918066j521141o36659
$$ plain form
41350 -882180 -180588 1562726 3090068 3509069 3325191 3587434 4572554 5858030 7077156
41341 7077156 7955655 8168940 7900178 8065208 9150395 10129050 9406501 6786699 3763842
41332 3763842 1830583 1155231 1011337 804749 339621 -385342 -1129025 -1419087 -1090466
41323 -1090466 -686375 -849037 -1364603 -1394239 -756972 -237853 -173029 456146 2513773 4799904
41313 4799904 5061602 2988076 784769 289151 880120 1088867 1002409 1766609 3551707
41304 3551707 5412930 6700077 7373212 7340887 6708748 6314856 6782642 7375048 7013375
41295 7013375 6002945 5347274 4828483 3540225 2083689 2161479 3749271 4726157 3955575
41286 3955575 2846044 2946455 3709080 3810246 3271107 2960766 3045075 3133346 3129403 2904247
$$ packed form
41350h82180P01592J743314J527342M19001j83878K62243R85120J285476J219126
41341G077156Q78499K13285k68762J65030J085187R78655p22549k619802l022857
41332C763842j933259o75352j43894k06588m65128p24963p43683k90062L28621
41323a090466M04091j62662n15566k9636O37267N19119O4824O29175K057627K286131
41313D799904K61698k073526k203307m95618N90969K08747q6458P64200J785098
41304C551707J861223J287147O73135l2325o32139l93892M67786N92406l61673
41295G013375j010430o55671n18791j288258j456536P7790J587792R76886p70582
41286C955575j109531J00411P62625J01166n39139l10341Q4309Q8271l943k25156
$$ plain form
41276 2904247 1922053 168609 -1256504 -1313442 -100272 1832440 4229680 6461063 7320866
41267 7320866 6630698 6067815 7198363 9461199 11161755 11579423 10932767 9226676 6634512
41258 6634512 4384455 3753397 4484627 5357095 5833982 5985920 5431672 3804505 1852068
41249 1852068 655525 94467 -533160 -780344 428763 2713107 4366786 4740893 4951753
41240 4951753 5875124 6855569 6965668 6372310 5763568 5265260 4612143 3885282 3499825
41231 3499825 3586550 3636070 2921346 1580843 1095810 2723865 5275263 5909115 3977073
41222 3977073 2441018 3887825 6608289 6939223 4580675 2866786 3940042 6357740
41214 6357740 7831735 7740946 6131519 2726427 -1640908 -4535684 -4528360 -3056049 -2357008
$$ packed form
41276B904247r82194j753444j425113n6938J213170J932712K397240K231383Q59803
41267G320866o90168n62883J130548K262836J700556M17668o46656j706091k592164
41258F634512k250057o31058P31230Q72468M76887J51938n54248j627167j952437
41249A852068j196543n61058o27627k47184J209107K284344J653679L74107K10860
41240D951753R23371R80445J10099n93358o08742m98308o53117p26861l85457
41231C499825Q6725M9520p14724j340503m85033J628055K551398O33852j932042
41222C977073j536055J446807K720464L30934k358548j713889J073256K417698
41214F357740J473995r0789j609427l405092m367335k894776P324J472311O99041
$$ plain form
41205 -2357008 -2689361 -2864371 -2423450 -1802279 -1063980 105938 1483531 2462113 2871815
41196 2871815 2871856 2392593 1394565 321823 -329541 -569934 -602587 -413735 -84612 62411
41186 62411 106213 725180 2185902 3610323 3830894 2727534 1390920 1167553 2532037
41177 2532037 4469394 5127038 3744110 1718958 917476 1313166 1597196 1774561 3222358
41168 3222358 5891018 7499182 6457991 3964917 2137009 1489885 1333324 1259829 1007530
41159 1007530 85564 -1207887 -1533827 -491168 339677 -359296 -1545085 -1420748 -49814
41150 -49814 1171545 1628475 1480079 581028 -814528 -1248351 42807 1227790 80399
41141 80399 -2475852 -3406356 -1983132 -712427 -1499503 -3144205 -3474494 -2188014 -577126
$$ packed form
41205b357008l32353j75010M40921O21171P38299J169918J377593R78582M09702
41196B871815M1m79263r98028j072742o51364k40393l2653J88852L29123J47023
41186F2411M3802O18967J460722J424421K20571j103360j336614k23367J364484
41177B532037J937357O57644j382928k025152q01482L95690K84030J77365J447797
41168C222358K668660J608164j041191k493074j827908o47124j56561p3495k52299
41159A007530r21966j293451l25940J042659Q30845o98973j185789J24337J370934
41150d9814J221359M56930j48396q99051j395556m33823J291158J184983j147391
41141H0399k556251r30504J423224J270705p87076j644702l30289J286480J610888
$$ plain form
41132 -577126 299904 285338 -126070 -45346 1099117 2731041 3663636 3621373 3504791 4068932
41122 4068932 5068421 5731681 5440624 4108049 2501100 1773413 2005536 1960131 1159412
41113 1159412 1036975 2574082 4112702 3753658 2886229 4380247 7617032 8650313 5872679
41104 5872679 2341668 1248448 1948875 2200346 1778382 1627396 1334237 -86392 -2007797
41095 -2007797 -2908340 -2523608 -1625838 -490076 872731 1855177 2199121 2895824 4534115
41086 4534115 5720498 4971592 3301301 2871286 3752779 4281115 4161602 4642036 5530187
41077 5530187 4784217 1970974 -221175 598350 3260609 4785813 4206147 3002587 2504857
41068 2504857 2578469 2690018 2740790 2593233 1933373 1042977 855038 1752892 2978654 3726809
$$ packed form
41132e77126Q77030j4566m11408Q0724J144463J631924R32595m2263j16582N64141
41122D068932R99489O63260k91057j332575j606949p27687K32123m5405q00719
41113A159412j22437J537107J538620l59044q67429J494018L236785J033281k777634
41104E872679l531011j093220P00427K51471m21964j50986k93159j420629j921405
41095b007797r00543L84732Q97770J135762J362807R82446L43944O96703J638291
41086D534115J186383p48906j670291m30015Q81493N28336j19513M80434Q88151
41077E530187p45970k813243k192149Q19525K662259J525204n79666j203560m97730
41068B504857P3612J11549N0772j47557o59860q90396j87939Q97854J225762P48155
$$ plain form
41058 3726809 4175323 4781089 5192330 4859391 4322673 4608480 5397605 5284226 4212654
41049 4212654 3999193 5515656 6986611 6568885 5173851 4724285 4797407 3594432 1600979
41040 1600979 1254599 2831593 3715606 2514499 959336 523375 150128 -844518 -546520
41031 -546520 2218628 4694263 3583593 107562 -1624696 -333694 1636983 2662808
41023 2662808 3496903 4511914 4691093 4144158 4624607 6350559 6896598 4718419 1637743
41014 1637743 240384 589586 1171625 1593144 2499190 3795116 4703480 5110245 5476552
41005 5476552 5698754 5149297 3728850 2152116 1283896 1488208 2276184 2500373 1561738
40996 1561738 487505 879355 2676583 4135620 4246062 3713442 3079207 1600768 -963665
$$ packed form
41058C726809M48514O05766M11241l32939n36718K85807P89125j13379j071572
41049D212654k13461J516463J470955m17726j395034m49566P3122j202975j993453
41040A600979l46380J576994Q84013j201107j555163m35961l73247r94646K97998
41031e46520K765148K475635j110670l476031j732258J291002J970677J025825
41023B662808Q34095J015011J79179n46935M80449J725952N46039k178179l080676
41014A637743j397359L49202N82039M21519R06046J295926R08364M06765L66307
41005E476552K22202n49457j420447j576734q68220K04312P87976K24189r38635
40996A561738j074233L91850J797228J459037J10442n32620o34235j478439k564433
$$ plain form
40987 -963665 -3045603 -3210949 -2254356 -1879588 -2309226 -2754998 -3273051 -4256177 -4722435
40978 -4722435 -3215814 -341557 1494290 1112223 -296823 -1313709 -1908137 -2373624 -2272906
40969 -2272906 -1457261 -946674 -1600237 -2603818 -2354840 -446498 2105341 4220009 5386511
40960 5386511 5217745 3556170 1255343 -197944 -498176 -1218939 -3783372 -7157453 -8729018
40951 -8729018 -7540395 -5450763 -4618164 -5008891 -5308974 -5197978 -5235463 -5166656 -4166555
40942 -4166555 -2668426 -2129270 -2686504 -2789485 -1676855 -433993 213043 1252624 3190297
40933 3190297 4208026 2421550 -1102035 -3470845 -3386272 -1714021 565796 2924426
40925 2924426 4253008 3525321 1677316 933224 1891073 2864398 2399509 861676 -777714
$$ packed form
40987i63665k081938j65346R56593L74768m29638m45772n18053r83126m66258
40978d722435J506621K874257J835847l82067j409046j016886n94428m65487J00718
40969b272906Q15645N10587o53563j003581K48978J908342K551839K114668J166502
40960E386511j68766j661575k300827j453287l00232p20763k564433l374081j571565
40951h729018J188623K089632Q32599l90727l00083J10996l7485O8807J000101
40942d166555J498129N39156n57234j02981J112630J242862O47036J039581J937673
40933C190297J017729j786476l523585k368810Q4573J672251K279817K358630
40925B924426J328582p27687j848005p44092R57849R73325m64889j537833j639390
$$ plain form
40916 -777714 -2037752 -2302698 -798433 1946725 3960134 3979034 2636590 940384 -1021400
40907 -1021400 -3042124 -3931007 -2926834 -954118 672592 1893429 3163333 4004888
40899 4004888 3618556 2339517 1290603 1001193 1301240 2004456 2722397 2654601 1674068
40890 1674068 1020057 1714843 2839213 2692818 1235865 -11758 -178851 342099 1331279
40881 1331279 3183993 5704013 7856884 9065497 9562909 9267543 7698954 5409907
40873 5409907 4047701 4270385 4876803 4827245 4827698 5739325 6547073 5523029 2880078 658915
40863 658915 9097 -14461 -673607 -1784841 -2331791 -1966518 -1103655 42003 1681442
40854 1681442 3664343 5039001 4802601 3045439 1046476 -39651 -522072 -1785434
$$ packed form
40916g77714j260038k64946J504265K745158K013409J8900j342444j696206j961784
40907a021400k020724q88883J004173J972716J626710J220837J269904Q41555
40899D004888l86332j279039j048914k89410L00047P03216P17941o7796r80533
40890A674068o54011O94786J124370j46395j456953j247623j67093N20950R89180
40881A331279J852714K520020K152871J208613M97412k95366j568589k289047
40873E409907j362206K22684O06418m9558M53R11627Q07748j024044k642951k221163
40863F58915o49818k3558o59146j111234n46950L65273Q62863J145658J639439
40854A681442J982901J374658k36400j757162j998963j086127m82421j263362
$$ plain form
40846 -1785434 -4343016 -6699814 -6759188 -4311817 -1506041 -573213 -1489654 -2238930 -1109271
40837 -1109271 1685191 4516252 5987496 5989538 5471446 5371687 5689533 5626710 4756469 3789209
40827 3789209 3701165 4272261 4320889 3598261 3468023 4975085 7046570 7747151 6887231
40818 6887231 6072424 6233526 6477985 5695299 4053268 2394164 1278276 1186141 2413470
40809 2413470 3902658 3447666 396705 -2736931 -2834042 199438 3716583 5695369 6246103
40800 6246103 6111520 5520765 4789261 4492282 4548821 4319051 3910393 4132467 4854940 4826534
40790 4826534 3655241 2546710 2310552 1999426 585488 -1141632 -1585531 -473774 1181873
40781 1181873 2678600 4082756 5449019 6450769 6558915 5168731 2214787 -875627
$$ packed form
40846a785434k557582k356798n9374K447371K805776R32828r16441p49276J129659
40837a109271K794462K831061J471244K042n18092r9759L17846o2823q70241r67260
40827C789209q8044N71096M8628p22628j30238J507062K071485P00581q59920
40818F887231q14807J61102K44459p82686j642031j659104j115888r2135J227329
40809B413470J489188m54992l050961l133636r7111L033480L517145J978786N50734
40800F246103j34583n90755p31504k96979N6539k29770m08658K22074P22473k8406
40790D826534j171293j108531k36158l11126j413938j727120m43899J111757J655647
40781A181873J496727J404156J366263J001750J08146j390184k953944l090414
$$ plain form
40773 -875627 -1901340 -456159 1219142 1055459 -173903 -385748 552681 928105 54965
40764 54965 -918824 -1083665 -853138 -693683 -345517 274499 778261 1321163 2549839 4065657
40754 4065657 4337550 2838752 1008326 280368 320580 158868 5672 760581 2428659
40745 2428659 4183858 5559727 6542280 6807119 5898617 4140794 2620532 2225667 3139033
40736 3139033 5075815 7447298 9370909 10039784 9222569 7330564 5190828 3780435
40728 3780435 3674474 4442706 4967632 4624829 3789036 3054091 2539483 2188459 2055074
40719 2055074 1940529 1454332 847378 1016213 2195898 3490137 4248539 4876299 5484212
40710 5484212 4957664 2709115 343822 -191963 455420 -71203 -2158578 -3482321 -2371296
$$ packed form
40773h75627j025713J445181J675301j63683j229362k11845R38429L75424q73140
40764E4965r73789j64841K30527J59455L48166O20016N03762N42902J228676J515818
40754D065657K71893j498798j830426p27958M0212j61712j53196P54909J668078
40745B428659J755199J375869R82553K64839r08502j757823j520262l94865R13366
40736C139033J936782K371483J923611O68875q17215j892005k139736j410393
40728C780435j05961P68232N24926l42803q35793p34945n14608l51024j33385
40719B055074j14545m86197o06954J68835J179685J294239P58402O27760O07913
40710E484212n26548k248549k365293n35785O47383n26623k087375j323743J111025
$$ plain form
40701 -2371296 -29698 1490626 2033069 2916043 4835312 7327941 9606927 10934604
40693 10934604 10771217 9505108 8524417 8605222 8617506 6793172 3051768 -807322 -3055270
40684 -3055270 -3341215 -2241570 -549768 773780 811391 -595520 -2583680 -3904967 -3733377
40675 -3733377 -2154174 -372164 -120269 -1938043 -3996554 -3646663 -519806 2848512
40667 2848512 4095194 3792372 4123179 5539420 6272841 5120592 3120728 1813651 1115379
40658 1115379 22598 -1390319 -2040465 -1625709 -1020886 -747700 -228029 996274 2279072
40649 2279072 2732094 2293069 1247630 -544039 -2945301 -4582790 -3855343 -965252 2063319
40640 2063319 3625960 3957720 4062814 4188402 4022547 3701551 3678886 3822354 3504445
$$ packed form
40701b371296K341598J520324N42443Q82974J919269K492629K278986J327677
40693A0934604j63387j266109r80691Q0805J2284j824334l741404l859090k247948
40684c055270k85945J099645J691802J323548L7611j406911j988160j321287J71590
40675c733377J579203J782010K51895j817774k058511L49891L126857L368318
40667B848512J246682l02822L30807J416241P33421j152249j999864j307077o98272
40658A115379j092781j412917o50146M14756O04823K73186N19671J224303J282798
40649B279072M53022m39025j045439j791669k401262j637489P27447K890091L028571
40640B063319J562641L31760J05094J25588j65855l20996k2665J43468l17909
$$ plain form
40631 3504445 2666204 2062335 2132719 2192110 1314045 -192209 -829095 372228 2611335
40622 2611335 4152211 4133877 3097061 1899423 848766 121014 247006 1438541 2799600
40613 2799600 3090794 2314740 1767332 2265202 3043495 2950439 2208398 2164752 3365906 4692269
40603 4692269 4784317 3787249 3029191 3132129 3195177 2115719 90652 -1764878 -2852871
40594 -2852871 -3348127 -3247994 -2228374 -653364 354668 470588 853256 2346692 3752950
40585 3752950 3200093 930548 -664025 60079 2305853 4416102 5921364 7192101
40577 7192101 7974857 7500772 5876632 4405570 4265154 5284711 6181490 5818345 4255134
40568 4255134 2729139 2496722 3511605 4397824 3979809 2698302 2131073 3063087 4417343
$$ packed form
40631C504445q38241o03869P0384N9391q78065j506254o36886J201323K239107
40622B611335J540876j8334j036816j197638j050657p27752J25992J191535J361059
40613B799600K91194p76054n47408M97870P78293r3056p42041m3646J201154J326363
40603D692269R2048r97068p58058J02938O3048j079458k025067j855530j087993
40594b852871m95256J00133J019620J575010J008032J15920L82668J493436J406258
40585C752950n52857k269545j594573P24104K245774K110249J505262J270737
40577G192101P82756m74085j624140j471062j40416J019557Q96779l63145j563211
40568D255134j525995k32417J014883Q86219m18015j281507n67229R32014J354256
$$ plain form
40559 4417343 4417659 2628884 345034 -1165815 -2170980 -3584229 -5001969 -4825123 -2618810
40550 -2618810 -185681 550739 -89047 -313232 624308 1877992 2593243 2734475 2505791
40541 2505791 2295562 3159437 5829740 8950067 9845505 7726845 4827031 3601864 4041021
40532 4041021 4594788 4430163 3535728 1725406 -872107 -2947163 -3137823 -1756883 -198301
40523 -198301 1016112 2331206 3608866 3927730 3010013 1657400 634962 137614 339193
40514 339193 1264422 1989151 1283765 -506122 -1409482 -317447 1465392 1944284 918454
40505 918454 -166938 -308357 147130 558086 1027096 2057021 3642502 5108491 5774218
40496 5774218 5537192 4781414 3985661 3661974 4395572 6310273 8421592 9218882 8249813
$$ packed form
40559D417343L16j788775k283850j510849j005165j413249j417740J76846K206313
40550b618810K433129P36420o39786k24185R37540J253684P15251J41232k28684
40541B505791k10229Q63875K670303L120327Q95438k118660k899814j225167M39157
40532D041021N53767j64625q94435j810322k597513k075056j90660J380940J558582
40523a98301J214413J315094J277660L18864r17717j352613j022438m97348K01579
40514C39193R25229P24729p05386j789887r03360J092035J782839M78892j025830
40505I18454j085392j41419M55487M10956M69010J029925J585481J465989O65727
40496E774218k37026p55778p95753l23687P33598J914701K111319P97290r69069
$$ plain form
40487 8249813 6557553 5202788 4096180 2858531 1978852 2127158 2898010 3327920 3291772
40478 3291772 3368285 3718399 4171422 4938051 5952113 6035608 4401181 2658724 3262829
40469 3262829 5816631 7117812 5539427 3235842 2883509 4170824 5047108 4868397 4519976
40460 4519976 4535788 4834741 5481796 6094424 5283441 2371448 -954496 -2369313 -1765133
40451 -1765133 -786698 -182546 451162 774479 -172426 -1901893 -2708152 -2332038 -2397992
40442 -2397992 -3695634 -5001092 -5287517 -5143549 -5089798 -4443293 -3043110 -2190454 -2327386
40433 -2327386 -1549090 1616601 5339414 6553155 4887963 2394517 286295 -1536767
40425 -1536767 -2338911 -892253 1830586 3155540 2678750 3108917 5930256 8721430 8608326
$$ packed form
40487H249813j692260j354765j106608j237649q79679J48306P70852M29910l6148
40478C291772P6513L50114M53023P66629J014062Q3495j634427j742457O04105
40469C262829K553802J301181j578385k303585l52333J287315Q76284j78711l48421
40460D519976J5812K98953O47055O12628q10983k911993l325944j414817O04180
40451a765133R78435O04152O33708L23317r46905j729467q06259L76114o5954
40442b397992j297642j305458k86425J43968N3751O46505J400183Q52656j36932
40433b327386P78296L165691L722813J213741j665192k493446k108222j823062
40425a536767q02144J446658K722839J324954m76790M30167K821339K791174j13104
$$ plain form
40416 8608326 6297481 4419910 3477320 2078569 237033 -421816 430222 1321041 1671670
40407 1671670 2597368 4400613 5564527 5339962 5323598 6977106 9170238 9861704 8976185
40398 8976185 7808236 6532021 4333003 1534879 -442085 -1208806 -1628293 -1745250 -436291
40389 -436291 2214711 3989556 3238677 1324750 958717 2734163 4665383 4957977 3977683
40380 3977683 3167048 2892897 2065425 -253107 -3361508 -5359654 -5020305 -2864223 -262535
40371 -262535 1955422 3511677 3966894 3095705 1760437 1171144 1159763 471280 -900573
40362 -900573 -1134954 846915 3570852 4954540 4951434 4785796 4470503 3031349 928732
40353 928732 212457 1767373 3968180 4833778 4349446 3810022 3759706 3545883 2454669
$$ packed form
40416H608326k310845j877571r42590j398751j841536o58849Q52038Q90819L50629
40407A671670R25698J803245J163914k24565j6364J653508K193132O91466q85519
40398H976185j167949j276215k199018k798124j976964p66721m19487j16957J308959
40389d36291K651002J774845p50879j913927l66033J775446J931220K92594r80294
40380C977683q10635k74151q27472k318532l108401j998146L39349K156082K601688
40371b62535K217957J556255M55217q71189j335268n89293j1381o88483j371853
40362i00573k34381J981869K723937J383688l106j65638l15293j439154k102617
40353I28732p16275J554916K200807Q65598m84332n39424n0316k13823j091214
$$ plain form
40344 2454669 535363 -1445998 -2405230 -1648129 342795 2105550 2570545 2018250 1498800
40335 1498800 1742999 2868096 4516605 5782345 5575812 3807797 1936332 1665128 3210142
40326 3210142 5330867 6814507 7307982 6888240 5644642 3934834 2577257 2470560 4014248
40317 4014248 6698455 9106948 9788362 8621253 6931365 5701609 4259312 1722168
40309 1722168 -818846 -1189549 724332 2499311 2523513 2122285 3070303 4456556 3978432
40300 3978432 1629118 -21617 769456 3060685 5059944 6122062 6333311 5666160 4496398
40291 4496398 3801138 3874486 3756360 2761536 1590327 1015308 563713 -272266 -547142
40282 -547142 769383 2551035 2457892 46609 -2628048 -3598359 -2723775 -747536 1752578
$$ packed form
40344B454669j919306j981361r59232P57101J990924J762755M64995n52295n19450
40335A498800K44199J125097J648509J265740k06533j768015j871465k71204J545014
40326C210142K120725J483640M93475m19742j243598j709808j357577j06697J543688
40317D014248K684207K408493O81414j167109j689888j229756j442297k537144
40309A722168k541014l70703J913881J774979K4202m01228R48018J386253m78124
40300C978432k349314j650735P91073K291229J999259J062118K11249o67151j169762
40291D496398o95260P3348j18126r94824j171209n75019m51595q35979k74876
40282e47142J316525J781652r3143k411283k674657r70311Q74584J976239K500114
$$ plain form
40273 1752578 3938007 4706394 4048239 3464635 4201217 5738819 6667646 6392156 5345646
40264 5345646 4096322 2866542 1571052 -45084 -1941055 -3357295 -3493478 -2697838
40256 -2697838 -2163580 -2320757 -2517983 -2446307 -2564547 -2659067 -1479189 1235390 3648270
40247 3648270 3979218 2807955 2006520 2199058 2527108 2206683 1059052 -791898 -2398168
40238 -2398168 -1863299 1659921 6216426 8792396 8564089 7067559 5595850 4124672
40230 4124672 2621587 1585970 1094805 888781 1538810 3856157 6900039 8369336 7525998
40221 7525998 6053325 5353514 4718242 3130923 1242032 241116 41753 -18508 337307
40212 337307 1731868 3714167 5172410 5586584 4829915 2524675 -1056978 -4061707 -4572451
$$ packed form
40273A752578K185429P68387o58155n83604P36582J537602R28827k75490j046510
40264E345646j249324j229780j295490j616136j895971j416240j36183P95640
40256b697838N34258j57177j97226P1676j18240r4520J179878K714579K412880
40247C648270L30948j171263q01435J92538L28050l20425j147631j850950j606270
40238b398168N34869L523220M556505K575970k28307j496530j471709j471178
40230D124672j503085j035617m91165k06024O50029K317347L043882J469297q43338
40221G525998j472673o99811o35272j587319j888891j000916j99363o0261L55815
40212C37307J394561J982299J458243M14174p56669k305240l581653l004729n10744
$$ plain form
40203 -4572451 -2889940 -1003204 61847 1033129 2590403 4293615 5715669 7267533
40195 7267533 9052861 9888935 8600699 5906193 3961185 3919024 4689852 4457092 2901519
40186 2901519 1374192 1128370 2131019 3746935 5744384 7920285 9253252 8478438
40178 8478438 5632773 2363403 530680 860250 2721904 4530087 4597065 2620992 383688
40169 383688 -65512 938208 992632 -1077993 -3485106 -3638212 -926367 3338619 7562312
40160 7562312 10478312 11187924 9853543 7758259 5743790 3352149 479807 -1163511
40152 -1163511 190022 3703943 6601762 7319022 6709800 6343077 6918258 8246735 9524822
40143 9524822 9667795 8527208 7599912 8275047 9628597 9461201 7379262 5103387 3649643
$$ packed form
40203d572451J682511J886736J065051R71282J557274J703212J422054J551864
40195G267533J785328Q36074j288236k694506j945008m2161P70828k32760j555573
40186B901519j527327k45822J002649J615916J997449K175901J332967p74814
40178H478438k845665l269370j832723L29570J861654J808183O6978j976073k237304
40169C83688m49200J003720N4424k070625k407113j53106K711845M264986M223693
40160G562312K916000P09612j334381k095284k014469k391641k872342j643318
40152a163511J353533L513921K897819P17260o09222l66723N75181J328477J278087
40143I524822J42973j140587r27296O75135J353550j67396k081939k275875j453744
$$ plain form
40134 3649643 2211713 372143 -645482 -59906 853375 663284 -41225 71964 703004
40125 703004 549374 -395412 -966797 -947936 -1330362 -2393447 -3075859 -2585248 -1305303
40116 -1305303 311732 2446752 4831569 6172506 5716675 4563620 4184738 4138933 2696717
40107 2696717 -268531 -2502584 -2119867 -9226 1456450 1314889 471171 -168013 -543139
40098 -543139 -537195 146278 761182 -267037 -2973796 -5018272 -4503537 -2631955 -2035554
40089 -2035554 -3182564 -4178640 -3773806 -2662379 -1665350 -462202 1258762 2858995 3698021
40080 3698021 3878582 3476750 2237691 639826 -76577 245781 191040 -813327 -1049750
40071 -1049750 926346 3475347 3761186 1960934 1341353 3854687 7600714 9494328
$$ packed form
40134C649643j437930j839570j017625N85576R13281j90091p04509J13189O31040
40125G03004j53630r44786n71385J8861l82426j063085o82412M90611J279945
40116a305303J617035K135020K384817J340937m55831j153055l78882m5805j442216
40107B696717k965248k234053L82717K110641J465676j41561q43718o39184l75126
40098e43139N944O83473O14904j028219k706759k044476N14735J871582N96401
40089b035554j147010r96076M04834J111427R97029J203148J720964J600233Q39026
40080C698021J80561m01832j239059j597865p16403L22358n4741j004367k36423
40071a049750J976096K549001K85839j800252o19581K513334L746027J893614
$$ plain form
40063 9494328 8995768 8041197 8144111 8828029 8762354 7493887 5740153 4379157 3591538
40054 3591538 3131233 3143650 4115227 5817733 6929477 6317086 4394988 2645466 2023455
40045 2023455 2365120 3055811 3571137 3528869 2940089 2397772 2457390 2924261 3223820 3162743
40035 3162743 2754765 1833842 707471 542426 1778432 2681595 1271802 -1443049 -2281024
40026 -2281024 -344448 1608126 1312370 310817 1312713 4013697 5897047 6114845
40018 6114845 6036911 6391779 6385414 5788516 5599246 6113313 6328129 5912438 5883806 6522461
40008 6522461 6499486 5226789 4320328 5206834 6731444 6935858 6108164 6057076 7039479
39999 7039479 7576902 7217930 7396716 9058442 11099866 11951079 11484784 10503373 9244316
$$ packed form
40063I494328m98560r54571J02914O83918o5675j268467j753734j360996p87619
40054C591538m60305J2417R71577J702506J111744o12391j922098j749522o22011
40045B023455L41665O90691N15326m2268n88780n42317N9618M66871K99559o1077
40035C162743m07978r20923j126371j65045J236006R03163j409793k714851q37975
40026b281024J936576J952574k95756j001553J001896K700984J883350K17798
40018F114845p7934L54868o365n96898j89270N14067K14816m15691k8632O38655
40008F522461k2975j272697r06461Q86506J524610K04414q27694n1088R82403
39999G039479N37423l58972J78786J661726K041424Q51213m66295r81411j259057
$$ plain form
39990 9244316 7384213 5130057 3472763 3243565 4146718 4788273 3852947 1522622 -460220
39981 -460220 -481922 1422603 4033392 6364395 7995552 8670225 8646171 8981620 10165568
39972 10165568 10795682 9262674 6747920 6565257 9786511 13294865 13483077 10616612
39964 10616612 8015976 7725259 8635862 8692604 7482835 6246207 6156778 7087908 7849036
39955 7849036 7453884 6131586 5008299 4945823 6004008 7771534 9567749 10488923 10113803
39946 10113803 9148000 8521753 7985801 6691802 5023878 4425542 5315737 6719071 8150089
39937 8150089 10098163 12270024 13331923 13061687 12727524 12557496 11123768 8298623 6283140
39928 6283140 6204107 6335889 5586272 5873518 8467134 10816169 10376525 9145700 10512803
$$ packed form
39990I244316j860103k254156j657294k29198R03153O41555r35326k330325j982842
39981d60220k1702J904525K610789K331003J631157O74673k4054L35449J183948
39972A0165568O30114j533008k514754j82663L221254L508354J88212k866465
39964A0616612k600636k90717R10603N6742j209769j236628q9429R31130P61128
39955G849036l95152j322298j123287o2476J058185J767526J796215R21174l75120
39946A0113803r65803o26247n35952j293999j667924n98336Q90195J403334J431018
39937H150089J948074K171861J061899k70236l34163j70028j433728k825145k015483
39928F283140p9033J31782p49617K87246K593616K349035m39644j230825J367103
$$ plain form
39919 10512803 13629594 15210972 15296159 16452952 18329923 18157181 16381648 16659970 19918294
39910 19918294 23337936 25795013 29352186 34550134 39308658 43635159 50260220 59201291
39902 59201291 66940663 72533425 79158120 88390605 99289050 114412877 138838731 171575651
39894 171575651 208723673 258619485 337673824 437561385 509036203 500528588 413180181
39887 413180181 301327271 216861814 168343353 136630218 109946909 90193833 77940626
39880 77940626 68715422 61224632 57258471 54520013 48496981 40369787 35177489 32982592
39872 32982592 29221722 23329998 19769347 20104777 20746049 19612475 18961432 19979353
39864 19979353 19985417 17183121 13794222 12323545 12284042 12356224 12511656 12532155 11566666 10407804
$$ packed form
39919A0512803L116791J581378Q5187J156793J876971j72742j775533K78322L258324
39910A9918294L419642K457077L557173N197948M758524M326501O625061Q941071
39902E9201291P739372N592762O624695R232485J0898445J5123827K4425854L2736920
39894A71575651L7148022M9895812P9054339R9887561P1474818q507615q7348407
39887D13180181j11852910q4465457m8518461l1713135k6683309j9753076j2253207
39880G7940626r225204p490790l966161k738458o023032q127194n192298k194897
39872C2982592l760870n891724l560651L35430O41272j133574o51043J017921
39864A9979353O064k802296l388899j470677l9503P2182J55432K0499r65489j158862
$$ plain form
39854 10407804 11124224 13479732 15034014 15559836 17472254 20879953 22707777 22427065
39846 22427065 23899800 29065468 34607278 38064949 42308187 49801250 57465476 62817906
39838 62817906 70677005 86892773 109461650 134525560 167664516 216274903 268610087
39831 268610087 293598493 270640052 213078115 154020075 113692266 88917563 69959025
39824 69959025 55134290 46737557 42739363 38954785 34802161 31765736 28877808 24072931
39816 24072931 18411425 15157978 15254304 16525956 16970000 16476270 15578862 14607861 14023956
39807 14023956 13871682 12974624 10212230 6500012 4031192 3607592 4134168 4702075 5621610
39798 5621610 7132573 8516192 9060394 8917959 8516960 7876717 6889913 5712940 4672258
$$ packed form
39854A0407804P16420K355508J554282N25822J912418L407699J827824k80712
39846B2427065J472735N165668N541810L457671M243238P493063P664226N352430
39838F2817906P859099J6215768K2568877K5063910L3138956M8610387N2335184
39831B68610087K4988406k2958441n7561937n9058040m0327809k4774703j8958538
39824F9959025j4824735q396733l998194l784578m152624l036425k887928m804877
39816B4072931n661506l253447R6326J271652M44044m93730q97408r71001n83905
39807A4023956j52274q97058k762394l712218k468820m23600N26576N67907R19535
39798E621610J510963J383619N44202j42435m00999o40243r86804j176973j040682
$$ plain form
39789 4672258 4205576 4733692 5972837 6696866 6087447 5083872 5369780 7204471 9372361
39780 9372361 11072025 12458316 13296112 12670901 10535117 8253598 7048640 6940764 7530585
39771 7530585 8534855 9114523 8122510 5773367 3798077 3193339 3128451 2862101 3149956
39762 3149956 4492900 5496501 4730302 3175392 2928277 4098639 4846762 4158029 2795072
39753 2795072 1632046 799918 580415 1437722 2777743 3203610 2562992 2367284 3452869
39744 3452869 4486700 3844574 2101783 1442368 2925331 5407345 7246224 8199550 9098590
39735 9098590 10004982 9526747 6514772 2105478 -877566 -901926 688167 1688875 1890864
39726 1890864 2879325 5372965 7975929 8724227 7052255 4151210 2105676 2583239 5392946
$$ packed form
39789D672258m66682N28116J239145P24029o09419j003575K85908J834691K167890
39780I372361J699664J386291Q37796o25211k135784k281519j204958j07876N89821
39771G530585J004270N79668r92013k349143j975290o04738o4888k66350K87855
39762C149956J342944J003601p66199j554910k47115J170362P48123o88733j362957
39753B795072j163026q32128k19503Q57307J340021M25867o40618j95708J085585
39744C452869J033831o42126j742791o59415J482963K482014J838879R53326Q99040
39735I098590R06392m78235l011975m409294k983044k4360J590093J000708K01989
39726A890864R88461K493640K602964P48298j671972k901045k045534M77563K809707
$$ plain form
39717 5392946 8200758 8647206 7042594 6064417 7459022 10028646 11401082 10764219 9000944
39708 9000944 7027263 5278050 4422103 5141639 6935205 8222385 8189934 7789427 8246885
39699 8246885 9156009 8984498 7339251 5731097 5701007 6905471 7691745 7113352 5619283
39690 5619283 3992807 2486900 1079022 -200021 -1419141 -2613032 -3362661 -3190925
39682 -3190925 -2446691 -1868921 -1101831 1065736 4328080 6098337 4428594 819536 -1344904
39673 -1344904 -659400 1401619 2981221 3576595 3371861 2588623 1921951 2163624 2792448
39664 2792448 2205038 73520 -1652521 -1005841 1577859 4011414 5066258 5177448 5186317
39655 5186317 5276507 5114759 4362809 2988218 1451911 542974 743609 1818241 3128347
$$ packed form
39717E392946K807812M46448j604612r78177J394605K569624J372436o36863j763275
39708I000944j973681j749213q55947P19536J793566J287180l2451m00507M57458
39699H246885R09124j71511j645247j608154l0090J204464P86274n78393j494069
39690E619283j626476j505907j407878j279043j219120j193891p49629J71736
39682c190925P44234N77770P67090K167567L262344J770257j669743l609058k164440
39673a344904O85504K061019J579602N95374k04734p83238o66672K41673O28824
39664B792448n87410k131518j726041O46680K583700K433555J054844J11190Q869
39655E186317R0190j61748p51950j374591j536307r08937K00635J074632J310106
$$ plain form
39646 3128347 4110423 4395942 3943753 3279998 3079347 3147786 2379581 300225 -1810888
39637 -1810888 -2149369 -600411 1082429 1453488 1003893 1196025 2422540 3656699 3996020
39628 3996020 3714279 3409990 2800750 1208953 -979451 -2321179 -2019565 -831966 92700
39619 92700 512612 698242 522823 -209214 -1042396 -1358859 -1239231 -1043872 -549014 586361
39609 586361 1875423 2575930 2927149 3688329 4652748 4864208 4217367 3502702 2862130
39600 2862130 1731860 544278 744803 2388724 3321039 1868000 -912756 -2887762
39592 -2887762 -3634604 -4105992 -4354591 -3389132 -1154389 919183 1658270 1323174 706883
39583 706883 66019 -467924 -185845 1559912 4136694 5837780 5659921 4441356 3708626
$$ packed form
39646C128347R82076K85519m52189o63755k00651O8439p68205k079356k111113
39637a810888l38481J548958J682840L71059m49595J92132J226515J234159L39321
39628C996020k81741l04289o09240j591797k188404j341728L01614J187599R24666
39619I2700M19912J85630j75419p32037q33182l16463J19628J95359M94858J135375
39609E86361J289062P00507L51219P61180R64419K11460o46841p14665o40572
39600B862130j130270j187582K00525J643921R32315j453039k780756j975006
39592b887762p46842m71388k48599R65459K234743K073572P39087l35096o16291
39583G06883o40864n33943K82079J745757K576782J701086j77859j218565p32730
$$ plain form
39574 3708626 3685377 3330808 2417501 2315150 3874271 5616387 5479801 3772794 2700129
39565 2700129 3109466 3483765 2402061 274183 -1862745 -3551129 -4155035 -2631601 704556
39556 704556 3520550 3894988 2430165 869230 -214763 -1052365 -1192612 -114691 1349316
39547 1349316 1824083 1246833 619358 432001 639202 1539678 3095214 3877901 2469305
39538 2469305 -273964 -2043805 -2099265 -1748361 -1764493 -1233337 462690 2215272 2725664
39529 2725664 2280478 1971721 1933203 1351565 -94703 -1561604 -1893110 -969120 -81473
39520 -81473 -598515 -2125926 -2761134 -1728134 -774333 -1828931 -4159292 -5432620 -4968487
39511 -4968487 -4021368 -3181495 -1782040 -62395 557119 201853 1178189 4404628 7213425
$$ packed form
39574C708626k3249l54569r13307j02351J559121J742116j36586j707007j072665
39565B700129M09337L74299j081704k127878k136928j688384o03906J523434L336157
39556G04556K815994L74438j464823j560935j083993q37602j40247J077921J464007
39547A349316M74767n77250o27475j87357K07201R00476J555536P82687j408596
39538B469305k743269j769841n5460L50904j6132N31156J696027J752582N10392
39529B725664m45186l08757l8518n81638j446268j466901l31506R23990Q87647
39520h1473n17042j527411o35208J033000R53801j054598k330361j273328M64133
39511d968487R47119Q39873J399455J719645O19514l55266R76336L226439K808797
$$ plain form
39502 7213425 6728370 4030500 2669497 3770021 4974292 4202433 2270249 1137422
39494 1137422 1281676 1893371 2518925 3142855 3109407 1409048 -1599373 -3796672 -3547019
39485 -3547019 -1902319 -1467768 -3009463 -4433466 -3793101 -2099886 -1769303 -3007417 -3577958
39476 -3577958 -2162831 -107285 837874 963303 1667939 3112657 4110484 3934092 3132247
39467 3132247 2570601 2383131 2005084 921787 -699105 -2138209 -2984311 -3571876 -4153995
39458 -4153995 -4120376 -2948732 -1598477 -1658424 -3082812 -4154285 -3904228 -3050136 -2161615
39449 -2161615 -762235 819031 645534 -2074329 -4823380 -4374209 -800326 2897129
39441 2897129 4500451 4031976 2115311 -725058 -2954428 -2513630 611714 3804393
$$ packed form
39502G213425m85055k697870j361003J100524J204271p71859j932184j132827
39494A137422J44254O11695O25554O23930l3448j700359l008421k197299K49653
39485c547019J644700M34551j541695j424003O40365J693215L30583j238114n70541
39476c577958J415127K055546R45159J25429P04636J444718R97827j76392q01845
39467C132247n61646j87470l78047j083297j620892j439104q46102n87565n82119
39458d153995L3619J171644J350255n9947j424388j071473K50057Q54092Q88521
39449b161615J399380J581266j73497k719863k749051M49171L573883L697455
39441B897129J603322m68475j916665k840369k229370M40798L125344L192679
$$ plain form
39433 3804393 4722939 3676346 2358106 1416335 381117 -825164 -1614080 -1798076 -1949258
39424 -1949258 -2495029 -2995214 -2652547 -1465631 -608110 -1285553 -3132511 -4314447 -3671987
39415 -3671987 -2133388 -1144717 -271175 2232150 6498989 10273027 11630322 11158714 10507955
39406 10507955 9881084 8290911 5694284 3364800 2070824 1073745 -608170 -2679385
39398 -2679385 -3834285 -3179528 -994812 1713098 4049394 5628941 6402764 6359373 5581955
39389 5581955 4543071 3982613 4198601 4591457 4215857 2774423 832232 -926421 -2347185
39380 -2347185 -3601308 -4587547 -4808192 -3866549 -2008115 -131248 824387 659206 116431
39371 116431 151607 952062 1879378 2433110 2858796 3437574 3579995 2437133 455792
$$ packed form
39433C804393R18546j046593j318240r41771j035218j206281p88916j83996j51182
39424a949258n45771n00185L42667J186916Q57521o77443j846958j181936O42460
39415c671987J538599R88671Q73542K503325M266839L774038J357295m71608o50759
39406A0507955o26871j590173k596627k329484j293976r97079j681915k071215
39398b679385j154900O54757K184716K707910K336296J579547P73823m3391p77418
39389E581955j038884n60458K15988L92856l75600j441434j942191j758653j420764
39380b347185j254123r86239k20645R41643J858434J876867R55635j65181n42775
39371A16431L5176Q00455R27316N53732M25686N78778J42421j142862j981341
$$ plain form
39362 455792 -557231 570639 2931599 4716416 5347098 5628449 6090547 6171482 5116534
39353 5116534 2877659 -17395 -2760907 -4358215 -4327704 -3556546 -3519098 -4271277 -4283899
39344 -4283899 -2879727 -1606743 -2009962 -3050469 -2452699 -166187 1490670 1375723 1227578
39335 1227578 2789711 4818145 4699409 2312153 324364 499843 1472110 1089076 -336174
39326 -336174 -620016 961933 2619786 2662084 1767297 1726888 2856574 3922511 4271694
39317 4271694 4694475 5961392 7571398 8470075 8315612 7499677 6384290 5034537 3467544
39308 3467544 1809169 314242 -685325 -1078654 -1183555 -1304891 -1201297 -486448 614985
39299 614985 1598292 2551995 3717529 4288332 3001139 256765 -1696900 -1331204 622086
$$ packed form
39362D55792j013023J127870K360960J784817O30682K81351M62098Q0935j054948
39353E116534k238875k895054k743512j597308L0511P71158L7448p52179j2622
39344d283899J404172J272984m03219j040507N97770K286512J656857j14947j48145
39335A227578J562133K028434j18736k387256j987789J75479R72267l83034j425250
39326c36174k83842J581949J657853M2298q94787m0409J129686J065937L49183
39317D271694M22781J266917J610006Q98677j54463q15935j115387j349753j566993
39308C467544j658375j494927r99567l93329j04901j21336J03594P14849J101433
39299F14985R83307R53703J165534N70803j287193k744374j953665L65696J953290
$$ plain form
39290 622086 2828282 5089303 7369249 8542635 7754111 6082494 5151781 4729245 3391777
39281 3391777 1096892 -678564 -1128332 -728262 227777 1952102 3955658 5268488 6112549
39272 6112549 7606423 9379814 9305147 6455722 2806852 989180 1585063 3588829 6239330
39263 6239330 9060044 10970070 10864660 8957771 6686576 5368337 5298000 5694459 5207440
39254 5207440 3190490 914406 679493 3088671 5989929 6855466 5507299 3768377
39246 3768377 3161120 3781840 4763933 4955080 3731112 1989893 1662407 3288838 4828455
39237 4828455 4071695 1562430 -328036 -727259 -891700 -1617540 -2029496 -1590147 -1545372
39228 -1545372 -3056850 -4972828 -4966257 -2515303 562785 2546112 3558813 4451600 4973477
$$ packed form
39290F22086K206196K261021K279946J173386p88524j671617r30713m22536j337468
39281C391777k294885j775456m49768M00070R56039J724325K003556J312830Q44061
39272F112549J493874J773391p4667k849425l648870j817672N95883K003766K650501
39263F239330K820714J910026j05410j906889k271195j318239p0337L96459m87019
39254E207440k016950k276084k34913K409178K901258Q65537j348167j738922
39246C768377o07257O20720R82093J91147j223968j741219l27486J626431J539617
39237D828455p56760k509265j890466l99223j64441p25840m11956M39349M4775
39228a545372j511478j915978O571K450954L078088J983327J012701Q92787N21877
$$ plain form
39219 4973477 4125408 2015127 164344 -421015 -533346 -1279231 -2002912 -1023902 1630318
39210 1630318 3693379 3445238 1850113 995275 1303193 1472102 628065 -770647 -1997630
39201 -1997630 -2760994 -2707944 -1393508 769870 2363027 2372391 1314261 530911 719461
39192 719461 1487222 2020929 1830244 1041756 252093 -41289 -21688 -353399 -1222405 -1852188
39182 -1852188 -1338300 126541 1261628 1091826 92475 -329051 583957 2197324 3382078
39173 3382078 3742949 3661585 3493539 3271851 3035451 2826662 2387013 1501188 694270 863112
39163 863112 2022003 3145226 3541091 3626213 3969883 4420100 4744199 5276155 6120087
39154 6120087 6458456 5639119 4385851 3888376 4148791 4320578 4240648 4301741 4058911 2526676
$$ packed form
39219D973477q48069k110281j850783n85359j12331p45885p23681R79010K654220
39210A630318K063061k48141j595125q54838L07918J68909q44037j398712j226983
39201a997630p63364N3050J314436K163378J593157R364j058130p83350J88550
39192G19461P67761N33707j90685p88488p89663k93382J9601l31711q69006o29783
39182a852188N13888J464841J135087j69802r99351m21526R13008J613367J184754
39173C382078L60871q1364j68046k21688k36400k08789m39649q85825q06918J68842
39163H63112J158891J123223L95865Q5122L43670M50217L24099N31956Q43932
39154F120087L38369q19337j253268m97475K60415J71787p9930O1093k42830j532235
$$ plain form
39144 2526676 70008 -1466298 -1065257 240358 1116774 1767993 3087884 4841960 5863957
39135 5863957 5697170 5017837 4524369 4274223 4215708 4625953 5631236 6652095 6733837
39126 6733837 5461063 3437038 1814610 1324365 1705997 2010161 1408577 -148300 -1809413
39117 -1809413 -2408823 -1577415 -303346 173127 140915 1224903 3896540 6173181 5907054
39108 5907054 3663287 1873566 1522259 1438024 941616 1147934 2711206 3993125 3048727
39099 3048727 487921 -1232184 -942468 231557 848814 780962 613599 508580 262526
39090 262526 11547 404950 2072607 4813844 7200651 7468675 5407989 3102802 3048279
39081 3048279 5521498 8381945 9414344 8250055 6047183 4104805 3033403 2561867
$$ packed form
39144B526676k456668j536306M01041J305615Q76416O51219J319891J754076J021997
39135E863957j66787o79333m93468k50146n8515M10245J005283J020859Q1742
39126F733837j272774k024025j622428m90245L81632L04164o01584j556877j661113
39117a809413n99410Q31408J274069M76473l2212J083988K671637K276641k66127
39108E907054k243767j789721l51307q4235m96408K06318J563272J281919r44398
39099C048727k560806j720105K89716J174025O17257o7852j67363j05019k46054
39090B62526k50979L93403J667657K741237K386807K68024k060686k305187n4523
39081C048279K473219K860447J032399j164289k202872j942378j071402m71536
$$ plain form
39073 2561867 1696104 -468786 -3626140 -6211215 -6857083 -5743262 -4220915 -3245606 -2493034
39064 -2493034 -1080446 995429 2411681 1880932 20567 -766760 1109363 4388556
39056 4388556 6427686 6455649 6107758 6586784 6884464 5767379 4164079 3929460 4909308
39047 4909308 5087623 3632468 2026020 1706446 2211684 2568039 3113674 4541108 6011118
39038 6011118 5864442 4000450 2087495 1215594 586047 -930768 -2858317 -3547216 -2220160
39029 -2220160 44878 1450118 1378982 1016321 1945774 4234244 6397540 7380762 7753556
39020 7753556 8345311 8593114 7458387 5464768 4338289 4724307 5734089 6769733 8062883
39011 8062883 9027562 8023281 4797991 1550081 254255 270335 -52342 -809264 -1277562
$$ packed form
39073B561867q65763k164890l157354k585075o45868J113821J522347R75309P52572
39064b493034J412588K075875J416252n30749j860365p87327J876123L279193
39056D388556K039130K7963l47891M79026K97680j117085j603300k34619R79848
39047D909308J78315j455155j606448l19574N05238L56355N45635J427434J470010
39038F011118j46676j863992j912955q71901o29547j516815j927549o88899J327056
39029b220160K265038J405240p1136l62661R29453K288470K163296R83222L72794
39020G753556N91755K47803j134727j993619j126479L86018J009782J035644J293150
39011H062883R64679j004281l225290l247910j295826J6080l22677p56922m68298
$$ plain form
39002 -1277562 -1880843 -3214050 -4019888 -2640007 -77791 983387 215682 -19230 1166183
38993 1166183 1560864 -372180 -2743182 -3226028 -2757687 -3852162 -6533021 -8412068 -8100052
38984 -8100052 -6194707 -3298945 437857 3629846 3997862 1443134 -979019 -414538
38976 -414538 2584398 5251478 5949455 5090384 3539345 1684298 24281 -642963 -75544
38967 -75544 1045512 1884251 2082585 1509253 38196 -2050173 -3918919 -4851985 -4811149
38958 -4811149 -4094245 -2922317 -1738855 -1288701 -1642377 -1619110 -217265 1613794 1882653
38949 1882653 338585 -1002552 -554321 998655 2313516 3388736 4672856 5452124
38941 5452124 4907891 3959624 4076757 4734357 4217255 2818166 2794876 4660610 5957694
$$ packed form
39002a277562o03281j333207q05838J379881K562216J061178p67705k34912J185413
38993A166183L94681j933044k371002m82846M68341j094475k680859j879047L12016
38984h100052J905345K895762L736802L191989L68016k554728k422153N64481
38976d14538K998936K667080O97977q59071j551039j855047j660017o67244N67419
38967g5544J121056Q38739J98334n73332j471057k088369j868746r33066M0836
38958d811149P16904J171928J183462M50154l53676K3267J401845J831059K68859
38949A882653j544068j341137M48231J552976J314861J075220J284120P79268
38941E452124n44233r48267J17133O57600n17102j399089k3290J865734J297084
$$ plain form
38932 5957694 4886268 3055290 2990282 4509939 5442133 4851061 3692373 2938190 2770652
38923 2770652 3229619 4124136 4550438 3812603 2558450 1838062 1471185 607421 -609052
38914 -609052 -1391238 -1852951 -2551983 -2857827 -1668457 347982 1268956 879581 1013818
38905 1013818 2429991 3542988 3234006 2792969 3606204 4778524 4917668 4777893 5918927
38896 5918927 7721179 8088210 6665598 5081324 4130418 3090899 2116782 2788354 5202650
38887 5202650 6708572 5288809 2678043 2084257 3727457 4830216 3720729 1675746
38879 1675746 309315 -701258 -2111459 -3013035 -2062733 -69076 470990 -1536476 -4481042
38870 -4481042 -5993419 -5052032 -2042756 1869963 4874682 5414892 4066322 3524093 5435622
$$ packed form
38932E957694j071426j830978o5008J519657R32194n91072j158688p54183j67538
38923B770652M58967Q94517M26302p37835j254153p20388l66877q63764j216473
38914f09052p82186m61713o99032l05844J189370K016439R20974l89375J34237
38905A013818J416173J112997l08982m41037Q13235J172320J39144j39775J141034
38896E918927J802252L67031j422612j584274r50906j039519r74117O71572K414296
38887E202650J505922j419763k610766n93786J643200J102759j109487k044983
38879A675746j366431j010573j410201r01576R50302J993657N40066k007466k944566
38870d481042j512377R41387L009276L912719L004719N40210j348570n42229J911529
$$ plain form
38861 5435622 7998542 8208902 5966351 4063984 4099693 4508029 3433752 1607939 824447
38852 824447 951629 458556 -788492 -1408000 -1120188 -1337237 -2547656 -3063946 -1601836
38843 -1601836 392451 638581 -673759 -1296720 -288655 862449 682063 -370116 -1084600
38834 -1084600 -1315353 -1676936 -2293913 -2813440 -3132845 -3262100 -2837497 -1583495 -76023
38825 -76023 633717 133105 -992024 -1754977 -1480055 -273598 915493 1105144 392823
38816 392823 -255348 -435926 -614015 -745192 49799 1671753 2410246 1447156 579335
38807 579335 1652544 3547462 4004445 3410283 3889270 5137893 4549144 1837927 67645
38798 67645 860667 1840738 755905 -763705 -145389 1728960 2091279 771822 36247
$$ packed form
38861E435622K562920K10360k242551j902367L5709M08336j074277j825813p83492
38852H24447J27182m93073j247048o19508K87812k17049j210419n16290J462110
38843a601836J994287K46130j312340o22961J008065J151104j80386j052179p14484
38834a084600k30753l61583o16977n19527l19405j29255M24603J254002J507472
38825g6023P09740n00612j125129p62953K74922J206457J189091J89651p12321
38816C92823o48171j80578j78089j31177P94991J621954P38493r63090q67821
38807E79335J073209J894918M56983n94162M78987J248623n88749k711217j770282
38798F7645P93022R80071j084833j519610O18316J874349L62319j319457p35575
$$ plain form
38789 36247 679444 1119967 216241 -1370336 -2636461 -3147105 -2579846 -1058893 301562
38780 301562 776466 1415288 3256238 4859628 3909757 919130 -1094775 -613285 1023161
38771 1023161 2260148 2842608 2506592 907829 -500750 708551 4087467 5845176
38763 5845176 3779696 422744 -581391 691483 1384061 224840 -1322926 -1549527
38755 -1549527 -123323 2470374 5430314 7526011 7672732 5867958 3123459 662028
38747 662028 -646216 -705544 -343888 -333973 -217320 795964 1795815 837936 -1825471 -3166446
38737 -3166446 -1184558 2444131 4885539 5650381 5916530 5895442 4987073 3577926 2604825
38728 2604825 1911326 842734 -86562 126919 1143737 1825683 2056528 2252168 1675068
$$ packed form
38789C6247O43197M40523r03726j586577j266125n10644N67259J520953J360455
38780C01562M74904O38822J840950J603390r49871k990627k013905M81490J636446
38771A023161J236987N82460l36016j598763j408579J209301L378916J757709
38763E845176k065480l356952j004135J272874O92578j159221j547766k26601
38755a549527J426204K593697K959940K095697J46721j804774k744499k461431
38747F62028j308244n9328L61656R915J16653J013284R99851r57879k663407j340975
38737c166446J981888L628689K441408P64842K66149k1088r08369j409147r73101
38728B604825o93499j068592r29296K13481J016818O81946K30845J95640n77100
$$ plain form
38719 1675068 -617784 -3363206 -3824958 -1205517 2464283 5055366 6228887 6404707
38711 6404707 5760987 4876484 4709565 5108202 4617131 2525696 53999 -1131275 -652369
38702 -652369 775363 2249290 2893814 2202449 827381 245743 1063706 2273549 2574839
38693 2574839 1781368 632601 -57133 264190 1682881 3556336 4950380 5532854 5592017
38684 5592017 5277199 4509582 3516970 2634886 1712967 630622 173765 1213941 3112963
38675 3112963 4285621 4417851 4701205 5650184 6220629 5571035 4231196 2906381 1554976
38666 1554976 395895 382549 1675686 2911574 3088405 3057654 3979523 5321397 5668690
38657 5668690 4700254 3094035 1181960 -1022291 -3040655 -4430069 -5581423 -6833905
$$ packed form
38719A675068k292852k745422m61752K619441L669800K591083J173521J75820
38711F404707o43720q84503j66919L98637m91071k091435k471697j185274M78906
38702f52369J427732J473927O44524o91365j375068n81638Q17963J209843L01290
38693B574839p93471j148767o89734L21323J418691J873455J394044N82474N9163
38684E592017l14818p67617r92612q82084r21919j082345m56857J040176J899022
38675C112963J172658J32230K83354R48979N70445o49594j339839j324815j351405
38666A554976j159081j3346J293137J235888J76831l0751R21869J341874L47293
38657E668690r68436j606219j912075k204251k018364j389414j151354j252482
$$ plain form
38649 -6833905 -7292450 -5820103 -2873733 -120099 1483983 2040082 1556947 -38318 -1838640
38640 -1838640 -2455501 -1818037 -1156871 -958428 -326289 1172150 2422001 2329249 1371755
38631 1371755 679034 453712 285668 331646 1107377 2506652 3962547 5247645 6209646
38622 6209646 6077050 4184533 1378704 -382895 -76478 1574172 3431559 5074849
38614 5074849 6318475 6754549 6426629 5964642 5290489 3274180 -217415 -3028815 -3162858
38605 -3162858 -1827502 -1971602 -3932443 -4829525 -2813130 312485 1847550 1651480 1281252
38596 1281252 1268638 1190516 1348279 2264487 3080038 2464008 868139 10168 246007 376918
38586 376918 172725 1048790 3572442 5998966 6300416 4544323 2389453 1036246 401427
$$ packed form
38649f833905m58545J472347K946370K753634J604082N56099m83135j595265j800322
38640a838640o16861O37464O61166J98443O32139J498439J249851r2752r57494
38631A371755o92721k25322j68044M5978P75731J399275J455895J285098R62001
38622F209646j32596j892517k805829j761599L06417J650650J857387J643290
38614E074849J243626M36074l27920m61987o74153k016309l491595k811400j34043
38605c162858J335356j44100j960841q97082K016395L125615J535065j96070l70228
38596A281252j2614p8122J57763R16208Q15551o16030j595869q57971K35839J30911
38586C76918k04193Q76065K523652K426524L01450j756093k154870j353207o34819
$$ plain form
38577 401427 -257457 -1415283 -2603078 -2587345 -781769 1663880 2981097 2793047 2054801
38568 2054801 1287817 171919 -1226446 -2291592 -3060113 -4208801 -5694216 -6749620
38560 -6749620 -7243066 -7477725 -6690283 -3747249 366595 2923297 2994967 2517259 2961338
38551 2961338 3174199 1815136 -142609 -963433 -479620 686916 2531693 4631712 5384793
38542 5384793 4175088 2825382 2994617 3617723 3008247 2016950 2636227 4601547 5966998
38533 5966998 6251519 6447409 6522741 5565110 4122303 3850789 4849438 5611118 5555447 5368499
38523 5368499 4941150 3411223 1412948 864260 2070475 3197361 3059059 2377396 1930680
38514 1930680 1642512 1950007 3706564 5919634 5899070 2901015 -251065 -514599 1821920
$$ packed form
38577D01427o58884j157826j187795J5733J805576K445649J317217j88050p38246
38568B054801p66984j115898j398365j065146p68521j148688j485415j055404
38560f749620m93446k34659P87442K943034M113844K556702P1670m77708M44079
38551B961338K12861j359063j957745q20824M83813J166536J844777K100019P53081
38542E384793j209705j349706J69235O23106o09476r91297O19277J965320J365451
38533E966998K84521J95890P5332r57631j442807k71514R98649P61680n5671j86948
38523E368499m27349j529927j998275n48688J206215J126886j38302o81663m46716
38514A930680k88168L07495J756557K213070k0564k998055l152080k63534K336519
$$ plain form
38505 1821920 4018399 4034312 1906815 -762551 -1886496 -640653 1232014 1100902 -1086735
38496 -1086735 -2444344 -759657 3055025 6642181 8622515 8657315 6900421 4433071
38488 4433071 2805306 2257315 1694996 902143 1014658 2202322 2945789 2533411 2183271
38479 2183271 2613258 2703238 1868793 1450613 2118931 2203628 564248 -1084110 -942974
38470 -942974 -147593 -535833 -1356015 -959064 4068 121028 392269 2507165 5144764
38461 5144764 5563889 4092861 3383986 3702307 2821912 545265 -690983 -201887 -61531
38452 -61531 -790862 -79551 2564515 3793888 1509880 -1315962 -870783 2031361 3891134
38443 3891134 3906874 3934598 4342535 3590840 1796751 1486403 4064395 7788847 10080493
$$ packed form
38505A821920K196479J5913k127497k669366j123945J245843J872667j31112k187637
38496a086735j357609J684687L814682L587156J980334L4800j756894k467350
38488D433071j627765n47991n62319p92853J12515J187664P43467m12378l50140
38479B183271M29987Q9980q34445m18180O68318Q4697j639380j648358J41136
38470i42974P95381l88240q20182L96951R63132J16960K71241K114896K637599
38461E144764M19125j471028p08875L18321q80395k276647j236248M89096J40356
38452f1531p29331P11311K644066J229373k284008k825842M45179K902144J859773
38443C891134J5740K7724M07937p51695j794089l10348K577992L724452K291646
$$ plain form
38434 10080493 10244623 9234426 8036156 7014783 5988948 4413292 2047403 -348387
38426 -348387 -1556983 -1255695 -317163 216566 -66064 -1066399 -2457997 -3781867 -4672320
38417 -4672320 -4963368 -4366670 -2474396 418012 2930894 3753893 2950588 1546055 213268
38408 213268 -902369 -1517847 -1459447 -1430920 -2396802 -4041585 -4867155 -4153835 -2919722
38399 -2919722 -2480838 -2847686 -3088448 -2584378 -1284688 682960 2882679 4489518 5182976
38390 5182976 5810350 7175393 8296725 7131672 3484286 81060 -207058 2401920
38382 2401920 5131065 5967432 5272392 4251495 3306711 2415146 1871222 1680456 1050358
38373 1050358 -444091 -1757073 -1578978 -317128 327265 -313133 -1161331 -1189783 -766407
$$ packed form
38434A0080493J64130j010197j198270j021373j025835j575656k365889k395790
38426c48387j208596L01288R38532N33729k82630j000335j391598j323870q90453
38417d672320k91048N96698J892274K892408K512882Q22999q03305j404533j332787
38408B13268j115637o15478N8400K8527r65882j644783q25570P13320J234113
38399b919722M38884l66848k40762N04070J299690J967648K199719J606839O93458
38390E182976O27374J365043J121332j165053l647386l403226k88118K608978
38382B401920K729145Q36367o95040j020897r44784q91565n43924j90766o30098
38373A050358j494449j312982J78095J261850O44393o40398q48198k8452M23376
$$ plain form
38364 -766407 -692320 -787332 -158804 1549159 3695114 5204319 5395819 4589738 3992414
38355 3992414 4529860 5725415 6282601 5833619 5381897 5806021 6710810 7139849 6685527
38346 6685527 5405886 3355128 859899 -1257526 -2394754 -2741770 -2618268 -1713126 342208
38337 342208 2979173 4984962 5679631 5312654 4471862 3570701 2758470 1936747 1041169
38328 1041169 560660 1314156 3216395 4742120 4390825 2492708 817643 423613 587382
38319 587382 5858 -1514511 -2871232 -2883540 -1421295 655926 2513526 4001010 5110060
38310 5110060 5248801 3900165 1937781 1168639 2125259 3363991 3688097 3991066 5655174
38301 5655174 7888589 8327529 6262304 3787954 3286059 4774033 6288650 6197371 4591724
$$ packed form
38364g66407P4087r5012O28528J707963K145955J509205J91500q06081n97324
38355C992414N37446J195555N57186m48982m51722M24124R04789M29039m54322
38346F685527j279641k050758k495229k117425j137228l47016J23502R05142K055334
38337C42208K636965K005789O94669l66977q40792r01161q12231q21723q95578
38328A041169m80509P53496J902239J525725l51295j898117j675065l94030J63769
38319E87382n81524j520369j356721j2308J462245K077221J857600J487484J109050
38310E110060J38741j348636j962384p69142R56620J238732L24106L02969J664108
38301E655174K233415M38940k065225k474350n01895J487974J514617r1279j605647
$$ plain form
38292 4591724 2809274 2059067 2454457 3216917 3668489 3688566 3237562 2239175 1324866
38283 1324866 1693986 3341437 4371138 3397395 1851588 2154370 4039805 4815764 3409232
38274 3409232 1926807 2409548 4028785 4766811 4278180 3535272 2790867 1557289 -38744
38265 -38744 -1336251 -2167771 -2625572 -2257728 -691351 1295867 2462113 2580768 2237525
38256 2237525 1586788 488677 -477427 -483783 175389 473258 387254 910198 2159915 2835004
38246 2835004 2072130 781842 495831 1583324 3083041 3745753 2941717 1080621 -636552
38237 -636552 -1311285 -1148454 -656752 525348 2913086 5517139 6400524 5194110 3672801
38228 3672801 3316364 3632413 3566206 3178095 2898282 2334790 1127256 122242 362771
$$ packed form
38292D591724j782450p50207L95390P62460M51572K0077m51004r98387r14309
38283A324866L69120J647451J029701r73743j545807L02782J885435P75959j406532
38274C409232j482425M82741J619237P38026m88631p42908p44405j233578j596033
38265c8744j297507q31520m57801L67844J566377J987218J166246J18655l43243
38256B237525o50737j098111r66104o356O59172K97869q6004N22944J249717O75089
38246B835004p62874j290288k86011J087493J499717O62712q04036j861096j717173
38237f36552o74733J62831M91702J182100K387738K604053Q83385j206414j521309
38228C672801l56437L16049o6207l88111k79813n63492j207534j005014K40529
$$ plain form
38219 362771 1482290 2303670 2520013 2597859 2509598 1886825 1147150 1124096 1600807 1393705
38209 1393705 -1999 -1812805 -3067316 -3405445 -2888428 -1952546 -1512702 -2141994 -3123816
38200 -3123816 -3220829 -2346262 -1537618 -1382849 -1560083 -1874889 -2509282 -3133320 -3041828 -2413137
38190 -2413137 -2178789 -2349823 -1779113 21354 2164705 3909345 5357766 5997353 4339010
38181 4339010 329871 -3306642 -3822443 -1696520 362382 951697 953050 1448192 2290345
38172 2290345 2799348 2710432 2319404 2373030 3537275 5325284 6156761 5298024 3946534
38163 3946534 3385830 3134223 2411279 2283584 4092607 6394107 6178761 3279484 905590
38154 905590 1137568 2491758 3108314 3738677 5549850 7037214 5849822 2719781 928047
$$ packed form
38219C62771J119519Q21380K16343P7846q8261o22773p39675k3054M76711k07102
38209A393705j395704j810806j254511l38129N17017R35882M39844o29292r81822
38200c123816r7013Q74567Q08644J54769j77234l14806o34393o24038R1492O28691
38190b413137K34348j71034N70710J800467K143351J744640J448421O39587j658343
38181D339010m009139l636513n15801K125923K058902N89315J353M95142Q42153
38172B290345N09003q8916l91028N3626J164245J788009Q31477q58737j351490
38163C946534n60704k51607p22944j27695J809023K301500k15346k899277k373894
38154I05590K31978J354190O16556O30363J811173J487364j187392l130041j791734
$$ plain form
38145 928047 1968272 3901368 4278387 2895446 1128498 23200 -171448 402694 1241162
38136 1241162 1624664 1314068 802940 644659 930376 1570818 2520520 3405229 3449799 2295230
38126 2295230 668951 -194762 216418 1283897 2072552 2396474 3008644 4694048 7121174
38117 7121174 8710668 7948821 5004075 1866317 573676 1224895 1969451 1124573 -950361
38108 -950361 -2465536 -2495810 -1939343 -1963102 -2316488 -1959398 -856105 -103223 -357723 -1135083
38098 -1135083 -1816565 -2384920 -2778434 -2394116 -872576 1195392 2954055 4270737 5521560
38089 5521560 6745825 7516912 7405696 6189491 3884335 947399 -1787850 -3683220
38081 -3683220 -4626372 -4746469 -4255205 -3638713 -3312383 -2844595 -1360472 807925 1799025
$$ packed form
38145I28047J040225J933096L77019j382941j766948j105298j94648N74142Q38468
38136A241162L83502l10596n11128j58281K85717O40442R49702Q84709M4570j154569
38126B295230j626279q63713M11180J067479P88655L23922O12170J685404K427126
38117G121174J589494p61847k944746l137758j292641O51219P44556q44878k074934
38108i50361j515175l0274N56467k3759l53386L57090J103293P52882k54500p77360
38098a135083o81482n68355l93514L84318J521540K067968J758663J316682J250823
38089E521560J224265P71087j11216j216205k305156k936936k735249j895370
38081c683220r43152j20097M91264O16492L26330M67788J484123K168397R91100
$$ plain form
38072 1799025 435017 -1881429 -2529213 -665344 2001693 3237260 2287229 35259
38064 35259 -2001454 -2779865 -2448708 -2035843 -2121222 -2135890 -1461830 -757571 -1342631 -3432128
38054 -3432128 -5764791 -6943244 -6545089 -5116364 -3784755 -3666662 -4794551 -5698153 -4895674
38045 -4895674 -2793882 -1273670 -1393917 -2422445 -3195823 -3348049 -2856293 -1493401 489537
38036 489537 1914039 1892881 1208375 1594142 3556369 5526593 5483372 3119767 70091
38027 70091 -1894648 -2431813 -2230416 -1681761 -752211 84770 3677 -718624 -558794 1123230
38017 1123230 2754424 2486301 852950 245724 2009387 5190692 7992699 9337138
38009 9337138 9028069 7503945 5674231 4258760 3218136 2363423 2119752 2797179 3552762
$$ packed form
38072A799025j364008k316446o47784J863869K667037J235567r50031k251970
38064C5259k036713p78411L31157M12865q5379j4668O74060P04259n85060k089497
38054c432128k332663j178453L98155J428725J331609J18093j127889r03602Q02479
38045d895674K101792J520212j20247j028528p73378j52226M91756J362892J982938
38036D89537J424502k1158o84506L85767J962227J970224m3221k363605l049676
38027G0091j964739n37165K01397N48655R29550Q36981q1093p22301J59830J682024
38017A123230J631194k68123j633351o07226J763663L181305K802007J344439
38009I337138l09069j524124j829714j415471j040624q54713k43671O77427P55583
$$ plain form
38000 3552762 3253834 2079139 1047428 323578 -546385 -1089634 -506465 206085 -1054556
37991 -1054556 -4060516 -5589677 -3357385 967932 3890164 3941636 2280616 673012
37983 673012 185783 980179 2172491 2498218 1920348 1792968 2808708 3950017 4278997
37974 4278997 4350689 4659741 4130398 1841866 -819792 -1627160 -519955 576686 490563
37965 490563 -274493 -957766 -1179883 -330061 2038228 5107155 7424579 8618772 9216606
37956 9216606 8942996 6821689 3203251 202883 -440740 1100606 3713675 6749347
37948 6749347 9853325 12190533 12625574 10641571 6986037 3439900 1555148 1289838
37940 1289838 1325946 964358 838770 1331987 1619322 1292384 1512178 2976602 4043214
$$ packed form
38000C552762k98928j174695j031711p23850q69963n43249N83169P12550j260641
37991a054556l005960j529161K232292M325317K922232N1472j661020j607604
37983F73012m87229P94396J192312L25727n77870j27380J015740J141309L28980
37974D278997P1692L09052n29343k288532k661658q07368J107205J096641q6123
37965D90563p65056o83273k22117Q49822K368289L068927K317424J194193N97834
37956I216606k73610k121307l618438l000368o43623J541346K613069L035672
37948F749347L103978K337208M35041j984003l655534l546137j884752k65310
37940A289838L6108l61588j25588M93217K87335l26938K19794J464424J066612
$$ plain form
37931 4043214 2955145 922707 512326 1608421 1792886 609841 425035 2508572 5161412
37922 5161412 6740885 7796718 8750931 8056352 4777928 1089591 -116896 1062155
37914 1062155 2217774 2063494 1336810 1006079 1349188 2370842 3651750 4154222 3386609
37905 3386609 2280246 1867745 1852291 1682699 2120092 4112016 6711921 7847437 6953690
37896 6953690 5365634 4244546 3497613 2675227 1647655 378398 -898290 -1388158 -644279
37887 -644279 486700 889730 799979 1220397 2153612 2819211 3259704 4074211 4722114 3952878
37877 3952878 2124813 1225538 2005160 2782276 1933695 90857 -1163851 -1546128 -1821675
37868 -1821675 -2198113 -2212971 -1812072 -1544125 -1774064 -2216231 -2100710 -672791 1991807
$$ packed form
37931D043214j088069k032438m10381J096095J84465j183045j84806K083537K652840
37922E161412J579473J055833R54213o94579l278424l688337j206487J179051
37914A062155J155619j54280p26684l30731L43109J021654J280908N02472p67613
37905C386609j106363m12501j5454j69592M37393J991924K599905J135516q93747
37896F953690j588056j121088p46933q22386j027572j269257j276688m89868P43879
37887f44279J130979M03030q9751M20418R33215O65599M40493Q14507O47903p69236
37877C952878j828065q99275P79622P77116q48581j842838j254708l82277k75547
37868a821675l76438j4858M00899K67947k29939m42167J15521J427919K664598
$$ plain form
37859 1991807 4589171 5731141 5625954 5717268 6450274 6573475 5180395 3200639 1970742
37850 1970742 1404065 693788 -57241 -189538 178393 490750 951260 1991139 2860149
37841 2860149 2290106 586721 -481738 -254892 -195358 -1598706 -3492393 -3883649 -2323689
37832 -2323689 -61510 1943292 3906003 6039342 7624554 7866689 7044773 6077587 5184737
37823 5184737 3718562 1429136 -766591 -1718617 -1363969 -585621 38755 744510 1870310
37814 1870310 3272691 4596939 5572882 5866268 5276802 4397238 4351537 5278247 5697901
37805 5697901 4246253 1679670 215466 960183 2855645 4225591 4529798 4373361 4522338
37796 4522338 5259113 6175423 6329359 5084758 2981105 1266501 485322 216720 295398
$$ packed form
37859A991807K597364J141970j05187R1314P33006J23201j393080j979756j229897
37850A970742n66677p10277p51029j32297L67931L12357M60510J039879Q69010
37841B860149n70043j703385j068459K26846N9534j403348j893687l91256J559960
37832b323689K262179K004802J962711K133339J585212K42135q21916r67186q92850
37823E184737j466175k289426k195727r52026L54648P78348O24376P05755J125800
37814A870310J402381J324248R75943K93386n89466q79564m5701R26710M19654
37805E697901j451648k566583j464204P44717J895462J369946L04207j56437J48977
37796D522338P36775R16310J53936j244601k103653j714604p81179k68602P8678
$$ plain form
37787 295398 1233950 2907024 3880654 3065346 1370409 604038 1089968 1444409 564513
37778 564513 -1111296 -2246505 -1715536 682865 3700921 5133334 3986594 1979473
37770 1979473 1632283 3065776 4256649 4333023 4466890 5042878 4432061 1957567 -188973
37761 -188973 -88322 668103 -493552 -2627349 -2362355 973574 4475794 6136527 7119293
37752 7119293 8683819 9738526 9072429 7710912 7081297 6555650 4876613 2769975 2069363
37743 2069363 3029888 4329590 5088307 5196068 4318956 2466812 1152974 2064082 4598295
37734 4598295 6402891 6414130 5790431 5732647 6014966 6057020 5980653 5985182 5755800 5021663
37724 5021663 3905647 2523226 1110753 562626 1705401 3898690 5515950 5972995
$$ packed form
37787B95398R38552J673074R73630q15308j694937p66371M85930L54441q79896
37778E64513j675809j135209N30969K398401L018056J432413j146740k007121
37770A979473l47190J433493J190873P6374J33867N75988o10817k474494k146540
37761a88973J00651P56425j161655k133797K64994L335929L502220J660733R82766
37752G119293J564526J054707o66097j361517o29615n25647j679037k106638p00612
37743B069363R60525J299702P58717J07761q77112j852144j313838R11108K534213
37734D598295J804596J1239o23699n7784K82319M2054p6367M529k29382p34137
37724E021663j116016j382421j412473n48127J142775K193289J617260M57045
$$ plain form
37716 5972995 6063506 6179215 5725520 4709760 4292275 4972569 5654258 5429810 4933691
37707 4933691 4825647 4266612 2414484 500861 691902 3159918 5680873 6151431 4522679
37698 4522679 2285774 912202 877145 1622206 2342287 2886605 3562057 4121620 3866279
37689 3866279 3000195 2701239 3249657 3422134 2732955 2831064 5026636 7519866 7195326
37680 7195326 3774921 188207 -1150356 -565924 498880 1370004 1774756 1258614 -31015
37671 -31015 -1030199 -1002964 -280471 694440 2031673 3547861 4312142 3767104 2454488
37662 2454488 1052061 -289472 -965121 453145 4284215 8230343 9299467 7047702
37654 7047702 3814675 1970372 2049077 3430781 5468207 7474573 8568373 8237790 6725859
$$ packed form
37716E972995R0511J15709m53695j015760m17485O80294O81689k24448m96119
37707D933691j08044n59035j852128j913623J91041K468016K520955M70558j628752
37698D522679k236905j373572l5057P45061P20081N44318O75452N59563k55341
37689C866279q66084k98956N48418J72477o89179R8109K195572K493230l24540
37680G195326l420405l586714j338563N84432J064804Q71124M04752n16142j289629
37671c1015r99184K7235P22493R74911J337233J516188P64281n45038j312616
37662B454488j402427j341533o75649J418266L831070L946128J069124k251765
37654G047702l233027j844303P8705J381704K037426K006366J093800l30583j511931
$$ plain form
37645 6725859 4600574 2353577 567746 -125986 310876 1096739 1464190 1511965 1903946
37636 1903946 2922696 4145310 4877813 4567190 2993606 601912 -1346811 -1554817 64085
37627 64085 2263418 3816692 4542937 4675386 3905289 1932784 -376742 -1478262 -849107
37618 -849107 744131 2693764 4996037 6921441 6792705 4150131 974765 -512181
37610 -512181 -327960 299550 1309608 3213729 4902790 4544005 2676837 1911402 2942666
37601 2942666 3286675 1167380 -1520622 -1874700 39214 1845921 2323530 2114092 1683182
37592 1683182 714266 -566223 -1252246 -1119886 -790416 -525530 -134397 11476 -686167
37583 -686167 -1615913 -1331818 295146 1628023 1421955 239909 -781965 -1418460 -1948003
$$ packed form
37645F725859k125285k246997j785831o93732M36862P85863L67451M7775L91981
37636A903946J018750J222614P32503l10623j573584k391694j948723k08006J618902
37627F4085K199333J553274P26245J32449p70097j972505k309526j101520O29155
37618h49107J593238J949633K302273J925404j28736k642574l175366j486946
37610e12181J84221O27510J010058J904121J689061l58785j867168p65435J031264
37601B942666L44009k119295k688002l54078J913914J806707M77609k09438m30910
37592A683182r68916j280489o86023J32360L29470K64886L91133J45873o97643
37583f86167r29746K84095J626964J332877k06068j182046j021874o36495n29543
$$ plain form
37574 -1948003 -2273432 -2225386 -2007198 -1681009 -863934 492267 1663273 2037220 1808352
37565 1808352 1293352 283045 -1287236 -2665648 -2989744 -2202751 -749687 1041943 2745125
37556 2745125 3752290 4136297 4822850 6005707 6225213 4349380 1893466 1645454 3907145
37547 3907145 5756139 4699876 1775167 15156 680815 2237351 2810063 2439180 2461360
37538 2461360 3399698 4322810 4323476 3946723 4606939 6827359 9675318 11918054 13007574
37529 13007574 12716547 10720201 7344929 4202857 3028121 3791025 4632276 3858674 1670597
37520 1670597 -112414 164870 2307085 4196310 3842551 1754437 513896 1446770 2740170
37511 2740170 2022799 -117982 -1002062 162981 1291854 685076 -786734 -1542505 -1438701
$$ packed form
37574a948003l25429M8046K18188L26189Q17075J356201J171006L73947k28868
37565A808352n15000j010307j570281j378412l24096P86993J453064J791630J703182
37556B745125J007165L84007O86553J182857K19506j875833k455914k48012K261691
37547C907145J848994j056263k924709j760011O65659J556536N72712l70883K2180
37538B461360R38338R23112O66l76753O60216K220420K847959K242736J089520
37529A3007574k91027j996346l375272l142072j174736P62904Q41251p73602k188077
37520A670597j783011K77284K142215J889225l53759k088114j240541R32874J293400
37511B740170p17371k140781q84080J165043J128873o06778j471810p55771J03804
$$ plain form
37502 -1438701 -903244 337627 2082924 2631284 876391 -1495382 -1935421 -632657 -125810
37493 -125810 -1513297 -3174230 -3541446 -3130526 -3072156 -3347110 -3564972 -4216581 -5899522
37484 -5899522 -8003981 -9170124 -8648721 -6653313 -3982184 -1825791 -1191899 -1804946 -2172600
37475 -2172600 -1364797 -92375 529856 417345 -54205 -1035346 -2388306 -2689338 -682628
37466 -682628 2485595 4040248 2769413 205183 -1549205 -1883566 -1237167 36216 1548756
37457 1548756 2608130 2992263 3382144 4268328 5022229 4866963 4242518 4236310 4927451 5247131
37447 5247131 4413389 2647204 483895 -1683550 -3191559 -3249796 -2093294 -1242719 -1822626
37438 -1822626 -3100167 -3565398 -3091090 -2799931 -2694525 -894818 3723505 9037603 11347471
$$ packed form
37502a438701N35457J240871J745297N48360j754893k371773m40039J302764N06847
37493a25810j387487j660933l67216M10920N8370k74954k17862o51609j682941
37484e899522k104459j166143N21403J995408K671129K156393O33892o13047l67654
37475b172600Q07803J272422O22231j12511m71550r81141j352960l01032K006710
37466f82628L168223J554653j270835k564230j754388l34361O46399J273383J512540
37457A548756J059374L84133L89881Q86184P53901j55266o24445o208O91141L19680
37447E247131q33742j766185k163309k167445j508009n8237J156502Q50575n79907
37438a822626j277541m65231M74308K91159J05406J799707M618323N314098K309868
$$ plain form
37429 11347471 9480600 5902803 3455454 2358911 1294099 210813 412217 2184068
37421 2184068 4032720 4751801 5014123 6114931 7974502 9380935 9798435 9877013 10106934
37412 10106934 9868682 8318874 5778087 3641164 2881514 2981995 2486021 436351 -2811215
37403 -2811215 -5897790 -7258621 -5913356 -2245784 1746722 3668575 2833566 877496
37395 877496 -183400 -49006 339392 714931 1605641 2655284 2419059 493587 -1417504
37386 -1417504 -1602317 -606553 -194174 -655562 -566482 923531 2956329 4363261 4960033
37377 4960033 4881327 3661623 923971 -2491208 -4928611 -5351496 -3953415 -1694606 192149
37368 192149 613726 -538743 -1924222 -2000229 -1004303 -862058 -2630187 -4861744 -5387527
$$ packed form
37429A1347471j866871l577797k447349j096543j064812j083286K01404J771851
37421B184068J848652P19081K62322J100808J859571J406433M17500P8578K29921
37412A0106934k38252j549808k540787k136923p59650J00481m95974k049670l247566
37403b811215l086575j360831J345265L667572L992506J921853q35009j956070
37395H77496j060896J34394L88398L75539Q90710J049643k36225j925472j911091
37386a417504j84813R95764M12379m61388Q9080J490013K032798J406932N96772
37377D960033p8706j219704k737652l415179k437403m22885J398081K258809J886755
37368A92149M21577j152469j385479p6007R95926J42245j768129k231557n25783
$$ plain form
37359 -5387527 -4083174 -2643336 -1945001 -1235891 -177016 99469 -989715 -1894899 -976724
37350 -976724 887255 1663934 1509373 2456282 4764354 6071541 4961662 3063929 2210111
37341 2210111 1547422 -510063 -2959372 -3262723 -1005556 1790662 3671791 4806859
37333 4806859 5094556 3674849 1035942 -472797 571297 2749927 3722447 2909913 1322906
37324 1322906 -141429 -1070919 -1042998 60199 1647801 3066486 4124538 4476615 3455021
37315 3455021 1379080 65520 805397 2464838 2835662 1409374 -435916 -1639113
37307 -1639113 -2470875 -3414776 -4324247 -4894315 -4973773 -4263124 -2654789 -1043911 -838349
37298 -838349 -2293095 -4017213 -4397918 -2969433 -386254 2137084 3236964 2199155
$$ packed form
37359e387527J304353J439838O98335P09110J058875K76485j089184r05184R18175
37350i76724J863979P76679j54561R46909K308072J307187j109879j897733q53818
37341B210111o62689k057485k449309l03351K257167K796218J881129J135068
37333D806859K87697j419707k638907j508739J044094K178630R72520q12534j587007
37324A322906j464335r29490K7921J103197J587602J418685J058052L52077j021594
37315C455021k075941j313560P39877J659441L70824j426288j845290j203197
37307a639113q31762r43901r09471n70068p9458P10649J608335J610878K05562
37298h38349j454746j724118l80705J428485K583179K523338J099880j037809
$$ plain form
37290 2199155 -184777 -2157362 -2728069 -2377283 -1938084 -1548550 -1008731 -368573 388519
37281 388519 1631990 3400700 4787288 4633896 2834681 687530 -60049 1366141 3983338
37272 3983338 5806187 5824584 5077710 5213370 6285348 6901833 6374210 5455972 4796692
37263 4796692 4084648 3289315 3361435 4709841 6068865 5994981 4655715 3103221 1688024
37254 1688024 429532 74396 1196885 2752945 3112437 2233560 1318009 694616 -141643
37245 -141643 -587346 750015 3360341 4644250 3406076 1612132 1329122 1663861 600732
37236 600732 -1415692 -1981578 -251420 2233732 4193342 5995313 7929494 8983468
37228 8983468 8393751 7122488 6577111 6633742 6042218 4285610 1991036 -148017 -1728235
$$ packed form
37290B199155k383932j972585n70707L50786M39199L89534N39819O40158P57092
37281C88519J243471J768710J386588j53392j799215k147151p47579J426190K617197
37272C983338J822849J8397p46874J35660J071978O16485n27623r18238o59280
37263D796692p12044p95333P2120J348406J359024p3884j339266j552494j415197
37254A688024j258492l55136J122489J556060L59492q78877r15551o23393q36259
37245a41643m45703J337361K610326J283909j238174j793944k83010L34739j063129
37236F00732k016424n65886J730158K485152J959610J801971J934181J053974
37228H983468n89717j271263n45377N6631n91524j756608k294574k139053j580218
$$ plain form
37219 -1728235 -2015146 -210568 3180427 6110367 6837704 5642958 4191964 3568178 3560541
37210 3560541 3621018 3651628 3670833 3437122 2880757 2477586 2659184 3048437 2788249 1638326
$$ packed form
37219a728235k86911J804578L390995K929940P27337j194746j450994o23786p637
37210C560541O0477L0610J9205k33711n56365m03171J81598L89253k60188j149923
$$ [...]
##END NTUPLES=NMR SPECTRUM
##END=
