##TITLE=31Pdec_60-2021
 CDCl3, 24 sc
 30.07.2021
##JCAMPDX= 6.0         $$ Bruker NMR JCAMP-DX V2.0
##DATA TYPE= NMR SPECTRUM
##DATA CLASS= NTUPLES
##ORIGIN= UXNMR, Bruker Analytische Messtechnik GmbH
##OWNER= root
$$ XWIN-NMR		Version 3.5
$$ Fri Jul 30 09:40:10 2021 Russian Standard Time (UT+4h)  she@DPX200
##.OBSERVE FREQUENCY= 81.013821
##.OBSERVE NUCLEUS= ^31P
##.ACQUISITION MODE= SIMULTANEOUS
##.ACQUISITION SCHEME= undefined
##.AVERAGES= 24
##.DIGITISER RES= 16
##SPECTROMETER/DATA SYSTEM= spect
##.PULSE SEQUENCE= zgpg30
##.SOLVENT NAME= CDCl3
##.SHIFT REFERENCE= (INTERNAL, CDCl3, 0, 248.564)
##AUDIT TRAIL= $$ (NUMBER, WHEN, WHO, WHERE, WHAT)
$$ ##TITLE= Audit trail, XWIN-NMR		Version 3.5
$$ ##JCAMPDX= 5.01
$$ ##ORIGIN= Bruker BioSpin GmbH
$$ ##OWNER= she
$$ F:/spectra/data/she/nmr/P31/1/pdata/1/auditp.txt
$$ ##AUDIT TRAIL=  $$ (NUMBER, WHEN, WHO, WHERE, WHAT)
(   1,<2021-07-30 09:38:30.29 +0400>,<she>,<DPX200>,
      <created by zg, POWCHK disabled, PULCHK disabled
       configuration hash MD5:
       00 E9 B6 7A A2 85 ED C7 34 08 36 98 17 FE 4E 26
       data hash MD5: 32K
       98 13 A2 A1 36 A3 D9 71 52 A1 83 A4 BB 8D C0 F9>)
(   2,<2021-07-30 09:39:10.65 +0400>,<she>,<DPX200>,
      <Start of raw data processing
       efp BC_mod = 2 LB = 1 FT_mod = 6 PKNL = 1 PHC0 = -7362.268 PHC1 = 57.2744 SI = 64K 
       data hash MD5: 64K
       7D 13 81 B3 F0 35 E3 B4 6D 04 D0 27 EF 62 C0 3B>)
(   3,<2021-07-30 09:39:34.89 +0400>,<she>,<DPX200>,
      <pk PHC0 = -87.24445 PHC1 = 206.7999 
       data hash MD5: 64K
       09 7D D7 05 FB CA C2 8D 82 C8 AC FF 16 B4 C7 EC>)
(   4,<2021-07-30 09:39:38.60 +0400>,<she>,<DPX200>,
      <abs ABSG = 5 
       data hash MD5: 64K
       6C 14 F4 3E 9E F6 E7 17 A5 4E AC F0 50 95 6E 6C>)
$$ ##END=
$$ 
$$ hash MD5
$$ 69 41 A6 5B 50 DC D9 33 61 51 B9 82 60 D6 90 D9
##$RELAX= 
##$RELAX= 
##$RELAX= 
##$RELAX= 
##$RELAX= 
##$RELAX= 
##$RELAX= 
##$RELAX= 
$$ Bruker specific parameters
$$ --------------------------
##$DU= <F:/spectra>
##$EXPNO= 1
##$NAME= <P31>
##$PROCNO= 1
##$TYPE= <nmr>
##$USER= <she>
##$AMP= (0..31)
100 100 100 100 100 100 100 100 100 100 100 100 100 100 100 100 100 100 
100 100 100 100 100 100 100 100 100 100 100 100 100 100 
##$AQSEQ= 0
##$AQ_mod= 1
##$AUNM= <au_zg>
##$AUTOPOS= <>
##$BF1= 81.014009
##$BF2= 200.13
##$BF3= 200.13
##$BF4= 200.13
##$BF5= 200.13
##$BF6= 200.13
##$BF7= 200.13
##$BF8= 200.13
##$BYTORDA= 1
##$CFDGTYP= 0
##$CFRGTYP= 5
##$CHEMSTR= <none>
##$CNST= (0..31)
1 1 145 1 1 1 1 1 1 1 1 1 1 1 1 1 1 1 1 1 1 1 1 1 1 1 1 1 1 1 1 1 
##$CPDPRG= <waltz16>
##$CPDPRG1= <>
##$CPDPRG2= <waltz16>
##$CPDPRG3= <>
##$CPDPRG4= <mlev>
##$CPDPRG5= <mlev>
##$CPDPRG6= <mlev>
##$CPDPRG7= <mlev>
##$CPDPRG8= <mlev>
##$CPDPRGB= <>
##$CPDPRGT= <>
##$D= (0..31)
0 1 0 0 0 0 0 0 0 0 0 0.03 2e-05 3e-06 0 0 0 0 0 0 0 0 0 0 0 0 0 0 0 0 
0 0 
##$DATE= 1627623509
##$DBL= (0..7)
120 120 120 11 120 120 24 19 
##$DBP= (0..7)
150 150 150 150 150 150 150 150 
##$DBP07= 0
##$DBPNAM0= <>
##$DBPNAM1= <>
##$DBPNAM2= <>
$$ [...]
##$SUBNAM3= <"">
##$SUBNAM4= <"">
##$SUBNAM5= <"">
##$SUBNAM6= <"">
##$SUBNAM7= <"">
##$SUBNAM8= <"">
##$SUBNAM9= <"">
##$SW= 501.771253377433
##$SWIBOX= (0..15)
0 1 3 0 0 0 0 0 0 0 0 0 0 0 0 0 
##$SW_h= 40650.406504065
##$TD= 32768
##$TD0= 1
##$TE= 0
##$TE2= 300
##$TE3= 300
##$TEG= 300
##$TL= (0..7)
0 120 53 12 22 120 120 120 
##$TP= (0..7)
150 150 150 150 150 150 150 150 
##$TP07= 0
##$TPNAME0= <>
##$TPNAME1= <>
##$TPNAME2= <>
##$TPNAME3= <>
##$TPNAME4= <>
##$TPNAME5= <>
##$TPNAME6= <>
##$TPNAME7= <>
##$TPOAL= (0..7)
0.5 0.5 0.5 0.5 0.5 0.5 0.5 0.5 
##$TPOFFS= (0..7)
0 0 0 0 0 0 0 0 
##$TUNHIN= 0
##$TUNHOUT= 0
##$TUNXOUT= 0
##$USERA1= <user>
##$USERA2= <user>
##$USERA3= <user>
##$USERA4= <user>
##$USERA5= <user>
##$V9= 5
##$VALIST= <valist>
##$VCLIST= <CCCCCCCCCCCCCCC>
##$VD= 0
##$VDLIST= <DDDDDDDDDDDDDDD>
##$VPLIST= <PPPPPPPPPPPPPPP>
##$VTLIST= <TTTTTTTTTTTTTTT>
##$WBST= 1024
##$WBSW= 4
##$XGAIN= (0..3)
0 0 0 0 
##$XL= 0
##$YL= 0
##$YMAX_a= 2265
##$YMIN_a= -3485
##$ZGOPTNS= <>
##$ZL1= 120
##$ZL2= 120
##$ZL3= 120
##$ZL4= 120
##$ABSF1= 248.5645
##$ABSF2= -253.2056
##$ABSG= 5
##$ABSL= 3
##$ALPHA= 0
##$AQORDER= 0
##$ASSFAC= 0
##$ASSFACI= 0
##$ASSFACX= 0
##$ASSWID= 0
##$AUNMP= <proc_1d>
##$AZFE= 0.1
##$AZFW= 0.5
##$BCFW= 0
##$BC_mod= 2
##$BYTORDP= 0
##$COROFFS= 0
##$CY= -3
##$DATMOD= 1
##$DC= 0
##$DFILT= <>
##$DTYPP= 0
##$F1P= 0
##$F2P= 0
##$FCOR= 1
##$FTSIZE= 65536
##$FT_mod= 6
##$GAMMA= 0
##$GB= 0
##$INTBC= 1
##$INTSCL= 5.30512e-09
##$ISEN= 30
##$LB= 1
##$LEV0= 0
##$LPBIN= 0
##$MAXI= 10000
##$MC2= 0
##$MEAN= 0
##$ME_mod= 0
##$MI= 50
##$NCOEF= 0
##$NC_proc= -7
##$NLEV= 6
##$NOISF1= 182.463
##$NOISF2= 159.3651
##$NSP= 0
##$NTH_PI= 0
##$NZP= 0
##$OFFSET= 248.5645
##$PC= 4
##$PHC0= -7449.513
##$PHC1= 264.0743
##$PH_mod= 1
##$PKNL= yes
##$PPARMOD= 0
##$PSCAL= 0
##$PSIGN= 0
##$REVERSE= no
##$SF= 81.014009
##$SI= 65536
##$SIGF1= 159.3651
##$SIGF2= -187.1042
##$SINO= 113.3802
##$SIOLD= 16384
##$SREGLST= <1H.CDCl3>
##$SSB= 0
##$STSI= 65536
##$STSR= 0
##$SW_p= 40650.406504065
##$SYMM= 0
##$S_DEV= 0
##$TDeff= 32768
##$TDoff= 0
##$TI= <>
##$TILT= no
##$TM1= 0
##$TM2= 0
##$TOPLEV= 0
##$USERP1= <user>
##$USERP2= <user>
##$USERP3= <user>
##$USERP4= <user>
##$USERP5= <user>
##$WDW= 1
##$XDIM= 65536
##$YMAX_p= 366450540
##$YMIN_p= -13545952
$$ End of Bruker specific parameters
$$ ---------------------------------
##NTUPLES= NMR SPECTRUM
##VAR_NAME=  FREQUENCY,     SPECTRUM/REAL,   SPECTRUM/IMAG
##SYMBOL=    X,             R,               I
##VAR_TYPE=  INDEPENDENT,   DEPENDENT,       DEPENDENT
##VAR_FORM=  AFFN,          ASDF,            ASDF
##VAR_DIM=   65536,         65536,           65536
##UNITS=     HZ,            ARBITRARY UNITS, ARBITRARY UNITS
##FACTOR=    0.620285442955139, 1,           1
##FIRST=     20137.2065510759, 0,            0
##LAST=      -20513.1999529892, 0,           0
##MIN=       -20513.1999529892, -13545952,   0
##MAX=       20137.2065510759, 366450540,    0
$$ Real data points
##PAGE= N=1
##DATA TABLE= (X++(R..R)), XYDATA
$$ [...]
39848A245071K067163m30167k420017j510372R76213K165187J064353r40641j941493
39839B75297j273303N5297N67235J23754m0305O11026R50808J28075p88430m20020
39829A89434P10884J067853L55515n58122j115240j040558Q6705J609247J431107
39820B736825j055112l008047j699156J153282J769430J25227m37002Q77560J222917
39811A685924l30650q12160J102217J961839q68038m149092l369925K19100J723132
39802b837653J87542p58660N65143J547318L91995o95642N29601K402822J949989
39793C282455n68818k271071j725802j96592O91098O35266L7897p94775j444348
39784b354690j277681n6590J601548K557616J997315J91249j517720j833107p86247
$$ plain form
39848 1245071 3312234 2882067 462050 -1048322 -72109 2093078 3157431 2216790 275297
39839 275297 -998006 -942709 -375474 -251720 -292025 319001 1269809 1397884 609454 189434
39829 189434 900318 1968171 2323686 1765564 650324 -390234 -303529 1305718 2736825
39820 2736825 1681713 -1326334 -3025490 -1872208 -102778 22449 -414553 463007 1685924
39811 1685924 1355274 543114 1645331 3607170 2739132 -1409960 -4779885 -4560785 -2837653
39802 -2837653 -2650111 -3408771 -2843628 -1296310 -904315 -1599957 -1070356 1332466 3282455
39793 3282455 2713637 442566 -1283236 -1479828 -788730 -153464 -115567 -910342 -2354690
39784 -2354690 -3632371 -3688961 -2087413 470203 2467518 2658767 1141047 -692060 -1478307
39775a478307L50006M69998l61720j270396j464965p47617L91526J124487J091419
39766a895569P39362M90864L9963p84623j058860K8323J367838J075947m59119
39757d55874o82314J287268K964613K013261l03497j092838p535P76428J25353
39748D624865q12196r30077o35052n33476l92620j17495l44811j215888j667762
39739b024512q69808M23400Q53438K89496j48630K82957R36519N58332j023527
39730g22335k225871j278241J295356K650099R96112j782247k349408k95251J587654
39721b124132J394174K92448m5794j1175o31319j328989r73039j2279L77193M88874
39711b574038J401153K506207J870466p26612k982326k914585j099035O06741
$$ plain form
39775 -1478307 -1128301 -658303 -1020023 -2290419 -3755384 -4503001 -4111475 -2986988 -1895569
39766 -1895569 -1156207 -665343 -625380 -1410003 -2468863 -2440540 -1072702 3245 -455874
39757 -455874 -1138188 149080 3113693 5126954 4823457 3730619 3723084 4499512 4624865
39748 4624865 3812669 2882592 2247540 1714064 1321444 1203949 859138 -356750 -2024512
39739 -2024512 -2894320 -2470920 -1617482 -1327986 -1476616 -1193659 -257140 301192 -722335
39730 -722335 -2948206 -4226447 -2931091 -280992 715120 -1067127 -3416535 -3711786 -2124132
39721 -2124132 -729958 -437510 -483304 -494479 -1125798 -2454787 -3427826 -3440105 -3062912 -2574038
39711 -2574038 -1172885 1333322 3203788 2477176 -505150 -3419735 -4518770 -3912029
39703c912029J365032J546187J517484J230260O70303K4470n43869r96087j348895
39694d47144j507261j087335K25312J787646K097277O31544r64821p95190N41467
39685D81495P92883l39248n42509J328757K920569J577794j621230l289212k408457
39676a099158j101210q16068m02277J129833K296517J394995m77517q75367K36284
39667B86032N07090r29421j886160m02602K152324K834338J010704j196749j970436
39658D05120j598602j042516l05727R07568J938272J728604L26007j061877j535020
39649b38171j382864j303065j220927m36508R93748J640414K88202j938897k282940
39640e881008Q6986K409036J687714j112043k269110m38090J846038K230288J505700
$$ plain form
39703 -3912029 -2546997 -1000810 516674 1746934 2417237 2441707 1897838 901751 -447144
39694 -447144 -1954405 -3041740 -2816428 -1028782 1068495 1700039 735218 -59972 481495
39685 481495 1274378 935130 392621 1721378 4641947 6219741 4598511 1309299 -1099158
39676 -1099158 -2200368 -3016436 -3418713 -2288880 7637 1402632 925115 49748 286032
39667 286032 793122 -136299 -2022459 -2425061 -272737 2561601 3572305 2375556 405120
39658 405120 -1193482 -2235998 -2541725 -1634157 304115 2032719 2358726 1296849 -238171
39649 -238171 -1621035 -2924100 -4145027 -4581535 -3587787 -1947373 -1659171 -3598068 -5881008
39640 -5881008 -5794022 -3384986 -1697272 -2809315 -5078425 -5516515 -3670477 -1440189 65511
39631F5511J239773R22110m02200j549578q73781O54715P38758n60588j085966
39622h51246j63465P43737Q71965R71879J133241M92614n24713m24951L93286
39613B642347j03994j608717j186719J570895K776475J02111k982493k241497
39605a031592Q09009J539220n19929j612880j61081J331712R53364j51777p26130
39596D29916j171608j440158n23291R12395P05439q28271o35356J810038K773813
39587B032917J73792k456535j241654J905976K479102L89323p45786N6704L06469
39578B900308p98349j061828K09459O45321q76719k013955q58138J027132J481773
39569F55004R94588Q61670M40055j199814k647807j921849J85425J067896O8418
$$ plain form
39631 65511 1305284 2227394 1825194 275616 -598165 56550 795308 234720 -851246
39622 -851246 -1014711 -270974 600991 1572870 2706111 3198725 2674012 2249061 2642347
39613 2642347 2538353 929636 -257083 1313812 4090287 4192398 1209905 -1031592
39605 -1031592 -222583 1316637 796708 -816172 -977253 354459 1307823 1156046 429916
39596 429916 -741692 -2181850 -2705141 -1792746 -1087307 -1915578 -2550934 -740896 2032917
39587 2032917 2206709 -249826 -1491480 414496 2893598 3282921 2537135 2593839 2900308
39578 2900308 2101959 1040131 1249590 1894911 1018192 -995763 -1853901 -826769 655004
39569 655004 1649592 2511262 2951317 1751503 -896304 -2818153 -2632728 -1564832 -1496414
39560a496414r44710n30786O86678J312787O57682r65275k265705j725284M92562
39551d778465K029703J129257p98406j124327K00919R96322O31892Q06635K114233
39542A207763K493163M63375k150091k589582r69323K49125p5470n96824m0487
39533b008351Q25344O17097l28274l14487J143062K287516J355790q54678j841187
39524H81832p30249O33367M47577o05971q30391k58466k20771p82778n85276O72181
39514a378945J403877M24430j284269j919186j113882r2745j4408o79827q01372
39505e456327M53007K161776K476349J057646l17800l39099m6027p89339j715762
39496b515576j330397l27821k12865q6382J855141M102233L143443n75568k341784
$$ plain form
39560 -1496414 -2441124 -2971910 -2285232 -972445 -314763 -1280038 -3545743 -5271027 -4778465
39551 -4778465 -2748762 -1619505 -2417911 -3542238 -3341319 -2344997 -1713105 -906470 1207763
39542 1207763 3700926 4164301 2014210 -575372 -1544695 -1295570 -1371040 -1967864 -2008351
39533 -2008351 -1183007 -565910 -894184 -1208671 -65609 2221907 3577697 2723019 881832
39524 881832 151583 784950 1232527 626556 -203835 -462301 -683072 -1465850 -2051126 -1378945
39514 -1378945 24932 449362 -834907 -2754093 -3867975 -3960720 -3975128 -4654955 -5456327
39505 -5456327 -5003320 -2841544 -365195 692451 374651 35552 -10475 -799814 -2515576
39496 -2515576 -3845973 -4173794 -4386659 -4473041 -2617900 1484333 4627776 4052208 1710424
39487A710424k68191J667944J68676j991508q53459J869167J611333j438513k736630
39478b60757p55195J009135J4300j652481j151247Q55787J860707J248715M00365
39469A569329K68965M54225K70629j45702J36636J554755K701751J352019k312922
39460E849685m870911l630601k25051J701122J229122K67986K3166J92585R10935
39451A448038K332861K715435L51346k703867k609769K30228J256588j129315
39443A891545k972269j322540R54950J87924j897675j212029J803079K898574
39435C31559O91279j634736j419918K28399J049665P03881J03127l67988p50749
39426a065481p60494q5590R99871J686073J204700k93965j321878m86895J233885
$$ plain form
39487 1710424 1442233 3110177 3278853 1287345 433886 2303053 3914386 2475873 -260757
39478 -260757 -1015952 -6817 7483 -1644998 -2796245 -1940458 -79751 1168964 1569329
39469 1569329 1838294 2292519 2563148 2417446 2554082 4108837 6810588 8162607 5849685
39460 5849685 978774 -2651827 -2876878 -1175756 53366 321352 344518 537103 1448038
39451 1448038 3780899 6496334 6847680 4143813 1534044 1764272 3020860 1891545
39443 1891545 -1080724 -2403264 -1448314 -1260390 -3158065 -4370094 -2567015 331559
39435 331559 1022838 -611898 -2031816 -1803417 -753752 -49871 53256 -314732 -1065481
39426 -1065481 -1825975 -1911565 -911694 774379 1979079 1685114 363236 -123659 1110226
39417A110226J122185j418983l368099k132350N81311J364992K80891K92039K002652
39408a65136K517739K77684k207122k132470m16532K37268m33394m27510R50020
39399a799453K092940J679325L57389n70515p23647l49441L74760J001599O75711
39390B738668p38377j955725j682839m31676J02366n99264j254430p47582M12132
39381d156727J162316J351309J259838O20295o50356j413062m98930J304185J951171
39372I30039Q93031l01839l92692j29477p48492j868889j903045k06051J881594
39363a845821K247232K76442k083510k098624M67165K635116J699131j345828
39355d8697l156679k173130J67336J838838K054682R82667m54980o24602J051482
$$ plain form
39417 1110226 2232411 813428 -2554671 -4687021 -4105710 -2740718 -2459827 -2167788 -165136
39408 -165136 2352603 2630287 423165 -1709305 -2125837 -1888569 -2321963 -2749473 -1799453
39399 -1799453 293487 1972812 2330201 1759686 1036039 686598 1061358 2062957 2738668
39390 2738668 2000291 44566 -1638273 -2069949 -1967583 -2566847 -3821277 -4568859 -4156727
39381 -4156727 -2994411 -1643102 -383264 237031 -413325 -1826387 -2325317 -1021132 930039
39372 930039 1823070 1521231 1128539 999062 250570 -1618319 -3521364 -3727415 -1845821
39363 -1845821 401411 677853 -1405657 -3504281 -3037116 -402000 1297131 -48697
39355 -48697 -3205376 -5378506 -5211170 -3372332 -1317650 -334983 -789963 -1414565 -363083
39346c63083K533009J479940j083411j972320o85569J8754j064295j548187L69767
39337b315395K743961K873165J033626p64905j671137j791090j081748k08127
39329a181650n53932j791554j639123L82176J591123M94832m55282R46860K638854
39320D32304J729008n89003j246952l09842J19330J79786J265176K182020P10734
39311D472561j860305k143715j47139R00409J897o05285j0643P5360q60125j042691
39301a219676J6831N10257k55801q28085o46068o93839o30017R87755L016112
39292B57469K380927n92589j827470M4459J306135o15324k862269k011112N36023
39283c383751J445938P46819O65659J417434J559565R60767M91733N5981o80708
$$ plain form
39346 -363083 2169926 3649866 2566455 594135 -91434 -72680 -1136975 -2685162 -2315395
39337 -2315395 428566 3301731 4335357 3570452 1899315 108225 -973523 -1181650
39329 -1181650 -1735582 -3527136 -5166259 -4784083 -3192960 -2698128 -3153410 -2206550 432304
39320 432304 2161312 1572309 325357 15515 134845 314631 1579807 3761827 4472561
39311 4472561 2612256 468541 321402 1221811 1223708 618423 607780 683140 -176985 -1219676
39301 -1219676 -1202845 -692588 -948389 -1776474 -2422542 -3116381 -3746398 -2758643 257469
39292 257469 2638396 2045807 218337 262796 1568931 953607 -1908662 -3919774 -3383751
39283 -3383751 -1937813 -1190994 -525335 892099 2451664 3412431 3904164 3960145 3279437
39274C279437r87478n45080n43345j327203j003865J300660K983915J584684j053468
39265C688257j420889K92158Q47021q21544k334885j751485M4534J181111R87845
39256G12123k8387j009285j335718j144624j007722q12786M6166J132847J273882
39247b173504Q00007J285698K387291J706216r99246k596406j395025R3906l82918
39238a273981j026869J85836J242741k88303k256726j248303J303589J411687
39230a950329o19940r88243Q51659J691384O56934L72041J556464J677107m005
39221C243072r81041m32825p66759k506824k439478P15796L209817J859101j031798
39212H69061j622159j81080O96242P86450J400081J845315N38324j492299j671472
$$ plain form
39274 3279437 2291959 1746879 1203534 -123669 -1127534 173126 3157041 4741725 3688257
39265 3688257 2267368 2559526 3406547 2585003 250118 -1501367 -1456833 -275722 712123
39256 712123 683736 -325549 -1661267 -2805891 -3813613 -4626399 -4580233 -3447386 -2173504
39247 -2173504 -1373497 -87799 2299492 4005708 3006462 410056 -984969 -891063 -1273981
39238 -1273981 -2300850 -2115014 -872273 -1160576 -3417302 -4665605 -3362016 -1950329
39230 -1950329 -2570269 -3558512 -2706853 -1015469 -358535 13506 1569970 3247077 3243072
39221 3243072 2262031 1829206 1062447 -1444377 -3883855 -3168059 41758 1900859 869061
39212 869061 -753098 -934178 -237936 548514 1948595 3793910 4332234 2839935 1168463
39203A168463N3755J118353J48692j505664k057689j238068R0998R30939Q17018
39194d73203L36257N30977J226824R61520p06969k137244j838373m37841O47927
39185a890125J090364J041429K11484j063848j380302l88174K33025m62370p58369
39176c366886Q16961K438436J501853j112537k228275j041702L50345O93432Q50191
39167a098182J248673R30955k66897j034569q03871n11418m98032J99281J617427
39158b16633K048483O48383r36416r29318L5967J74848p48067j405156r05652
39149b233561L43310J312087J151402r1014j094285n27844Q82083R17995p76908
39140a16735j686779j83667J524285N36563j976261k226425L94903K391877J636557
$$ plain form
39203 1168463 1222218 2340571 2489263 983599 -1074090 -2312158 -2221160 -1290221 -473203
39194 -473203 -136946 394031 1620855 2582375 1875406 -261838 -2100211 -2538052 -1890125
39185 -1890125 -799761 241668 453152 -610696 -1990998 -2379172 -2146147 -2608517 -3366886
39176 -3366886 -2549925 -111489 1390364 277827 -1950448 -2992150 -2641805 -1948373 -1098182
39167 -1098182 150491 1081446 814549 -220020 -1023891 -1535309 -2033341 -1834060 -216633
39158 -216633 1831850 2480233 1543817 614499 650466 825314 77247 -1327909 -2233561
39149 -2233561 -1890251 -578164 573238 482224 -612061 -1139905 -257822 660173 -116735
39140 -116735 -1803514 -1987181 -462896 73667 -1902594 -4129019 -3734116 -1342239 294318
39131B94318L26511P92153J502520O9580k128410j971401N4256N93317p41271
39122a208427o15747J944344L063651Q8430l503745k938563O44697K208858P08408
39113C91906O2646K064679L231037O61590k924442l114543k28400J614098N65371
39104B323942j155930j331326o26046o48574j266756j101086M15907K459689L685346
39095B755166L084467O17373k317153l531714k057856N41502J652038O13397n49732
39086H07488J3629J234117O01405j901972l280005j634786J071233J874085Q96434
39077c18372M38822J033984J078030J17476l13931L70214O19014n19102j676531
39068H29604j406452k86548M33032N91016L88588l41277r63090n6478K005245
$$ plain form
39131 294318 620829 1412982 2915502 2985082 856672 -1114729 -1060473 -467156 -1208427
39122 -1208427 -1824174 120170 3183821 3272251 -231494 -3170057 -2525360 -316502 391906
39113 391906 454552 2519231 5750268 6411858 3487416 372873 144473 1758571 2323942
39104 2323942 1168012 -163314 -789360 -1437934 -2704690 -3805776 -3389869 -930180 2755166
39095 2755166 5839633 6457006 4139853 608139 -1449717 -908215 743823 1357220 807488
39086 807488 821117 2055234 2656639 754667 -2525338 -4160124 -3088891 -1214806 -318372
39077 -318372 120450 1154434 2232464 2349940 2036009 2406223 3025237 2506135 829604
39068 829604 -576848 -863396 -430364 160652 549240 207963 -755127 -811605 1193640
39059A193640K537514L44388k016761j889653m25540k28037r24295l24715J228210
39050e05249J283256l41762j102031R2867J354421J053452j73711j305831k188795
39041a833383k155924p8266L055276M061956J574116j824464k911506j563565
39033a675760J83297J110199J231587N85530o52721j601639j557399r23659m11982
39024c712547j2335N42273J053949J200152R09213J77320o31739n12590P88040
39015a98264J538946K60810j234547l5563K629362K311700j429321l303943l96244
39006A42936K558750K99570m247155m063190J253315N100401L710227L00842j360148
38997C695548j772130k185010j471948N74460J095846j247585k977509q11969
$$ plain form
39059 1193640 3731154 4075542 2058781 169128 -256412 -484449 -1408744 -1733459 -505249
39050 -505249 778007 436245 -665786 -572919 781502 1834954 1661243 355412 -1833383
39041 -1833383 -3989307 -4067573 -1012297 3049659 4623775 2799311 -112195 -1675760
39033 -1675760 -1492463 -382264 849323 1434853 782132 -819507 -2376906 -3300565 -3712547
39024 -3712547 -3724882 -3182609 -2128660 -928508 -19295 158025 -473714 -986304 -198264
39015 -198264 1340682 1601492 366945 331382 2960744 5272444 3843123 539180 142936
39006 142936 2701686 3001256 -1245899 -5309089 -4055774 1044627 4754854 5055696 3695548
38997 3695548 1923418 -261592 -1733540 -1159080 -63234 -1310819 -4288328 -5100297
38989e100297K751466K919369k28579k269907j177065N89416P17889J11125M95991
38980a190592J726273K528695K101202L51845j878053k636997p45711J889333
38972B145995J874806j178246l764323l007282k14986J394953R65170K67423N96718
38963i19772J221958Q88740m56396j811768k296255j814419q33599J79664R86355
38954d855492J379641J215922Q63237J065784J813793J877546L04112j972334
38946A692209k952115j817017M59690K391069K910741J566354q57386k282557
38938A110988j461280J41677L43522k94671N46895K524543K393172p36181l149653
38929A419012j724754J353165J973606J06635j033291n02961m22847j509527j668432
$$ plain form
38989 -5100297 -2348831 570538 341959 -1927948 -3105013 -2515597 -1797708 -1686583 -1190592
38980 -1190592 535681 3064376 5165578 5517423 3639370 1002373 256662 2145995
38972 2145995 4020801 2842555 -921768 -3929050 -4144036 -2749083 -1783913 -1516490 -919772
38963 -919772 302186 1190926 734530 -1077238 -3373493 -5187912 -6021511 -5841847 -4855492
38954 -4855492 -3475851 -2259929 -1396692 -330908 1482885 3360431 3664543 1692209
38946 1692209 -1259906 -3076923 -2617233 -226164 2684577 4250931 3393545 1110988
38938 1110988 -350292 -208615 134907 -159764 387131 2911674 5304846 4568665 1419012
38929 1419012 -305742 1047423 3021029 3127664 2094373 1591412 1168565 -340962 -2009394
38920b009394Q6368J518789N12070j784329k738095j524219O82364K409119K647827
38911a99500J224592n25232o70642P97291J688855P78580l63215j5848Q49808
38902C564689K56493j471762k276699j580199p36259m79318k9583J034522J867416
38893A49300J806288J207817L90551p51797j572182q03577J169120J797329l60056
38884C032793l101698l235081r91537M92841k1383k50575J461568K911158J279219
38875A577305j927289k313850J104297M141545L124952k57534j803094n58702
38867C087630Q95961Q04907j18299j128819k422129l092857j171965K809471M916006
38858D579906K661089j209314k340757o91099J90828j004033j738406k47382J562457
$$ plain form
38920 -2009394 -1923026 -404237 107833 -1676496 -4414591 -5938810 -5256446 -2847327 -199500
38911 -199500 1025092 499860 -170782 626509 2315364 3093944 2730729 2714881 3564689
38902 3564689 3821182 2349420 72721 -1507478 -2243737 -2723055 -2752638 -1718116 149300
38893 149300 1955588 3163405 3553956 2802159 1229977 426400 1595520 3392849 3032793
38884 3032793 -68905 -3303986 -4295523 -3802682 -3824065 -4074640 -2613072 298086 1577305
38875 1577305 -349984 -2663834 -1559537 2582008 5706960 5449426 3646332 3087630
38867 3087630 3983591 4788498 4670199 3541380 1119251 -1973606 -3145571 -336100 4579906
38858 4579906 7240995 6031681 3690924 2999825 3190653 2186620 448214 200832 1763289
38849A763289J359471l1065m20113J31571p3448j125175j419322o21594l11356
38840g47742j174544j669808n54088R69920J127023L48640L27235R88948N78682
38831A94266j146313j998408n83291J336951J260447m56473j296420l00886R34239
38822b055888J032099O09687O22843P01992L11741J80064J001936J632534M31364
38813D468372j887393k678831j021697P84683L60682j439399j811638R6996K231853
38804h96372K554620J352094R3516o47936j114204j228480r13588r47502j943835
38795c691687k703523j344708J633198L203417J590324j299622k363921r86683
38787e963205J018617K004664J557596l3145j685114j667811M05586K372824K101443
$$ plain form
38849 1763289 3122760 3091695 2671582 2803153 2729705 1604530 185208 -436386 -747742
38840 -747742 -1922286 -3592094 -4146182 -3176262 -2049239 -1700599 -1373364 -384416 194266
38831 194266 -952047 -2950455 -3533746 -2196795 -936348 -1392821 -2689241 -2990127 -2055888
38822 -2055888 -1023789 -414102 208741 910733 1222474 1402538 2404474 4037008 4468372
38813 4468372 2580979 -97852 -1119549 -334866 25816 -1413583 -3225221 -3128225 -896372
38804 -896372 1658248 3010342 3103858 2455922 1341718 113238 -800350 -1747852 -3691687
38795 -3691687 -6395210 -7739918 -6106720 -2903303 -1312979 -2612601 -4976522 -5963205
38787 -5963205 -4944588 -2939924 -1382328 -1415473 -3100587 -4768398 -4362812 -1989988 111455
38778A11455N28366j067L62941m26949k099247j862155Q60870K829035J677483
38769A980732o81622j360717o42307l75781l95258N33028J651718J175197m41654
38760A443336j062067l43083M3796m15920l84776M81321N81516p76219j737185
38751b169281n58939J564249J969207J48595j566252j030557R91495J768563M3794
38742A160874k286385k534984o57857R21283P47469p4629j04398M71128J005294
38733a352205J674891K266575J491539p51556k138218j053428O06329K43722j261940
38724b74291j168275M19034R16961j03965l94131N66022M01763j739268l024349
38715d400499j134916J995103K865915J030631j049007j500005n36843P14235
$$ plain form
38778 111455 639821 638754 1001695 574746 -1524501 -3386656 -2525786 303249 1980732
38769 1980732 1299110 -61607 -703914 -1079695 -1474953 -941925 709793 1884990 1443336
38760 1443336 381269 38186 81982 -333938 -718714 -237393 344123 -432096 -2169281
38751 -2169281 -2728220 -1163971 805236 953831 -612421 -1642978 -651483 1117080 1160874
38742 1160874 -1125511 -3660495 -4318352 -3397069 -2649600 -2724229 -2828627 -2357499 -1352205
38733 -1352205 322686 2589261 4080800 3329244 1191026 137598 743927 987649 -274291
38724 -274291 -1442566 -1023532 -106571 -210536 -604667 -38645 363118 -1376150 -4400499
38715 -4400499 -5535415 -3540312 -674397 356234 -692773 -2192778 -2729621 -2015386
38707b015386J350884J057707K60290m00705r34549j551735j539883j05048J651026
38698b227399J579437k38125j174006J45536J820286J640138J21759q76358q81499
38689i0231n41103l2216O12436O61574l12459j394455j489824p55659K0306N27967
38679b793664O81431L79012J51029P16177J376636N91402j238855j745505l31414
38670b213751N51269o04075j667649m11021J544679J139507j330960k710806j376970
38661g079777J306364L199835L019852O65411k177238k838233r00670P45100l7793
38652d097149j377091n75309J522161K400778K172496K334134J922897p28438
38644C574479l454157k332348J788897L630856J028495k307009k662052p61812
$$ plain form
38707 -2015386 -664502 393205 653495 252790 -681759 -2233494 -3773377 -3878425 -2227399
38698 -2227399 -647962 -886087 -2060093 -1914557 -94271 1545867 1667626 791268 -90231
38689 -90231 -631334 -663550 -51114 610460 298001 -1096454 -2586278 -3341937 -3321631 -2793664
38679 -2793664 -2112233 -1733221 -1582192 -866015 510621 1102023 -136832 -1882337 -2213751
38670 -2213751 -1662482 -2266557 -3934206 -4345227 -2800548 -1661041 -2992001 -5702807 -7079777
38661 -7079777 -5773413 -2573578 446274 1111685 -1065553 -3903786 -4804456 -4059356 -4097149
38652 -4097149 -5474240 -6049549 -4527388 -2126610 45886 2380020 4302917 3574479
38644 3574479 120322 -2212026 -423129 3207727 4236222 1929213 -732839 -1494651
38636a494651J084564K252201K381711M24806k701714l768896j762265K39634
38628c344610j39065r85023K21216K319781K801133J899904J281941P74398m57233
38619D372442j286877l84874Q74707M24130q17054m70139J053034J117891p81784
38610D101476k337414k022371o82104M90676J157043R89246j50071j165476q30148
38601d49143K81267Q43958J124836J954661K102762k90827l825578m674159j866202
38592d798425J309876K079822J397395J102387P77802n39158j786306j398250
38584a854857J6136O61342K77299L2697M08560Q10331P76545K48935q18034j943916
38574a384962j893364k29557J528658J662166O61204M35399J422170K014950R63356
$$ plain form
38636 -1494651 -410087 1842114 4223825 4648631 1946917 -1821979 -3584244 -3344610
38628 -3344610 -3483675 -4468698 -4247482 -1927701 873432 2773336 4055277 4829675 4372442
38619 4372442 3085565 2700691 3575398 3999528 3182474 2712335 3765369 4883260 4101476
38610 4101476 1764062 -258309 -940413 -449737 707306 1696552 1546481 381005 -449143
38601 -449143 -167876 676082 1800918 3755579 5858341 5567514 1741936 -2932223 -4798425
38592 -4798425 -3488549 -1408727 -11332 1091055 1868857 1329699 -456607 -1854857
38584 -1854857 -1838721 -1177379 -900080 -867383 -458823 351508 1128053 1376988 558954 -1384962
38574 -1384962 -3278326 -3507883 -1979225 -317059 344145 779544 2201714 4216664 5180020
38565E180020r90404k238374k108514j166061l91188l30842o15570k97620Q80232
38556b078321J797485J281028r9323o09648K11459R07525L77523m08514O924J137735
38546B523873J184130j36831j003724k16248R23449N62070q92657j485561p76955
38537F81546l19900q70577j091982K697J097190O87418k30521K56000J538356
38528A750227J204690q86754j959788m94529J402755J168096o95129j947909j833464
38519b291805j065996N0570J359936J691213K33584j515360j411398J29182Q67111
38510a952963L44894J18556L89507n39627k664532l190126o53739K437512L109139
38501b601379J905459J148465J159155Q36732M33770P82439Q27713r02751k975765
$$ plain form
38565 5180020 4189616 1951242 -157272 -1323333 -1714521 -2045363 -2660933 -2958553 -2078321
38556 -2078321 -280836 1000192 900869 291221 502680 1410205 1787728 1379214 1386138 2523873
38546 2523873 3708003 3571172 2567448 2351200 3274649 3836719 2944062 1458501 681546
38537 681546 361646 -508931 -1600913 -1598216 -501026 186392 -44129 211871 1750227
38528 1750227 2954917 2068163 108375 -386154 1016601 2184697 1489568 -458341 -2291805
38519 -2291805 -3357801 -3307231 -1947295 -256082 -22498 -1537858 -2949256 -2820074 -1952963
38510 -1952963 -1608069 -1489513 -1100006 -1639633 -4304165 -7494291 -8148030 -5710518 -2601379
38501 -2601379 -695920 452545 1611700 2448432 2882202 3664641 4492354 3589603 613838
38492F13838k529426K8477J238047n1345j060565O2381J263657M40153q18813
38483h13596r4643J596122J581715Q0486l65702O52158P68305j128936k992229
38474g16320k579696l53767J513379J717746P13558l6564O48318K327790K931757
38465F166201J084776j750551k725025j129191Q98370J231521p9813j626964k168169
38456i8845j123907R61497K162139R25957j542272k322914p00796Q41808L73651
38447e23682p94738n90420N19833P14382j8217j80838M56269O29760m0577m92326
38437c20554k00635Q5559o7015j00869J30836j03891p55413m48079J256996K433383
38427A910318J248672j051073j570454J08552J349231M36561r80834o88390O29853
$$ plain form
38492 613838 -1915588 -1887111 -649064 -700409 -1760974 -1698593 -434936 5217 -813596
38483 -813596 -908239 687883 2269598 2350084 1984382 2636540 3404845 2275909 -716320
38474 -716320 -3296016 -3649783 -2136404 -418658 294900 258336 906654 3234444 6166201
38465 6166201 7250977 5500426 2775401 1646210 2544580 3776101 3696288 2069324 -98845
38456 -98845 -1222752 -261255 1900884 2826841 1284569 -1038345 -1739141 -897333 -523682
38447 -523682 -1318420 -1908840 -1389007 -674625 -692842 -873680 -417411 212349 171772 -320554
38437 -320554 -521189 -435630 -502645 -603514 -472678 -576569 -1331982 -1780061 -523065 1910318
38427 1910318 3158990 2107917 537463 646015 1995246 2431807 1450973 762583 1392436
38418A392436P68867k61216m57617M71158M67620j106253j839554n9131K087905
38409A464215J682861n32789j499709n11397M11296K85075K23867O55039M70388
38400B648846m61468o90423O7455J65796j003522j830280j413175j043178j374339
38391d934288q69274J083205K222772R41835p36003m03003Q17089O71015o6575
38382a273227N58159J495397N27960r77378J56734K852949K526770j489063m255256
38373A23045k636983J88789K39932j235022o95980J649861K653186J382950j70432
38364A499346p12448p65066n48117L88498J369854Q99679q94481k085931j584848
38355b433514l23523M59996N93477L11627l25076q43555l57814J229261K729261
$$ plain form
38418 1392436 2161303 1900087 1442470 1913628 2381248 1274995 -564559 -623690 1464215
38409 1464215 3147076 2614287 1114578 603181 1014477 1299552 1523419 2178458 2648846
38400 2648846 2187378 1496955 1564410 1730206 726684 -1103596 -2516771 -3559949 -4934288
38391 -4934288 -5803562 -4720357 -2497585 -1555750 -2291753 -2694756 -1877667 -1206652 -1273227
38382 -1273227 -715068 780329 1308289 330911 487645 3340594 5867364 4378301 123045
38373 123045 -2513938 -2325149 -2085217 -3320239 -4016219 -2366358 286828 1669778 1499346
38364 1499346 786898 21832 -526285 -137787 1232067 2131746 1237265 -848666 -2433514
38355 -2433514 -2757037 -2297041 -1703564 -1391937 -1717013 -2560568 -2918382 -1689121 1040140
38346A040140K753100R25373j805609l543832k706292R5736K003830J079537r81310
38337a139327j037665R32581J800018J71518j352983k53050J893851J834648l73433
38328B476158j633954o24959N23807r0311j285722r78996N30606J214468L54500
38319D85597p31505p41702J26111P85712M82112o43694j622278j410918p3542
38310c344107J087089J060120K91302k62515m92393o48289l34689O94545J466243
38301d82694J100625N19060R05448J136568o16664k973235k378916J209429L218497
38292A638118Q19696k873448l539443j660325m60857k36866J094878L118063L027906
38283I27722M62720j729475j895835j220900n65607P41022K214643J911536m5455
$$ plain form
38346 1040140 3793240 4718613 2913004 -630828 -3337120 -3241384 -1237554 -158017 -1139327
38337 -1139327 -2176992 -1244411 555607 727125 -625858 -878908 1014943 2849591 2476158
38328 2476158 842204 217245 741052 650741 -634981 -1613977 -1083371 131097 485597
38319 485597 -245908 -987610 -861499 -75787 406325 -237369 -1859647 -3270565 -3344107
38310 -3344107 -2257018 -1196898 -905596 -1168111 -1660504 -2308793 -2643482 -1948937 -482694
38301 -482694 617931 1136991 2042439 3179007 2562343 -410892 -2789808 -1580379 1638118
38292 1638118 2457814 -415634 -3955077 -5615402 -6076259 -6313125 -5218247 -2100184 927722
38283 927722 1390442 -339033 -2234868 -3455768 -4021375 -3280353 -1065710 845826 800371
38274H00371j033772k75101q5850j284740j256930J113663K526303N19098j908880
38265h85838r89933J448065J106506j395097j647832R48518K271575M92739j228347
38256A20356m17992R84709O47861l49787k34291K28248r4539j01102J096471J567104
38246C447038m28223k787597k354306N7343R93475j51821p03190M58129J383136
38237h6016R12750M94603R76689Q26323p41609j736729o68934O18466l6822j339083
38227g80362p70698R65678J151457k11119n44188O11629Q72654m28970q03397
38218F2684Q50416J915641N10859j050248k44773J091205l6682k190473j612034
38209g03405J206151J932856n62889k393566j006782J099597J035972m4891Q7137
$$ plain form
38274 800371 -233401 -508502 -594352 -1879092 -3136022 -2022359 503944 1023042 -885838
38265 -885838 -1875771 -427706 678800 -716297 -2364129 -1415611 855964 1348703 120356
38256 120356 -297636 687073 1334934 985147 750856 979104 884565 783463 1879934 3447038
38246 3447038 3018815 231218 -2123088 -2065745 -1072270 -1224091 -1927281 -1469152 -86016
38237 -86016 826734 1321337 2298026 3124349 2382740 646011 -22923 595543 558721 -780362
38227 -780362 -1551060 -585382 566075 354956 -189232 422397 1295051 866081 62684
38218 62684 913100 2828741 3339600 2289352 2044579 3135784 3099102 908629 -703405
38209 -703405 502746 2435602 1872713 -520853 -1527635 -428038 607934 563043 650180
38200F50180O36247o6193q35983L29328K210947J991447j32922j423326j046401
38191B313324o95755j086666j177144r20151j451623k165175j015856J434366
38183d764680J772814r56860l025233j315695K025599L028301J645329P36304
38175h54121R12917J86223j722696k433100q68639R08303R99556L52688O67351
38166a851518J552682J487982L23419q09480j226195r40406O2096J458828K132171
38157B189579J394093J36500m78802p83424j553374j946091n72449J645864K081638
38148B113534K15375j507905j393149o73242p49578p31423L16934R38741k09629
38139a680342j199526M77030L118577K587024j153468l258504q84697K749582
$$ plain form
38200 650180 1286427 1220234 384251 713579 2924526 4915973 4783051 3359725 2313324
38191 2313324 1617569 530903 -646241 -1566392 -3018015 -5183190 -6199046 -4764680
38183 -4764680 -2991866 -3948726 -6973959 -8289654 -6264055 -3235754 -1590425 -854121
38175 -854121 58796 245019 -1477677 -3910777 -4779416 -3871113 -2871557 -2518869 -1851518
38166 -1851518 -298836 1189146 1512565 703085 -523110 -1463516 -1401420 57408 2189579
38157 2189579 3583672 3720172 3241370 2457946 904572 -1041519 -1613968 31896 2113534
38148 2113534 2328909 821004 -572145 -1245387 -1994965 -2726388 -2409454 -1470713 -1680342
38139 -1680342 -2879868 -2402838 715739 3302763 2149295 -1109209 -1993906 755676
38131G55676L193086O82218j416640j848809j954855k073506q14862J869967L517845
38122A910120K128607j051068k741329j245523J633096K465680J88644k247620
38114A040607j356662J989678L204298J99383l458119l429458n44048R26284l51714
38105a779751j463416j93707J937252K469648J292387j89402j293778k006825
38097a227592j993882j079431O0611P36048J113038J445414J249032K40353n68729
38088b5138N5729J596454K040951M09932j762402k089210j89784J793175J740469
38079C570176J9196j283658j220156q98737j348747j849953j335333l74567l13242
38070e035021r57851o95410J009009K583651K319740N37550p89725k88823J245719
$$ plain form
38131 755676 3948762 4630980 3214340 1365531 -589324 -2662830 -3477692 -1607725 1910120
38122 1910120 4038727 2987659 246330 -999193 633903 3099583 3288227 1040607
38114 1040607 -316055 1673623 4877921 5077304 1619185 -1810273 -2354321 -1428037 -1779751
38105 -1779751 -3243167 -3436874 -1499622 970026 2262413 2073011 779233 -1227592
38097 -1227592 -3221474 -4300905 -4240294 -3504246 -2391208 -945794 303238 543591 -25138
38088 -25138 30591 1627045 3667996 4077928 2315526 226316 36532 1829707 3570176
38079 3570176 3589372 2305714 1085558 186821 -1161926 -3011879 -4347212 -4721779 -5035021
38070 -5035021 -5992872 -6688282 -5679273 -3095622 -775882 -238332 -1028057 -1316880 -71161
38061g1161J648516m1112k058988j878073K91982J479094J04954j613920r62192
38052c100900J169336J793358M36458n41289J6253O29821L08261K86425J339056
38043B336779J737596j39648k719259k967260n62355J646554J383396m20719j268449
38034i73365l47767P82107N31301o44595j131300n71575j51148l64708p9239J262546
38024a687743K062729Q81645q43815o42856J034110J290789o80303k190796j095365
38015a871605J036899J299578n63175k194712j793638J53159J892642K149544
38007A08692J027681k55396o58200m21325m82434r52807r87039j58000R11696
37998a867132J354791P59943p41834k239048k316059p18463P57660M65735n84259
$$ plain form
38061 -71161 1577355 1536243 -522745 -2400818 -2108836 -629742 -524788 -2138708 -3100900
38052 -3100900 -1931564 -138206 298252 -243037 -226784 403037 711298 997723 2336779
38043 2336779 4074375 3934727 1215468 -1751792 -2314147 -667593 715803 295084 -973365
38034 -973365 -1321132 -539025 -7724 -652319 -1783619 -2355194 -2506342 -2871050 -2950289 -1687743
38024 -1687743 374986 1256631 412816 -230040 804070 2094859 1414556 -776240 -1871605
38015 -1871605 -834706 464872 -98303 -2293015 -4086653 -3933494 -2040852 108692
38007 108692 1136373 880977 222777 -198548 -680982 -1633789 -2620828 -2778828 -1867132
37998 -1867132 -512341 247602 -494232 -2733280 -5049339 -5767802 -5010142 -4544407 -5128666
37989e128666k55992J198329J524085K65792m78270M36059J542524J457582P81538
37980A342981K81308m39178j251217q55831P52574J483400L98252n54617J24553
37971A282225Q01322l49574j924247j607160j57496J3864r53986q32159O16278
37962c110933J193224q055j221815q88279L31381J103652J224632J187359J274345
37953A085511J611881K102578K009505N60726j759976l262996k634063j91621
37945d78455K210358K438800P5903k526747k407620K04959J817208L91463j714032
37936A1837j239513J271315K649746J780642L73623l43548q72350j348353q86715
37927A396684L26248N32282r56115k253936j248136J517647L360466K518240M3038
$$ plain form
37989 -5128666 -5384658 -4186329 -2662244 -2396452 -2874722 -2438663 -896139 561443 1342981
37980 1342981 1624289 1185111 -66106 -921937 -169363 1314037 1712289 1157672 1282225
37971 1282225 2083547 1733973 -190274 -1797434 -1954930 -1941066 -2895052 -3727211 -3110933
37962 -3110933 -1917709 -1925764 -3147579 -4035858 -3704477 -2600825 -1376193 -188834 1085511
37953 1085511 2697392 4799970 6809475 7370201 5610225 2347229 -286834 -478455
37945 -478455 1731903 4170703 4246606 1719859 -687761 -482802 1334406 1725869 11837
37936 11837 -1227676 43639 2693385 4474027 4847650 4504102 3631752 2283399 1396684
37927 1396684 1722932 2255214 1299099 -954837 -2202973 -685326 2675140 5193380 5236418
37918E236418j462189q76906J27270n00444j972486j589207R68025K618330J263707
37909C812518j155236j774749p86324k0527L58481R17616N95726j324209k396940
37900a773644j00656L231321K942314p40306k689555o64670J631149Q66798j025722
37891A677029q72898N77870P90923k1966M7320Q86203R81957M65256M38773K07861
37881E178328j682358m048992l830986o01203K378128K476082Q35521n1171l4358
37872F18991o61692j864648j670886M51346K057302J015150j013973o90163J775204
37863A6631K385000o75367l707579k482468J630985L763315K474148P78956N85794
37854D769415L00342j078893j492177L98317K167305J180791j146051j720310
$$ plain form
37918 5236418 3774229 2897323 3024593 2524149 551663 -1037544 -69519 2548811 3812518
37909 3812518 2657282 882533 96209 75682 434163 1351779 1947505 623296 -1773644
37900 -1773644 -1874300 1357021 4299335 3559029 869474 204804 1835953 2702751 1677029
37891 1677029 804131 1382001 2172924 2150958 2198278 3084481 4066438 4531694 4970467 5178328
37881 5178328 3495970 -553022 -4384008 -4985211 -2607083 -131001 704520 653349 618991
37872 618991 -42701 -1907349 -3578235 -3126889 -1069587 -54437 -1068410 -1758573 16631
37863 16631 2401631 1726264 -1981315 -4463783 -2832798 930517 3404665 4183621 4769415
37854 4769415 5069757 3990864 2498687 2897004 5064309 6245100 5099049 3378739
37846C378739p45279r56470k667111l038572o46848K141032K474292O33579j000061
37837d26699j158765m35385K98483P42239P17107J44151m15421k11823M53392
37828b92721M32171l88727n69271N97810J483034M27470j284355j090816O02049
37819h3356P74318j204537k238990n53167J316079R41515J72674J462905K834845
37810C422286J004381k327436k506276M05602J424858j326101l672197k176411
37802e751294Q46301J698311P95296O79543J454147J428254L82013o23555j301888
37793c92872j760068j372215M8540J231267J230144Q62971R67417Q35388j65974
37784A484598j112368j132996p89320n23133K81426J338730R52072q54552j314586
$$ plain form
37846 3378739 2633460 1676990 -990121 -4028693 -4675541 -2534509 -60217 573362 -426699
37837 -426699 -1585464 -2020849 -1722366 -980127 -263020 -118869 -534290 -746113 -292721
37828 -292721 139450 -249277 -818548 -220738 1262296 1689766 405411 -685405 -83356
37819 -83356 690962 -513575 -2752565 -3305732 -1989653 -1048138 -875464 587441 3422286
37810 3422286 4426667 2099231 -407045 -1443 1423415 97314 -3574883 -5751294
37802 -5751294 -4904993 -3206682 -2411386 -1731843 -277696 1150558 1532571 909016 -392872
37793 -392872 -2152940 -3525155 -3476615 -2245348 -1015204 -152233 815184 1650572 1484598
37784 1484598 372230 -760766 -1550086 -2073219 -1791793 -453063 499009 -355543 -1670129
37775a670129Q15341K636307J441493q58780q76343Q41885J202887j86616r90880
37766B355165m63542j24416n15797o02849k57073l67572o02268J88644J489958
37757A100250J644039O29977j56414m63425r51240j012547K78182J561437P10569
37748C340828j339095j602352J75789J200667K79607p68393q34638r82828j347229
37739a877644l21036J811940K096585l79927k353877j185430J236175J849848
37731H76634Q91711K10869l99386j945684l145916k001277O12138K019565J684225
37722a197121J208232J049956K44334q68764o99439N57896Q32649k55195n25904
37713C46644R69940J951900M71605j698688j575883N31418J587566K85515j569563
$$ plain form
37775 -1670129 -854788 1781519 3223012 2364232 1487889 2329774 3532661 3346045 2355165
37766 2355165 1891623 1767207 1251410 648561 391488 23916 -578352 -389708 1100250
37757 1100250 2744289 3374266 3217852 2754427 1803187 790640 1068822 2630259 3340828
37748 3340828 2001733 399381 575170 1775837 2055444 1287051 452413 -530415 -1877644
37739 -1877644 -2198680 -386740 1709845 1329918 -1023959 -2209389 -973214 876634
37731 876634 1768345 1979214 1579828 -365856 -3511772 -5513049 -4900911 -2881346 -1197121
37722 -1197121 11111 1061067 1305401 436637 -262802 295094 1127743 872548 346644
37713 346644 1316584 3268484 3740089 2041401 465518 996936 2584502 2870017 1300454
37704A300454k158818j757432j156534j81670J046023J248507K7330p27677N36140
37695a823677K128145J264756j447067k451217l92521J928770J721867j16872
37687H12184r96591l21266O06404Q89802M66436o00245j623205j225343O09710
37678a382114J641453L23410j597360j517320J60785J053324P28168P46491J255127
37669A411964O89279q97884j318139L5535P66610p43297k450321j527736J395633
37660b638356K996955J639669p97749j540821j60469J314455J081127k90990q30842
37651G72979M9453Q68528N02452j33595J14604N28413j34257j215328j081648
37642B71601J38219P43939J7577j245340k255833k400470o96771K545092M322041
$$ plain form
37704 1300454 -858364 -2615796 -3772330 -3954000 -2907977 -1659470 -1632140 -2359817 -1823677
37695 -1823677 304468 1569224 122157 -2329060 -2721581 -792811 929056 812184
37687 812184 -184407 -505673 100731 990533 1456969 856724 -766481 -1991824 -1382114
37678 -1382114 259339 582749 -1014611 -2531931 -2371146 -1317822 -589654 156837 1411964
37669 1411964 2101243 1203359 -114780 -79245 687365 -55932 -2506253 -4033989 -2638356
37660 -2638356 358599 1998268 1200519 -340302 -500771 813684 1894811 1603821 772979
37651 772979 822432 1690960 2193412 2059817 2174421 2702834 2568577 1353249 271601
37642 271601 409820 1153759 1171336 -74004 -2329837 -4730307 -5427078 -2881986 1440055
37633A440055K192341j510911k147974N36613K035144O5357k203693j584103M06283
37624g70888Q21782j0340j39577K50824l7829l67437K97961Q20328q0284q44453
37614e9913M38812K001495Q11602j869383j795228J322349K788105J19041k974460
37605G82420k207127J069609K449550R69773n33553m46951j62803p39183r32810
37596B48925L00903J620120J219909m52906j544408j497326j252118j187291o31197
37587c175389M52311R76347N35992K54664R13838J492678P72030o33868j258836
37578C29767r75968o24439j35703J044715K003100J037264j427897k703471j363745
37569b816377Q80274J747038J164654L47201l80199j323339k044687j813208q60348
$$ plain form
37633 1440055 3632396 2121485 -26489 510124 2545268 2610625 406932 -1177171 -770888
37624 -770888 50894 40554 -99023 151801 113972 -253465 44496 864824 784540 -59913
37614 -59913 378899 2380394 3191996 1322613 -472615 849734 3637839 3756880 782420
37605 782420 -1424707 -355098 2094452 3064225 2530672 2083721 1920918 1181735 248925
37596 248925 549828 2169948 3389857 2936951 1392543 -104783 -1356901 -2544192 -3175389
37587 -3175389 -2723078 -1746731 -1210739 -956075 -42237 1450441 2222471 1588603 329767
37578 329767 -646201 -1270640 -1406343 -361628 1641472 2678736 1250839 -1452632 -2816377
37569 -2816377 -1936103 -189065 975589 1322790 942591 -380748 -2425435 -4238643 -5098991
37560e098991M8802P71587J422798J494667O25142k32337J60651J273812J209953
37551A676084o04206k383091k239845n68467O94719P30285O93737J672405K693406
37542B365027J796780j045859l307666k831939m62262J235866J204387N68931
37534d76735M50423N90340L19077l62465j039996j297841o80094Q22300K122862
37525D47871J908075L43208j072512j446525j185680o92430K54452J439127J831314
37516A826900Q96016o31459j666498j675333o60440O91275J019625j48460j067408
37507a415782J93682K509243K774814M74197j463435j156545l18304q76759j775490
37498a054379j265946q3708J99875J68204J139463K146941J285987p70974j528090
$$ plain form
37560 -5098991 -5050189 -4278602 -2855804 -1361137 -735995 -968332 -807681 466131 1676084
37551 1676084 1071878 -1311213 -3551058 -4119525 -3424806 -2694521 -2000784 -328379 2365027
37542 2365027 4161807 3115948 -191718 -3023657 -3485919 -2250053 -1045666 -476735
37534 -476735 -26312 564028 883105 520640 -519356 -1817197 -2497291 -1674991 447871
37525 447871 2355946 2699154 1626642 180117 -1005563 -1697993 -1443541 -4414 1826900
37516 1826900 2722916 2091457 424959 -1250374 -1910814 -1219539 -199914 -348374 -1415782
37507 -1415782 -1222100 1287143 4061957 4536154 3072719 1916174 1597870 721111 -1054379
37498 -1054379 -2320325 -2404033 -2204158 -2035954 -896491 1250450 2536437 1765463 237373
37489B37373n27817L45374K98226N02871J177929O37450j638480l339875k377519
37480d684468J2921J038400K75180j28821R32805J629823j4352k569732k420080
37471e928324J128622L966606K181407k312424l848981n56661L256039L239489
37463A125773M95825j141140p59347k88597l96064M2445Q55878L39940j444308
37454a169595k024915k28027J750670J374509p82676k107027j394933K16374J221806
37445c143814J358293J260867J393031J602597J385696L96235j150617k419075
37437F83213k435448j038937N58214P90369k41817n83529Q27588K175003J178699
37428A913355j227675k021830p35507m2135j074425j409813N98033K577726J850737
$$ plain form
37489 237373 -290444 54930 353156 856027 2033956 2671406 1032926 -2306949 -4684468
37480 -4684468 -4671547 -3633147 -3357967 -3486788 -2553983 -924160 -938512 -3508244 -5928324
37471 -5928324 -4799702 -833096 1348311 -964113 -4813094 -5369755 -2113716 1125773
37463 1125773 1621598 480458 -278889 -567486 -963550 -921105 -65227 274713 -1169595
37454 -1169595 -3194510 -3422537 -1671867 -297358 -1080034 -3187061 -4581994 -4365620 -3143814
37445 -3143814 -1785521 -524654 868377 2470974 3856670 4252905 3102288 683213
37437 683213 -1752235 -2791172 -2232958 -1442589 -1684406 -2267935 -1440347 734656 1913355
37428 1913355 685680 -1336150 -2071657 -2113792 -3188217 -4598030 -3999997 -1422271 428466
37419D28466j63913m87219M23780n5180j645782j433785R75213K466887J270511
37410A778978n61583o97721K39113M19486l84647j191884j429590j035402k17058
37401c080308K40495k11657n03270Q01236K587999J929881j398229l673054k077775
37392e384682J381115K837170J694088M28832M30119O00157j69429j284387j507770
37383i74787l89669J480010K723547K013342k69787j707645n35849J732118K000511
37374F071791k39305k315248k232389j064385n21750j20627J332846K750861J807919
37365E469713j198798l054839k002920k76933p00580k348985j879485J403235
37357d589592M251874L708711O74615j759263k082071j134249j01683O23431Q00485
$$ plain form
37419 428466 264553 -222666 201114 145934 -1499848 -2933633 -1958420 508467 1778978
37410 1778978 1217395 519674 758787 1178273 793626 -398258 -1827848 -2863250 -3080308
37401 -3080308 -2839813 -3051470 -3554740 -2753504 -165505 1764376 366147 -3306907 -5384682
37392 -5384682 -4003567 -1166397 527691 956523 1386642 1986799 1817370 532983 -974787
37383 -974787 -1364456 115554 2839101 4852443 4582656 2875011 2339162 4071280 6071791
37374 6071791 5832486 3517238 1284849 220464 -301286 -421913 910933 3661794 5469713
37365 5469713 4270915 1216076 -786844 -1063777 -1764357 -4113342 -5992827 -4589592
37357 -4589592 -337718 3370993 4045608 2286345 204274 -929975 -1031658 -408227 392258
37348C92258M8329j328230k094396j348986K64572J174501P28335p7273m7322
37339b288212N15919M41291j46486K91780K046166K900805J042339j871071k593807
37330C38724p37789R40252P16160o1451K10685Q16458K96738j109264k094291
37321f83778k140544j419662L8078J674581J920698N7332j997535j495557J501420
37312b544967L760758K744217j57722j300767N54938K600917J812725p56455j499886
37303E213758L72947J858860J168023L00631P67266L73264k446817m456199k367680
37294G84053R49766O22197j883767j192112K263074K569733j210753l046641l82080
37285e26530J557858o28360k500302k58889K076767J86777k307119m30921K654295
$$ plain form
37348 392258 440587 -887643 -2982039 -4331025 -4066453 -2891952 -2163617 -2240890 -2288212
37339 -2288212 -1772293 -1331002 -1477488 -1185708 860458 3761263 4803602 2932531 338724
37330 338724 -399065 541187 1257347 1195896 1406581 2223039 2519777 1410513 -683778
37321 -683778 -2824322 -4243984 -4205906 -2531325 -610627 -553295 -2550830 -4046387 -2544967
37312 -2544967 1215791 3960008 3802286 2501519 3056457 5657374 7470099 6713644 5213758
37303 5213758 5586705 7445565 8613588 8914219 9681485 10054749 7607932 3151733 784053
37294 784053 1733819 2356016 472249 -719863 1543211 4112944 2902191 -144450 -526530
37285 -526530 1031328 402968 -2097334 -2356223 -279456 -92679 -2399798 -2830719 -176424
37276a76424R73641l363014l284521J476868M242024K158350o99037j095258n12487
37267b79858n58822n28833l84440j034598j216447J082017M032695L666067J50394
37258D928175k427950k425183j908250j751751n47894J455677K169261J591517
37250A083602J507320J596062L65872q43907J87685J594331k8039l020117k705949
37241b63140N97948K067259N09222o69390m45754j081605j974790p8920L045119
37232A705949K385403j383331k021388J549641L069520k45157l172625j898679
37224a0667J81839j55502m40584J427984K626339J229438J71694J355002J940656
37215H326199J76781j203575o58906n46337j279767L19945M074676N282448L207170
$$ plain form
37276 -176424 797217 -2565797 -5850318 -4373450 -131426 2026924 1327887 232629 -279858
37267 -279858 -838680 -1367513 -1751953 -2786551 -4002998 -2920981 1111714 4777781 4928175
37258 4928175 2500225 75042 -1833208 -3584959 -4132853 -2677176 -507915 1083602
37250 1083602 2590922 4186984 4552856 3708949 3896634 5490965 5462926 2442809 -263140
37241 -263140 334808 2402067 2911289 2241899 1796145 714540 -1260250 -1339170 1705949
37232 1705949 4091352 2708021 686633 2236274 5305794 5060637 1888012 -10667
37224 -10667 171172 15670 -424914 1003070 3629409 4858847 5030541 6385543 8326199
37215 8326199 8502980 7299405 6640499 6094162 4814395 5134340 9209016 14491464 17698634
37206A7698634K741447N024890N299248K895907L745953J0040780J7346718K3534204
37198H8327781K8417252K4651422O910381q049278N189790L9089564N3073985
37191B37610897L1389061J1000721K4413589M3018674J9017598l3447096m9975661
37184B83027783r111347L5327300K9998975j1399028m1034751m3124511l6579515
37177B07104906l3679111k9331100k2359982j9606567k0551974j7745727j1453537
37170E2376908q535329q885415o669498k635112k410413m800285l832457m58826
37162A4149573o85084l698937l078623J156375K397851r24155l372334k264163
37154C680503n10289L80705J818437K675400L08303l013898k452671P88661J004156
$$ plain form
37206 17698634 20440081 25464971 30764219 33660126 37406079 47446859 64793577 88327781
37198 88327781 116745033 141396455 148306836 140257558 145447348 184536912 237610897
37191 237610897 268999958 280000679 304414268 347432942 366450540 333003444 283027783
37184 283027783 273916436 309243736 339242711 327843683 286808932 243684421 207104906
37177 207104906 173425795 144094695 121734713 102128146 81576172 63830445 52376908
37170 52376908 43841579 34956164 28286666 25651554 23241141 18440856 14608399 14149573
37162 14149573 13464489 9765552 6686929 7843304 10241155 9317000 5944666 3680503
37154 3680503 3170214 3550919 5369356 8044756 8353059 5339161 2886490 3675151 4679307
37145D679307j992432k578948M84088J960705l24731j912293k9867J824357O36769
37136B746955j162618q29792L9225o09463j302172k57566J065417O16863r08893
37127f02044j706361j417259m80219P63805J362395N57636k75695P93843K678421
37118A674522K450940J21594j325585p93754j25801o0153O60710J593102N17242
37109D712817j881457j895241R72358K249364o32011l948461l279900J2513J440022
37100b249996o338j443502p84594J190088K647492K390904L91207j851626k261588
37091a977953n51718J357420J926358J552309R75807O9410q88500p60095M44834
37082B147872R83467K6015r31566n17232N28245J095702J464874J829267J099334
$$ plain form
37145 4679307 2686875 107927 592015 2552720 2227989 315696 285829 2110186 2746955
37136 2746955 1584337 754545 793770 184307 -1117865 -1375431 -310014 306849 -602044
37127 -602044 -2308405 -3725664 -4205883 -3442078 -2079683 -1522047 -1797742 -1003899 1674522
37118 1674522 4125462 4247056 2921471 2127717 2001916 1941763 2602473 4195575 4712817
37109 4712817 2831360 936119 1908477 4157841 3525830 -422631 -3702531 -3690018 -2249996
37100 -2249996 -2256334 -3699836 -4484430 -3294342 -646850 1744054 2135261 283635 -1977953
37091 -1977953 -2529671 -1172251 754107 2306416 3282223 3351633 2463133 1703038 2147872
37082 2147872 3131339 3157354 2225788 1708556 2236801 3332503 4797377 6626644 7725978
37073G725978r62306k281984j337559J04734m17723j958127j471151J268437K963075
37064C633374J481282j147907j620642L00077J805496P97648j720166l192455
37056C36707k531646q72223L30141R25059J471383J946147J877912J242748M07237
37047E133465m20373r95155r18217n18752r56142k270003k393377R2544L074632
37038a71378L148133M42909j417911m86325J104508Q94546l26516m74519K86348
37029B999795K51206o90677j005091l31034j92070j372085k241299r06670J764171
37020a723754K782294R14115j460476j483103J72019L89365j491305k453319m64734
37011d818898K177896K246339L64949l25501R40453J976140J420186J93195p47215
$$ plain form
37073 7725978 6763672 4481688 3144129 3248863 2831140 873013 -598138 670299 3633374
37064 3633374 5114656 3966749 2346107 2646184 4451680 5249328 3529162 336707
37056 336707 -2194939 -3067162 -2737021 -1811962 -340579 1605568 3483480 4726228 5133465
37047 5133465 4713092 3717937 2799720 2280968 1324826 -945177 -3338554 -3246010 -171378
37038 -171378 2976755 3419664 2001753 1515428 2619936 3514482 3187966 2713447 2999795
37029 2999795 3251001 2560324 1555233 1224199 1032129 -339956 -2581255 -3487925 -1723754
37020 -1723754 1058540 1972655 512179 -970924 -798905 -409540 -1900845 -4354164 -4818898
37011 -4818898 -2641002 -394663 -29714 -355215 585238 2561378 3981564 4174759 3427544
37002C427544j437232j593018p81314K901n46356j368342l31076J716566J565225
36993F54898j062904k500971p74219J356204J030021l97164l51944N90896N54008
36984i01175K02121J145357K178727R23574j680191k284635l39886J127161K93013
36975F64066j147347j294873p35631n38987o0168J371680K382835J359211o89257
36966A311529j259505l0187P14263l10922j388404o24010Q54824O37929q71457
36957i65940q99607R28694J483518o52854k113322M7248K804408J372795k609406
36948f04466k818441J663773M211263P87705l674730l066532O31275J384938r95280
36939b480495j486727J116634K485785N07098j281367P1042K156757J499729r91873
$$ plain form
37002 3427544 1990312 397294 -384020 -381119 -927475 -2295817 -2626893 -910327 654898
36993 654898 -408006 -2908977 -3683196 -2326992 -1296971 -1694135 -2046079 -1455183 -901175
36984 -901175 -699054 446303 2625030 3548604 1868413 -416222 -756108 371053 664066
36975 664066 -483281 -1778154 -2513785 -3052772 -3112940 -1741260 641575 2000786 1311529
36966 1311529 52024 21837 736100 425178 -963226 -1587236 -732412 -94483 -965940
36957 -965940 -1865547 -936853 546665 -106189 -2219511 -2172263 632145 2004940 -604466
36948 -604466 -3422907 -1759134 2452129 3239834 -434896 -3501428 -2870153 -1485215 -2480495
36939 -2480495 -3967222 -2850588 -364803 142295 -1139072 -1068030 1088727 2588456 1596583
36930A596583k016753r37973J90208K48160J1062Q6854K4851n13953j003431o64032
36920b978424N98142J768039J431652m35289j836460j131495M39588L86443j199659
36911b957463j782279m73642P22641N12413L08277J186853J589524K22033j064399
36902a736042j4604K043121J938667m71885k092330j071509J046962J945531J234259
36893B822170J7190o94537o08282j91132k85171r92405j293512n89109J40678
36884a674110r7099n11290O7934Q86153M83759m48721j9820J251996P41166j765286
36874a085318k816393j10710L787461M608891J753740j528519k430941j207016
36866I71195Q9732k9145j343906k263188j452311M86754J611563J236273P28384
$$ plain form
36930 1596583 -420170 -1358143 -1167935 -919775 -908713 -821859 -797008 -1310961 -2314392 -2978424
36920 -2978424 -2380282 -612243 819409 384120 -1452340 -2583835 -2144247 -1757804 -2957463
36911 -2957463 -4739742 -5213384 -4490743 -3978330 -3670053 -2483200 -893676 -671643 -1736042
36902 -1736042 -1750646 292475 2231142 1759257 -333073 -1404582 -357620 1587911 2822170
36893 2822170 2839360 2144823 1536541 1345409 1060238 67833 -1225679 -1814788 -1674110
36884 -1674110 -1771209 -2282499 -2214565 -1328412 -844653 -1293374 -1313194 -61198 679968 -1085318
36874 -1085318 -3901711 -4012421 -224960 4383931 6137671 4609152 2178211 971195
36866 971195 1060927 1031782 -312124 -2575312 -4027623 -3540869 -1929306 -693033 35351
36857C5351J012741Q35997j012156l051230k768206l28083J529939J286262K96498
36848b162887K34535P93320R17275Q09710J257164J790505J130146o23020j670417
36839B476331r14296L86301L39814q23477j123402M2274Q21717j66226j381815
36830c42779n51566J706888K656812J441704j23765q51232j565014k474879k025345
36821b129176P8270J306724l6416j774364j046460J277263K266591J539345R58483
36812B440260P96243j96104j386454p63800R91935Q18507j539395k489271k66185
36803a594264J971770J006573j554820k073554k07535J551798J940661J499674
36795B540303L46286j568500k719343j499070Q32788J453807J62126m97047N00660
$$ plain form
36857 35351 1048092 1884089 871933 -2179297 -4947503 -5275586 -3745647 -2459385 -2162887
36848 -2162887 -1928352 -1135032 -217757 591953 1849117 3639622 4769768 4146748 2476331
36839 2476331 1562035 1948336 2288150 1464673 341271 383545 1205262 1039036 -342779
36830 -342779 -894345 812543 3469355 4911059 4787294 3936062 2371048 -103831 -2129176
36821 -2129176 -2050906 -744182 -780598 -2554962 -3601422 -2324159 -57568 1481777 2440260
36812 2440260 3236503 3040399 1653945 890145 1882080 2700587 1161192 -1328079 -1594264
36803 -1594264 377506 1384079 -170741 -2244295 -2451830 -900032 1040629 2540303
36795 2540303 2886589 1318089 -1401254 -2900324 -2067536 -613729 -451603 -948650 -447990
36786d47990J191784L01704m50754N47016J690775N81647j828561k302344k03457
36777i20180J426687L87580j474691j244619N93611J137729j44526n17361J480764
36768G24994L314218K096798j020940k582180j733959o28271m68043j87871O72497
36759A87243P73795l46823j020091k63263M17313l33688j334600r92992K3082
36750b890024L49475N07252J470832K001680K78736k499530l111238r26457J205298
36741c613976J180657K48950L73821J113227P29783q56750j891431j154180O79568
36732c190331K017659J936194P05971p09030j363023q16724N25283J419771P83614
36723A309384p48357r78563J064245L149950K370680o66410k413642j401134m4740
$$ plain form
36786 -447990 743794 1045498 594744 1141760 2832535 3414182 1585621 -716723 -920180
36777 -920180 506507 894087 -580604 -1825223 -1231612 -93883 -238409 -755770 724994
36768 724994 4039212 6136010 5115070 2532890 798931 170660 -297383 -485254 187243
36759 187243 961038 614215 -405876 -669139 -251826 -585514 -1920114 -2913106 -2890024
36750 -2890024 -2540549 -2033297 -562465 1439215 1717951 -781579 -3892817 -4819274 -3613976
36741 -3613976 -2433319 -2184369 -1810548 -697321 32462 -824288 -2715719 -3869899 -3190331
36732 -3190331 -1172672 763522 1469493 760463 -602560 -1419284 -894001 525770 1309384
36723 1309384 561027 -417536 646709 3796659 6167339 5500929 3087287 1686153 1641413
36714A641413m42389j195845m03501P22190P4691j334437q74457J195085K053077
36705A435827Q26510m25401m14415k88858r20124j224239l21153P37326O23222
36696B8695m09137j295095j547773j166682k94280N14737P11024O88743J233020
36687a536748K016834J900138O63831q72854k177071k891770j963172R30067L432254
36678d98491K722443j70918j227973P34636K249603N70366k224225k656243q40936
36669a341738N90691P13873O26689O93308K49398l92174m7531J220755J934581
36660D247852J236368k86738j720093k530178k342253j197971P4205O83189Q07906
36651a027713R17864P51908j1253o95049m68692K34310M02723J21217K09870N44305
$$ plain form
36714 1641413 1199024 3179 -400322 321868 396559 -937878 -1812335 -617250 1435827
36705 1435827 2262337 1836936 1422521 1133663 213539 -1010700 -1331853 -594527 28695
36696 28695 -380442 -1675537 -3223310 -4389992 -4684272 -4169535 -3458511 -2769768 -1536748
36687 -1536748 480086 2380224 3044055 2171201 -5870 -2897640 -4860812 -3930745 -498491
36678 -498491 2223952 2053034 825061 1559697 3809300 4379666 2155441 -500802 -1341738
36669 -1341738 -751047 -37174 589515 1282823 1532221 1140047 1092516 2313271 4247852
36660 4247852 5484220 5197482 3477389 947211 -1395042 -2593013 -2518808 -1835619 -1027713
36651 -1027713 -109849 642059 630806 -64243 -532935 -298625 104098 225315 435185 979490
36641I79490K38992o12807r36832n53442n09137j101629j078926L18543J726593
36632a529155J316857n72562j801347j280677j80326O8692j72885L61363J604603
36623b185437K149211J439263N98784N82139P53798K16493n12079l94827L08775
36614B956120M79571j42903j002211j895116k613784k118222k621J760822R54331
36605a624013j184969j195643J328148K817248J226703p38914j9179J938840J659015
36596D207236q96347k620546k079494q45674k47204K62855J098190J424992Q79893
36587A183901M58715P69072R17313O8677j095904j445474j047946q27990j113064
36578b132700j333144r50805p8904Q51335J629890K170504J962021K65670k483498
$$ plain form
36641 979490 1218482 605675 -331157 -884599 -1393736 -2495365 -3574291 -3255748 -1529155
36632 -1529155 -212298 -784860 -2586207 -3866884 -4047210 -3978518 -4151403 -3790040 -2185437
36623 -2185437 -36226 1403037 2001821 2583960 3337758 3554251 3042172 2647345 2956120
36614 2956120 3435691 3292788 2290577 395461 -2218323 -4336545 -4339166 -2578344 -1624013
36605 -1624013 -2808982 -4004625 -2676477 140771 1367474 628560 609381 2548221 4207236
36596 4207236 3310889 690343 -1389151 -2234825 -2482029 -2219174 -1120984 304008 1183901
36587 1183901 1642616 2411688 3329001 3397678 2301774 856300 -191646 -1019636 -2132700
36578 -2132700 -3465844 -4416649 -4495553 -3644218 -2014328 156176 2118197 2383867 -99631
36569i9631l984766k190822J678679L819688K366168k49457p43814N93052Q48251
36560B037348r85242k758752k484616q11546M73586Q54627J057242J550677J947641
36551H80965J550954J54314j448901j907614q10749N64863Q22600L81157O46106
36542H33695J501579J281838m37993j738233r95128P15817J142497j13527j482356
36533G08189j814546j428767q97913k18366M77903N63122q6797n37393M5851J200938
36523a987779J765256J246858K3401j329518k170215j751128p1766J495332J548440
36514a231119N20630M4441N60779R61896O13751J0966p79271k186383l075316
36505d559626j262740K515525L984817J066240k367661j746259J365413J875751
$$ plain form
36569 -99631 -4084397 -6275219 -4596540 -776852 1589316 1339859 596045 1189097 2037348
36560 2037348 1052106 -1706646 -4191262 -5002808 -4529222 -3674595 -2617353 -1066676 880965
36551 880965 2431919 2586233 1137332 -770282 -1581031 -1016168 -193568 187589 833695
36542 833695 2335274 3617112 3179119 1440886 445758 1161575 2304072 2190545 708189
36533 708189 -1106357 -2535124 -3433037 -3651403 -3173500 -2610378 -2697175 -3234568 -3188717 -1987779
36523 -1987779 -222523 1024335 1047736 -281782 -2451997 -4203125 -4274891 -2779559 -1231119
36514 -1231119 -710489 -666048 -105269 856627 1470378 1481344 702073 -1484310 -4559626
36505 -4559626 -5822366 -3306841 677976 1744216 -623445 -2369704 -1004291 871460
36497H71460p68772k086377k6574K178201J807470N87091O99712R34918l82888
36488C814241j864770j485814r6812L20109j17334k53370k60538n27484j22374
36479e94146J228110J634839L0681j426995o66925P07661K16814j140902q21178
36470h32041O74764Q76104k82203r05738q82843j388682j620608k7142J957404
36461b430985J607323j74707o9177J726717J547587j348729l299748k226683m27551
36452e095953J55067Q86452K547483K808949L73521j976888j442307O58856J568146
36443D83326J118527M05084p90534k362026k324345l3667J486997j65493k374592
36434d556723j167825K445698L895540J859137m00836l41231R03431J330804P78992
$$ plain form
36497 871460 102688 -1983689 -2010263 167938 1975408 2562499 3262211 4197129 3814241
36488 3814241 1949471 463657 366845 686954 569620 316250 55712 -471772 -594146
36479 -594146 633964 2268803 2299484 872489 205564 913225 1130039 -10863 -832041
36470 -832041 -157277 718827 436624 -469114 -1351957 -2740639 -4361247 -4388389 -2430985
36461 -2430985 -823662 -998369 -1067546 659171 2206758 858029 -2441719 -4668402 -5095953
36452 -5095953 -4940886 -4054434 -1506951 1301998 1675519 -301369 -1743676 -1084820 483326
36443 483326 1601853 2006937 1216403 -1145623 -3469968 -3503635 -2016638 -2182131 -4556723
36434 -4556723 -5724548 -3278850 616690 2475827 2074991 1733760 2637191 3967995 4746987
36425D746987K335o88072j088482r78672o89018o18454m13532K17724N93822L05007
36415A389645K54057P91667L38568j788291k830862j93039L552718L331536r38972
36406C907027l814043k079680J116459J569433l33984j734855j920150j761111
36398e050904q25125J596968L854754L462278P53508j521731j898367j233449
36390h62068m16662N43196J113597K91507j382475j846593l63279J256751J164941
36381e01085j18027p70338q3134J185354K054871J958876P58978r41186j913106
36372A631203j534902n76341j15393j31047P7768N28542N43810j07893q86877
36363e71130j156263n45216R38640K355055K059678k16803k123242j334446Q95264
$$ plain form
36425 4746987 4749322 4061250 2972768 1994096 1305078 686624 273092 490816 1084638 1389645
36415 1389645 1643702 2435369 2773937 985646 -1845216 -2038255 1514463 4845999 3907027
36406 3907027 92984 -1986696 -870237 699196 365212 -1369643 -3289793 -5050904
36398 -5050904 -5876029 -4279061 -424307 3037971 3791479 2269748 371381 -862068
36390 -862068 -1278730 -735534 378063 669570 -712905 -2559498 -2922777 -1666026 -501085
36381 -501085 -619112 -1389450 -1472584 -287230 1767641 3726517 4485495 3544309 1631203
36372 1631203 96301 -480040 -595433 -726480 -648712 -120170 423640 315747 -571130
36363 -571130 -1727393 -2272609 -1333969 1021086 3080764 2863961 740719 -593727 301537
36354C01537J171200q95969j894187m9897J692356L82405j931143j434310J109462
36345a548546J602371m92404j263994R43792K623949R79994j345607o22232J888989
36336B766312K082063m91133k238333j115033R68430J612684Q32747k67690j342417
36327B807630k223676k154588p41930J172081K241858J804604L98204m31659N07616
36318C380140K106533J524582j881223m612486l300523K84425J592865k1167q18826
36309a745680Q78428K071193N15148j250488j11034K493227K988951J048725q30077
36300F058393j536835j773860j441079M071J295428P60637n02007j14812J272771
36291D022707P08198j961881l407591j928358K47325Q55832M89013K20416m88396
$$ plain form
36354 301537 1472737 576768 -1317419 -1367316 325040 707445 -1223698 -2658008 -1548546
36345 -1548546 53825 -438579 -1702573 -758781 1865168 2845162 1499555 877323 2766312
36336 2766312 4848375 4357242 2118909 1003876 1972306 3584990 4417737 4150047 2807630
36327 2807630 583954 -1570634 -2312564 -1140483 1101375 2905979 3304183 2872524 3380140
36318 3380140 5486673 7011255 5130032 517546 -2782977 -2498552 -905687 -926854 -1745680
36309 -1745680 -867252 1203941 1719089 468601 357567 2850794 5839745 6888470 6058393
36300 6058393 4521558 2747698 1306619 1310690 2606118 3366755 2864748 2749936 4022707
36291 4022707 4730905 2769024 -638567 -2566925 -2319600 -1463768 -974755 -754339 -1242735
36282a242735j772747k085938p60258P05157J469940K569365L666691K143315
36274D692790k060808m372164j853541J748990J465143j289162j608458O24770
36266b652440J228446n61599j052397R55817K087644N45876r73987l75535O14582
36257a83593M34001M02431J079186L01773k293371l009081K00673L511023K631408
36248C074450p31206j971232n16611O86505N50108K45862l19989k046543l511090
36239d539746k394305M16083J791932J030652J68733J48372J08294P7204R17340
36230b275441J833666J253909r0628k18303M54709O001j026808m92350R59801
36221D04556O42623j050431r77592R24074J186968q04431j296097J090795K422225
$$ plain form
36282 -1242735 -3015482 -5101420 -5861678 -5156521 -3686581 -1117216 2549475 4692790
36274 4692790 2631982 -1740182 -3593723 -1844733 -379590 -1668752 -3277210 -2652440
36266 -2652440 -1423994 -1985593 -3037990 -2082173 5471 551347 -422640 -798175 -183593
36257 -183593 250408 652839 1732025 2033798 -259573 -3268654 -3067981 443042 3074450
36248 3074450 2343244 372012 -144599 541906 1092014 1337876 1017887 -1028656 -4539746
36239 -4539746 -6934051 -6517968 -4726036 -3695384 -3526651 -3378279 -3269985 -3192781 -2275441
36230 -2275441 -441775 812134 721506 503203 957912 963913 -62895 -555245 404556
36221 404556 1047179 -3252 -980844 -56770 1130198 325767 -970330 120465 2542690
36212B542690J31161k334013j324923Q79212L11474j774755j364672J256339K186576
36203E09089N53977n26151M42526J235966J72221j193968r62554K09809N82719
36194A023634j8020l29727M42689J647130J823750K94907j715543k184608q54815
36185A29397L82221K61304j67700K93975P39292k26953j839762k122598p87362
36176c338186O35429J144196J127194J099340R31794L37047o48972j482075j207286
36167a401519M36161J945070J529901j91032r68972o50600j321301k901531k184741
36158e708564J666732M314845K258805j418494j521813J321078K055824o65362
36150B303051k846495j718379O76992J421840M66350p78280j546058j289427L22626
$$ plain form
36212 2542690 2673851 339838 -985085 -105873 205601 -1569154 -2933826 -1677487 509089
36203 509089 1063066 536915 979441 2215407 2387628 1193660 231106 440915 1023634
36194 1023634 1005614 675887 1118576 2765706 4589456 4884363 3168820 984212 129397
36185 129397 511618 772922 605222 899197 1638489 1411536 -428226 -2550824 -3338186
36176 -3338186 -2702757 -1558561 -431367 667973 1599767 1936814 1287842 -194233 -1401519
36167 -1401519 -965358 979712 2509613 2318581 1349609 699009 -622292 -3523823 -5708564
36158 -5708564 -4041832 273013 2531818 1113324 -408489 912589 2968413 2303051
36150 2303051 -543444 -2261823 -1584831 -162991 303359 -474921 -2020979 -3310406 -2987780
36141b987780K125137K378893J341601O50426K45451j231586l011903k617166
36133c106927k00128J119357K35497k41744J272579K479293J191877r76824j466107
36124C06873o93540m43080m92237L36988J377833J112448j20961p86608o18840
36115b1124l59061M6630R41149J472896O63103o59278r30107l82208n92193j714967
36105a535160k025058m88803J590913K065147M40003j513695j645072Q0619J444301
36096a586805R01038k13969J40721J203109N68535j415310j660306N62276K027088
36087E26377P16344q44788J7374J499265N71449j526540j207138J334906K214277
36078C301526r6127k689666k765995r97878N44075J135168R85938K27260o26022
$$ plain form
36141 -2987780 -862643 1516250 2857851 3508277 3753728 2522142 -489761 -3106927
36133 -3106927 -3307055 -2187698 -1952201 -2193945 -921366 1557927 2749804 1772980 306873
36124 306873 -386667 -829747 -1321984 -984996 392837 1505285 1384324 597716 -21124
36115 -21124 -380185 -333555 607594 2080490 2743593 2084315 1154208 772000 179807 -1535160
36105 -1535160 -3560218 -4049021 -2458108 -392961 47042 -1466653 -3111725 -3031106 -1586805
36096 -1586805 -685767 -899736 -759015 444094 1012629 -402681 -2062987 -1500711 526377
36087 526377 1242721 397933 415307 1914572 2486021 959481 -247657 1087249 3301526
36078 3301526 3205399 515733 -2250262 -3248140 -2704065 -1568897 -582959 -355699 -981721
36069i81721p53148k38593J13418L05142Q87617J240986J49486j721702k127442
36060c125957n17219J130984J371745R78963P52610J8744j322841j491225M74031
36051a730165K385516J559818j173416k384845o79533J608383J692351k12928
36043A065181j527069o88059R79820R89035j083800k830764j901461J029865L157795
36034h09457K948554J340804k32726j363038j928882j534319m57652J79279L2544
36025a824893J51247J141594J917759J323739k5545o77897l53532O9695q084m71650
36015A242433j040271j440400j384890r23885m12806R5119P44373J142784Q33573
36006a143970M96927J099909J745647N59895j757376k039186L72646J826430j32512
$$ plain form
36069 -981721 -1734869 -1973462 -1860044 -1554902 -667285 573701 723187 -998515 -3125957
36060 -3125957 -3643176 -2512192 -1140447 -161484 591126 609870 -712971 -2204196 -1730165
36051 -1730165 655351 2215169 1041753 -1343092 -2022625 -414242 1278109 1065181
36043 1065181 -461888 -1149947 -170127 818908 -264892 -3095656 -4997117 -3967252 -809457
36034 -809457 2139097 3479901 3247175 1884137 -44745 -1579064 -2036716 -1857437 -1824893
36025 -1824893 -1673646 -532052 1385707 2709446 2683901 2006004 1652472 1722167 1714083 1242433
36015 1242433 202162 -1238238 -2623128 -3547013 -3959819 -3864700 -3120327 -1977543 -1143970
36006 -1143970 -647043 452866 2198513 2758408 1001032 -1038154 -665508 1160922 1028410
35997A028410k471740j356571J423341J336537j098067r27957K709893M383722
35989E027568O42358m375979m837545j139908J786674J671215M54659m3856j74513
35980i89327l41439l8344M99825J02573j172435j554224p6252J789896J925074
35971A45347J70439j620820j757127l95757Q95689R76699K38164k52642j98890
35962a798898m934K59463O94721O88586k92311j150047k86558J553545J853667
35953A517234L19819l46240J098576K056555K65914k255034k297215m19544M67905
35944D07970o6102j49620L64774j91451j697515k151617j224152m95943p0635
35935e274291J438376L220434K527890m30549j854127j78301J350248J00451j669104
$$ plain form
35997 1028410 -1443330 -2799901 -1376560 -40023 -1138090 -2066047 643846 5027568
35989 5027568 5669926 1293947 -3543598 -4683506 -2896832 -1225617 -770958 -814814 -989327
35980 -989327 -1330766 -1369110 -869285 -766712 -1939147 -3493371 -3569623 -1779727 145347
35971 145347 315786 -1305034 -3062161 -3457918 -2562229 -1585530 -1347366 -1600008 -1798898
35962 -1798898 -1803832 -1544369 -849648 -161062 -453373 -1603420 -1889978 -336433 1517234
35953 1517234 1837053 1490813 2589389 4645944 4911858 2656824 359609 -59935 407970
35944 407970 341868 192248 557022 365571 -1331944 -3483561 -4707713 -5203656 -5274291
35935 -5274291 -3835915 -615481 1912409 1481860 -372267 -550568 799680 900131 -768973
35926g68973q96844J139201J327355n3100m60650J79189j98643j541747j517788
35917b792000L76146J769984R89592q71121j983683j776665m44274J560132K951632
35908b20257K272154j09520j938933j689692k64977M41141j08271p36553j86441
35899b541349J258222J974551J079945j41409J4382Q19555O345k185285k520663
35890b235706K96978K957418K201649k75270p91123L82208L0873k112306k928239
35881b473518j376945m2678l55038l92624R80281J632321Q7340j431393o81420
35872d053674P07715K87125n81238R62669L722278L520643k21951l097613k056161
35863h10207L53290K26946j833856k101334L22172K224591J227013q15976q04661
$$ plain form
35926 -768973 -1665817 -526616 800739 747639 286989 466178 267535 -1274212 -2792000
35917 -2792000 -2415854 -645870 343722 -527399 -2511082 -4287747 -4732021 -3171889 -220257
35908 -220257 2051897 1942377 3444 -1686248 -1951225 -1510084 -1618355 -2354908 -2541349
35899 -2541349 -1283127 691424 1771369 1629960 1644342 2463897 2470242 284957 -2235706
35890 -2235706 -1938728 1018690 3220339 2945069 2153946 2536154 2567027 454721 -2473518
35881 -2473518 -3850463 -3893141 -4248179 -4640803 -3660522 -2028201 -1940861 -3372254 -4053674
35872 -4053674 -3345959 -3058834 -3640072 -2677403 1044875 4565518 4343567 1245954 -810207
35863 -810207 -456917 -229971 -2063827 -4165161 -3842989 -1618398 -391385 -1207361 -2012022
35854b012022J122383K183914J141769l72776p10160k75687j27907k93197m37643
35845B18674o99091p88977K07222J876373K010204j78780k068346j193185P13720
35836I7814K90189j899142k144837K22285J613512J71633j158287K16178J938317
35827f52338O15032k270935k409018O29634K819722J752057m74334j271032j144159
35818b405371j532822j693564k36389J754467J859089J19329q32319K71045J578123
35809a118412J305251N49489J082849J936460Q43263j548418j987982L52344K186736
35800C601580R57249j295787j260336N26117R28740o04977j470957l15175J129533
35791B195987J146079L12115k11433m85798q73352j041046p81343m46165o9218
$$ plain form
35854 -2012022 -889639 1294275 2436044 2063268 1353108 1077421 949514 656317 218674
35845 218674 -480417 -1269394 -1062172 814201 2824405 2645625 577279 -615906 97814
35836 97814 388003 -1511139 -3655976 -3433691 -1820179 -1648546 -2806833 -2590655 -652338
35827 -652338 -37306 -2308241 -4717259 -4087625 -1267903 484154 9820 -1261212 -2405371
35818 -2405371 -3938193 -5631757 -5868146 -4113679 -2254590 -2135261 -2967580 -2696535 -1118412
35809 -1118412 186839 736328 1819177 3755637 4598900 3050482 1062500 1414844 3601580
35800 3601580 4558829 3263042 2002706 2528823 3457563 2852586 1381629 1066454 2195987
35791 2195987 3342066 3654181 3442748 2956950 2083598 1042552 261209 -184956 -254174
35782b54174N04792M91816r28365k417763j560849J286131K753466J063069j571870
35773f33747k356843j269172L63437J981097K721702J029612k274754l227893
35765c666561o8745L082147J671675k073211k020538K550313N572916K940424
35757G988420j981175l660861j585954O87194J108932N01181l38704j632550k740206
35748a653723j956291Q90518L330761K989693N73500j097817o97887K80677O4850
35739B724281q97648j075495n27410o40270j392833r87824J081807K550313J423088
35730B258009r16755j503109J13347J523426J027469k82151m25151P79945J656316
35721D231346P73745j334402k562170j486831Q40696K007353J183652j18127n38337
$$ plain form
35782 -254174 250618 742434 -185931 -2603694 -4164543 -2878412 -124946 938123 -633747
35773 -633747 -2990590 -4259762 -3896325 -1915228 806474 1836086 -438668 -3666561
35765 -3666561 -3735306 -653159 1018516 -1054695 -3075233 -524920 5047996 7988420
35757 7988420 6007245 2346384 760430 1447624 2556556 3057737 2719033 1086483 -1653723
35748 -1653723 -3610014 -2719496 611265 3600958 4174458 3076641 2378754 2659431 2724281
35739 2724281 1826633 751138 223728 -416542 -1809375 -2797199 -1715392 834921 2258009
35730 2258009 1341254 -161855 -48508 1474918 2502387 2220236 1795085 2575030 4231346
35721 4231346 5005091 3670689 1108519 -378312 462384 2469737 3653389 3535262 2996925
35712B996925o34672j258948j690580q87572N05277J023646M53900m39921j348077
35703a280022j991159j323230Q74513K532189J684059m12505j036879k48863m06451
35694a608348j659778j384102J187476L145641K250432K03510m05177L4249k90894
35685A473009j119892q62446L47180R22572N13923J21930o8597p53494j548005
35676i73820j145048K86981Q32858l81865j710272j169873R93762K772202K677899
35667B182824Q97593j218058k189324j372225N16773J948168J862409L26261j823623
35658A130798l421436l296070j175700J510654K689496J907348O65486J26776
35650A37352l00586j291728j871168q84700P12839R79108J4437k17611Q27079
$$ plain form
35712 2996925 2362253 1103305 -587275 -1474847 -969570 54076 507976 68055 -1280022
35703 -1280022 -3271181 -4594411 -3719898 -1187709 496350 83845 -953034 -1201897 -1608348
35694 -1608348 -3268126 -4652228 -3464752 -319111 1931321 2134831 1729654 1763903 1473009
35685 1473009 353117 -509329 -162149 760423 1274346 1396276 1327679 574185 -973820
35676 -973820 -2118868 -1831887 -999029 -1380894 -3091166 -4261039 -3267277 -495075 2182824
35667 2182824 3080417 1862359 -326965 -1699190 -1182417 765751 2628160 2954421 1130798
35658 1130798 -2290638 -5586708 -6762408 -5251754 -2562258 -654910 10576 137352
35650 137352 -163234 -1454962 -3326130 -4210830 -3497991 -2518883 -2504446 -2722057 -1894978
35641a894978J394781M78292m22756K17933J549002J870780J007622l21026j867061
35632B012589k907036j776896J361302L055119Q07118k658560k868020k32921
35624c207305R76757k16781l83008J600843K114621o81661k896381j019401K158854
35615a553462K101976k49092p86931M91813R807k524715l220226m30743K567661
35606c593912K562616M35477j101985q76049P14303K448054K326042n13921l379422
35597i78797k482855J457048L376746Q88911k271536j828444J146552K668631
35589A976256J706961M02290p2197n84562j449954j581599n48891M75794L78501
35580G02599m54777q08984j96966M93910m0283j650248k265017l15255K739266
$$ plain form
35641 -1894978 -500197 -21905 -444661 -226728 1322274 3193054 4200676 3879650 2012589
35632 2012589 -894447 -2671343 -1310041 1745078 2552196 -106364 -2974384 -3207305
35624 -3207305 -2230548 -2447329 -2830337 -1229494 885127 203466 -2692915 -3712316 -1553462
35615 -1553462 548514 299422 -487509 4304 14111 -2510604 -5730830 -6161573 -3593912
35606 -3593912 -1031296 -595819 -1697804 -2573853 -1859550 588504 2914546 2400625 -978797
35597 -978797 -3461652 -2004604 1372142 2261053 -10483 -1838927 -692375 1976256
35589 1976256 3683217 4085507 4013310 3428748 1978794 397195 -151696 324098 702599
35580 702599 247822 -561162 -758128 -264218 -304501 -1954749 -4219766 -4535021 -1795755
35571a795755L895784K497038O26774m70809j747845l358143l239618m84002K345880
35562a730696K534502Q95848j63706l83011q19967r94045N5999J069784K07483
35553F72191j375856j011005Q29831J026881q53649j585425L09102J891884N36835
35544D40789j795084j686941N57742J819972Q98589n51072j164232j242958j034532
35535c757727o3841J324159J709080O44628n20736o43140l10572m81174p52431
35526b851754j91907Q61422J167723M81571j44915J2469M78180N44894J89375
35517E47058l15181q85716j320881j246611p76769m56317j76238P91838K076097
35508a762720J919019j60046j795903p63214J549110K085060Q23082M46029J375769
$$ plain form
35571 -1795755 2100029 4597067 5223841 4753032 3005187 -352956 -3592574 -4076576 -1730696
35562 -1730696 803806 1699654 1535948 1152937 332970 -661075 -605076 464708 672191
35553 672191 -703665 -1714670 -884839 142042 -711607 -2297032 -1987930 -96046 440789
35544 440789 -1354295 -3041236 -2483494 -663522 235067 -316005 -1480237 -2723195 -3757727
35535 -3757727 -3821568 -2497409 -788329 -143701 -664437 -1307577 -1618149 -2099323 -2851754
35526 -2851754 -3043661 -2182239 -1014516 -532945 -677860 -665391 -187211 357683 547058
35517 547058 231877 -653839 -1974720 -3221331 -3998100 -4454417 -4630655 -3838817 -1762720
35508 -1762720 156299 -3747 -1799650 -2562864 -1013754 1071306 1894388 2340417 3716186
35499C716186Q85303j687707k775327k31418K289943N12370l342481l493205L98543
35490c727793K602581L24489k070692k69207L151679L031627l10898k002475k01519
35481E27792J877972J531069m217o93269q06459j181240j106241J5481R10347
35472A071235M32595k66313L16482J265626P43358p67051j255085o17443o01776
35463C21628j464365j490772k31020N87278K50529L96523J743552K164921J66452
35454B444726j986802j359931J053363J877445N22753m74285l4969p8015j748111
35445B16174l075239j926704P79996K475595K197056J004112J11521j26034K0223
35436A676700k5467o06701j163334p84803K99265Q02805K97773k13586j48506
$$ plain form
35499 3716186 4601489 2913782 138455 -92963 2196980 2709350 -633131 -4126336 -3727793
35490 -3727793 -1125212 -800723 -2871415 -3140622 11057 3042684 2731786 729311 527792
35481 527792 2405764 3936833 3932616 3239347 2432888 1251648 145407 160888 1071235
35472 1071235 1503830 1237517 1553999 2819625 3562983 2795932 1540847 923404 321628
35463 321628 -1142737 -2633509 -2864529 -2277251 -2026722 -1630199 113353 2278274 2444726
35454 2444726 457924 -902007 151356 2028801 2551554 2077269 2042300 1964285 216174
35445 216174 -2859065 -4785769 -4005773 -1530178 666878 1670990 1782511 1656477 1676700
35436 1676700 1651233 1044532 -118802 -903605 -604340 198465 496238 282652 134146
35427A34146k76770r27948q32079Q25646K456471J985042j8313j016503q0028
35418B249664J046838O99595n09554r78724m33912P0655r3753m26700l45787o2458
35408A215864K9937K12505Q38964J170250N6047j947850k577102q95338J030933
35399h65790R72449j73781l3996J175485R52520j218579k783622j965422n6765
35390c997501J149511J712485J999750J242016o14843j764656j172023l76990
35382a822251o81265o33364J218889L043892K221625l50401j707053j497464j710496
35373a917888k359041j314760J312502K418291O34652j400711j066398O12302
35365c081051J191346N35523K18028N76696M67525n30856j239969l68092J740226
$$ plain form
35427 134146 -142624 -1070572 -1902651 -1077005 1379466 3364508 3346195 2329692 2249664
35418 2249664 3296502 3996097 3486543 2507819 2073907 2144562 2050809 1624109 1278322 1215864
35408 1215864 1245801 1458306 2297270 3467520 3523567 1575717 -1001385 -1896723 -865790
35399 -865790 106659 -67122 -101118 1074367 2026887 808308 -1975314 -3940736 -3997501
35390 -3997501 -2847990 -1135505 864245 2106261 1491418 -273238 -1445261 -1822251
35382 -1822251 -2503516 -3136880 -1917991 1125901 3347526 2997125 1290072 -207392 -1917888
35373 -1917888 -4276929 -5591689 -4279187 -1860896 -1226244 -2626955 -3693353 -3081051
35365 -3081051 -1889705 -1354182 -1136154 -559458 -91933 -622789 -1862758 -2230850 -490624
35356d90624L036925J759946j196933k708357j139736J365066J821074M90462
35348B937823j96548J85196k1666q97499p27345K98853p3224j711609j457141
35339a663160J336603K621373k26934l652420k913442Q81177K840548J599859
35331H23604K66983Q56341J823916J277187n73545k479066l223569j814948J043978
35322a999119K283485j6713l112074k724108Q42046L254483K592839J215453Q17517
35313C153809l9092k106882l203217j847104K08530J168335J756795K454701J518094
35304C063969j507848l388268j556839J696100K724039J796389J257097P64778
35296D849417j284084l275896k146443J080938K207326K61802j424225q59584
$$ plain form
35356 -490624 2546301 4306247 3109314 400957 -738779 626287 2447361 2937823
35348 2937823 2741275 2926471 2904805 2007306 1279961 1578814 1505590 -206019 -1663160
35339 -1663160 -326557 2294816 2067882 -1584538 -4497980 -3616803 -776255 823604
35331 823604 1090587 1946928 3770844 5048031 4474486 1995420 -1228149 -3043097 -1999119
35322 -1999119 284366 267653 -2844421 -5568529 -4726483 -1472000 1120839 2336292 3153809
35313 3153809 3114717 1007835 -2195382 -4042486 -3833956 -2665621 -908826 1545875 3063969
35304 3063969 1556121 -1832147 -3388986 -1692886 1031153 2827542 4084639 4849417
35296 4849417 3565333 289437 -1857006 -776068 1431258 1693060 268835 -590749
35288e90749K19099L16969L06856M69697m93602k033647j378601J522932K656119
35279I95073j1669k873285k106973N76399J214352q7860j87835J490947K440702
35270A449851J361803m84024j796086k240275j425317M69999J581979M23756j504488
35261b162802j621192m4278J112987J350111J701430J748546J01819k267718k574525
35252b655622m76479J292576J081425K15142J09945L17355K71893M20581P55818
35243A332634M97856j71980k90826k24315j054113j913785j075108L30764m34867
35234c003740k373130j318823K854338M711504J488553k135978j245777J781391
35226G58338J739282r51345j834125j87042O19664m65529r40221J10319O43513
$$ plain form
35288 -590749 -371650 -54681 252175 721872 228270 -1805377 -3183978 -1661046 995073
35279 995073 983404 -1889881 -3996854 -3420455 -2206103 -2293963 -2481798 -990851 1449851
35270 1449851 2811654 2327630 531544 -1708731 -3134048 -2664049 -1082070 -658314 -2162802
35261 -2162802 -3783994 -3828272 -2715285 -1365174 336256 2084802 2186621 -81097 -2655622
35252 -2655622 -3132101 -1839525 -758100 -542958 -433013 -115658 156235 576816 1332634
35243 1332634 1830490 1658510 1367684 1143369 89256 -1824529 -2899637 -2568873 -3003740
35234 -3003740 -5376870 -6695693 -3841355 870149 2358702 222724 -1023053 758338
35226 758338 2497620 1546275 -287850 -474892 144772 -320757 -1260978 -1150659 -507146
35217e07146K7361L01029J994429K579105N27783k185265k989519j654995N57913
35208a349305K355839K465987N98828j292327j103827J07788k79539j812059j550571
35199a859186N63305J224151m34242j152947N21659J304396r54725k839782p65486
35190d392857K765995K975896L02978r41744J79182N45602r47600j684834k84125
35181a481507J170615J087610P97286J445831J683751L22300j345701j814317
35173A865868j734976k076025j895965j33121J903431K108395O72553m72297n75727
35164c37864m26115k90908L94976J302242J121223l57657j626099j515752o14958
35155b350912K0224M03482R51919J209390M64650p67431j156814n32466k74078
$$ plain form
35217 -507146 -479785 -178756 1815673 4394778 4922561 2737296 -252223 -1907218 -1349305
35208 -1349305 1006534 3472521 4071349 2779022 1675195 1782983 1503444 -308615 -1859186
35199 -1859186 -1295881 -71730 -505972 -1658919 -1137260 167136 -787589 -3627371 -4392857
35190 -4392857 -1626862 1349034 1652012 710268 889450 1435052 487452 -1197382 -1481507
35181 -1481507 -310892 776718 1574004 3019835 4703586 5025886 3680185 1865868
35173 1865868 130892 -1945133 -3841098 -3974219 -2070788 37607 710160 237863 -337864
35164 -337864 -763979 -1054887 -659911 642331 1763554 1405897 -220202 -1735954 -2350912
35155 -2350912 -2330688 -1927206 -975287 234103 698753 -68678 -1225492 -1757958 -2032036
35146b032036j180987j912389o48875K062542L443408J840707j081843k300109
35138a809582r31631J147161J798701O81195j111218k365647k405965j286890
35130f283876K12800J280929J903654K442132K500635J285736p35846j830884
35122G75280j225118j07658L42827O05182J369546J768750P00103j008610j594936
35113A625366r77360n59368q08076r04753n64704k50748K74840J489263K256464
35104A580924Q99676j559978j938138M84660K558639J817569j62923p66078k83547
35095B630804n18312j327878j173640O7788J157603J451300R26217o00341k453203
35086A60338k703556p94103R74554P18748j06090M09774R80600k63603j512869
$$ plain form
35146 -2032036 -3213023 -5125412 -5774287 -3711745 -268337 1572370 490527 -1809582
35138 -1809582 -2741213 -1594052 204649 885844 -225374 -2591021 -4996986 -6283876
35130 -6283876 -6071076 -4790147 -2886493 -444361 2056274 3342010 2606164 775280
35122 775280 -449838 -557496 -214669 390513 1760059 3528809 4228912 3220302 1625366
35113 1625366 648006 88638 -719438 -1624191 -2188895 -2439643 -2164803 -675540 1580924
35104 1580924 2480600 920622 -1017516 -532856 2025783 3843352 3680429 2914351 2630804
35095 2630804 2112492 784614 -389026 -321238 836365 2287665 3213882 2613541 160338
35086 160338 -2543218 -3337321 -2362767 -1644019 -1750109 -1340335 -359735 -623338 -2136207
35077b136207J26586L107107L233031L88208j388825n33195K91105m52718j084266
35068A550826r57407j758433l126100k105654J083030J981704q04091k524564
35060f660689O8041L119892K117625o52898l72408K203356K669719N32718q85085
35051B140271n69774m70593r15229l11870J001468J004255j87423n99544l1694
35042A059867J48916M5544N24669O09385o85035j376158M15816K061363K8042
35033B832409l534549l469732L5538J932160P99728K01452J157385M26873k145957
35024a764693j859213K398227M761706J425674k999423k866625N3017P93302n56048
35015f14076o38198M28890L3591j350220j117262L27260M46042m40839J15169
$$ plain form
35077 -2136207 -2009621 1097486 4330517 4718725 3329900 2796705 3087810 2635092 1550826
35068 1550826 593419 -1165014 -4291114 -6396768 -5313738 -3332034 -4136125 -6660689
35060 -6660689 -6592648 -3472756 -1355131 -2008029 -2380437 -177081 2492638 3025356 2140271
35051 2140271 1570497 1099904 184675 -127195 874273 1878528 1691105 1091561 1059867
35042 1059867 1208783 1254327 1778996 2388381 1703346 327188 743004 2804367 2832409
35033 2832409 -702140 -4171872 -4136334 -2204174 -1404446 -1202994 -45609 381264 -1764693
35024 -1764693 -3623906 -1225679 3536027 4961701 1962278 -904347 -851330 -58028 -614076
35015 -614076 -1252274 -823384 -789793 -2140013 -3257275 -2930015 -2483973 -2924812 -2809643
35006b809643J639490J188782j192840j979687K36807K550176K217083J84470
34998B034638j098067r63797l97747k80708o75792q87150n3938J489957J979785
34989A147181M69099j520660k014416j259194o96667l65823N20387J285266N71748
34980a863079r47053j092334M97159J727824J088298m74969j210230p14255Q4098
34971b904541K53054j40812j03969Q95705J642741M94242j742586k153378J18801
34962c640743K166140J341790j044665k041783j131690L26860J855659L287835
34954A119403L054814K11822k907161l214472j261200m9890k46201J01969J545335
34945a645581K413638K024034J462067R80153k77007j699821j470721J71862Q95103
$$ plain form
35006 -2809643 -1170153 18629 -1174211 -3153898 -2917091 -366915 1850168 2034638
34998 2034638 936571 -27226 -424973 -705681 -1381473 -2268623 -2322561 -832604 1147181
34989 1147181 1616280 95620 -1918796 -3177990 -3874657 -4240480 -3720093 -2434827 -1863079
34980 -1863079 -2810132 -3902466 -3405307 -1677483 -589185 -1064154 -2274384 -2988639 -2904541
34971 -2904541 -2651487 -2792299 -2896268 -2000563 -357822 136420 -1606166 -3759544 -3640743
34962 -3640743 -1474603 -132813 -1177478 -3219261 -4350951 -4024091 -2168432 1119403
34954 1119403 4174217 4386039 1478878 -1735594 -2996794 -3046684 -3292885 -3190916 -1645581
34945 -1645581 768057 2792091 4254158 5234311 4957304 3257483 1786762 1958624 2853727
34936B853727k1195q42794o96821o93756j127021o76021O96174J060615j97412
34927C55496j248739r82796m19766L0222J531551L677064L668460N93817k406661
34918D798648k439912p44977p7993o67154j138878j252798j235384l12471J663568
34909a407351K828299J818716L9106o32871n33134n30053J04271J611182J831729
34900E129894n52848k920446k268054l7840L92646o03467j08087J546721J115298
34891A693817j540864k711594q86672J094832J242556J243839K177395J816664
34883D129973r55293k921039j297214J358991J017369j400667j855517O9777R83546
34874h70074j97804o91680Q48393J816231K24972j782860j463675K06818N71998
$$ plain form
34936 2853727 2832532 1989738 1292917 599161 -527860 -1203881 -507707 552908 355496
34927 355496 -893243 -1876039 -2295805 -2265583 -734032 2943032 6611492 7205309 4798648
34918 4798648 2358736 1613759 1535766 868612 -270266 -1523064 -2758448 -3070919 -1407351
34909 -1407351 1420948 3239664 3278770 2645899 2112765 1582712 1686983 3298165 5129894
34900 5129894 4577046 1656600 -611454 -649294 -256648 -860115 -968202 578519 1693817
34891 1693817 152953 -2558641 -3445313 -2350481 -1107925 135914 2313309 4129973
34883 4129973 3174680 253641 -1043573 315418 1332787 -67880 -1923397 -1853620 -870074
34874 -870074 -1067878 -1759558 -911165 905066 1130038 -652822 -2116497 -1909679 -1337681
34865a337681k84802k35709R05139J257119M38967K22801J159373J302010n10444
34856B916773k320184j727577N77075J848422J038705l11108o43054j63928J57589
34847A372713N4319j12043p5160J94404O15884R14094O88868j82820j301244j967659
34837B01356j713825p96406n4298J40041N50686J832805K824861J654496j107433
34828C532283k426060j081536K29246q37787k024711J56910M088862M417895K6899
34819F082001l744145k515238J283667K585502O92984j138432j070888j63632
34811B011819M30183N55129j14435j531039k017471k99214J629137P11498k161156
34802g85549k723010L82509L236429K175334j132792k443461p90098J041343R30669
$$ plain form
34865 -1337681 -1622483 -1858192 -953053 304066 743033 965834 2125207 3427217 2916773
34856 2916773 596589 -1130988 -553913 1294509 2333214 2022106 1379052 1215124 1372713
34847 1372713 1427032 1314989 1239829 1434233 2050117 2964211 3653079 3470259 2169015 201356
34837 201356 -1512469 -2308875 -2363173 -2223132 -1672446 160359 2985220 4639716 3532283
34828 3532283 1106223 24687 253933 -583854 -2608565 -2451655 1637207 6055102 6082001
34819 6082001 2337856 -177382 1106285 3691787 4384771 3246339 2175451 2011819
34811 2011819 2442002 2997131 2882696 1351657 -665814 -965028 664109 1375607 -785549
34802 -785549 -3508559 -3126050 110379 2285713 1152921 -1290540 -2080638 -1039295 -108626
34793a08626j65624k60348R42616J924451J246891p64031k243941j913291o33270
34784a975173l6954q7758M40738J294234Q45024o83960p99855J124282K047843
34775B168421j12708k510292j265457K340428L454288Q08447j761071j348431
34767A773625L54378P31288J30735K5943O8892n19511o81520O70459J993835R87488
34757E535612j662878k977427j811550L7277Q54062R33949J040426Q33251k44431
34748B538291j663461k246902j418209K78352J516396J231867p5105n21604P72889
34739D12514K047652J043033j535697k505499m86861K048295J972932n05578k330184
34730A60607j474152Q95802K173403J351351k24306q81639o27489n21896n97119
$$ plain form
34793 -108626 -274250 -534598 408018 2332469 3579360 2815329 571388 -1341903 -1975173
34784 -1975173 -2012127 -2099885 -1659147 -364913 480111 -203849 -1003704 120578 2168421
34775 2168421 2055713 -454579 -1720036 620392 4074680 4883127 3122056 1773625
34767 1773625 2128003 2859291 2990026 3015969 3084861 2565350 1883830 2554289 4548124 5535612
34757 5535612 3872734 895307 -916243 -878966 -24904 909045 1949471 2782722 2538291
34748 2538291 874830 -1372072 -2790281 -2511929 -995533 236334 161229 -360375 412514
34739 412514 2460166 3503199 1967502 -537997 -1024858 1023437 2996369 2490791 160607
34730 160607 -1313545 -417743 1755660 3107011 2882705 2001066 1373577 851681 254562
34721B54562J68582J571268J656579l57282k210656j505472O89125J399004J38403
34712A804113q92629p05798o53853j265272r87219P31720J837181Q80167m53215
34703B95195p3170J140593J021866k55982p64885j74156J6506o81638r98644k15209
34693f89524O99933P46871K22635j31620j80774r7309J19981L87273M14455J39822
34683A631743j90861n09174r87112j478040j381146l67335R79008J567434R83663
34674B48180J16366K00484J148329J487545M00088r81561j168911l93227J48541
34665A205834L44545Q12588J120289L96763o32959n01727K65157j96585j661669
34656A152236j912904o28001M86p20204p77412N45800J130893K02634J65682J891476
$$ plain form
34721 254562 423144 1994412 3650991 3293709 1083053 -422419 266706 1665710 1804113
34712 1804113 911484 205686 -448167 -1713439 -2700658 -1968938 -131757 748410 295195
34703 295195 222025 1362618 2384484 2128502 1363617 1189461 1205967 524329 -474315 -689524
34693 -689524 10409 757280 979915 848295 667521 570212 690193 1077466 1491921 1631743
34683 1631743 1440882 931708 -55404 -1533444 -2914590 -3281925 -2302917 -735483 248180
34674 248180 364546 565030 1713359 3200904 3600992 2619431 1450520 1057293 1205834
34665 1205834 1550379 2362967 3483256 3880019 3247060 2745333 3010490 2813905 1152236
34656 1152236 -760668 -1388669 -1388183 -2108387 -2885799 -2339999 -1209106 -1006472 -840790 1050686
34646A050686K207552o51585k997976j273990J781222J508755r81490j158793
34638e15619R18317J144908r92058j636699L73183J648257M48611p52290l62840
34629B73770k02705j098205p96652J424102K495585N65738j647283j329475P0121
34620b45004r6286j244091j189586J58572J399113J922574J517657j45852j879518
34611A97579j322290J356467K915937J953353J034894J786834J676271j228666
34603H370379l975746l157980n49917L8365j017419p45923O74298P54266j36340
34594B53983M03943J584620L12421k693783k958847O08351L477808K165144j013232
34585B140408k109006j026137j77368k25834k8075O37110P91718J30754n48940
$$ plain form
34646 1050686 3258238 2606653 -391323 -1665313 115909 1624664 643174 -515619
34638 -515619 402698 1547606 555548 -1081151 -707968 940289 1388900 636610 273770
34629 273770 71065 -1027140 -1823792 -399690 2095895 2661633 1014350 -315125 -245004
34620 -245004 -341290 -1585381 -2774967 -2616395 -1217282 705292 2222949 2077097 197579
34611 197579 -1124711 231756 3147693 5101046 6135940 7922774 9599045 8370379
34603 8370379 4394633 1236653 686736 725101 -292318 -1038241 -363943 390323 253983
34594 253983 657926 2242546 2554967 -138816 -3097663 -2489312 988496 3153640 2140408
34585 2140408 31402 -994735 -1172103 -1397937 -1426012 -788902 2816 133570 -415370
34576d15370n44326J06047Q45028R32037L7033j174484j584186q86500K23160
34567b461561R82197J004065J46558j113625j522524l77425J220641J522838L17548
34558b81288j021065j305449l98166J120360K094951J379537n06709j284653M2139
34549a60343J253704M2256k098801j821152Q94573K586676J424275n67812j077212
34540D76164m98811j85748r6993K64318L49577l88726j123747p00452O70185J708437
34530D74204J524524K82469j032816j348675o42935j77798p77069j391735o38147
34521c727978Q62085J411901J005584J040413J488422P88787j179166k433264
34513g43216j844252n87646P8202M06546P45481N77883p2936j42702O36321J120412
$$ plain form
34576 -415370 -959696 -853649 -8621 923416 960449 -214035 -1798221 -2684721 -2461561
34567 -2461561 -1479364 -475299 -328741 -1442366 -2964890 -3342315 -2121674 -598836 -281288
34558 -281288 -1302353 -2607802 -3005968 -1885608 209343 1588880 1082171 -202482 -160343
34549 -160343 1093361 1135617 -963184 -2784336 -1889763 696913 2121188 1553376 476164
34540 476164 -22647 -208395 -305388 -41070 308507 -80219 -1203966 -1904418 -1234233 474204
34530 474204 1998728 2281197 1248381 -100294 -743229 -921027 -1698096 -3089831 -3727978
34521 -3727978 -2865893 -1453992 -448408 592005 2080427 2869214 1690048 -743216
34513 -743216 -2587468 -3175114 -3096912 -2690366 -1944885 -1367002 -1439938 -1582640 -946319 174093
$$ [...]
##END NTUPLES=NMR SPECTRUM
##END=
