##TITLE=31Pdec_59-2021
 CDCl3, 24 sc
 29.07.2021
##JCAMPDX= 6.0         $$ Bruker NMR JCAMP-DX V2.0
##DATA TYPE= NMR SPECTRUM
##DATA CLASS= NTUPLES
##ORIGIN= UXNMR, Bruker Analytische Messtechnik GmbH
##OWNER= root
$$ XWIN-NMR		Version 3.5
$$ Thu Jul 29 11:00:25 2021 Russian Standard Time (UT+4h)  she@DPX200
##.OBSERVE FREQUENCY= 81.013821
##.OBSERVE NUCLEUS= ^31P
##.ACQUISITION MODE= SIMULTANEOUS
##.ACQUISITION SCHEME= undefined
##.AVERAGES= 24
##.DIGITISER RES= 16
##SPECTROMETER/DATA SYSTEM= spect
##.PULSE SEQUENCE= zgpg30
##.SOLVENT NAME= CDCl3
##.SHIFT REFERENCE= (INTERNAL, CDCl3, 0, 248.564)
##AUDIT TRAIL= $$ (NUMBER, WHEN, WHO, WHERE, WHAT)
$$ ##TITLE= Audit trail, XWIN-NMR		Version 3.5
$$ ##JCAMPDX= 5.01
$$ ##ORIGIN= Bruker BioSpin GmbH
$$ ##OWNER= she
$$ F:/spectra/data/she/nmr/P31/1/pdata/1/auditp.txt
$$ ##AUDIT TRAIL=  $$ (NUMBER, WHEN, WHO, WHERE, WHAT)
(   1,<2021-07-29 10:59:27.15 +0400>,<she>,<DPX200>,
      <created by zg, POWCHK disabled, PULCHK disabled
       configuration hash MD5:
       00 E9 B6 7A A2 85 ED C7 34 08 36 98 17 FE 4E 26
       data hash MD5: 32K
       EB A5 7F E7 6D 6E 0B A0 2E 33 14 D7 2B 10 20 54>)
(   2,<2021-07-29 10:59:29.76 +0400>,<she>,<DPX200>,
      <Start of raw data processing
       efp BC_mod = 2 LB = 1 FT_mod = 6 PKNL = 1 PHC0 = -7225.775 PHC1 = -262.1251 SI = 64K 
       data hash MD5: 64K
       E4 98 E9 67 ED 24 70 4E 5D 75 48 82 D1 60 C4 C8>)
(   3,<2021-07-29 10:59:51.79 +0400>,<she>,<DPX200>,
      <pk PHC0 = 77.22911 PHC1 = -101.2 
       data hash MD5: 64K
       BB 07 3E 2B 42 A7 A6 E0 A0 2E 07 55 56 06 65 64>)
(   4,<2021-07-29 10:59:55.48 +0400>,<she>,<DPX200>,
      <abs ABSG = 5 
       data hash MD5: 64K
       6F B1 35 E1 9B B3 50 C4 82 F2 59 30 26 89 30 64>)
$$ ##END=
$$ 
$$ hash MD5
$$ 27 94 86 96 7B 3C 88 4C B1 15 F3 78 01 FB 6A 24
##$RELAX= 
##$RELAX= 
##$RELAX= 
##$RELAX= 
##$RELAX= 
##$RELAX= 
##$RELAX= 
##$RELAX= 
$$ Bruker specific parameters
$$ --------------------------
##$DU= <F:/spectra>
##$EXPNO= 1
##$NAME= <P31>
##$PROCNO= 1
##$TYPE= <nmr>
##$USER= <she>
##$AMP= (0..31)
100 100 100 100 100 100 100 100 100 100 100 100 100 100 100 100 100 100 
100 100 100 100 100 100 100 100 100 100 100 100 100 100 
##$AQSEQ= 0
##$AQ_mod= 1
##$AUNM= <au_zg>
##$AUTOPOS= <>
##$BF1= 81.014009
##$BF2= 200.13
##$BF3= 200.13
##$BF4= 200.13
##$BF5= 200.13
##$BF6= 200.13
##$BF7= 200.13
##$BF8= 200.13
##$BYTORDA= 1
##$CFDGTYP= 0
##$CFRGTYP= 5
##$CHEMSTR= <none>
##$CNST= (0..31)
1 1 145 1 1 1 1 1 1 1 1 1 1 1 1 1 1 1 1 1 1 1 1 1 1 1 1 1 1 1 1 1 
##$CPDPRG= <waltz16>
##$CPDPRG1= <>
##$CPDPRG2= <waltz16>
##$CPDPRG3= <>
##$CPDPRG4= <mlev>
##$CPDPRG5= <mlev>
##$CPDPRG6= <mlev>
##$CPDPRG7= <mlev>
##$CPDPRG8= <mlev>
##$CPDPRGB= <>
##$CPDPRGT= <>
##$D= (0..31)
0 1 0 0 0 0 0 0 0 0 0 0.03 2e-05 3e-06 0 0 0 0 0 0 0 0 0 0 0 0 0 0 0 0 
0 0 
##$DATE= 1627541966
##$DBL= (0..7)
120 120 120 11 120 120 24 19 
##$DBP= (0..7)
150 150 150 150 150 150 150 150 
##$DBP07= 0
##$DBPNAM0= <>
##$DBPNAM1= <>
##$DBPNAM2= <>
$$ [...]
##$SUBNAM3= <"">
##$SUBNAM4= <"">
##$SUBNAM5= <"">
##$SUBNAM6= <"">
##$SUBNAM7= <"">
##$SUBNAM8= <"">
##$SUBNAM9= <"">
##$SW= 501.771253377433
##$SWIBOX= (0..15)
0 1 3 0 0 0 0 0 0 0 0 0 0 0 0 0 
##$SW_h= 40650.406504065
##$TD= 32768
##$TD0= 1
##$TE= 0
##$TE2= 300
##$TE3= 300
##$TEG= 300
##$TL= (0..7)
0 120 53 12 22 120 120 120 
##$TP= (0..7)
150 150 150 150 150 150 150 150 
##$TP07= 0
##$TPNAME0= <>
##$TPNAME1= <>
##$TPNAME2= <>
##$TPNAME3= <>
##$TPNAME4= <>
##$TPNAME5= <>
##$TPNAME6= <>
##$TPNAME7= <>
##$TPOAL= (0..7)
0.5 0.5 0.5 0.5 0.5 0.5 0.5 0.5 
##$TPOFFS= (0..7)
0 0 0 0 0 0 0 0 
##$TUNHIN= 0
##$TUNHOUT= 0
##$TUNXOUT= 0
##$USERA1= <user>
##$USERA2= <user>
##$USERA3= <user>
##$USERA4= <user>
##$USERA5= <user>
##$V9= 5
##$VALIST= <valist>
##$VCLIST= <CCCCCCCCCCCCCCC>
##$VD= 0
##$VDLIST= <DDDDDDDDDDDDDDD>
##$VPLIST= <PPPPPPPPPPPPPPP>
##$VTLIST= <TTTTTTTTTTTTTTT>
##$WBST= 1024
##$WBSW= 4
##$XGAIN= (0..3)
0 0 0 0 
##$XL= 0
##$YL= 0
##$YMAX_a= 3164
##$YMIN_a= -3850
##$ZGOPTNS= <>
##$ZL1= 120
##$ZL2= 120
##$ZL3= 120
##$ZL4= 120
##$ABSF1= 248.5645
##$ABSF2= -253.2056
##$ABSG= 5
##$ABSL= 3
##$ALPHA= 0
##$AQORDER= 0
##$ASSFAC= 0
##$ASSFACI= 0
##$ASSFACX= 0
##$ASSWID= 0
##$AUNMP= <proc_1d>
##$AZFE= 0.1
##$AZFW= 0.5
##$BCFW= 0
##$BC_mod= 2
##$BYTORDP= 0
##$COROFFS= 0
##$CY= -3
##$DATMOD= 1
##$DC= 0
##$DFILT= <>
##$DTYPP= 0
##$F1P= 0
##$F2P= 0
##$FCOR= 1
##$FTSIZE= 65536
##$FT_mod= 6
##$GAMMA= 0
##$GB= 0
##$INTBC= 1
##$INTSCL= 5.30512e-09
##$ISEN= 30
##$LB= 1
##$LEV0= 0
##$LPBIN= 0
##$MAXI= 10000
##$MC2= 0
##$MEAN= 0
##$ME_mod= 0
##$MI= 50
##$NCOEF= 0
##$NC_proc= -8
##$NLEV= 6
##$NOISF1= 182.463
##$NOISF2= 159.3651
##$NSP= 0
##$NTH_PI= 0
##$NZP= 0
##$OFFSET= 248.5645
##$PC= 4
##$PHC0= -7148.546
##$PHC1= -363.3251
##$PH_mod= 1
##$PKNL= yes
##$PPARMOD= 0
##$PSCAL= 0
##$PSIGN= 0
##$REVERSE= no
##$SF= 81.014009
##$SI= 65536
##$SIGF1= 159.3651
##$SIGF2= -187.1042
##$SINO= 113.3802
##$SIOLD= 16384
##$SREGLST= <1H.CDCl3>
##$SSB= 0
##$STSI= 65536
##$STSR= 0
##$SW_p= 40650.406504065
##$SYMM= 0
##$S_DEV= 0
##$TDeff= 32768
##$TDoff= 0
##$TI= <>
##$TILT= no
##$TM1= 0
##$TM2= 0
##$TOPLEV= 0
##$USERP1= <user>
##$USERP2= <user>
##$USERP3= <user>
##$USERP4= <user>
##$USERP5= <user>
##$WDW= 1
##$XDIM= 65536
##$YMAX_p= 527000547
##$YMIN_p= -57679331
$$ End of Bruker specific parameters
$$ ---------------------------------
##NTUPLES= NMR SPECTRUM
##VAR_NAME=  FREQUENCY,     SPECTRUM/REAL,   SPECTRUM/IMAG
##SYMBOL=    X,             R,               I
##VAR_TYPE=  INDEPENDENT,   DEPENDENT,       DEPENDENT
##VAR_FORM=  AFFN,          ASDF,            ASDF
##VAR_DIM=   65536,         65536,           65536
##UNITS=     HZ,            ARBITRARY UNITS, ARBITRARY UNITS
##FACTOR=    0.620285442955139, 1,           1
##FIRST=     20137.2065510759, 0,            0
##LAST=      -20513.1999529892, 0,           0
##MIN=       -20513.1999529892, -57679331,   0
##MAX=       20137.2065510759, 527000547,    0
$$ Real data points
##PAGE= N=1
##DATA TABLE= (X++(R..R)), XYDATA
$$ [...]
$$ plain form
35001 -5657800 -7955429 -7526152 -7729732 -8460542 -8287924 -7438188 -6024114 -2951696 1121008
34992 1121008 3214872 2654290 2756137 5381391 7284143 5034650 508760 -2257769
34984 -2257769 -3295712 -5524816 -8636313 -8616793 -3766470 2266076 4796410 3479750
34976 3479750 2088920 3765260 7347129 8492249 4532222 -2051660 -5874890 -4340224
34968 -4340224 207154 4056814 5842552 5929444 4464750 1973156 315142 815658 2218877
34959 2218877 2336318 994556 -433057 -1625414 -3299790 -4992184 -5139093 -3603330
34951 -3603330 -2104484 -1542808 -626794 1924750 5155555 6960122 6574692 4985438 3422622
34942 3422622 2411084 1995156 1977862 1950973 1740075 1732323 2100474 1939787 324220 -1643384
$$ packed form
35001e657800k297629M29277k03580p30810J72618Q49736J414074L072418M072704
34992A121008K093864n60582J01847K625254J902752k249493m525890k766529
34984b257769j037943k229104l111497J9520M850323O032546K530334j316660
34976C479750j390830J676340L581869J145120l960027o583882l823230J534666
34968d340224M547378L849660J785738Q6892j464694k491594j658014N00516J403219
34959B218877J17441j341762j427613j192357j674376j692394j46909J535763
34951c603330J498846N61676R16014K551544L230805J804567l85430j589254j562816
34942C422622j011538m15928j7294k6889k10898p752L68151j60687j615567j967604
$$ plain form
34932 -1643384 -1400378 1451966 3536355 1627728 -2579820 -4105853 -1224594 2233294
34924 2233294 2215286 -267087 -1207307 559425 2054956 386242 -3661552 -6635541 -6063019
34915 -6063019 -2822265 -43077 592504 975625 3705399 7627743 8826841 6396173
34907 6396173 3924252 3853085 3962516 1941030 -213398 -61928 302130 -1993620 -4401236
34898 -4401236 -2338387 2592514 4151905 1164325 -825529 1232214 3390504 1914322
34890 1914322 -710831 -522167 1759663 3223258 3763650 4601375 4676898 2389150 -1225676
34881 -1225676 -4332312 -7098748 -9548430 -9139489 -4170047 2514282 7017659 9649735
34873 9649735 12606970 14304431 11123589 4173638 -895132 -1396086 -204822 311545
$$ packed form
34932a643384K43006K852344K084389j908627m207548j526033K881259L457888
34924B233294j8008k482373r40220J766732J495531j668714m047794k973989N72522
34915f063019L240754K779188O35581L83121K729774L922344J199098k430668
34907F396173k471921p1167J09431k021486k154428J51470L64058k295750k407616
34898d401236K062849M930901J559391k987580j989854K057743K158290j476182
34890A914322k625153J88664K281830J463595N40392Q37725P5523k287748l614826
34881a225676l106636k766436k449682M08941M969442O684329M503377K632076
34873I649735K957235J697461l180842o949951n068770n00954J191264N16367
$$ plain form
34865 311545 2122447 6552144 9435811 5632323 -3210116 -9658976 -9494867 -6185891
34857 -6185891 -5001279 -5741287 -4430079 -617844 1424887 -392136 -2147457 152342
34849 152342 4051417 4270394 838046 -1424009 -815194 -690973 -2879755 -4638412 -4033146
34840 -4033146 -3305675 -4161203 -4309979 -2154138 -849089 -3546382 -7730006 -8550002 -5417322
34831 -5417322 -1364907 1837656 3883659 3444812 -14315 -3366347 -3049008 -223840
34823 -223840 1091913 86551 -315752 1864602 5803020 9742746 11766137 10233858
34815 10233858 6496685 5027404 7421383 9035719 5808663 1087603 71770 817701
34807 817701 -1843056 -5879825 -4514737 1558619 4059856 513203 -1928165 890140
$$ packed form
34865C11545J810902M429697K883667l803488q842439o448860J64109L308976
34857f185891J184612p40008J311208L812235K042731j817023j755321K299799
34849A52342L899075K18977l432348k262055O08815J24221k188782j758657O05266
34840d033146P27471q55528j48776K155841J305049k697293m183624q19996L132680
34831e417322M052415L202563K046003m38847l459127l352032L17339K825168
34823b23840J315753j005362m02303K180354L938418L939726K023391j532279
34815A0233858l737173j469281K393979J614336l227056m721060j015833P45931
34807H17701k660757m036769J365088O073356K501237l546653k441368K818305
$$ plain form
34799 890140 3125857 -407002 -5095656 -4724746 -1793692 -1876424 -3148220 -223965 5037144
34790 5037144 5565662 684373 -2628838 -592246 2379575 1186682 -3180846 -6625725
34782 -6625725 -7322752 -5767015 -2685822 879563 3532852 5099504 6710588 8714397
34774 8714397 10297679 11373015 12436315 12009944 7042195 -2468544 -11246858 -13372005
34766 -13372005 -8570789 -2387848 -251087 -2465778 -5215914 -5528259 -4236745 -3986653
34758 -3986653 -5487875 -7028272 -7298595 -6933943 -6699500 -5665390 -2414571 2569049 6673968
34749 6673968 7274321 4023454 -565527 -3145245 -2798324 -1631878 -1371324 -1043084 57003
34740 57003 -632962 -5087909 -9376965 -7688127 -1769511 -118093 -5830113 -11565591 -10337657
$$ packed form
34799H90140K235717l532859m688654L70910K931054q2732j271796K924255N261109
34790E037144N28518m881289l313211K036592K971821j192893m367528l444879
34782f625725o97027J555737L081193L565385K653289J566652J611084K003809
34774H714397J583282J075336J063300m26371m967749r510739q778314k125147
34766a3372005M801216O182941K136761k214691k750136l12345J291514K50092
34758c986653j501222j540397k70323L64652K34443J034110L250819M983620M104919
34749F673968O00353l250867m588981k579718L46921J166446K60554L28240J100087
34740E7003o89965m454947m289056J688838N918616J651418n712020n735478J227934
$$ plain form
34731 -10337657 -5497407 -4475498 -7120338 -7095606 -2447585 2068089 2555858 24700
34723 24700 -3152325 -5757104 -6456049 -4534954 -2211598 -2192925 -3062147 -1334930 2259067
34714 2259067 3528721 1985069 1722976 3971549 4299164 -307915 -6213002 -7982900
34706 -7982900 -5000581 -597314 2293603 2175005 -1217058 -5402745 -6014809 -1872828
34698 -1872828 2818508 3604167 1183464 -294434 1593555 5833990 9476951 9390034 4808215
34689 4808215 -471974 -1129042 2916106 5831181 3795379 43109 -624009 1268125
34681 1268125 2109548 1368893 1267056 2223916 2647505 1974630 586182 -1748059 -4151374
34672 -4151374 -3513179 1014696 4442781 1496792 -5680706 -10211114 -9742095 -7765675
$$ packed form
34731a0337657M840250J021909k644840K4732M648021M515674M87769k531158
34723B4700l177025k604779o98945J921095K323356J8673q69222J727217L593997
34714B259067J269654j543652k62093K248573L27615m607079n905087j769898
34706g982900K982319M403267K890917j18598l392063m185687o12064M141981
34698a872828M691336P85659k420703j477898J887989M240435L642961q6917m581819
34689D808215n280189o57068M045148K915075k035802l752270o67118J892134
34681A268125Q41423p40655j01837R56860M23589o72875j388448k334241k403315
34672d151374O38195M527875L428085k945989p177498m530408M69019J976420
$$ plain form
34664 -7765675 -6369197 -3748476 294063 2279598 560396 -1951771 -2866228 -3723239
34656 -3723239 -5747033 -6405906 -3601964 -4572 460703 -1810111 -3349164 -2701409 -1195316
34647 -1195316 70419 1200906 2197212 2715265 2405605 336311 -4218792 -9055462 -9588187
34638 -9588187 -4527278 1184024 2098986 -745364 -1815104 1192305 5121526 6307084
34630 6307084 4374561 1159468 -1095349 -321459 3660171 7654184 8047598 5546915
34622 5546915 4100577 4838988 4723034 2431070 1597375 5248881 9930219 9311836 2453304
34613 2453304 -5214560 -8925207 -9170275 -8701307 -8222894 -6872937 -4732409 -2551428 -227582
34604 -227582 2178497 2705793 -630454 -6223051 -9817549 -9893283 -9472787 -10902026 -11445028
$$ packed form
34664g765675J396478K620721M042539J985535j719202k512167r14457q57011
34656c723239k023794o58873K803942L597392M65275k270814j539053O47755J506093
34647a195316J265735J130487R96306N18053l09660k069294m555103m836670n32725
34638i588187N060909N711302R14962k844350j069740L007409L929221J185558
34630F307084j932523l215093k254817P73890L981630L994013L93414k500683
34622E546915j446338P38411j15954k291964q33695L651506M681338o18383o858532
34613B453304p667864l710647k45068M68968M78413J349957K140528K180981K323846
34604b27582K406079N27296l336247n592597l594498p5734M20496j429239n43002
$$ plain form
34595 -11445028 -7227704 -114731 3314005 -61266 -6160325 -9154442 -7671428 -4188033
34587 -4188033 -1247657 -489037 -2850881 -6795877 -8070277 -4385286 646626 1267433
34579 1267433 -3248030 -7980252 -8645994 -5732699 -2406955 -1069010 -2350764 -5052268
34571 -5052268 -6544628 -5325918 -3361511 -3705733 -6015452 -7308622 -7075571 -7809728 -9638117
34562 -9638117 -8749134 -3421983 2218651 3675261 2240023 2022525 3324359 3243229 1255102
34553 1255102 -405054 -1301551 -3156475 -5393112 -4745541 -590110 3069235 2745510 -366641
34544 -366641 -3164167 -4850294 -6280353 -7378827 -7488346 -6595282 -4289182 610409 7257028
34535 7257028 11636858 10984413 7661748 5525215 4063385 314845 -4204886 -3828971
$$ packed form
34595a1445028M217324P112973L428736l375271o099059k994117J483014L483395
34587d188033K940376P58620k361844l944996j274400L684991N031912O20807
34579A267433m515463m732222o65742K913295L325744J337945j281754k701504
34571e052268j492360J218710J964407l44222k309719j293170K33051p34157j828389
34562i638117Q88983N327151N640634J456610j435238k17498J301834q1130j988127
34553A255102j660156q96497j854924k236637O47571M155431L659345l23725l112151
34544c66641k797526j686127j430059j098474j09519Q93064K306100M899591O646619
34535G257028M379830o52445l322665k136533j461830l748540m519731L75915
$$ plain form
34527 -3828971 2623686 8345374 6797268 139249 -4263388 -3500503 -1203513 -1080800
34519 -1080800 -2614987 -3507893 -2805927 -492445 3200340 6683473 7463126 5191413 2532002
34510 2532002 1696172 1803148 1021315 -386805 -834642 154409 1960015 4108358 5891696
34501 5891696 6018978 4450873 3385689 4475520 6258160 6519285 5932282 6645697 8248649
34492 8248649 8320695 6554933 5026601 4407434 3327365 1713802 1028323 557751 -2316927
34483 -2316927 -6744147 -7869436 -4264249 -1329543 -3263607 -5678942 -1887772 6046334
34475 6046334 9340971 5149741 319256 870876 4001592 4095449 1664727 1185592 3056828
34466 3056828 3522122 1825988 1946635 5994737 10210437 9886835 5365184 562670 -2305291
$$ packed form
34527c828971O452657N721688j548106o658019m402637P62885K296990J22713
34519a080800j534187q92906P01966K313482L692785L483133P79653k271713k659411
34510B532002q35830J06976p81833j408120m47837R89051J805606K148343J783338
34501E891696J27282j568105j065184J089831J782640K61125n87003P13415J602952
34492H248649P2046j765762j528332o19167j080069j613563o85479m70572k874678
34483b316927m427220j125289L605187K934706j934064k415335L791170P934106
34475F046334L294637m191230m830485N51620L130716R3857k430722m79135J871236
34466C056828M65294j696134J20647M048102M215700l23602m521651m802514k867961
$$ plain form
34457 -2305291 -3667020 -3847554 -2810710 -2091618 -3434136 -5201012 -3795944 227721
34449 227721 1474588 -2322102 -5389315 -1262722 7416013 11762144 8441774 2959808
34441 2959808 612273 29368 -1854777 -3688439 -2742927 -509842 -603582 -3044398 -4821844
34432 -4821844 -4839738 -4394616 -3729769 -2069573 -566674 -1233962 -2842963 -1673290 2955021
34423 2955021 7152401 7303429 3620874 -1697340 -6696436 -9112304 -7018760 -2013121
34415 -2013121 883949 -1173579 -5203072 -6506236 -4913686 -4456819 -7421423 -11030305
34407 -11030305 -10653387 -5313706 816868 2746830 293388 -1811734 -173394 2668507
34399 2668507 2058819 -1760518 -3865910 -1647302 2127695 4023527 4116990 3949133 3667317
$$ packed form
34457b305291j361729j80534J036844P19092j342518j766876J405068M023665
34449B27721J246867l796690l067213M126593Q678735M346131l320370n481966
34441B959808k347535n82905j884145j833662R45512K233085r3740k440816j777446
34432d821844j7894M45122O64847J660196J502899o67288j609001J169673M628311
34423B955021M197380J51028l682555n318214m999096k415868K093544N005639
34415b013121K897070k057528m029493j303164J592550M56867k964604l608882
34407a1030305L76918N339681O130574J929962k453442k105122J638340K841901
34399B668507o09688l819337k105392K218608L774997J895832R3463j67857k81816
$$ plain form
34390 3667317 3431839 4784369 7884949 9567233 6955818 1474241 -3151300 -5278606
34382 -5278606 -5392635 -3677745 -583321 1592022 1001476 -578517 84209 2891656 4811147
34373 4811147 4637895 4160362 4586414 5065797 5269684 6355889 8471488 10096786 10903875
34364 10903875 12397014 14179496 12443609 4769510 -5345774 -11548638 -11512853 -8408470
34356 -8408470 -5835853 -3841795 -811894 2600620 3403290 -36685 -5724811 -10213528
34348 -10213528 -12115074 -12271343 -11182255 -8459310 -5125829 -3812508 -5008114 -5367857
34340 -5367857 -2267447 1768253 2467947 419690 183763 2968616 4722985 2721971
34332 2721971 -283466 -817946 240710 541525 1016600 3640801 6541990 5929747 2110422
$$ packed form
34390C667317k35478J352530L100580J682284k611415n481577m625541k127306
34382e278606j14029J714890L094424K175343n90546j579993O62726K807447J919491
34373D811147j73252m77533M26052M79383K03887J086205K115599J625298Q07089
34364A0903875J493139J782482j735887p674099j0115284o202864L5785L104383
34356h408470K572617J994058L029901L412514Q02670l439975n688126m488717
34348a0213528j901546j56269J089088K722945L333481J313321j195606l59743
34340e367857L100410M035700O99694k048257k35927K784853J754369k001014
34332B721971l005437n34480J058656L00815M75075K624201K901189o12243l819325
$$ plain form
34323 2110422 -745940 -800372 -347976 -846518 -361840 2296700 4503192 3504965 680346
34314 680346 -680791 -162483 -15967 -1206095 -2380630 -2444659 -1754064 -557127 1776367
34305 1776367 5385497 9067294 11298130 11351715 9388684 6308871 3496609 1880680
34297 1880680 1253070 1020873 1034525 834680 -942005 -4770126 -8441460 -9020266 -6439381
34288 -6439381 -3231611 -834841 1510956 4011806 5199228 4454442 3072747 1648273
34280 1648273 -848871 -3829260 -4141190 -1006302 1287195 -480176 -2376769 1195571
34272 1195571 7368950 6951352 -2210429 -10707112 -9965199 -3777180 -2173192 -7352021
34264 -7352021 -12092377 -10961609 -6688297 -4287204 -4248659 -4348285 -4518000 -6386465 -9710472
$$ packed form
34323B110422k856362n4432M52396m98542M84678K658540K206492r98227k824619
34314F80346j361137N18308J46516j190128j174535o4029O90595J196937K333494
34305A776367L609130L681797K230836N3585j963031l079813k812262j615929
34297A880680o27610k32197J3652j99845j776685l828121l671334n78806K580885
34288f439381L207770K396770K345797K500850J187422p44786j381695j424474
34280A648273k497144k980389l11930L134888K293497j767371j896593L572340
34272A195571O173379m17598r161781q496683P41913O188019J603988n178829
34264g352021m740356J130768M273312K401093L8545r9626j69715j868465l324007
$$ plain form
34255 -9710472 -12183815 -12098936 -9366130 -4928480 -986167 -483841 -3819154 -6799073 -4788357
34246 -4788357 1073743 4710114 2762286 -1600439 -3877643 -4091852 -4768815 -5585545 -3999425
34237 -3999425 -322607 1940173 1299027 226158 739333 1343632 224979 -1432236 -1803643
34228 -1803643 -1736571 -2819692 -3979752 -3216621 -1449285 -1190614 -2151990 -1840886 -353102
34219 -353102 -613044 -3090134 -4113131 -1210466 2959298 4195740 1978222 -922075
34211 -922075 -1992314 -167356 4349848 8951906 9181919 3536158 -3235921 -4647680
34203 -4647680 -33644 4955351 5217695 974077 -4369396 -8226087 -9641374 -8437812
34195 -8437812 -5350115 -2018861 357629 1805276 2535203 2158960 624696 -1118739
$$ packed form
34255i710472k473343Q4879K732806M437650L942313N02326l335313k979919K010716
34246d788357N862100L636371j947828m362725k277204k14209o76963q16730J586120
34237c999425L676818K262780o41146j072869N13175O04299j118653j657215l71407
34228a803643O7072j083121j160060P63131J767336K58671r61376L11104J487784
34219c53102k59942k477090j022997K902665M169764J236442k217518k900297
34211i22075j070239J824958M517204M602058K30013n645761o772079j411759
34203d647680M614036M988995K62344m243618n343473l856691j415287J203562
34195h437812L087697L331254K376490J447647P29927l76243j534264j743435
$$ plain form
34187 -1118739 -2311334 -3369061 -4716238 -5502747 -4786122 -3386687 -2982268 -3545722 -3448477
34178 -3448477 -2379793 -2144129 -3491306 -4153112 -2098412 773071 1143222 -225143 769745
34169 769745 4785183 7117812 4692282 1116230 1179289 3456717 3309767 1223626 1972251
34160 1972251 5555083 5628977 -634432 -6828590 -5640905 951058 4619643 1731322
34152 1731322 -3200951 -4497351 -1838475 649665 -684512 -5500803 -9497549 -8240552
34144 -8240552 -2048097 3819682 4868172 1809403 -1750881 -3633983 -3128687 377842
34136 377842 5362122 7031379 2604202 -3533415 -4624192 -1014079 155322 -4743715
34128 -4743715 -10886626 -12148597 -8639193 -4269771 -561883 3257302 6224757 5947149
$$ packed form
34187a118739j192595j057727j347177p86509P16625J399435M04419n63454R7245
34178c448477J068684K35664j347177o61806K054700K871483L70151j368365R94888
34169G69745M015438K332629k425530l576052O3059K277428j46950k086141P48625
34160A972251L582832P3894o263409o194158J187685O591963L668585k888321
34152A731322m932273j296400K658876K488140j334177m816291l996746J256997
34144h240552O192455N867779J048490l058769l560284j883102N05296L506529
34136C77842M984280J669257m427177o137617j090777L610113J169401m899037
34128d743715o142911j261971L509404M369422L707888L819185K967455k77608
$$ plain form
34120 5947149 2779250 669998 2942312 8478582 12552521 11043640 4098184 -3906851
34112 -3906851 -8205803 -7555630 -4242174 -1078171 484810 155504 -1256947 -1922170 -989299
34103 -989299 -270512 -1670536 -3360251 -1783045 2219335 3295726 -651139 -4342216
34095 -4342216 -1762967 5822295 11891335 12685000 9605076 5122908 477137 -2879140
34087 -2879140 -3573774 -2791858 -3206144 -4554315 -3450188 1022429 4678805 3600148 -194597
34078 -194597 -1412841 1520773 5255347 6731008 6269763 4992109 2509886 -915819
34070 -915819 -2460042 76679 4222632 4927216 749187 -4509492 -6866060 -6600914 -6586097
34061 -6586097 -8021076 -9381778 -8683905 -5653488 -2188859 -1017392 -2847100 -4739140
$$ packed form
34120E947149l167899k109252K272314N536270M073939j508881o945456q005035
34112c906851m298952O50173L313456L164003J562981l29306j412451o65223R32871
34103i89299P18787j400024j689715J577206M002380J076391l946865l691077
34095d342216K579249P585262O069040P93665l079924m482168m645771l356277
34087b879140o94634P81916m14286j348171J104127M472617L656376j078657l794745
34078a94597j218244K933614L734574J475661m61245j277654k482223l425705
34070i15819j544223K536721M145953P04584m178029n258679k356568K65146J4817
34061f586097j434979j360702O97873L030417L464629J171467j829708j892040
$$ plain form
34053 -4739140 -3034423 1770650 5282335 4917844 2503901 92383 -3043933 -6688793
34045 -6688793 -6916859 -1541531 4383725 3925057 -2109333 -6281642 -4763453 -894752
34037 -894752 1720397 3617849 5284216 4362461 301036 -2655927 -885569 3330826
34029 3330826 5302312 4056749 1825066 -96350 -1520142 -1234780 1884721 6451683
34021 6451683 9546837 9216306 4798775 -2967249 -10474270 -12854220 -9736531 -6634230
34013 -6634230 -7499507 -8850865 -5401689 1038774 3549640 -126890 -5062422 -6460881
34005 -6460881 -4713447 -2377098 -492366 539296 -62976 -1769664 -2617554 -2166075 -2202785
33996 -2202785 -3388443 -3847045 -2614326 -1899913 -3735554 -6359586 -6558132 -4529036 -3708774
$$ packed form
34053d739140J704717M805073L511685l64491k413943k411518l136316l644860
34045f688793k28066N375328N925256m58668o034390m172309J518189L868701
34037h94752K615149J897452J666367r21755m061425k956963J770358M216395
34029C330826J971486j245563k231683j921416j423792K85362L119501M566962
34021F451683L095154l30531m417531p766024p507021k379950L117689L102301
34013f634230q65277j351358L449176O440463K510866l676530m935532j398459
34005f460881J747434K336349J884732J031662o02272j706688q47890M51479l6710
33996b202785j185658m58602J232719P14413j835641k624032j98546K029096Q20262
$$ plain form
33987 -3708774 -5753440 -7965429 -6638481 -1580401 3959324 7157508 7811887 6662975
33979 6662975 3605899 -950380 -4465637 -4465279 -1891636 122778 515016 542069 -15758
33970 -15758 -3089376 -7833890 -9956385 -7621347 -4482437 -4370314 -6408803 -8168997 -9866674
33961 -9866674 -11689278 -10649236 -5020148 828460 1304209 -2614390 -5497484 -5437444 -4494882
33952 -4494882 -3117784 -447385 1013454 -2079163 -7054363 -7937501 -5221048 -5346352
33944 -5346352 -9317286 -10051353 -3964952 2635166 3136510 -137459 -1428389 -563487 -812165
33935 -812165 -2336942 -3488113 -4958931 -7364208 -8086880 -5607219 -3420528 -4273448 -4203314
33926 -4203314 1347466 8575726 9653129 4206918 -716145 -1316847 -598680 -1215781 -1672016
$$ packed form
33987c708774k044666k211989J326948N058080N539725L198184O54379j148912
33979F662975l057076m556279l515257L58K573643K014414L92238K7053n57827
33970a5758l073618m744514k122495K335038L138910J12123k038489j760194j697677
33961i866674j822604J040042N629088N848608M75749l918599k883094O0040R42562
33952d494882J377098K670399J460839l092617m975200q83138K716453j25304
33944e346352l970934p34067O086401O600118N01344l273969j290930Q64902k48678
33935h12165j524777j151171j470818k405277p22672K479661K186691q52920P0134
33926d203314N550780P228260J077403n446211m923063o00702P18167o17101m56235
$$ plain form
33917 -1672016 -827835 -168415 42442 1698126 4493863 5531279 4571063 4619158 5786422
33908 5786422 4017989 -1728854 -6403566 -6191525 -4049455 -3956053 -4032308 -464450 4840050
33899 4840050 6279125 3011573 63844 754026 2483313 1442540 -1796413 -3545691
33891 -3545691 -2156155 220119 760899 -680207 -2142655 -2689933 -3236266 -3741344 -1795048
33882 -1795048 3685814 8851063 8565118 3490066 -368874 -80342 405138 -2841182 -6844659
33873 -6844659 -5714297 603191 5843884 5288652 650214 -3156069 -3353451 -762497
33865 -762497 1993490 2833972 1815993 673999 256496 -648720 -2650263 -3335853 -205716
33856 -205716 4488598 5160230 54633 -5873201 -7082251 -4302013 -2825516 -5201165
$$ packed form
33917a672016Q44181O59420K10857J655684K795737J037416r60216M8095J167264
33908E786422j768433n746843m674712K12041K142070R3402p6255L567858N304500
33899D840050J439075l267552k947729O90182J729287j040773l238953j749278
33891c545691J389536K376274N40780j441106j462448n47278n46333n05078J946296
33882a795048N480862N165249k85945n075052l858940K88532M85480l246320m003477
33873f844659J130362O317488N240693n55232m638438l806283j97382K590954
33865g62497K755987Q40482j017979j141994m17503r05216k001543o85590L130137
33856b05716M694314O71632n105597n927834j209050K780238J476497k375649
$$ plain form
33848 -5201165 -8495053 -8891855 -6451327 -4113061 -3649457 -4259420 -4413121 -3447174 -1463138
33839 -1463138 883594 2253148 1619978 -90796 -619034 646523 1540552 18620 -2983106
33830 -2983106 -4974673 -5247870 -5148123 -5694600 -6686048 -7749924 -8560548 -8389654 -7138145
33821 -7138145 -6216154 -6366753 -5411401 -1010506 4708742 6801137 4242735 1283797 790074
33812 790074 128682 -3803036 -8779992 -10016341 -6769372 -2743624 -916725 -889617 -858141
33803 -858141 138161 1696206 2394525 1448133 660786 2483799 5070683 2963050 -4560859
33794 -4560859 -9928149 -6830803 -18531 815194 -5049812 -9089727 -7039226 -4469037
33786 -4469037 -6589342 -10189623 -10213053 -8060384 -7477166 -6848969 -2372132 3893819 6143181
$$ packed form
33848e201165l293888l96802K440528K338266M63604o09963j53701R65947J984036
33839a463138K346732J369554o33170j710774n28238J265557Q94029j521932l001726
33830b983106j991567k73197R9747n46477r91448j063876q10624J70894J251509
33821g138145R21991j50599R55352M400895N719248K092395k558402k958938m93723
33812G90074o61392l931718m976956j236349L246969M025748J826899K7108L1476
33803h58141R96302J558045O98319r46392p87347J823013K586884k107633p523909
33794d560859n367290L097346O812272Q33725n865006m039915K050501K570189
33786d469037k120305l600281k3430K152669N83218O28197M476837O265951K249362
$$ plain form
33777 6143181 3995675 2938469 5198315 6308343 2626673 -2856585 -5091064 -3551549
33769 -3551549 -1127393 671560 1931299 1670141 -1309673 -5428714 -7278277 -5713735
33761 -5713735 -2661300 104509 2296686 2843679 -406331 -6705162 -10786770 -8507536
33753 -8507536 -2829422 -487909 -2813882 -3910246 630576 7022642 8409597 4199416
33745 4199416 334990 1070120 4251355 5274770 2766289 -832879 -2429100 -944514
33737 -944514 2134977 4417688 5315906 6375495 8039877 7978283 4944084 2301580 3922208
33728 3922208 7790389 8362160 4979589 2686936 3980753 5381733 4071959 2296125
33720 2296125 2233462 1956284 351974 735023 4552440 6458405 2021391 -3696913 -2777366
$$ packed form
33777F143181k147506j057206K259846J110028l681670n483258k234479J539515
33769c551549K424156J798953J259739k61158k979814m119041j849563J564542
33761e713735L052435K765809K192177N46993l250010o298831m081608K279234
33753h507536N678114K341513k325973j096364M540822O392066J386955m210181
33745D199416l864426P35130L181235J023415k508481l599168j596221J484586
33737i44514L079491K282711Q98218J059589J664382o1594l034199k642504J620628
33728C922208L868181N71771l382571k292653J293817J400980j309774j775834
33720B296125o2663k77178j604310L83049L817417J905965m437014n718304R19547
$$ plain form
33711 -2777366 2998089 4488392 -879013 -6016243 -5769165 -3333540 -2577991 -1495146
33703 -1495146 2416826 6085555 5341714 1719542 18292 1467034 3378784 3979667
33695 3979667 4069980 4697173 5667688 5887552 4024342 -12213 -3749710 -4381235 -2744633
33686 -2744633 -2242783 -3235755 -2270785 1806085 5315089 5683987 5554990 7590203 9347006
33677 9347006 7833025 5667697 7117842 10136231 8408157 910120 -6084917 -7327027
33669 -7327027 -4392055 -1836402 -1241534 -971779 541433 3056205 5013752 5147313 4291888
33660 4291888 5037041 8348619 11553960 11488263 8580088 5668941 3888495 2316175 791245
33651 791245 167645 249076 200708 481566 1641680 2062066 235103 -1437625 753986
$$ packed form
33711b777366N775455J490303n367405n137230K47078K435625P55549J082845
33703a495146L911972L668729p43841l622172j701250J448742J911750O00883
33695C979667R0313O27193R70515K19864j863210m036555l737497o31525J636602
33686b744633N01850r92972R64970M076870L509004L68898j28997K035213J756803
33677I347006j513981k165328J450145L018389j728074p498037o995037j242110
33669g327027K934972K555653N94868K69755J513212K514772J957547J33561q55425
33660D291888P45153L311578L205341o5697k908175k911147j780446j572320j524930
33651G91245o23600Q1431m8368K80858J160114M20386j826963j672728K191611
$$ plain form
33642 753986 5382235 6530792 2081627 -2817115 -2676694 1387610 4300403 4016069 2829804
33633 2829804 3097740 4466193 5233423 4723998 3920803 4229212 5782902 7348614 8085423
33624 8085423 8221624 7265633 3585616 -2357496 -6660577 -6867630 -5969393 -7496585 -8939598
33615 -8939598 -5825580 -864175 -1461437 -7564119 -10325018 -5722055 -1148742 -3243731
33607 -3243731 -6865524 -3900135 2805686 3840787 -1600610 -5005806 -2480800 307329
33599 307329 -1122590 -3210464 -2016063 -402955 -2344451 -5494195 -5373918 -3373432
33591 -3373432 -4396108 -8316044 -9725845 -6147859 -1441774 73165 -1147144 -2343565
33583 -2343565 -3061566 -4747178 -7419826 -9232492 -8888556 -6795952 -4093897 -2002925
$$ packed form
33642G53986M628249J148557m449165m898742J40421M064304K912793k84334j186265
33633B829804K67936J368453P67230n09425q03195L08409J553690J565712P36809
33624H085423J36201r55991l680017n943112m303081k07053Q98237j527192j443013
33615h939598L114018M961405n97262o102682k760899M602963M573313k094989
33607c243731l621793K965389O705821J035101n441397l405196K525006K788129
33599C07329j429919k087874J194401J613108j941496l149744J20277K000486
33591c373432j022676l919936j409801L577986M706085J514939j220309j196421
33583b343565p18001j685612k672648j812666L43936K092604K702055K090972
$$ plain form
33575 -2002925 -1921766 -4389044 -7444454 -7568638 -3347416 2713128 7003670 8558893 8904657
33566 8904657 9212008 9287622 8684709 6796507 2291351 -5029741 -11653351 -12455553 -6539339
33557 -6539339 1241693 5749836 6294652 4686038 1597604 -2378444 -4381505 -1865842
33549 -1865842 3058011 5296092 3113680 36427 -311035 1132630 804929 -2256374
33541 -2256374 -4845442 -3402576 1413035 5000716 4189121 1075159 -427221 -792489
33533 -792489 -3857972 -9206021 -10592737 -4932623 1656685 1678134 -3072971 -4673432 -1105939
33524 -1105939 1773226 435126 -1137744 1270634 5510944 7305215 6771615 6763635 7584787
33515 7584787 7121243 4553472 1008618 -2252998 -4246908 -4290834 -3258082 -3170573 -4301013
$$ packed form
33575b002925Q1159k467278l055410j24184M221222O060544M290542J555223L45764
33566H904657L07351P5614o02913j888202m505156p321092o623610q02202N916214
33557f539339P781032M508143N44816j608614l088434l976048k003061K515663
33549a865842M923853K238081k182412l077253l47462J443665l27701l061303
33541b256374k589068J442866M815611L587681q11595l113962j502380l65268
33533g92489l065483n348049j386716N660114O589308K1449m751105j600461L567493
33524a105939K879165j338100j572870K408378M240310J794271n33600p980Q21152
33515G584787m63544k567771l544854l261616j993910m3926J032752Q7509j130440
$$ plain form
33506 -4301013 -4779557 -4049189 -3675842 -3400501 -464763 4539717 5618973 -458900 -7631142
33497 -7631142 -7791625 -2128578 1132827 -841359 -2393683 404866 3332862 1127433
33489 1127433 -4081168 -5989079 -3014273 386726 327324 -2094525 -3196861 -1203721
33481 -1203721 2375481 4688021 4163190 1453719 -1771761 -4331391 -5529699 -4669368
33473 -4669368 -1870004 1029222 1747073 -313316 -4097930 -8386545 -11948994 -13170213
33465 -13170213 -11597030 -9423615 -9264246 -10624415 -10711279 -8486325 -5483998 -2812737
33457 -2812737 -264616 1401267 610941 -1676781 -2065988 298121 1924174 199245
33449 199245 -2356716 -1638149 2391291 6266930 7556936 6184953 2687595 -1951819
$$ packed form
33506d301013m78544P30368L73347K75341K935738N004480J079256o077873p172242
33497g631142j60483N663047L261405j974186j552324K798549K927996k205429
33489A127433n208601j907911K974806L400999n9402k421849j102336J993140
33481a203721L579202K312540n24831k709471l225480k559630j198308Q60331
33473d669368K799364K899226P17851k060389l784614m288615l562449j221219
33465a3170213J573183K173415J59369j360169q6864K224954L002327K671261
33457b812737K548121J665883p90326k287722l89207K364109J626053j724929
33449A99245k555961P18567M029440L875639J290006j371983l497358m639414
$$ plain form
33441 -1951819 -5531379 -6344616 -5358401 -4715090 -4712783 -4263503 -3556771 -3932928 -5452668
33432 -5452668 -6682423 -6704341 -5650035 -3778404 -1780541 -1203749 -2519180 -3626029 -2646308
33423 -2646308 -1287617 -2434577 -4948329 -4460349 264244 5260606 6750916 5419443
33415 5419443 3743504 1997050 -786141 -3933180 -5639985 -5199213 -2953108 738833
33407 738833 4703863 6302949 3719826 -1400116 -5098896 -4791668 -1088250 3337889
33399 3337889 5850834 5672696 4495497 4448870 4943697 3168576 -1187644 -3793408 -591801
33390 -591801 6386263 10830531 9388117 4607196 696121 -1028070 -1683830 -2077593 -2021406
33381 -2021406 -1387744 -540129 71068 232729 87300 -59565 -372641 -1473090 -3051956
$$ packed form
33441a951819l579560q13237R86215O43311K307M49280P06732l76157j519740
33432e452668j229755k1918J054306J871631J997863N76792j315431j106849R79721
33423b646308J358691j146960k513752M87980M724593M996362J490310j331473
33415E419443j675939j746454k783191l147039j706805M40772K246105L691941
33407G38833L965030J599086k583123n119942l698780L07228L703418M426139
33399C337889K512945j78138j177199m6627M94827j775121m356220k605764L201607
33390e91801O978064M444268j442414m780921l911075j724191o55760l93763N6187
33381b021406O33662Q47615O11197J61661j45429j46865l13076j100449j578866
$$ plain form
33372 -3051956 -3258357 -1000855 1603007 1241555 -1851746 -3539666 -1266758 2302085
33364 2302085 3004742 749817 -1239397 -1646185 -2231994 -3626692 -3356270 222605 4522048
33355 4522048 5748267 3900377 2143214 2003366 2032060 1098069 -82362 -1398430 -4184195
33346 -4184195 -7937442 -9087310 -5745177 -1600333 -1829125 -6358180 -10530427 -11605182
33338 -11605182 -10817499 -9257899 -6125233 -2162138 -685111 -2982891 -5839604 -5897727
33330 -5897727 -3697092 -1216710 1467765 4270932 5006358 2907208 1559148 3990353
33322 3990353 7008580 5384134 93642 -3243766 -3352140 -4268266 -6801743 -6104238 -476968
33313 -476968 3899437 1708481 -2964596 -2521733 2994583 6744440 5395274 2392574
$$ packed form
33372c051956k06401K257502K603862l61452l093301j687920K272908L568843
33364B302085P02657k254925j989214m06788n85809j394698K70422L578875M299443
33355D522048J226219j847890j757163j39848K8694r33991j180431j316068k785765
33346d184195l753247j149868L342133M144844k28792m529055m172247j074755
33338a1605182P87683J559600L132666L963095J477027k297780k856713n8123
33330e897727K200635K480382K684475K803167P35426k099150j348060K431205
33322C990353L018227j624446n290492l337408j08374r16126k533477O97505N627270
33313d76968M376405k190956m673077M42863N516316L749857j349166l002700
$$ plain form
33305 2392574 974182 -282521 -3291818 -6391173 -7040459 -5623513 -3973783 -2053154
33297 -2053154 1402476 5895427 8920545 8583631 5352065 1428756 -891720 -678078
33289 -678078 1012616 2126956 1762834 1155142 2102580 4644844 6930005 7527117 7184497
33280 7184497 7394597 7393372 4310582 -2409034 -8303953 -8452928 -4389196 -2855556 -6577375
33271 -6577375 -10197719 -8161410 -3000240 -1143785 -2866844 -2457047 1908112 4928372
33263 4928372 2809636 -635975 -330366 1996429 1033503 -3408462 -6223997 -4729576
33255 -4729576 -1808374 -987247 -2220312 -3430975 -3220028 -1235484 1524544 2289341 -694098
33246 -694098 -4370600 -3371873 2291681 5723084 1948515 -4948775 -7182273 -3518834
$$ packed form
33305B392574j418392j256703l009297l099355o49286J416946J649730J920629
33297b053154L455630M492951L025118l36914l231566l923309k320476K13642
33289f78078J690694J114340l64122o07692R47438K542264K285161N97112l42620
33280G184497K10100j225l082790o719616n894919j48975M063732J533640l721819
33271f577375l620344K036309N161170J856455j723059M09797M365159L020260
33263D928372k118736l445611L05609K326795r62926m441965k815535J494421
33255d729576K921202Q21127j233065j210663K10947J984544K760028P64797k983439
33246f94098l676502R98727N663554L431403l774569o897290k233498L663439
$$ plain form
33238 -3518834 284575 406209 -585068 799665 3326859 3546882 1360471 -103140 688711
33229 688711 1759402 976696 -582344 34940 3423985 6296325 5159634 1065001 -1054209
33220 -1054209 1394529 4807554 3738085 -1955922 -7030342 -7748580 -5796753 -4441508
33212 -4441508 -3757180 -1738331 1797512 4731785 5112163 2517977 -1929623 -5526833
33204 -5526833 -5482482 -2314135 -316773 -2481065 -6289065 -7096236 -4476926 -2084471 -1869311
33195 -1869311 -2001507 -864198 250014 -380031 -2246386 -3737004 -4158367 -3820527 -3643924
33186 -3643924 -4843791 -7066273 -7124032 -2562796 3376613 4226145 -981889 -5475797 -3790188
33177 -3790188 523681 -34480 -6510498 -12364823 -11880196 -6105829 -459736 915046
$$ packed form
33238c518834L803409J21634r91277J384733K527194K20023k186411j463611P91851
33229F88711J070691p82706j559040O17284L389045K872340j136691m094633k119210
33220a054209K448738L413025j069469n694007n074420p18238J951827J355245
33212d441508O84328K018849L535843K934273L80378k594186m447600l597210
33204e526833M4351L168347J997362k164292l808000q07171K619310K392455K15160
33195a869311j32196J137309J114212o30045j866355j490618m21363L37840J76603
33186c643924j199867k222482n7759M561236N939409Q49532n208034m493908J685609
33177c790188M313869n58161o476018n854325M84627N774367N646093J374782
$$ plain form
33169 915046 -1650729 -3866368 -1567019 4146627 7009030 2846414 -4792063 -9045095
33161 -9045095 -8349585 -6944905 -7461913 -7396424 -3884375 1685364 5586503 5862951 3207254
33152 3207254 -128006 -1248989 1333626 5400315 6764299 4285623 961222 -873272
33144 -873272 -2536296 -5420200 -7361743 -5601999 -1472792 1233154 1629259 2156413 3908541
33135 3908541 4986264 4361448 4313812 6971541 10311570 10181835 5869930 1398243 665446
33126 665446 2870850 3957199 1770856 -1637009 -2735666 -267104 3993427 7160358
33118 7160358 7503278 5709670 4247324 4555688 4863238 2385431 -2176239 -4855919 -4147976
33109 -4147976 -3419655 -5297228 -6804310 -4047735 557372 996339 -3099769 -5474037
$$ packed form
33169I15046k565775k215639K299349N713646K862403m162616p638477m253032
33161i045095O95510J404680n17008O5489L512049N569739L901139K76448k655697
33152C207254l335260j120983K582615M066689J363984k478676l324401j834494
33144h73272j663024k883904j941543J759744M129207K705946L96105N27154J752128
33135C908541J077723o24816m7636K657729L340029j29735m311905m471687p32797
33126F65446K205404J086349k186343l407865j098657K468562M260531L166931
33118G160358L42920j793608j462346L08364L07550k477807m561670k679680P07943
33109d147976P28321j877573j507082K756575M605107M38967m096108k374268
$$ plain form
33101 -5474037 -2327740 2820626 5152940 4543131 2830223 -367974 -5194005 -8231041
33093 -8231041 -6105086 -656061 3206728 3503547 1889916 -115328 -2191088 -3585128
33085 -3585128 -3695368 -3501558 -3590277 -1974459 2861041 7936024 8703412 5543339 3405164
33076 3405164 4808436 6918703 6260646 3053524 -83423 -1079594 572826 3343572
33068 3343572 4095691 1694939 -80409 3205666 9383502 10984323 5026903 -2662917
33060 -2662917 -4960102 -1664557 2096515 2374875 -1327269 -7290414 -12045789 -11922691
33052 -11922691 -7024348 -1848613 239081 713660 1771623 1807121 -1275497 -4994133
33044 -4994133 -5209012 -2499789 -949087 -1578382 -1834829 -1212633 -2228850 -5084375 -6209180
$$ packed form
33101e474037L146297N148366K332314o09809j712908l198197m826031l037036
33093h231041K125955N449025L862789K96819j613631k005244k075760j394040
33085c585128j10240J93810q8719J615818M835500N074983P67388l160073k138175
33076C405164J403272K110267o58057l207122l136947r96171J652420K770746
33068C343572P52119k400752j775348L286075O177836J600821n957420p689820
33060b662917k297185L295545L761072K78360l702144n963145m755375J23098
33052a1922691M898343N175735K087694M74579J057963L5498l082618l718636
33044d994133k14879K709223J550702o29295k56447O22196j016217k855525j124805
$$ plain form
33035 -6209180 -3819011 -842642 -232613 -895928 -729975 -646007 -2534820 -5223018 -5540082
33026 -5540082 -2675141 716225 1442366 -1402314 -5893606 -8653742 -7612519 -4116201
33018 -4116201 -1438584 -1028555 -1691621 -2450424 -3739658 -5111650 -4711585 -2622961 -1837112
33009 -1837112 -3528500 -4091797 -228248 5011497 5367626 -133044 -5844450 -7053126
33001 -7053126 -5290204 -4865104 -6935256 -8880440 -7958591 -4065428 226862 1592581
32993 1592581 -1038076 -4827501 -5607690 -2664344 445299 548703 -1320189 -2040382 -836797
32984 -836797 491879 1174462 2904443 6880937 10941329 11153007 6157393 -904030 -5006953
32975 -5006953 -3542640 1698949 6047594 5428588 -443329 -7367957 -9907562 -6623318
$$ packed form
33035f209180K390169K976369O10029o63315J65953Q3968j888813k688198l17064
33026e540082K864941L391366P26141k844680m491292k760136J041223L496318
33018d116201K677617M10029o63066p58803j289234j371992M00065K088624P85849
33009a837112j691388n63297L863549N239745L56129n500670n711406j208676
33001g053126J762922M25100k070152j945184R21849L893163M292290J365719
32993A592581k630657l789425p80189K943346L109643J03404j868892p20193J203585
32984h36797J328676O82583J729981L976494M060392K11678m995614p061423m102923
32975e006953J464313N241589M348645o19006n871917o924628k539605L284244
$$ plain form
32967 -6623318 -1742635 -410173 -2852751 -5051614 -4689655 -3614648 -3906827 -4663075 -4331207
32958 -4331207 -3384855 -2371642 -5864 3724988 5067523 1306605 -3563924 -2928907
32950 -2928907 3068967 7382846 5995798 2740727 2200563 2891354 1235514 -1511330
32942 -1511330 -1126292 2652978 5665807 5401506 3727417 3112676 3156573 2062455 -141234
32933 -141234 -1024668 1840783 7789428 12386841 11268574 5464809 1141460 2548398
32925 2548398 7002810 8865153 6618583 3211538 951469 -286296 -413883 1363161
32917 1363161 3991416 5019691 4408905 4673410 6317341 6595965 4280035 2052439 1900238
32908 1900238 1638510 -729766 -2318626 558470 5656727 7340521 5255546 5037578
$$ packed form
32967f623318M880683J332462k442578k198863L61959J075007k92179p56248L31868
32958d331207R46352J013213K365778L730852J342535l760918m870529O35017
32950b928907N997874M313879j387048l255071n40164O90791j655840k746844
32942a511330L85038L779270L012829k64301j674089o14741M3897j094118k203689
32933a41234q83434K865451N948645M597413j118267n803765m323349J406938
32925B548398M454412J862343k246570l407045k260069j237765j27587J777044
32917A363161K628255J028275o10786K64505J643931K78624k315930k227596j52201
32908A900238k61728k368276j588860K877096N098257J683794k084975k17968
$$ plain form
32900 5037578 9456008 14056107 13977930 10560192 7620520 4923066 180826 -4655155
32892 -4655155 -4638590 744776 6082004 6807488 3697827 -165073 -2958294 -3364697 -410673
32883 -410673 3688715 4252706 461835 -2540219 -1046977 1426790 63897 -3064147
32875 -3064147 -2589843 706499 1067393 -2185458 -3210907 358711 3174458 1186252
32867 1186252 -1323910 1418840 7306183 9401565 5883428 1696076 1203345 3412875
32859 3412875 4416627 1678152 -3887203 -8085373 -6559777 348087 6976028 8304064
32851 8304064 4983681 709259 -3066236 -7015083 -10466669 -11387561 -9024872 -4212180
32843 -4212180 1833439 7084833 9000702 7626528 6295661 6711759 5971846 1632673
$$ packed form
32900E037578M418430M600099p8177l417738k939672k697454m742240m835981
32892d655155J6565N383366N337228P25484l109661l862900k793221m06403K954024
32883d10673M099388N63991l790871l002054J493242K473767j362893l128044
32875c064147M74304L296342L60894l252851j025449L569618K815747j988206
32867A186252k510162K742750N887343K095382l518137m187352m92731K209530
32859C412875J003752k738475n565355m198170J525596O907864O627941J328036
32851H304064l320383m274422l775495l948847l451586r20892K362689M812692
32843d212180O045619N251394J915869j374174j330867M16098p39913m339173
$$ plain form
32835 1632673 -3302430 -4690408 -3733986 -4046559 -4661246 -2147711 1743300 1532491 -2741721
32826 -2741721 -4532358 -507570 4813763 6389841 5297175 5247025 6839576 8306475
32818 8306475 8752168 8202964 7068017 7182716 10620099 16165701 19721248 19040462 15263028
32809 15263028 9862016 3990397 646011 2287110 5660272 4626141 -673932 -3511505
32801 -3511505 -1070578 1558482 617074 -397327 1650388 3118375 708123 -1234468
32793 -1234468 2355734 7989793 8981500 6353713 6410628 9977036 12085322 10934581 9343182
32784 9343182 7848538 3981483 -1176413 -2821298 -69529 2344271 1346339 -1075157
32776 -1075157 -2963917 -5210426 -7463484 -6589916 -1833528 2652229 2867083 -607794
$$ packed form
32835A632673m935103j387978R56422l12573o14687K513535L891011k10809m274212
32826b741721j790637M024788N321333J576078j092666n0150J592551J466899
32818H306475M45693n49204j134947J14699L437383N545602L555547o80786l777434
32809A5263028n401012n871619l344386J641099L373162j034131n300073k837573
32801c511505K440927K629060r41408j014401K047715J467987k410252j942591
32793a234468L590202N634059R91707k627787N6915L566408K108286j150741j591399
32784I343182j494644l867055n157896j644885K751769K413800r97932k421496
32776a075157j888760k246509k253058Q73568M756388M485757K14854l474877
$$ plain form
32768 -607794 -4647907 -6689340 -4907494 700945 6203439 6764630 3094903 681862
32760 681862 1421276 1137256 -2418927 -4719071 -1531782 3819402 5265694 2800388 1197156
32751 1197156 2022050 2401895 1083301 501952 1960042 2911581 926408 -2319362 -3112135
32742 -3112135 -465778 2919012 4176225 3630111 4178962 7505067 11480627 12096441 8030610
32733 8030610 2484176 -28939 1727984 4830049 5758598 4358437 3580541 4958734
32725 4958734 5554841 1523667 -5524305 -8963969 -5411569 633084 3041115 1958053
32717 1958053 1561816 2398213 1299378 -1945448 -3626452 -2557995 -2184920 -4515271 -6596035
32708 -6596035 -5335224 -1842371 1452098 4247032 6322757 5770095 2462904 14966
$$ packed form
32768f07794m040113k041433J781846N608439N502494N61191l669727k413041
32760F81862P39414k84020l556183k300144L187289N351184J446292k465306j603232
32751A197156Q24894L79845j318594n81349J458090R51539j985173l245770p92773
32742c112135K646357L384790J257213n46114N48851L326105L975560O15814m065831
32733H030610n546434k513115J756923L102065R28549j400161p77896J378193
32725D958734N96107m031174p047972l439664L552400O044653K408031j083062
32717A958053l96237Q36397j098835l244826j681004J068457L73075k330351k080764
32708f596035J260811L492853L294469K794934K075725n52662l307191k447938
$$ plain form
32700 14966 796682 2032826 693483 -756461 1577183 5371996 4492972 -1157123 -4024909
32691 -4024909 1067137 9761765 13830940 11016181 6020837 3268995 2139797 -148964
32683 -148964 -3405030 -4255007 -843414 4007835 5674746 3230708 443796 1032314 4559812
32674 4559812 7894950 9179169 8727708 6937836 3458592 -1127983 -4216291 -3053011
32666 -3053011 2060524 6990831 7190205 2451863 -2490968 -3024104 463610 4048231
32658 4048231 5599799 6255348 6884418 6221365 3695668 1533089 1987476 4022087 4819034
32649 4819034 3797894 3236757 4919935 7442333 7395239 3196861 -2387536 -4357679 -910464
32640 -910464 4137914 5742923 3405512 438979 -1481390 -3742835 -6841365 -8720472
$$ packed form
32700A4966P81716J236144j339343j449944K333644L794813q79024n650095k867786
32691d024909N092046Q694628M069175k814759m995344k751842j129198k288761
32683a48964l256066q49977L411593M851249J666911k444038k786912N88518L527498
32674D559812L335138J284219m51461j789872l479244m586575l088308J163280
32666c053011N113535M930307J99374m738342m942831n33136L487714L584621
32658D048231J551568O55549O29070o63053k525697k162579M54387K034611P96947
32649D819034j021140n61137J683178K522398m7094m198378n584397j970143L447215
32640i10464N048378J605009k337411k966533j920369k261445l098530j879107
$$ plain form
32632 -8720472 -8184251 -6752661 -5562947 -3306025 897754 5072948 6810552 6094116
32624 6094116 4169834 1818753 236188 1121480 4105829 6429001 6720948 6421732 6045673
32615 6045673 3705177 -399878 -2190965 87897 1826074 -1186230 -5297330 -3885611
32607 -3885611 2570745 7337743 7113246 4768592 2820416 490121 -1942183 -1893724 581091
32598 581091 1933183 1447896 3299113 9200668 13793237 11770280 6193339 4652459
32590 4652459 8848669 12880434 11623892 6488181 1897048 -466652 -1899943 -3289054
32582 -3289054 -3945660 -3314159 -1856486 134401 3100799 6707088 9080087 9265995 9577415
32573 9577415 12872333 17394609 17587225 11647721 5232668 4734137 9069184 11764782
$$ packed form
32632h720472N36221J431590J189714K256922M203779M175194J737604p16436
32624F094116j924282k351081j582565Q85292K984349K323172K91947k99216l76059
32615F045673k340496m105055j791087K278862J738177l012304m111100J411719
32607c885611O456356M766998k24497k344654j948176k330295k432304M8459K474815
32598E81091J352092m85287J851217N901555M592569k022957n576941j540880
32590D652459M196210M031765j256542n135711m591133k363700j433291j389111
32582c289054o56606O31501J457673J990887K966398L606289K372999J85908L11420
32573I577415L294918M522276J92616n939504o415053m98531M335047K695598
$$ plain form
32565 11764782 9851500 6589275 5723065 7315811 9995687 13224678 15555404 14191452
32557 14191452 9079740 5138891 7360797 14630895 20782280 21319268 17187495 12195609
32549 12195609 8758959 6928728 6385343 7819521 11667856 16114505 17960339 16334750
32541 16334750 14330171 15467763 19338482 22446717 22650821 20565361 16964857 11653267
32533 11653267 5617972 1772117 2040297 5193132 8661861 11119996 12377957 12384786 11744536
32524 11744536 12052502 14344852 17947732 21671894 24970039 26951538 25842495 21308405
32516 21308405 16432703 15312786 18760350 23875915 27640864 29253599 29094537 27748961
32508 27748961 26957268 29275722 34727518 39173475 38648453 34854996 33484623 36848554
$$ packed form
32565A1764782j913282l262225q66210J592746K679876L228991K330726j363952
32557A4191452n111712l940849K221906P270098O151385N36988m131773m991886
32549A2195609l436650j830231n43385J434178L848335M446649J845834j625589
32541A6334750k004579J137592L870719L108235K04104k085460l600504n311590
32533A1653267o035295l845855K68180L152835L468729K458135J257961O829o40250
32524A1744536L07966K292350L602880L724162L298145J981499j109043m534090
32516B1308405m875702j119917L447564N115565L764949J612735j59062j345576
32508B7748961p91693K318454N451796M445957n25022l793457j370373L363931
$$ plain form
32500 36848554 41422432 43766523 44947182 46327511 45079343 39189720 34327043 38501447
32492 38501447 49762244 56644922 53287687 47172472 47609194 52896256 55321605 54224093
32484 54224093 56083571 63582851 72367732 78732477 83683465 88229221 90683587 90760302
32476 90760302 91576264 95362134 100942505 107138281 114920769 124483043 133829770 142198780
32468 142198780 151621089 163388917 176330943 190256547 207262926 227124211 245038163
32461 245038163 257476982 267890799 283170171 305836016 332462087 358611330 382718698
32454 382718698 405653163 428458359 450641166 470243557 486188983 500002227 513220065
32447 513220065 523597238 527000547 523161338 515738179 505906949 490355924 467621674
$$ packed form
32500C6848554M573878K344091J180659J380329j248168n889623m862677M174404
32492C8501447J1260797O882678l357235o115215M36722N287062K425349j097512
32484E4224093J859478P499280Q784881O364745M950988M545756K454366P6715
32476I0760302Q15962L785870N580371O195776P782488R562274R346727Q369010
32468A42198780R422309J1767828J2942026J3925604J7006379J9861285J7913952
32461B45038163J2438819J0413817J5279372K2665845K6626071K6149243K4107368
32454C82718698K2934465K2805196K2182807J9602391J5945426J3813244J3217838
32447E13220065J0377173L403309l839209p423159r831230j5551025k2734250
$$ plain form
32440 467621674 442013810 418153330 395331228 370821358 345426995 321546724 298440443
32433 298440443 274221443 251020882 233357538 221621377 211187678 198387157 184222544
32426 184222544 171553783 161006645 150609300 138445770 125378729 115074313 110040748
32419 110040748 107566375 102078424 92294793 82825621 77148549 72853862 66691111 60505112
32411 60505112 57911472 57886519 56454079 53026072 50491910 50201317 51133905 52882188 55015915
32402 55015915 54451064 48245588 38773484 31676027 28729005 26967715 24639402 23269094
32394 23269094 23466472 23532439 23338642 25156586 29095439 31611154 30240830 26549504 23078251
32385 23078251 20598342 19438625 19986796 20596202 18604065 14926062 14015757 17544560
$$ packed form
32440D67621674k5607864k3860480k2822102k4509870k5394363k3880271k3106281
32433B98440443k4219000k3200561j7663344j1736161j0433699j2800521j4164613
32426A84222544j2668761j0547138j0397345j2163530j3067041j0304416n033565
32419A10040748k474373n487951r783631r469172n677072m294687o162751o185999
32411F0505112k593640k4953j432440l428007k534162k90593R32588J748283K133727
32402E5015915n64851o205476r472104p097457k947022j761290k328313j370308
32394B3269094J97378O5967j93797J817944L938853K515715j370324l691326l471253
32385B3078251k479909j159717N48171O09406j992137l678003r10305L528803
$$ plain form
32377 17544560 21816418 23508996 24138874 26007461 27288811 24986238 20441753 17881458
32369 17881458 18400280 18703597 15800111 10706611 7137766 7471389 10096640 11006119 8840685
32360 8840685 7250820 9844636 13864642 13091855 7296662 3704311 6957302 12416283
32352 12416283 12946399 8439034 4266439 3223753 3807616 4638030 5691411 5880978 3883094
32343 3883094 1389026 1725444 4935364 7513545 7326143 5679359 4168347 2753385
32335 2753385 1828166 2970397 5910767 7307823 4870634 1176900 871467 4501946
32327 4501946 7555311 6351419 2892643 1811537 3473510 3366658 -741387 -4674082
32319 -4674082 -3974816 -1184232 -1953761 -5465968 -5211338 292572 4757641 4638503 5150497
$$ packed form
32377A7544560M271858J692578O29878J868587J281350k302573m544485k560295
32369A7881458N18822L03317k903486n093500l568845L33623K625251R09479k165434
32360H840685j589865K593816M020006p72787n795193l592351L252991N458981
32352A2416283N30116m507365m172595j042686N83863Q30414J053381J89567j997884
32343C883094k494068L36418L209920K578181j87402j646784j511012j414962
32335B753385r25219J142231K940370J397056k437189l693734l05433L630479
32327D501946L053365j203892l458776j081106J661973j06852m108045l932695
32319d674082O99266K790584p69529l512207K54630N503910M465069j19138N11994
$$ plain form
32310 5150497 10979250 17418508 17487957 12867515 9877900 8418890 4104129 -783220
32302 -783220 1069774 8932568 12925820 8777094 4123804 5544997 8239630 5391695
32294 5391695 419067 1083672 6029235 6691238 966495 -3823233 -2226182 2429458
32286 2429458 4390203 3016054 1330716 1138020 2176739 3411228 3340874 1270630 -681413
32277 -681413 581289 4367484 6276464 4369564 1958257 2072902 2486331 -143026 -3439760
32268 -3439760 -1398431 6708074 13811906 13248859 6666805 1374868 1521288 4713050
32260 4713050 6841876 7111017 7045431 6836323 5190721 2241869 263552 874653 2999348
32251 2999348 4377701 4118142 3069474 2480568 2971898 4216987 5091835 4598479 2835428
$$ packed form
32310E150497N828753O439258O9449m620442k989615j459010m314761m887349
32302g83220J852994P862794L993252m148726m653290J421193K694633k847935
32294E391695m972628O64605M945563O62003n724743m789728J597051M655640
32286B429458J960745j374149j685338j92696J038719J234489p0354k070244j952043
32277f81413J262702L786195J908980j906900k411307J14645M13429k629357l296734
32268c439760K041329Q106505P103832n63047o582054n291937J46420L191762
32260D713050K128826K69141o5586k09108j645602k948852j978317O11101K124695
32251B999348J378353k59559j048668n88906M91330J245089Q74848m93356j763051
$$ plain form
32242 2835428 498824 -2225823 -4945850 -5624759 -2307150 3082504 5385887 2384012
32234 2384012 -1979674 -2800748 -576249 492179 -1113399 -3085020 -3760453 -4032953 -4699273
32225 -4699273 -5297988 -6100929 -8049773 -9893813 -8580502 -3879908 133940 -154006 -3823361
32216 -3823361 -7318135 -8129528 -5585294 -866193 2282517 75191 -5859065 -8682654
32208 -8682654 -4788236 1087952 2645611 723246 488937 2519966 2883392 1241786
32200 1241786 2038246 6254347 8201064 3614591 -3763666 -7320284 -5722979 -2311539
32192 -2311539 589152 2679612 3333524 2613800 3207362 6969070 10314004 7598394 -760166
32183 -760166 -7941152 -9498909 -8374861 -9289920 -11871408 -12415587 -9998973 -7211811 -5684192
$$ packed form
32242B835428k336604k724647k720027o78909L317609N389654K303383l001875
32234B384012m363686q21074K224499J068428j605578j971621o75433k72500o66320
32225d699273n98715q02941j948844j844040J313311M700594M013848k87946l669355
32216c823361l494774q11393K544234M719101L148710k207326n934256k823589
32208h682654L894418N876188J557659j922365k34309K031029L63426j641606
32200A241786P96460M216101J946717m586473p378257l556618J597305L411440
32192b311539K900691K090460O53912p19724N93562L761708L344934k715610q358560
32183g60166p180986j557757J124048r15059k581488n44179K416614K787162J527619
$$ plain form
32174 -5684192 -4141934 -1341744 1362747 1636779 -459249 -1775250 749728 6234675
32166 6234675 10109277 9224388 5775502 4134804 4527878 3247717 -457532 -2150760
32158 -2150760 684275 3512876 1134375 -3857452 -4718900 -1103569 638217 -2011182
32150 -2011182 -3862131 -1131434 1935382 -29003 -4866701 -6631944 -4660169 -2971774
32142 -2971774 -2579874 -692918 2712492 3616327 665164 -1758362 531954 6045513
32134 6045513 10273595 11007570 8878829 5073990 1013687 -1271886 -869093 459247
32126 459247 -4557 -2897599 -6251618 -7682410 -6780081 -5554311 -6062453 -7127201 -4842336
32117 -4842336 2090139 9182525 11002870 7925452 4708354 3372138 1766909 -1029762
$$ packed form
32174e684192J542258K800190K704491K74032k096028j316001K524978N484947
32166F234675L874602q84889l448886j640698L93074j280161l705249j693228
32158b150760K835035K828601k378501m991827q61448L615331J741786k649399
32150b011182j850949K730697L066816j964385m837698j765243J971775J688395
32142b971774L91900J886956L405410R03835k951163k423526K290316N513559
32134F045513M228082P33975k128741l804839m060303k285573M02793J328340
32126D59247m63804k893042l354019j430792R02329J225770n08142j064748K284865
32117d842336O932475P092386J820345l077418l217098j336216j605229k796671
$$ plain form
32109 -1029762 -2795501 -2552923 -2235113 -2600420 -2046591 -993880 -2328801 -5276380 -4429164
32100 -4429164 1717954 6820757 5830504 2862874 4178351 7872743 7593404 3345474
32092 3345474 934278 2223670 3438204 2736084 2364122 2883427 1997762 241773 1489914
32083 1489914 5956063 8330583 5169615 -612791 -4664068 -6124534 -5714256 -3398237
32075 -3398237 -334811 748175 -564727 -1441867 -406150 651563 400062 40776 -28797
32066 -28797 -1149252 -2444737 -845082 2849478 3231982 -1479669 -5863531 -5641214 -4103606
32057 -4103606 -5299931 -6063297 -1442988 5662802 7875746 4630534 2623178 4853004
32049 4853004 6105771 1380858 -6449838 -10511460 -8394030 -3873202 -1578459 -2217931
$$ packed form
32109a029762j765739K42578L17810l65307N53829J052711j334921k947579Q47216
32100d429164O147118N102803r90253k967630J315477L694392k79339m247930
32092C345474k411196J289392J214534p02120l71962N19305q85665j755989J248141
32083A489914M466149K374520l160968n782406m051277j460466M10278K316019
32075c398237L063426J082986j312902q77140J035717J057713k51501l59286o9573
32066b8797j120455j295485J599655L694560L82504m711651m383862K22317J537608
32057d103606j196325p63366M620309P105790K212944l245212k007356K229826
32049D853004J252767m724913p830696m061622K117430M520828K294743o39472
$$ plain form
32041 -2217931 -3173562 -2696852 -2246403 -3800795 -6047767 -5871562 -3437580 -2274061 -3470529
32032 -3470529 -3830359 -1609734 301626 -113616 159782 3415721 5360159 962231 -6378769
32023 -6378769 -8210039 -2904576 2136367 832900 -4541061 -8194672 -7972258 -5426845
32015 -5426845 -2399418 -255242 -364262 -2861683 -5681486 -6265833 -4212180 -1956777
32007 -1956777 -2612965 -6251880 -8512180 -5099210 1861371 5237780 2302722 -1139559
31999 -1139559 829140 5535118 6176842 2113938 -1103640 -604181 803404 420516 -861250
31990 -861250 -1619327 -2118032 -2662433 -3128229 -4147671 -5430727 -3775498 2919529 10321146
31981 10321146 11369120 5452703 -949190 -3046803 -2208125 -1315062 -1073945 -2001630 -4783707
$$ packed form
32041b217931r55631M76710M50449j554392k246972J76205K433982J163519j196468
32032c470529l59830K220625J911360m15242K73398L255939J944438m397928p341000
32023f378769j831270N305463N040943j303467n373961l653611K22414K545413
32015e426845L027427K144176j09020k497421k819803n84347K053653K255403
32007a956777o56188l638915k260300L412970O960581L376409k935058l442281
31999a139559J968699M705978O41724m062904l217578M99459J407585l82888j281766
31990h61250p58077m98705n44401m65796j019442j283056J655229O695027P401617
31981A0321146J047974n916417o401893k097613Q38678Q93063K41117r27685k782077
$$ plain form
31972 -4783707 -7130587 -5254166 -49528 3121108 2314218 1346608 2413890 2210124 -1641934
31963 -1641934 -5764568 -6332195 -4506759 -2845551 -780537 2270928 3501017 913807
31955 913807 -2565940 -3477433 -2970349 -3331440 -3020448 -273312 1510386 -2044610 -8523263
31946 -8523263 -10991932 -7354296 -2261204 115195 393097 658106 1103156 1125858 785045
31937 785045 229822 -335200 -34856 1487451 2744004 2175938 398146 -1343672 -3578332
31928 -3578332 -6781568 -8551353 -6218464 -1764081 -316722 -3212078 -5914582 -4133975
31920 -4133975 619647 3367201 1879402 -1431791 -3378829 -3935588 -5268890 -7491475
31912 -7491475 -7379082 -2552711 4623560 9573717 10857346 10174703 8197066 4621769
$$ packed form
31972d783707k346880J876421N204638L170636q06890r67610J067282k03766l852058
31963a641934m122634n67627J825436J661208K065014L051465J230089k587210
31955I13807l479747r11493N07084l61091L10992K747136J783698l554996o478653
31946h523263k468669L637636N093092K376399K77902K65009M45050K2702l40813
31937G85045n55223n65022L00344J522307J256553n68066j777792j741818k234660
31928c578332l203236j769785K332889M454383J447359k895356k702504J780607
31920d133975M753622K747554j487799l311193j947038n56759j333302k222585
31912g491475J12393M826371P176271M950157J283629o82643j977637l575297
$$ plain form
31904 4621769 2039758 4268095 9496511 10764006 5919356 1475078 2701839 5560357
31896 5560357 4052882 638285 2018656 7746481 11102150 10040786 9215044 10743624
31888 10743624 10684269 6730175 2765912 2577499 4163489 3720470 1273943 -1034630 -3074048
31879 -3074048 -5753610 -8114855 -8274366 -5821396 -1435327 3981433 8032348 7092032
31871 7092032 566101 -6617535 -8592678 -5068486 -1020325 -225081 -1357942 -947718
31863 -947718 1656304 3696563 2900273 582676 114208 2835145 6589368 8365907 7258617
31854 7258617 4472435 1666508 29730 -60012 738047 1555904 2476996 3612749 3420235
31845 3420235 529776 -2600751 -1501898 3474508 6087958 2502637 -3187647 -5192776
$$ packed form
31904D621769k582011K228337N228416J267495m844650m444278J226761K858518
31896E560357j507475l414597J380371N727825L355669j061364q25742J528580
31888A0743624n9355l954094l964263j88413J585990m43019k446527k308573k039418
31879c074048k679562k361245j59511K452970M386069N416760M050915r40316
31871G092032o525931p183636j975143L524192M048161P95244j132861M10224
31863i47718K604022K040259p96290k317597m68468K720937L754223J776539j107290
31854G258617k786182k805927j636778q9742P98059Q17857R21092J135753j92514
31845C420235k890459l130527J098853M976406K613450l585321n690284k005129
$$ plain form
31837 -5192776 -4069502 -3887214 -4460706 -2241825 2631239 6038188 6138742 4635948 2120183
31828 2120183 -2394586 -7088398 -7979429 -4883271 -1834463 -737579 420499 2148609
31820 2148609 1708940 -1553715 -4337248 -4747606 -4454224 -3654047 276397 6343140 8298993
31811 8298993 3548270 -1908455 -2242736 -110637 -375255 -738414 3618222 9610842 9424881
31802 9424881 2973091 -1584112 -479004 830404 -2156476 -5693438 -5007554 -2602859
31794 -2602859 -3584997 -6707879 -6286701 -1240398 3390977 3667585 856482 -2028672 -3663232
31785 -3663232 -3368784 -378495 3884062 5556457 2712747 -1810000 -4037767 -3664173
31777 -3664173 -2950152 -2439122 -928065 987447 883973 -1490850 -3355416 -3109490 -2487026
$$ packed form
31837e192776J123274J82288n73492K218881M873064L406949J00554j502794k515765
31828B120183m514769m693812q91031L096158L048808J096884J158078J728110
31820B148609m39669l262655k783533m10358K93382Q00177L930444O066743J955853
31811H298993m750723n456725l34281K132099k64618l63159M356636N992620j85961
31802I424881o451790m557203J105108J309408k986880l536962O85884K404695
31794b602859r82138l122882M21178N046303M631375K76608k811103k885154j634560
31785c663232K94448K990289M262557J672395k843710m522747k227767L73594
31777c664173P14021N11030J511057J915512j03474k374823j864566K45926O22464
$$ plain form
31768 -2487026 -2935320 -2755132 -362932 1880402 337164 -4518811 -8413222 -8539270 -5884860
31759 -5884860 -2572695 424669 2597040 3269276 2503506 1263759 309294 -97077 287133
31750 287133 1162467 1241981 -160112 -1816044 -2597957 -3750127 -6705693 -9568872 -9035909
31741 -9035909 -5634405 -3457649 -4045573 -4161913 -1176352 2719852 4076922 3214185 2529801
31732 2529801 1612848 -2028258 -7409936 -9063413 -3705789 4150196 6370977 1071655
31724 1071655 -4568038 -3072364 4066078 9113628 8720677 7034862 7574458 7451431 2951751
31715 2951751 -3474012 -6516549 -5526930 -3842728 -2650853 -730649 1075738 722590
31707 722590 -233741 1822194 6294959 9170292 10170750 12981195 17485184 18519857
$$ packed form
31768b487026m48294J80188K392200K243334j543238m855975l894411j26048K654410
31759e884860L312165K997364K172371O72236p65770j239747r54465m06371L84210
31750B87133Q75334P9514j402093j655932p81913j152170k955566k863179N32963
31741i035909L401504K176756n87924j16340K985561L896204J357070q62737o84384
31732B529801r16953l641106n381678j653477N357624P855985K220781n299322
31724A071655n639693J495674P138442N047550l92951j685815N39596j23027m499680
31715B951751o425763l042537R89619J684202J191875J920204J806387l53148
31707G22590r56331K055935M472765K875333J000458K810445M503989J034673
$$ plain form
31699 18519857 14684564 11889616 14506867 18662575 18683585 15259069 12248449 9661076
31691 9661076 5530219 1656422 1346557 2979891 1525574 -3857431 -8477322 -8565962 -5244167
31682 -5244167 -1727219 190097 427193 5538 557613 2625040 4625302 5061345 4817822
31673 4817822 5220625 4935695 1593025 -3839867 -7031165 -5162995 -143509 3453938
31665 3453938 2696136 -1308146 -4510882 -3806413 -199507 2781213 3783049 4695934 6582699
31656 6582699 7463792 5801666 3469801 2951346 3895700 4852108 5959764 7013548 5431480
31647 5431480 121818 -4435870 -2630842 4291368 9185946 8342319 5617432 5940975
31639 5940975 8576565 9513820 8100625 7870725 11021781 14723030 14273297 8917218 2763259
$$ packed form
31699A8519857l835293k794948K617251M155708K1010l424516l010620k587373
31691I661076m130857l873797l09865J633334j454317n383005m619891q8640L321795
31682e244167L516948J917316K37096m21655N52075K067427K000262M36043k43523
31673D817822M02803k84930l342670n432892l191298J868170N019486L597447
31665C453938p57802m004282l202736P04469L606906K980720J001836R12885J886765
31656F582699Q81093j662126k331865n18455R44354R56408J107656J053784j582068
31647E431480n309662m557688J805028O922210M894578q43627k724887L23543
31639E940975K635590R37255j413195k29900L151056L701249m49733n356079o153959
$$ plain form
31630 2763259 -373940 -1239976 -2787133 -5163194 -5844582 -4188580 -2518152 -2236030 -2131347
31621 -2131347 -1490105 -1537840 -2349620 -1732157 819840 2337070 981364 -655617 343680
31612 343680 2693534 3600812 3418886 4207743 5642479 5541872 2901663 -1890155 -7505800
31603 -7505800 -10263305 -5997024 3321043 8848855 5373030 -1088943 -1578414 3386722
31595 3386722 6310003 4866355 3558921 4253330 3549294 696675 352205 4841571 10099008
31586 10099008 12313048 13002219 14212501 13841314 9772749 4643063 2311527 2461802
31578 2461802 2449521 2148092 3265140 5406284 6235292 4988737 3420094 3453935 5253472
31569 5253472 7218316 7302219 5110687 2739809 2264624 2761046 1769938 -780067 -2790653
$$ packed form
31630B763259l137199q66036j547157k376061o81388J656002J670428K82122J04683
31621b131347O41242m7735q11780O17463K551997J517230j355706j636981R99297
31612C43680K349854R07278j81926P88857J434736j00607k640209m791818n615645
31603g505800k757505M266281R318067N527812l475825o461973m89471M965136
31595C386722K923281j443648j307434O94409p04036k852619l44470M489366N257437
31586A0099008K214040O89171J210282l71187m068565n129686k331536J50275
31578B461802j2281l01429J117048K141144Q29008j246555j568643L3841J799537
31569E253472J964844Q3903k191532k370878m75185M96422r91108k550005k010586
$$ plain form
31560 -2790653 -3780461 -5069655 -6028005 -4018479 945947 5292265 7049002 8147008
31552 8147008 9799957 9631506 6166097 2562543 2303301 3902506 3737199 2106643 2331809
31543 2331809 4851391 6307489 4664465 1855526 412370 -72749 -1721345 -4892873
31535 -4892873 -7295361 -6557180 -3182724 -396220 -595889 -2495894 -2924318 -1145973 290285
31526 290285 -808948 -3673957 -6264316 -7711443 -7892910 -6120906 -1970714 3131189
31518 3131189 6467999 6356907 3674279 1191311 1106576 2716767 3044476 500014 -3003950
31509 -3003950 -4800558 -5136126 -6092593 -7763165 -8065179 -6092217 -3144764 -393264 2111765
31500 2111765 3967988 4244987 3039258 1370363 -176083 -839180 1065720 5317896
$$ packed form
31560b790653r89808j289194r58350K009526M964426M346318J756737J098006
31552H147008J652949j68451l465409l603554k59242J599205j65307j630556K25166
31543B331809K519582J456098j643024k808939j443156m85119j648596l171528
31535d892873k402488P38181L374456K786504j99669j900005m28424J778345J436258
31526B90285j099233k865009k590359j447127j81467J772004M150192N101903
31518C131189L336810j11092k682628k482968q4735J610191L27709k544462l503964
31509c003950j796608l35568r56467j670572l02014J972962K947453K751500K505029
31500B111765J856223K76999j205729j668895j546446o63097J904900M252176
$$ plain form
31492 5317896 7457277 3463502 -3585255 -6171933 -2198878 2456422 2405612 -874491
31484 -874491 -2998220 -2639482 -1083506 447396 517243 -2120756 -5582607 -5741548 -2227414
31475 -2227414 238694 -1108202 -2919281 -1590545 1332254 3610814 7457145 14553015
31467 14553015 19630065 16080985 6462088 486383 2334895 6063127 4946448 93708
31459 93708 -2755590 -1319183 1264523 879885 -3065767 -7018524 -6837417 -2702362 357398
31450 357398 -1549690 -5787589 -6368427 -1864392 2968834 3676968 1167135 -760481 -520499
31441 -520499 207578 -731861 -3375086 -5436878 -4508310 -986441 1677125 791320 -2028490
31432 -2028490 -2752384 -211080 2372245 1619279 -1763135 -4001902 -2765067 465703
$$ packed form
31492E317896K139381l993775p048757k586678L973055M655300n0810l280103
31484h74491k123729L58738J555976J530902O9847k637999l461851j58941L514134
31475b227414K466108j346896j811079J328736K922799K278560L846331P095870
31467A4553015N077050l549080r618897n975705J848512L728232j116679m852740
31459I3708k849298J436407K583706l84638l945652l952757J81107M135055L059760
31450C57398j907088m237899n80838M504035M833226P08134k509833j927616K39982
31441e20499P28077r39439k643225k061792R28568L521869K663566q85805k819810
31432b028490p23894K541304K583325p52966l382414k238767J236835L230770
$$ plain form
31424 465703 2711775 3406928 4720175 7516549 8709103 4935855 -1770846 -5083155
31416 -5083155 -1832703 4424661 8352829 8350737 5553946 838927 -4093669 -5493360 -1647149
31407 -1647149 3143860 2811594 -2627590 -7220686 -7142035 -4841920 -4246230 -5324976 -5502456
31398 -5502456 -4210280 -3568368 -5159586 -7727927 -8240869 -4913534 576184 4040040
31390 4040040 2780200 -1269595 -3338740 -1120955 2572997 3194895 -14306 -3037144
31382 -3037144 -2022718 1838029 3785742 1444944 -2809716 -5899115 -7729019 -9047372
31374 -9047372 -8383618 -4413106 526446 3200339 4457339 7090345 9793974 8649560
31366 8649560 4515090 2860875 5128945 6510744 4492132 3149836 5371161 6946486
$$ packed form
31424D65703K246072O95153J313247K796374J192554l773248o706701l312309
31416e083155L250452O257364L928168k092k796791m715019m932596j399691L846211
31407a647149M791009l32266n439184m593096P8651K300115N95690j078746j77480
31398e502456J292176O41912j591218k568341n12942L327335N489718L463856
31390D040040j259840m049795k069145K217785L693952O21898l209201l022838
31382c037144J014426L860747J947713k340798m254660l089399j829904j318353
31374i047372O63754L970512M939552K673893J257000K633006K703629j144414
31366H649560m134470j654215K268070J381799k018612j342296K221325J575325
$$ plain form
31358 6946486 3470637 -1829557 -2871228 382110 3383267 4347321 4602949 4015244 1466444
31349 1466444 -1748858 -3578935 -4553052 -5748084 -6125833 -5626260 -7039266 -10224723 -9290909
31340 -9290909 -1724145 4680486 2080395 -4541338 -4369284 2620099 6957490 5730723
31332 5730723 5133700 6819473 4639711 -2331431 -6172672 -4249434 -4916345 -12460986
31324 -12460986 -17682191 -12318725 -3119874 -1030920 -4211847 -3597550 414102 -209829
31316 -209829 -5506554 -6769515 -1638296 1914532 -888351 -4410162 -2961509 227194
31308 227194 -251889 -2841468 -2672388 25661 1160526 -49830 -568860 789393 1858931
31299 1858931 1496045 1661740 3861714 6079869 5212994 1464748 -1613887 -1514041 451127
$$ packed form
31358F946486l475849n300194j041671L253338L001157R64054K55628n87705k548800
31349A466444l215302j830077r74117j195032l77749M99573j413006l185457R33814
31340i290909P566764O404631k600091o621733J72054O989383M337391j226767
31332E730723n97023J685773k179762o971142l841241J923238o66911p544641
31324a2460986n221205N363466R198851K088954l180927O14297M011652o23931
31316b09829n296725j262961N131219L552828k802883l521811J448653L188703
31308B27194m79083k589579J69080K698049J134865j210356n19030J358253J069538
31299A858931l62886J65695K199974K218155q66875l748246l078635R9846J965168
$$ plain form
31290 451127 1666354 2088445 3572069 5913370 6375181 3903596 1127320 504141 864714
31281 864714 132722 -628581 832713 3159520 2348504 -2357071 -7046459 -8671305 -8911252
31272 -8911252 -10505368 -11977376 -8952345 -346284 9061353 12974734 9511425 2341594
31264 2341594 -3282447 -4923481 -3818100 -2399629 -1614337 -651958 1068151 2281934
31256 2281934 1069740 -2133707 -3945221 -1898485 1755555 2290136 -1308404 -4860243
31248 -4860243 -4522911 -1109291 2600579 5771696 8035878 7009740 1366043 -5336349
31240 -5336349 -8239697 -7627321 -7463800 -8434001 -7576670 -4726650 -3568884 -5065397 -5373518
31231 -5373518 -2488992 136242 -565051 -2467000 -2597124 -2085963 -3036254 -4159482 -3588977
$$ packed form
31290D51127J215227M22091J483624K341301M61811k471585k776276o23179L60573
31281H64714p31992p61303J461294K326807q11016m705575m689388j624846k39947
31272h911252j594116j472008L025031Q606061R407637L913381l463309p169831
31264B341594n624041j641034J105381J418471P85292R62379J720109J213783
31256B281934j212194l203447j811514K046736L654040N34581l598540l551839
31248d860243L37332L413620L709870L171117K264182j026138n643697o702392
31240e336349k903348O12376J63521r70201Q57331K850020J157766j496513l08121
31231e373518K884526K625234p01293j901949j30124N11161r50291j123228N70505
$$ plain form
31222 -3588977 -2871327 -3966721 -4992124 -3174500 313059 2613505 4049862 6500144
31214 6500144 9007835 9384398 8257609 7114481 4511289 -612001 -3868150 41562
31206 41562 8499021 13141554 11144637 7962019 7714297 7494388 4051419 297322 775403
31197 775403 4424695 6227252 3926190 -377807 -3792212 -4926361 -3816928 -1931817
31189 -1931817 -1305589 -1924801 -1206823 2233370 5765733 5855527 3003985 1201785 2553498
31180 2553498 4481727 3085099 -1734782 -5659779 -4783487 -346693 2662779 1766309
31172 1766309 -121402 643973 3006079 3128654 442452 -1622813 -751470 1664261 3426658
31163 3426658 4031566 3621490 2315207 1449641 2729263 5123458 5369191 2819999 1054631
$$ packed form
31222c588977P17650j095394j025403J817624L487559K300446J436357K450282
31214F500144K507691L76563j126789j143128k603192n123290l256149L909712
31206D1562Q457459M642533j996917l182618k47722k19909l442969l754097M78081
31197G75403L649292J802557k301062m303997l414405j134149J109433J885111
31189a931817O26228o19212P17978L440193L532363Q9794k851542j802200J351713
31180B553498J928229j396628m819881l924997Q76292M436794L009472q96470
31172A766309j887711P65375K362106J22575k686202k065265Q71343K415731J762397
31163C426658O04908m10076j306283q65566J279622K394195K45733k549192j765368
$$ plain form
31154 1054631 3001262 6910026 9122282 8881781 8369329 9228194 10642020 10188125 6213456
31145 6213456 421500 -2644231 -1079764 534571 -3093314 -8924728 -8315489 -36977
31137 -36977 6370086 3944609 -1666853 -1407399 3657322 5856132 4009640 3633385 5437882
31128 5437882 3471378 -3766690 -9230090 -7867836 -3992747 -3586104 -5267734 -4440195
31120 -4440195 -1916293 -2193969 -5546614 -7540821 -5506070 -932618 3944528 7882329
31112 7882329 9369865 7596179 4846728 4432775 5830618 5191955 1390136 -1791306
31104 -1791306 -1026366 1824512 2610745 698008 -649046 994219 4368634 6681253
31096 6681253 6888220 5896574 4443108 2164598 -1077247 -4064620 -5282078 -4652538 -3414092
$$ packed form
31154A054631J946631L908764K212256k40501n12452Q58865J413826m53895l974669
31145F213456n791956l065731J564467J614335l627885n831414O09239Q278512
31137c6977O407063k425477n611462K59454N064721K198810j846492l76255J804497
31128E437882j966504p238068n463400J362254L875089M06643j681630Q27539
31120d440195K523902k77676l352645j994207K034751M573452M877146L937801
31112G882329J487536j773686k749451m13953J397843o38663l801819l181442
31104a791306P64940K850878P86233j912737j347054J643265L374415K312619
31096F681253K06967r91646j453466k278510l241845k987373j217458O29540J238446
$$ plain form
31087 -3414092 -2624559 -2608309 -3290789 -3769372 -2130498 2332739 6882317 7759474 5268805
31078 5268805 3695407 5092919 6257967 4095236 1116810 2069971 6643184 9321684
31070 9321684 6288046 -555145 -6486534 -8280049 -5578842 -558874 3249533 3665306
31062 3665306 1606005 -1126165 -4672982 -9304441 -12091273 -9399629 -2839260 1408231
31054 1408231 483286 -1615531 -356593 2773877 2965581 -810842 -4598636 -4701276 -1704000
31045 -1704000 930100 968744 -299190 206962 3300081 6044867 5351117 1948339 -1039838
31036 -1039838 -2308011 -2529015 -1398477 1849354 5281561 5567854 2808637 369494
31028 369494 -261577 -327075 382873 3155749 5157091 1098574 -7701392 -12495972 -8725407
$$ packed form
31087c414092P89533J6250o82480m78583J638874M463237M549578Q77157k490669
31078E268805j573398J397512J165048k162731k978426R53161M573213K678500
31070I321684l033638o843191n931389j793515K701207N019968L808407M15773
31062C665306k059301k732170l546817m631459k786832K691644O560369M247491
31054A408231r24945k098817J258938L130470J91704l776423l787794j02640K997276
31045a704000K634100L8644j267934N06152L093119K744786o93750l402778k988177
31036a039838j268173k21004J130538L247831L432207K86293k759217k439143
31028C69494o31071o5498P09948K772876K001342m058517q799966m794580L770565
$$ plain form
31019 -8725407 -2102065 917527 1886689 4152537 4940686 1365580 -1429427 2622435
31011 2622435 9195627 9088792 2601796 -1562406 -552876 -215530 -3285754 -4929288
31003 -4929288 -2272705 723024 990524 899347 1798185 666779 -3045770 -4477603 -1501856
30994 -1501856 883783 -1075830 -3446584 -1646883 1836938 2456416 1387138 2307414
30986 2307414 4310834 3981208 1641367 141883 -254549 -1048131 -1713058 -907120 648852
30977 648852 1995688 3957074 6021254 4695118 -996647 -5867362 -4988132 -614031
30969 -614031 1861696 1558385 701171 -1087276 -5153355 -8867989 -8316794 -4425821 -1130196
30960 -1130196 876693 3354592 5387025 4675408 2473335 1731071 1784359 348848 -1022176
$$ packed form
31019h725407O623342L019592R69162K265848P88149l575106k795007M051862
31011B622435O573192j06835o486996m164202J009530L37346l070224j643534
31003d929288K656583K995729K67500r1177Q98838j131406l712549j431833K975747
30994a501856K385639j959613k370754J799701L483821O19478j069278R20276
30986B307414K003420l29626k339841j499484l96432p93582o64927Q05938J555972
30977F48852J346836J961386K064180j326136n691765m870715Q79230M374101
30969f14031K475727l03311q57214j788447m066079l714634N51195L890973L295625
30960a130196K006889K477899K032433p11617k202073p42264N3288j435511j371024
$$ plain form
30951 -1022176 406158 2096546 -733568 -6550213 -8917764 -6083792 -2257703 380723
30943 380723 3527722 6353900 5167342 826221 -1150720 253380 -73324 -3450645
30935 -3450645 -3899996 1664075 7247789 6654941 2074686 -1360546 -3527976 -5939048
30927 -5939048 -5812643 -420309 6274228 7880447 4079539 -643411 -4180469 -7145407
30919 -7145407 -8483128 -6803666 -4616308 -5413671 -7419477 -5765474 -393021 3622796
30911 3622796 3635544 2157817 1640821 1547199 1602349 3187710 5761522 5956902 2401547
30902 2401547 -1746382 -3089136 -2046546 -698774 706631 2650563 3910686 3157853
30894 3157853 1896541 3006668 6491920 9093930 8788187 7724126 9118289 12176784
$$ packed form
30951a022176J428334J690388k830114n816645k367551K833972L826089K638426
30943C80723L146999K826178j186558m341121j976941J404100l26704l377321
30935c450645m49351N564071N583714n92848m580255l435232k167430k411072
30927e939048J26405N392334O694537J606219l800908m722950l537058k964938
30919g145407j337721J679462K187358p97363k005806J654003N372453M015817
30911C622796J2748j477727n16996r3622N5150J585361K573812J95380l555355
30902B401547m147929j342754J042590J347772J405405J943932J260123p52833
30894C157853j261312J110127L485252K602010l05743j064061J394163L058495
$$ plain form
30886 12176784 12389694 7565910 1556655 -210310 2042697 2689361 -1398207 -6363590
30878 -6363590 -6706888 -2705386 266154 -1464569 -6476975 -10964282 -12174717 -9438502
30870 -9438502 -4446957 -841841 -1221523 -3978998 -5099951 -3585437 -2779644 -5190845
30862 -5190845 -8284588 -7689221 -3451166 -464128 -2276098 -6433346 -7454087 -3740546
30854 -3740546 264365 -441653 -5050992 -7906136 -5757424 -1860745 -1513067 -5180853
30846 -5180853 -8398793 -7931254 -5419232 -4279116 -5176498 -6064790 -5376337 -3439901 -1289718
30837 -1289718 336090 880766 277234 -305706 789054 3566809 5805787 5315980 2156820
30828 2156820 -2008058 -5872451 -8601394 -8695047 -4798802 1793701 7127568 8403225
$$ packed form
30886A2176784K12910m823784o009255j766965K253007O46664m087568m965383
30878f363590l43298M001502K971540j730723n012406m487307j210435K736215
30870i438502M991545L605116l79682k757475j120953J514514Q05793k411201
30862e190845l093743N95367M238055K987038j811970m157248j020741L713541
30854c740546M004911p06018m609339k855144K148712L896679L47678l667786
30846e180853l217940M67539K512022J140116q97382q88292O88453J936436K150183
30837a289718J625808N44676o03532n82940J094760K777755K238978m89807l159160
30828B156820m164878l864393k728943r3653L896245O592503N333867J275657
$$ plain form
30820 8403225 6992613 6422122 7885414 9120287 7667702 3917079 421824 -890291
30812 -890291 -10709 2190145 5119411 7977418 8910669 6285453 1391136 -1610287 -23629
30803 -23629 3856855 5363860 3084620 -276884 -2361092 -3680374 -5254426 -6743877
30795 -6743877 -8105137 -10114530 -11581014 -9206629 -2754149 2603110 2451006 -694876
30787 -694876 -1115447 2208895 5667214 7427882 8771832 9528082 7497387 3278993 863484
30778 863484 1731449 2478546 361882 -2485900 -2874428 -1456091 -955695 -1860098 -2757675
30769 -2757675 -3256962 -3724640 -3220775 -489448 3223109 4623963 2184371 -1766341 -3470061
30760 -3470061 -1950927 -216696 -1698632 -5726699 -7963320 -5821927 -1450602 2017238
$$ packed form
30820H403225j410612n70491J463292J234873j452585l750623l495255j312115
30812h90291Q79582K200854K929266K858007R33251k625216m894317l001423J586658
30803b3629L880484J507005k279240l361504k084208j319282j574052j489451
30795f743877j361260k009393j466484K374385O452480N357259j52104l145882
30787f94876m20571L324342L458319J760668J343950P56250k030695m218394k415509
30778H63484Q67965P47097k116664k847782l88528J418337N00396r04403q97577
30769b757675m99287m67678N03865K731327L712557J400854k439592l950712j703720
30760c470061J519134J734231j481936m028067k236621K141393M371325L467840
$$ plain form
30752 2017238 4693895 7796333 9646615 7811022 3925022 1991630 2367582 1811451
30744 1811451 -698003 -2836399 -3776062 -5251021 -7180788 -7270400 -5892471 -6069848 -7361753
30735 -7361753 -5503215 101168 4641975 5927554 7382721 9897022 8354107 1396713
30727 1396713 -3006136 940070 6384334 3886451 -3140372 -3511794 4119180 9853795
30719 9853795 8180602 4099998 2206909 131662 -3608823 -4511238 -27873 4819551
30711 4819551 5461155 5210279 8488764 11857022 8990020 1255049 -4001185 -4165053 -3453787
30702 -3453787 -4502119 -4465738 -1209291 1959139 846362 -3518530 -6338947 -4837796
30694 -4837796 -143444 5323731 9761059 11634591 9969538 5984768 2977162 3192676
$$ packed form
30752B017238K676657L102438J850282j835593l886000j933392L75952n56131
30744A811451k509454k138396r39663j474959j929767q9612J377929j77377j291905
30735g361753J858538N604383M540807J285579J455167K514301j542915o957394
30727A396713m402849L946206N444264k497883p026823l71422P630974N734615
30719I853795j673193m080604j893089k075247l740485r02415M483365M847424
30711D819551O41604k50876L278485L368258k867002p734971n256234j63868P11266
30702c453787j048332L6381L256447L168430j112777m364892k820417J501151
30694d837796M694352N467175M437328J873532j665053l984770l007606K15514
$$ plain form
30686 3192676 5307790 6149354 4638952 2724164 2288969 2700350 2329956 1249306 834485
30677 834485 1163732 526462 -2001014 -4598397 -4252745 -112646 5297323 8474167 8262624
30668 8262624 6309502 4476014 3022393 1746140 1197531 1301812 342844 -2404441 -4291703
30659 -4291703 -2535445 967142 1634546 -1259916 -4090211 -5079312 -6184479 -7720186
30651 -7720186 -6577945 -2367375 63059 -1902644 -3639573 -708388 3189365 1924371
30643 1924371 -2798043 -4103494 -968509 1012985 -552082 -1893510 -1006263 -1243456
30635 -1243456 -4296972 -5883518 -2466038 2294292 2273238 -2686420 -7057218 -6839386 -3283419
30626 -3283419 -40439 1042352 1090969 2095852 3947209 4349822 2412049 635070 1215233
$$ packed form
30686C192676K115114Q41564j510402j914788m35195M11381l70394j080650m14821
30677H34485L29247o37270k527476k597383L45652M140099N409969L176844k11543
30668H262624j953122j833488j453621j276253n48609J04281r58968k747285j887262
30659d291703J756258L502587O67404k894462k830295r89101j105167j535707
30651g720186J142241M210570K430434j965703j736929K931185L897753j264994
30643A924371m722414j305451L134985J981494j565067j341428Q87247k37193
30635a243456l053516j586546L417480M760330k1054m959658m370798K17832L555967
30626c283419L242980J082791M8617J004883J851357M02613j937773j776979N80163
$$ plain form
30617 1215233 2150935 375424 -2682463 -3101273 -1328143 -1746501 -4898317 -5843618 -2297936
30608 -2297936 961691 -743741 -4703097 -4967895 -1039454 1973573 686164 -2697579
30600 -2697579 -3731229 -607078 4462371 7616721 7140143 4899717 3332958 2002845
30592 2002845 -785859 -4053685 -5239707 -4739329 -5191216 -6084225 -3857299 1624307 5758493
30583 5758493 6120162 5463856 5461399 3214235 -2209328 -5388333 -2074030 3382552 4232249
30574 4232249 1486998 1218260 4100320 4862281 1462271 -1996162 -2107988 -137913 1872257
30565 1872257 3838400 5198376 4430430 2612452 3297991 7051764 9812810 8611735
30557 8611735 5621043 4476195 5377848 5911907 4519599 1441731 -1901693 -3338985
$$ packed form
30617A215233R35702j775511l057887m18810J773130m18358l151816r45301L545682
30608b297936L259627j705432l959356k64798L928441L013027j287409l383743
30600b697579j033650L124151N069449L154350m76578k240426j566759j330113
30592B002845k788704l267826j186022N00378m51887q93009K226926N481606M134186
30583E758493L61669o56306k457k247164n423563l179005L314303N456582Q49697
30574D232249k745251k68738K882060P61961l400010l458433j11826J970075K010170
30565A872257J966143J359976p67946j817978O85539L753773K761046j201075
30557H611735k990692j144848R01653N34059j392308l077868l343424j437292
$$ plain form
30549 -3338985 -1828072 342941 -140395 -2370133 -1717761 2904381 6231618 4021794
30541 4021794 -266120 -351871 3675701 5949310 3669968 315134 -548069 -42298 -770053
30532 -770053 -2522699 -3668274 -4027830 -3732697 -1682530 1755285 2800346 -804372 -4404333
30523 -4404333 -1373735 6356674 8734947 1034027 -8684536 -10031366 -3788057 1084756
30515 1084756 850800 -248899 140610 -1512372 -6230555 -7718936 -1131651 8376774
30507 8376774 11583144 6541314 -1335452 -7928418 -13087548 -15860215 -13575120 -6935026
30499 -6935026 -1125587 195858 -1249938 -2012888 -1354676 -335239 854207 2445772
30491 2445772 3617817 3349046 1831190 -140773 -2263545 -4318284 -5587049 -5427256
$$ packed form
30549c338985J510913K171013m83336k229738O52372M622142L327237k209824
30541D021794m287914q5751M027572K273609k279342l354834q63203N05771p27755
30532g70053j752646j145575l59556K95133K050167L437815J045061l604718l599961
30523d404333L030598P730409K378273p700920r718563j346830O243309M872813
30515A084756k33956j099699L89509j652982m718183j488381O587285R508425
30507H376774L206370n041830p876766o592966n159130k772667K285095O640094
30499f935026N809439J321445j445796p62950O58212J019437J189446J591565
30491B445772J172045k68771j517856j971963k122772k054739j268765J59793
$$ plain form
30483 -5427256 -3664924 -139290 4871720 9257438 9693955 5089804 -1224238 -4064997
30475 -4064997 -1341541 4049579 7373742 6864673 5033364 4939577 5920617 4685486 772459
30466 772459 -1666335 599782 4703450 5243249 2012161 197518 2323015 4059161
30458 4059161 571158 -5765904 -7738608 -2737665 3659344 4699889 689828 -2072301
30450 -2072301 175613 3919353 3333089 -2029299 -7154275 -8640815 -8598388 -10267488 -12581351
30441 -12581351 -11743132 -6820039 -1063495 1897585 1096716 -1960215 -4327169 -2974176
30433 -2974176 2325618 7425360 7559949 3019373 -1164120 -1521667 342530 1251294 790381
30424 790381 533419 921755 903078 -289454 -2395087 -4401925 -4716880 -2218263 1855331
$$ packed form
30483e427256J762332L525634N011010M385718M36517m604151o314042k840759
30475d064997K723456N391120L324163n09069j831309r3787R81040j235131l913027
30466G72459k438794K266117M103668N39799l231088j814643K125497J736146
30458D059161l488003o337062j972704N000943O397009J040545m010061k762129
30450b072301K247914L743740n86264n362388n124976j486540M2427j669100k313863
30441a2581351Q38219M923093N756544K961080q00869l056931k366954J352993
30433b974176N299794N099742J34589m540576m183493l57547J864197R08764m60913
30424G90381k56962L88336j8677j192532k105633k006838l14955K498617M073594
$$ plain form
30415 1855331 4280219 3327901 838692 -344760 163969 884804 1353930 2289623 3376034
30406 3376034 3262789 2135147 2030576 3395961 3241743 -1050585 -6992804 -8951312 -5424398
30397 -5424398 -1542056 -2316081 -5740710 -6043388 -2556930 -703744 -3522208 -7202526
30389 -7202526 -7678767 -7104674 -9270834 -11979909 -10015340 -4240785 -1163575 -2923974
30381 -2923974 -4100663 -733096 3189075 2082788 -2683046 -5269519 -3738670 -1281787
30373 -1281787 -528487 -1101695 -2525158 -5530346 -9583969 -11884636 -10107020 -4950436
30365 -4950436 410575 2702198 970178 -2321893 -3419552 -1534189 258298 -579434
30357 -579434 -2861674 -4740771 -7183842 -10952447 -12512065 -8036915 -647116 2042352
$$ packed form
30415A855331K424888r52318k489209j183452N08729P20835M69126R35693J086411
30406C376034j13245j127642j04571J365385j54218m292328n942219j958508L526914
30397e424398L882342p74025l424629l02678L486458J853186k818464l680318
30389g202526m76241N74093k166160k709075J964569N774555L077210j760399
30381b923974j176689L367567L922171j106287m765834k586473J530849K456883
30373a281787P53300n73208j423463l005188m053623k300667J777616N156584
30365d950436N361011K291623j732020l292071j097659J885363J792487q37732
30357e79434k282240j879097k443071l768605j559618M475150P389799K689468
$$ plain form
30349 2042352 -1562958 -4440162 -980482 5406217 7967531 5594063 2028041 -419804
30341 -419804 -1561757 -364964 3269089 5271952 1706102 -4200087 -5324508 -1450846
30333 -1450846 -253210 -5311663 -9772725 -6445652 1231046 4538648 2185120 471790
30325 471790 2336936 3805072 2000425 -350885 -758988 -1224507 -3312947 -4315114 -2569111
30316 -2569111 -1895111 -5381135 -8605004 -5619317 707871 1759114 -3954028 -8587780
30308 -8587780 -6953470 -3317013 -3051058 -4212951 -2530545 383179 75893 -2762050
30300 -2762050 -3893676 -3267848 -4496110 -7160792 -6479801 -1731698 1397538 -598544
30292 -598544 -3681155 -2962745 29701 1156972 755369 1573292 2353707 -473541 -5779316
$$ packed form
30349B042352l605310k877204L459680O386699K561314k373468l566022k447845
30341d19804j141953J196793L634053K002863l565850n906189j124421L873662
30333a450846J197636n058453m461062L327073P676698L307602k353528j713330
30325D71790J865146J468136j804647k351310m08103m65519k088440j002167J746003
30316b569111O74000l486024l223869K985687O327188J051243n713142m633752
30308h587780J634310L636457K65955j161893J682406K913724l07286k837943
30300b762050j131626O25828j228262k664682O80991M748103L129236j996082
30292e98544l082611P18410K992446J127271m01603Q17923P80415k827248n305775
$$ plain form
30283 -5779316 -8392882 -6934106 -5292834 -5270094 -3592045 1284473 4932448 3642735
30275 3642735 1001150 2553742 6729255 6848224 1005958 -5621718 -8359121 -7770434
30267 -7770434 -6035785 -3554568 -1029802 -714791 -3032104 -5107140 -4943857 -4106289 -4072375
30258 -4072375 -3198716 -163461 2631940 2549240 1051921 915870 1462852 608775 -543612
30249 -543612 125911 772349 -1778350 -5398884 -4660853 519136 4421939 4500371 4174163
30240 4174163 4790905 2060699 -5486029 -11148116 -9047517 -3330750 -1632813 -3368950
30232 -3368950 -2328824 1613710 2242988 -1688985 -3662345 -186799 3201928 804951
30224 804951 -4259864 -5062969 -1086154 1700996 -825448 -6649660 -10852062 -10326655 -6007862
$$ packed form
30283e779316k613566J458776J641272K2740J678049M876518L647975j289713
30275C642735k641585J552592M175513J18969n842266o627676k737403N88687
30267g770434J734649K481217K524766L15011k317313k075036J63283Q37568L3914
30258d072375Q73659L035255K795401q2700j497319j36051N46982q54077j152387
30249e43612O69523O46438k550699l620534P38031N179989L902803P8432l26208
30240D174163O16742k730206p546728n662087K100599N716767J697937j736137
30232c368950J040126L942534O29278l931973j973360L475546L388727k396977
30224H04951n064815q03105L976815K787150k526444n824212m202402N25407M318793
$$ plain form
30215 -6007862 -2254793 -2886726 -6594664 -8202174 -5565842 -2261547 -1734663 -2580452 -2544521
30206 -2544521 -3146114 -5871314 -7337121 -4099735 144939 -1101608 -6655316 -8640400
30198 -8640400 -4323875 209618 -104460 -2723401 -3599838 -3323467 -3175076 -1023671 3730957
30189 3730957 6153160 2515357 -3017482 -4481410 -3133319 -3501052 -3711230 1736543
30181 1736543 10864944 14921900 11036611 5738915 3741599 1515785 -4108316 -8617932
30173 -8617932 -6950257 -2220121 -742405 -2262361 -1745213 1719641 4347367 4571996
30165 4571996 4327162 3869224 1137629 -3256170 -5548556 -4359042 -2394416 -1743438 -1718474
30156 -1718474 -2410120 -5823313 -11467040 -14883240 -13272622 -9417589 -7349044 -7005304
$$ packed form
30215f007862L753069o31933l707938j607510K636332L304295N26884q45789L5931
30206b544521o01593k725200j465807L237386M244674j246547n553708j985084
30198h640400M316525M533493l14078k618941q76437K76371J48391K151405M754628
30189C730957K422203l637803n532839j463928J348091l67733k10178N447773
30181A736543R128401M056956l885289n297696j997316k225814n624101m509616
30173h617932J667675M730136J477716j519956N17148L464854K627726K24629
30165D571996k44834m57938k731595m393799k292386J189514J964626O50978K4964
30156a718474o91646l413193n643727l416200J610618L855033K068545L43740
$$ plain form
30148 -7005304 -6123508 -4792748 -4529794 -4545080 -2686926 569513 2375206 1610830 -82393
30139 -82393 -1431590 -3029798 -5257580 -7062824 -7636069 -7502346 -7151127 -6087027 -4021414
30130 -4021414 -1732483 3099 1259617 2118864 2030994 752298 -823530 -1324213 70576
30121 70576 3146333 6291193 7054133 4812910 2743427 4662372 9349949 11001061 6978617
30112 6978617 2041247 1865112 4892668 4890751 333062 -3784749 -3893139 -2694658 -4047067
30103 -4047067 -6963565 -7688601 -5112857 -1178795 2178898 3690242 1928187 -3205343
30095 -3205343 -8900951 -11599218 -10114392 -5338856 1204575 6500152 6386954 422241
30087 422241 -5306457 -4400401 1607458 5266974 2909888 -2030945 -5244632 -6123640 -5184676
$$ packed form
30148g005304Q81796J330760K62954j5286J858154L256439J805693p64376j693223
30139h2393j349197j598208k227782j805244n73245J33723L51219J064100K065613
30130d021414K288931J735582J256518Q59247q7870j278696j575828n00683J394789
30121G0576L075757L144860P62940k241223k069483J918945M687577J651112m022444
30112F978617m937370j76135L027556j917m557689m117811j08390J198481j352409
30103d047067k916498p25036K575744L934062L357693J511344j762055n133530
30095c205343n695608k698267J484826M775536O543431N295577j13198n964713
30087D22241n728698R06056O007859L659516k357086m940833l213687q79008R38964
$$ plain form
30078 -5184676 -1909779 2525196 4375291 2020950 -1341025 -2187399 -1332111 -1751320 -3972164
30069 -3972164 -5916584 -5658741 -2761156 1269750 2853293 -676723 -6716465 -9112388
30061 -9112388 -5760071 -1086483 737460 872905 1499431 1044218 -2161124 -5394073 -5675945
30052 -5675945 -5258351 -7577803 -10308847 -8557663 -3448256 -1051100 -2994906 -4467775
30044 -4467775 -2568753 -882763 -3519073 -9026518 -12880331 -13055259 -10918430 -8611718
30036 -8611718 -7157620 -5972959 -3816429 -1211684 -913130 -4009346 -7176551 -6887749
30028 -6887749 -4772109 -4717706 -5845945 -3450307 3108999 8647386 9265802 6556355 3462994
30019 3462994 516657 -2045275 -2710790 -1606476 -1513974 -3730703 -5828497 -5398704 -3256479
$$ packed form
30078e184676L274897M434975J850095k354341l361975q46374Q55288m19209k220844
30069c972164j944420K57843K897585M030906J583543l530016o039742k395923
30061i112388L352317M673588J823943J35445O26526m55213l205342l232949k81872
30052e675945M17594k319452k731044J751184N109407K397156j943806j472869
30044d467775J899022J685990k636310n507445l853813j74928K136829K306712
30036h611718J454098J184661K156530K604745K98554l096216l167205K88802
30028f887749K115640N4403j128239K395638O559306N538387O18416k709447l093361
30019C462994k946337k561932o65515J104314R2502k216729k097794M29793K142225
$$ plain form
30010 -3256479 -1288068 224761 1741260 3412345 5683911 8263617 8479473 4380491
30002 4380491 -605176 -978338 2392225 2889701 -1485031 -4907774 -3532764 -1614360
29994 -1614360 -3484444 -5843938 -3933896 -32820 1074467 901431 3839559 7687862
29986 7687862 5919739 -1164935 -5334817 -1775438 4767107 7395605 5701148 4160021
29978 4160021 5081069 6078532 3636961 -2216390 -7016179 -6423479 -1922340 307276 -2496922
29969 -2496922 -5700913 -3943817 1314376 4609405 4255405 2970782 2678990 3241453 4829237
29960 4829237 6888420 6168667 869724 -4382120 -3321172 2694334 6109537 3976248
29952 3976248 1026053 855239 640191 -2516031 -5613709 -4191853 1039196 5707881
$$ packed form
30010c256479J968411J512829J516499J671085K271566K579706K15856m098982
30002D380491m985667l73162L370563M97476m374732l422743J375010J918404
29994a614360j870084k359494J910042L901076J107287j73036K938128L848303
29986G687862j768123p084674m169882L559379O542545K628498j694457j541127
29978D160021R21048R97463k441571n853351m799789N92700M501139K229616k804198
29969b496922l203991J757096N258193L295029l54000j284623k91792N62463J587784
29960D829237K059183p19753n298943n251844J060948O015506L415203k133289
29952C976248k950195j70814k15048l156222l097678J421856N231049M668685
$$ plain form
29944 5707881 7195378 5600125 1976434 -1508560 -2133259 -257990 -204099 -4515535 -9312367
29935 -9312367 -8763560 -3068404 1361870 -478388 -7086918 -13246944 -15651299 -14751978
29927 -14751978 -12425177 -9467089 -5744401 -1834597 920644 2209426 3108456 3914522
29919 3914522 3344318 1160865 -455738 -180575 5411 -1550482 -2421913 -14599 2716966
29910 2716966 814434 -4187115 -5426221 -1129973 2391718 459626 -3062584 -2234400
29902 -2234400 2307213 5598842 5777295 4629670 3119566 874692 -1236880 -1907598
29894 -1907598 -1907507 -2741956 -3910669 -4308114 -4807888 -6230682 -6294860 -2530215 2581266 3578644
$$ packed form
29944E707881J487497j595253l623691l484994o24699J875269N3891m311436m796832
29935i312367N48807N695156M430274j840258o608530o160026k404355Q99321
29927a4751978K326801K958088L722688L909804K755241J288782Q99030Q06066
29919C914522n70204k183453j616603K75163J85986j555893q71431K407314K731565
29910B716966j902532n001549j239106M296248L521691j932092l522210Q28184
29902b234400M541613L291629J78453j147625j510104k244874k111572o70718
29894a907598R1q34449j168713l97445m99774j422794o4178L764645N111481R97378
$$ [...]
##END NTUPLES=NMR SPECTRUM
##END=
