##TITLE=31Pdec_58-2021
 CDCl3, 24 sc
 29.07.2021
##JCAMPDX= 6.0         $$ Bruker NMR JCAMP-DX V2.0
##DATA TYPE= NMR SPECTRUM
##DATA CLASS= NTUPLES
##ORIGIN= UXNMR, Bruker Analytische Messtechnik GmbH
##OWNER= root
$$ XWIN-NMR		Version 3.5
$$ Thu Jul 29 11:14:21 2021 Russian Standard Time (UT+4h)  she@DPX200
##.OBSERVE FREQUENCY= 81.013821
##.OBSERVE NUCLEUS= ^31P
##.ACQUISITION MODE= SIMULTANEOUS
##.ACQUISITION SCHEME= undefined
##.AVERAGES= 24
##.DIGITISER RES= 16
##SPECTROMETER/DATA SYSTEM= spect
##.PULSE SEQUENCE= zgpg30
##.SOLVENT NAME= CDCl3
##.SHIFT REFERENCE= (INTERNAL, CDCl3, 0, 248.564)
##AUDIT TRAIL= $$ (NUMBER, WHEN, WHO, WHERE, WHAT)
$$ ##TITLE= Audit trail, XWIN-NMR		Version 3.5
$$ ##JCAMPDX= 5.01
$$ ##ORIGIN= Bruker BioSpin GmbH
$$ ##OWNER= she
$$ F:/spectra/data/she/nmr/P31/1/pdata/1/auditp.txt
$$ ##AUDIT TRAIL=  $$ (NUMBER, WHEN, WHO, WHERE, WHAT)
(   1,<2021-07-29 11:13:01.40 +0400>,<she>,<DPX200>,
      <created by zg, POWCHK disabled, PULCHK disabled
       configuration hash MD5:
       00 E9 B6 7A A2 85 ED C7 34 08 36 98 17 FE 4E 26
       data hash MD5: 32K
       B9 A0 C8 47 8B 65 33 61 84 C3 95 F7 0E E2 52 C2>)
(   2,<2021-07-29 11:13:04.12 +0400>,<she>,<DPX200>,
      <Start of raw data processing
       efp BC_mod = 2 LB = 1 FT_mod = 6 PKNL = 1 PHC0 = -7148.546 PHC1 = -363.3251 SI = 64K 
       data hash MD5: 64K
       CB B8 BD FD 13 9E 9D DA C9 ED F8 B1 69 5D C6 10>)
(   3,<2021-07-29 11:13:32.89 +0400>,<she>,<DPX200>,
      <pk PHC0 = -257.6136 PHC1 = 512.3995 
       data hash MD5: 64K
       A9 20 CA 5D 8F 77 CD AB 17 5B 6F 44 09 0B 90 3C>)
(   4,<2021-07-29 11:13:36.93 +0400>,<she>,<DPX200>,
      <abs ABSG = 5 
       data hash MD5: 64K
       82 4B E9 92 77 37 33 08 9E 0C DD CE D5 31 7D FD>)
$$ ##END=
$$ 
$$ hash MD5
$$ D0 71 F0 AD DB FB 1C 9D 21 44 77 FE 22 9E 98 92
##$RELAX= 
##$RELAX= 
##$RELAX= 
##$RELAX= 
##$RELAX= 
##$RELAX= 
##$RELAX= 
##$RELAX= 
$$ Bruker specific parameters
$$ --------------------------
##$DU= <F:/spectra>
##$EXPNO= 1
##$NAME= <P31>
##$PROCNO= 1
##$TYPE= <nmr>
##$USER= <she>
##$AMP= (0..31)
100 100 100 100 100 100 100 100 100 100 100 100 100 100 100 100 100 100 
100 100 100 100 100 100 100 100 100 100 100 100 100 100 
##$AQSEQ= 0
##$AQ_mod= 1
##$AUNM= <au_zg>
##$AUTOPOS= <>
##$BF1= 81.014009
##$BF2= 200.13
##$BF3= 200.13
##$BF4= 200.13
##$BF5= 200.13
##$BF6= 200.13
##$BF7= 200.13
##$BF8= 200.13
##$BYTORDA= 1
##$CFDGTYP= 0
##$CFRGTYP= 5
##$CHEMSTR= <none>
##$CNST= (0..31)
1 1 145 1 1 1 1 1 1 1 1 1 1 1 1 1 1 1 1 1 1 1 1 1 1 1 1 1 1 1 1 1 
##$CPDPRG= <waltz16>
##$CPDPRG1= <>
##$CPDPRG2= <waltz16>
##$CPDPRG3= <>
##$CPDPRG4= <mlev>
##$CPDPRG5= <mlev>
##$CPDPRG6= <mlev>
##$CPDPRG7= <mlev>
##$CPDPRG8= <mlev>
##$CPDPRGB= <>
##$CPDPRGT= <>
##$D= (0..31)
0 1 0 0 0 0 0 0 0 0 0 0.03 2e-05 3e-06 0 0 0 0 0 0 0 0 0 0 0 0 0 0 0 0 
0 0 
##$DATE= 1627542780
##$DBL= (0..7)
120 120 120 11 120 120 24 19 
##$DBP= (0..7)
150 150 150 150 150 150 150 150 
##$DBP07= 0
##$DBPNAM0= <>
##$DBPNAM1= <>
$$ [...]
##$SUBNAM3= <"">
##$SUBNAM4= <"">
##$SUBNAM5= <"">
##$SUBNAM6= <"">
##$SUBNAM7= <"">
##$SUBNAM8= <"">
##$SUBNAM9= <"">
##$SW= 501.771253377433
##$SWIBOX= (0..15)
0 1 3 0 0 0 0 0 0 0 0 0 0 0 0 0 
##$SW_h= 40650.406504065
##$TD= 32768
##$TD0= 1
##$TE= 0
##$TE2= 300
##$TE3= 300
##$TEG= 300
##$TL= (0..7)
0 120 53 12 22 120 120 120 
##$TP= (0..7)
150 150 150 150 150 150 150 150 
##$TP07= 0
##$TPNAME0= <>
##$TPNAME1= <>
##$TPNAME2= <>
##$TPNAME3= <>
##$TPNAME4= <>
##$TPNAME5= <>
##$TPNAME6= <>
##$TPNAME7= <>
##$TPOAL= (0..7)
0.5 0.5 0.5 0.5 0.5 0.5 0.5 0.5 
##$TPOFFS= (0..7)
0 0 0 0 0 0 0 0 
##$TUNHIN= 0
##$TUNHOUT= 0
##$TUNXOUT= 0
##$USERA1= <user>
##$USERA2= <user>
##$USERA3= <user>
##$USERA4= <user>
##$USERA5= <user>
##$V9= 5
##$VALIST= <valist>
##$VCLIST= <CCCCCCCCCCCCCCC>
##$VD= 0
##$VDLIST= <DDDDDDDDDDDDDDD>
##$VPLIST= <PPPPPPPPPPPPPPP>
##$VTLIST= <TTTTTTTTTTTTTTT>
##$WBST= 1024
##$WBSW= 4
##$XGAIN= (0..3)
0 0 0 0 
##$XL= 0
##$YL= 0
##$YMAX_a= 4746
##$YMIN_a= -5424
##$ZGOPTNS= <>
##$ZL1= 120
##$ZL2= 120
##$ZL3= 120
##$ZL4= 120
##$ABSF1= 248.5645
##$ABSF2= -253.2056
##$ABSG= 5
##$ABSL= 3
##$ALPHA= 0
##$AQORDER= 0
##$ASSFAC= 0
##$ASSFACI= 0
##$ASSFACX= 0
##$ASSWID= 0
##$AUNMP= <proc_1d>
##$AZFE= 0.1
##$AZFW= 0.5
##$BCFW= 0
##$BC_mod= 2
##$BYTORDP= 0
##$COROFFS= 0
##$CY= -3
##$DATMOD= 1
##$DC= 0
##$DFILT= <>
##$DTYPP= 0
##$F1P= 0
##$F2P= 0
##$FCOR= 1
##$FTSIZE= 65536
##$FT_mod= 6
##$GAMMA= 0
##$GB= 0
##$INTBC= 1
##$INTSCL= 5.30512e-09
##$ISEN= 30
##$LB= 1
##$LEV0= 0
##$LPBIN= 0
##$MAXI= 10000
##$MC2= 0
##$MEAN= 0
##$ME_mod= 0
##$MI= 50
##$NCOEF= 0
##$NC_proc= -5
##$NLEV= 6
##$NOISF1= 182.463
##$NOISF2= 159.3651
##$NSP= 0
##$NTH_PI= 0
##$NZP= 0
##$OFFSET= 248.5645
##$PC= 4
##$PHC0= -7406.16
##$PHC1= 149.0744
##$PH_mod= 1
##$PKNL= yes
##$PPARMOD= 0
##$PSCAL= 0
##$PSIGN= 0
##$REVERSE= no
##$SF= 81.014009
##$SI= 65536
##$SIGF1= 159.3651
##$SIGF2= -187.1042
##$SINO= 113.3802
##$SIOLD= 16384
##$SREGLST= <1H.CDCl3>
##$SSB= 0
##$STSI= 65536
##$STSR= 0
##$SW_p= 40650.406504065
##$SYMM= 0
##$S_DEV= 0
##$TDeff= 32768
##$TDoff= 0
##$TI= <>
##$TILT= no
##$TM1= 0
##$TM2= 0
##$TOPLEV= 0
##$USERP1= <user>
##$USERP2= <user>
##$USERP3= <user>
##$USERP4= <user>
##$USERP5= <user>
##$WDW= 1
##$XDIM= 65536
##$YMAX_p= 418698633
##$YMIN_p= -32195805
$$ End of Bruker specific parameters
$$ ---------------------------------
##NTUPLES= NMR SPECTRUM
##VAR_NAME=  FREQUENCY,     SPECTRUM/REAL,   SPECTRUM/IMAG
##SYMBOL=    X,             R,               I
##VAR_TYPE=  INDEPENDENT,   DEPENDENT,       DEPENDENT
##VAR_FORM=  AFFN,          ASDF,            ASDF
##VAR_DIM=   65536,         65536,           65536
##UNITS=     HZ,            ARBITRARY UNITS, ARBITRARY UNITS
##FACTOR=    0.620285442955139, 1,           1
##FIRST=     20137.2065510759, 0,            0
##LAST=      -20513.1999529892, 0,           0
##MIN=       -20513.1999529892, -32195805,   0
##MAX=       20137.2065510759, 418698633,    0
$$ Real data points
##PAGE= N=1
##DATA TABLE= (X++(R..R)), XYDATA
$$ [...]
37691 -1095118 -964586 -976565 -1010079 -740562 -287306 -187700 -533467 -685426 -241755 214160
37681 214160 -68298 -793198 -980105 -438849 -75356 -534743 -1256581 -1324505 -745519 -299523
37671 -299523 -391799 -694951 -888459 -1106313 -1426100 -1463119 -942848 -343917 -363376 -832931
37661 -832931 -836032 -63640 622229 425235 -157546 -67868 695068 1106855 747925 407200
37651 407200 708240 1055654 672660 24042 229180 1328160 2134232 1885001 1150523
37642 1150523 794357 795211 622652 229683 11058 54381 77761 32190 188539 574627
37632 574627 831994 776274 665587 718721 771055 664389 586572 675773 655086 326912 109595
37621 109595 458441 952410 731883 -139165 -591912 -95672 537205 390037 -231317 -409839
37611 -409839 -6096 390911 543605 717390 925167 875053 629635 530140 484623 130751
37601 130751 -301621 -181594 386119 567418 127779 -261184 -344330 -775867 -1735929 -2204134
37591 -2204134 -1475090 -405230 -112603 -303314 -103986 190990 -317943 -1271944 -1370760
37582 -1370760 -503119 -1809 -515276 -1058666 -690131 126071 511422 474735 439402 312545
37572 312545 -146067 -644176 -796395 -748393 -737133 -559873 -109100 136828 -121500 -303468
37562 -303468 150975 673757 357864 -471094 -587810 278187 1006922 706213 -182806 -747972
37552 -747972 -767294 -551970 -288502 -76981 -152424 -531625 -761791 -496236 -63773 -15467
37542 -15467 -318050 -470137 -295271 -138799 -273174 -525438 -592755 -414145 -111397 193570
37532 193570 383376 375564 275261 317643 523621 589162 296901 -116927 -252983 -120157
37522 -120157 -127007 -495469 -977706 -1247351 -1285183 -1202562 -951881 -487754 -21404 208612
37512 208612 294996 461482 616442 495612 176366 -17847 -125687 -509325 -1081225 -1181040
37502 -1181040 -552683 117703 136247 -183071 -62377 501898 783893 503607 203748 335166
37492 335166 624016 634549 464994 504463 776003 860199 386989 -544178 -1364688 -1478340
37482 -1478340 -889593 -331562 -491488 -1177269 -1614146 -1487481 -1175996 -943021 -563046
37473 -563046 10947 276247 -54455 -436079 -217423 380172 620932 339988 26447 -54349
37463 -54349 -158033 -432020 -586938 -406367 -157163 -227485 -591667 -836266 -619483 -40464
37453 -40464 393872 255971 -251206 -431348 31508 624949 753507 593119 679859 923314
37443 923314 749379 145266 -223703 -56055 179838 119156 47557 209014 265884 -25693
37433 -25693 -188305 287874 1037922 1248487 721318 -63225 -700565 -1103015 -1191021 -943759
37423 -943759 -649855 -575128 -495037 -84190 371323 268564 -355250 -793753 -650051 -255476
37413 -255476 -16675 76146 119047 6770 -273850 -471126 -417437 -241707 -107557 -52143
37403 -52143 -134842 -380628 -560417 -445104 -252904 -339466 -503708 -266726 179409 158152
37393 158152 -237668 -116462 603596 698270 -478544 -1657183 -1331350 -10718 541481
37384 541481 -143507 -917256 -1084890 -1232484 -1699695 -1704352 -726617 363966 505706 -5087
37374 -5087 -138478 213909 235776 -364913 -866645 -604743 191618 873502 1179142 1282772
37364 1282772 1352040 1340825 1116949 653233 129614 -156672 -84042 115402 113023 -87544
37354 -87544 -139039 191616 693479 927997 702838 241290 -98030 -180847 -137209 -116460
37344 -116460 -123920 -102082 -24371 149608 432892 608438 304231 -467159 -1048660 -821538
37334 -821538 -60996 354406 98205 -267368 -246706 -108681 -267965 -504194 -381243 -98861
37324 -98861 -229973 -733878 -943258 -609717 -287546 -416393 -616645 -344864 176681 260798
37314 260798 -197252 -542920 -271331 345764 706968 623463 385245 293673 377929 490087
37304 490087 463845 181120 -352622 -939593 -1278698 -1192727 -775329 -313240 -49658 15412
37294 15412 87603 289158 435127 229462 -292376 -695825 -636844 -266003 10120 18228
37284 18228 -141333 -391549 -699645 -858203 -597259 31131 664443 1057528 1196420 995335
37274 995335 340235 -437960 -658259 -174824 295413 147669 -248959 -220305 83736 6615
37264 6615 -368363 -217091 652589 1311640 1004622 226030 -66766 214653 428203 335166
37254 335166 319849 531596 542779 82634 -428909 -436249 -13466 299096 262869 180305 374067
37243 374067 739983 946215 874275 668515 443395 162873 -177688 -447458 -540212 -490885
37233 -490885 -348605 -99780 155888 142273 -251663 -686423 -689226 -205002 407349 867155
37223 867155 1176169 1362890 1364596 1228588 1113971 982934 590540 -71851 -615983 -736010
37213 -736010 -587634 -464191 -349337 -91933 166711 105397 -293516 -685427 -801983 -712708
37203 -712708 -635155 -691624 -877733 -1091335 -1165779 -1027338 -819505 -703745 -558829 -126464
37193 -126464 485429 730728 270807 -489232 -799285 -459052 -40422 -158088 -758374 -1269476
37183 -1269476 -1260154 -750530 -32800 531113 619552 220208 -164888 53444 762114 1121907
37173 1121907 588143 -344565 -776174 -554369 -334954 -572143 -948374 -924509 -454637 80025
37163 80025 406270 585602 798074 1054076 1120175 743619 23279 -523808 -451626 84485
37153 84485 480159 357056 -104887 -492617 -595137 -495822 -436146 -616074 -957873 -1078138
37143 -1078138 -678481 68155 712518 1029606 1078417 875257 378876 -205451 -482597 -310662
37133 -310662 87495 467658 725850 760691 562582 433316 673624 1012072 839763 131283
37123 131283 -391565 -244709 151934 113418 -390374 -808437 -741721 -306289 54449 -60477
37113 -60477 -636919 -1162710 -1164536 -813005 -619262 -598839 -328404 137386 172466 -351693
37103 -351693 -697474 -403163 -45959 -263846 -684315 -577300 -53824 214774 119004 125216
37093 125216 383587 597200 654942 685136 570183 87425 -522831 -787005 -771612 -980924
37083 -980924 -1454790 -1605402 -1084572 -277142 246761 367732 363634 523143 891267 1193467
37073 1193467 1065049 538280 101897 42745 50323 -187257 -406451 -282091 -96069 -242456
37063 -242456 -431357 -163018 273992 143109 -543338 -1047031 -1074434 -1041503 -1147355 -1092325
37053 -1092325 -852437 -848189 -1104329 -1054093 -466209 166415 433302 492680 503310 310342
37043 310342 -16436 -77187 106475 -8579 -482248 -587201 28386 656089 583625 143373
37033 143373 69009 404222 709091 837461 864665 709222 449195 544099 1088689 1316298
37023 1316298 589206 -503390 -832480 -242068 413355 551006 370196 147556 -179077
37014 -179077 -599500 -839075 -773297 -600505 -487952 -405030 -341968 -325501 -189940 299977
37004 299977 1032499 1550793 1524537 1011013 300036 -250335 -307399 183198 829596 1131170
36994 1131170 999005 763032 708015 788536 766103 486030 66071 -137013 94921 460219
36984 460219 415771 -67397 -402456 -239536 11008 -142573 -472319 -403863 74998 417835
36974 417835 307861 -47184 -356241 -534571 -542849 -327685 922 204860 190878 73838
36964 73838 -22849 -82983 -154972 -293378 -456614 -430018 -55704 412981 486375 71001 -412125
36953 -412125 -657749 -799402 -928371 -810441 -406348 -173817 -422939 -802756 -875903 -785612
36943 -785612 -880234 -1097506 -1227441 -1347075 -1441284 -1081779 -174892 423810 -125489 -1371788
36933 -1371788 -2098333 -1888804 -1329248 -859147 -354335 215122 624748 921000 1276278
36924 1276278 1328518 558240 -634349 -1188069 -876046 -583311 -833910 -1027536 -592624
36915 -592624 -1542 -4375 -505250 -827547 -642828 -135022 370558 544618 203545 -351999
36905 -351999 -534136 -248189 -30538 -208047 -472354 -531272 -553464 -635275 -481364 -47065
36895 -47065 129062 -261809 -725752 -734616 -517428 -514532 -570665 -311778 123643 378026 505843
36884 505843 691682 745707 531555 475570 908453 1274455 827536 -151243 -690061 -507402
36874 -507402 -193331 -107525 3199 238704 255874 -67742 -386743 -475996 -436378 -219283
36864 -219283 354880 974345 993223 443749 134691 425837 677967 365462 -34367 95468
36854 95468 406332 149886 -564661 -926131 -642714 -211321 1212 202624 565196 800896
36844 800896 627709 239968 26316 69264 131052 -33075 -460732 -921660 -1033310 -640255
36834 -640255 -94073 93231 -111120 -271547 -162895 -34404 -57515 27252 387486 626499
36824 626499 320218 -224186 -302835 182031 605660 529053 175167 -129949 -432606 -777167
36814 -777167 -850788 -461340 -56105 -250316 -960643 -1463514 -1311036 -820795 -599542 -857254
36804 -857254 -1271881 -1359001 -936045 -319208 -8438 -95566 -150215 163500 608266 781926
36794 781926 747280 843279 1041152 983481 618112 305612 256936 303786 281957 216517 77299
36783 77299 -193472 -348422 -41029 519336 669426 243467 -142263 -18079 323334 506838
36773 506838 742454 1251196 1551807 1041262 -23306 -820619 -1044713 -1031329 -980789 -782444
36763 -782444 -566372 -687086 -1045203 -1082528 -636079 -204392 -143557 -182851 -55758 -61343
36753 -61343 -530513 -1127756 -1218010 -738299 -239638 -146723 -372442 -640469 -815450 -826648
36743 -826648 -552182 22885 618089 781100 285650 -563922 -1093181 -855618 -80228 597208
36733 597208 825271 761534 622141 358644 -26639 -166424 285638 1075570 1535003 1353886
36723 1353886 850254 432686 140710 -126167 -238397 -2394 440676 685976 539873
36714 539873 217904 43485 112237 288446 386724 297242 38454 -255468 -461474 -582718
36704 -582718 -656024 -598482 -321394 22841 147581 33117 -42295 32979 24585 -166771 -187681
36693 -187681 244716 753076 693082 26931 -645331 -880167 -759262 -472675 -51651 367035
36683 367035 506768 392753 399314 631285 694062 360009 13448 41937 188327 2392
36673 2392 -368501 -398334 -16224 328748 360202 221012 53912 -163574 -325449 -213445
36663 -213445 83534 173431 -88167 -404700 -504351 -448411 -365102 -243445 -133537 -175019
36653 -175019 -241032 55831 733003 1173164 853732 80104 -405590 -373230 -244268 -357792
36643 -357792 -523195 -387695 55761 464726 485831 31667 -628546 -1010133 -810493 -251669
36633 -251669 91069 -115109 -618965 -895236 -696983 -210313 251674 546411 673808 606563
36623 606563 308533 -82221 -244395 29573 569423 971469 1007926 801319 589220 432045
36613 432045 215217 -132460 -498767 -655890 -460625 -30187 282021 157239 -407467 -1107829
36603 -1107829 -1590579 -1657238 -1310061 -765479 -381178 -341060 -378235 -56917 581481 939594
36593 939594 634269 84322 8967 508261 1024305 1141897 992410 802779 487143 -72003
36583 -72003 -646371 -871766 -681987 -301285 59470 283319 268555 32969 -179984 -141992
36573 -141992 56062 141819 30818 -158309 -362752 -575401 -659831 -495664 -290841 -388303
36563 -388303 -716238 -805137 -462937 -57060 58384 35871 193732 487412 640477 593414
36553 593414 515634 515607 587743 697059 703794 402938 -129221 -461327 -350144 -102518 -77489
36542 -77489 -110681 154477 618512 891935 900717 810989 560840 77768 -216642 129156
36532 129156 674186 460087 -560000 -1305704 -1076569 -473130 -367189 -685002 -813398
36523 -813398 -626507 -428070 -298237 -168140 -222628 -584958 -862687 -639477 -203675 -165210
36513 -165210 -545834 -902797 -1176303 -1657864 -2167516 -2068732 -1253939 -416614 -109994 -144377
36503 -144377 -169343 -234032 -394218 -318412 197890 699856 590199 -38716 -568820 -698068
36493 -698068 -637059 -545385 -304834 39512 93736 -324387 -736138 -505456 296648 906427
36483 906427 815161 376554 268692 607605 920109 862638 571255 290789 60466 -103774
36473 -103774 -96695 -26876 -292168 -1004830 -1568261 -1233334 -20453 1225535 1691278 1282217
36463 1282217 504078 -96762 -350328 -475282 -714890 -979108 -1001401 -847626 -940577 -1421982
36453 -1421982 -1836860 -1725245 -1219567 -734312 -368487 -3423 287760 369670 340327 259604
36443 259604 -118930 -810717 -1133366 -525183 372978 343452 -684393 -1445568 -1092936 -268682
36433 -268682 -10208 -352465 -613646 -505277 -278233 -91914 121702 297776 253599 33062
36423 33062 -124929 -143525 -176005 -348179 -612588 -808799 -761275 -415243 52609 383919
36413 383919 520370 568943 532552 351528 167597 171062 194914 -80805 -477113 -409733 219374
36402 219374 787388 834800 608266 429709 157679 -277200 -412247 55707 592527 515119
36392 515119 3258 -255682 -137812 -74775 -184102 -176748 -60668 -185668 -530204 -617080
36382 -617080 -267828 145351 335620 432547 518929 387842 -1192 -307243 -328258 -332687
36372 -332687 -589692 -923073 -1031691 -955956 -909625 -868478 -637816 -203704 231597 492282
36362 492282 541474 425944 229408 19716 -203570 -412977 -427654 -97005 356258 438794
36352 438794 -33414 -661088 -916329 -701609 -307169 20239 262126 470677 626507 663548
36342 663548 532855 232686 -177621 -599256 -939725 -1117443 -1053711 -738825 -306126 30750
36332 30750 131232 -1111 -258502 -504865 -672822 -809702 -932068 -849921 -369861 252679
36322 252679 394382 -145528 -718715 -573605 155328 640051 444808 -50467 -313645 -272150
36312 -272150 -150641 -111546 -225883 -469248 -595122 -327052 178277 387607 84832 -315251
36302 -315251 -359524 -156377 -119075 -355004 -589671 -533688 -105921 545442 1058388 1077850
36292 1077850 643281 170733 -90204 -311323 -621865 -751325 -467011 -55662 64297
36283 64297 -9418 125646 473342 675002 695554 904072 1363618 1570117 1160355 485555
36273 485555 152963 248284 337612 101668 -326313 -607650 -547629 -185964 285784 625880
36263 625880 645171 311500 -187018 -499320 -358157 128350 521434 523664 317898 257938
36253 257938 328804 202227 -203053 -565032 -636104 -538830 -452152 -352138 -268657 -425617
36243 -425617 -795117 -857853 -282958 397774 383313 -223421 -491684 -522 571575 493964
36233 493964 17496 -132841 152799 407156 447037 513882 615074 394465 -203910 -707408
36223 -707408 -792081 -728830 -855567 -990522 -740782 -128865 460228 779504 826129 598328
36213 598328 123327 -317840 -329388 189909 968855 1655353 2000069 1865333 1337785 780489
36203 780489 485551 305693 -80555 -588543 -786364 -559143 -300817 -307672 -379667 -264342
36193 -264342 -142041 -312656 -629539 -654009 -303555 18157 -19310 -264535 -345034 -157176
36183 -157176 42689 -23359 -319534 -519887 -361076 52331 342681 253591 -111177 -423655
36173 -423655 -407669 -1937 592612 997638 952379 583812 240209 40358 -178224 -396328
36163 -396328 -227253 549610 1494446 1879846 1482275 737141 162471 -114988 -282613 -536843
36153 -536843 -891203 -1141083 -1041570 -640565 -329900 -392622 -639326 -726023 -664470 -684227
36143 -684227 -737094 -589188 -353297 -412756 -745254 -850135 -525107 -195898 -200396 -253814
36133 -253814 -8181 335381 472458 620369 1051847 1328891 806918 -196049 -590410
36124 -590410 -23200 603301 466938 -35199 -40935 415602 518869 -79342 -818396 -1050634
36114 -1050634 -751251 -273285 173387 561747 819111 806005 481073 17432 -223909 71125
36104 71125 799422 1379140 1297297 713050 271562 297237 454333 303818 -95633 -354542
36094 -354542 -313495 -169149 -126964 -173506 -191291 -111589 76972 326316 489776 408162 117676
36083 117676 -100829 8889 346675 478022 79315 -643553 -1099008 -957665 -560017 -508985
36073 -508985 -890982 -1141636 -781468 -64444 322240 81696 -434641 -764956 -834970 -813031
36063 -813031 -742340 -577648 -447180 -548990 -770441 -726460 -314881 45173 -24756 -291590
36053 -291590 -274565 -59435 -255341 -1045086 -1768694 -1758038 -1212599 -817961 -737948 -510656
36043 -510656 101636 673090 665605 58212 -739092 -1321493 -1480838 -1210872 -717826 -276264
36033 -276264 49185 390703 725711 775585 389923 -189318 -619201 -823162 -894878 -828584
36023 -828584 -570353 -209320 98418 314365 451836 414395 85163 -454525 -917547 -1009949
36013 -1009949 -640649 -63876 207433 -109106 -610196 -572830 84945 593221 342312 -283940
36003 -283940 -491492 -166830 140118 119578 -4013 -37689 -111209 -318579 -546687 -780420
35993 -780420 -1148806 -1529399 -1525429 -1040363 -527948 -445980 -719008 -910723 -695787 -66976
35983 -66976 638019 850842 301444 -447784 -460583 354756 985137 636168 -176968 -412281
35973 -412281 11221 232875 -190159 -713655 -726731 -388111 -218106 -301567 -292512 6712
35963 6712 392361 505060 166597 -422627 -738988 -386208 380075 800820 475954 -137518
35953 -137518 -342378 -116978 -54772 -481333 -1051012 -1291977 -1173372 -943486 -710181 -459964
35943 -459964 -298012 -351732 -502057 -475450 -188603 199553 528324 702176 589680 176767
35933 176767 -169484 38260 736528 1213916 902739 44386 -629533 -662725 -136752 558366
35923 558366 941141 676261 -50151 -563670 -459651 -159282 -311798 -808840 -915372 -345513
35913 -345513 344032 536409 233830 -210644 -573842 -734290 -571650 -195473 30594 -35584
35903 -35584 -82895 173227 563131 760447 719707 566972 370122 302414 677949 1442677
35893 1442677 1959503 1753169 1179970 857647 730024 339958 -193598 -279262 82581 196134
35883 196134 -162413 -310609 174800 616442 244722 -496946 -513361 310400 922610 627803
35873 627803 16325 33755 680429 1122760 825923 120951 -292469 -84107 478040 822637
35863 822637 576679 -87172 -602777 -596570 -249165 42453 214443 482215 813393 838194
35853 838194 404851 -112618 -301547 -249308 -290689 -421258 -373060 -198474 -299494 -749504
35843 -749504 -1001528 -556330 333343 931721 852031 341274 -167894 -481170 -614732 -628998
35833 -628998 -604739 -611456 -579464 -316670 224238 759041 884080 489527 -123714 -576799
35823 -576799 -787010 -919808 -1021516 -896718 -454071 -5353 13998 -413575 -850236 -924797
35813 -924797 -671961 -306207 75212 410342 528920 351171 125370 209880 610606 912062
35803 912062 714636 51878 -646840 -958676 -825446 -521617 -279191 -56423 214275 327551
35793 327551 73948 -277858 -237641 91084 8100 -694425 -1223926 -894330 -236599 -234314
35783 -234314 -764706 -766256 52566 710078 491966 38158 235813 779804 742982 143886
35773 143886 -79377 411555 833423 517871 -122320 -295669 78099 495361 683508 730898
35763 730898 650143 400460 267577 644467 1343352 1635190 1194162 587404 517560 911658
35753 911658 1164496 1062593 961544 1066950 1042259 536644 -235962 -729001 -703178 -388772
35743 -388772 -108221 32446 99614 166767 228676 193207 -29318 -361148 -547219 -436803
35733 -436803 -242728 -362341 -884466 -1368826 -1216710 -296491 809222 1250149 704176
35724 704176 -273424 -806172 -608335 -192608 -156526 -523283 -941487 -1249580 -1488931 -1515625
35714 -1515625 -1082562 -384013 -66303 -420314 -886023 -755258 -187626 -28968 -587162
35705 -587162 -1128631 -913519 -298796 -214249 -707043 -778016 100969 1031933 861064 -169902
35695 -169902 -763574 -379926 206057 281503 195774 515494 962223 926819 535636 384631
35685 384631 492683 358953 -31976 -100007 339645 744514 739832 648842 766339 725081
35675 725081 118680 -676618 -909964 -480855 -7384 62818 -82208 -96303 7721 18051
35665 18051 -59281 -1361 278667 577189 650654 501205 295327 70906 -251658 -522272
35655 -522272 -322075 480891 1344181 1564390 1085861 460598 84711 -118285 -272375 -281932
35645 -281932 -117060 28090 21208 -76277 -233416 -435142 -424211 21269 475066 208169
35635 208169 -603490 -793746 171283 1249204 1261716 624362 619377 1365814 1719357 1112486
35625 1112486 275519 -98636 -271997 -573997 -602605 -17157 629154 642695 242622 85609
35615 85609 159118 -27807 -415000 -401475 170913 780485 1005276 904913 592394 71710
35605 71710 -384972 -317317 266538 832057 1076311 1204790 1303892 1098424 631187 490883
35595 490883 878197 1079471 511799 -258618 -343253 44226 -43059 -683564 -920804 -315066
35585 -315066 352600 313846 -104796 -192623 19037 3637 -342146 -694247 -931124 -1148917
35575 -1148917 -1217172 -882517 -247426 300367 567844 609651 461842 218901 179642 438990
35565 438990 511342 -74420 -907222 -1052092 -305091 521762 697995 392987 201416 362231
35555 362231 708386 972592 881628 299382 -491811 -960970 -942289 -743769 -539996 -130397
35545 -130397 482557 789770 436970 -197402 -506076 -454179 -475711 -773104 -1090804 -1086268
35535 -1086268 -694193 -227291 -189770 -741593 -1323387 -1233093 -629146 -360945 -636927 -645703
35525 -645703 76270 749427 568575 83092 345833 1167726 1377791 635628 -162701 -329583
35515 -329583 -162398 -72892 59699 299279 279642 -113273 -378717 -180521 103082 40788
35505 40788 -195106 -271892 -273544 -366774 -362080 -103673 100967 -69803 -408898 -539211 -503241
35494 -503241 -568035 -746432 -918091 -1106542 -1236602 -986595 -334746 142641 52383 -127633
35484 -127633 227535 837731 943444 516613 184805 78556 -280731 -854337 -844867 30752
35474 30752 860579 706536 -137540 -659916 -473022 -33847 178764 95117 -189872 -539341
35464 -539341 -686701 -468398 -123298 17137 55611 297319 557192 290268 -462553 -880537
35454 -880537 -478597 93127 -88836 -888508 -1298197 -851306 -157821 87754 -14764 -5782
35444 -5782 155083 220303 199812 242869 202026 -136154 -511603 -448380 -21790 200005 23133
35433 23133 -158191 -145400 -286023 -733689 -967210 -540437 144602 375620 116269 -123932
35423 -123932 -160425 -238129 -379840 -289771 32080 154719 -144321 -567054 -794194 -877506
35413 -877506 -933746 -842663 -529376 -247859 -278626 -539286 -765463 -930018 -1211563 -1610457
35403 -1610457 -1827710 -1559341 -819404 32610 574765 692080 650130 712365 767206 547744
35393 547744 163124 67225 409982 765368 709596 371526 123381 -26194 -339548 -765300
35383 -765300 -875525 -464717 106465 330771 141948 -63890 91929 562522 898943 655718
35373 655718 -144702 -927791 -1054840 -465211 235746 389721 -70709 -643176 -846580 -686215
35363 -686215 -537111 -656944 -876222 -780725 -198315 526251 816201 456620 -171851 -523728
35353 -523728 -459021 -232536 3288 381863 909218 1189023 889184 330765 191879 571497
35343 571497 737103 34892 -1203506 -1973621 -1728601 -916531 -366444 -374614 -549724 -460379
35333 -460379 -207952 -216057 -549998 -732590 -374961 255685 587080 492673 297371 118775
35323 118775 -278356 -880891 -1235306 -1135269 -1005628 -1190077 -1289488 -777422 627 101626
35313 101626 -772027 -1854016 -2214195 -1656520 -655965 201898 599324 614602 603436 790747
35303 790747 1007646 1004390 842011 660488 289689 -418863 -1047835 -1042630 -652161 -730022
35293 -730022 -1463943 -2018189 -1729575 -992883 -543544 -459340 -404015 -357801 -457323 -441189
35283 -441189 53787 767714 998231 519212 -148415 -416939 -193266 275590 749520 1069893
35273 1069893 1140415 980772 726187 554555 624667 949366 1252137 1146621 611989 106505
35263 106505 43116 345615 694234 966421 1188034 1272987 1124482 863323 684595 584010
35253 584010 434186 218420 24358 -56328 70989 366779 461500 -3028 -692124 -761865
35243 -761865 -29585 594084 301757 -513977 -938100 -798684 -539367 -275044 158693 511331
35233 511331 395893 97810 194124 487295 291300 -279029 -382172 110660 394422 184666
35223 184666 194237 708664 892812 235837 -409885 -178688 332180 45741 -818758 -1164015
35213 -1164015 -786854 -507022 -694082 -832875 -618446 -449143 -599464 -745336 -599717
35204 -599717 -341695 -143491 140857 554414 819637 782771 622644 428619 51961 -400861
35194 -400861 -419412 233421 1057640 1359466 1016405 465101 158925 229697 457765 410753
35184 410753 -164616 -957906 -1334596 -1046794 -426966 170227 705555 1109007 1113181 761955
35174 761955 633888 1092528 1645644 1582592 1024039 738619 990251 1193155 830525 158520
35164 158520 -278862 -399726 -462165 -472821 -179764 399269 840848 813871 458523 134954
35154 134954 -23329 -145703 -335748 -528715 -596604 -451268 -78823 372569 564683 235721
35144 235721 -445186 -962948 -987890 -684796 -416478 -311270 -247831 -97908 193904 640330
35134 640330 1127414 1402029 1332853 1090491 889036 685158 375057 145728 277978 642940
35124 642940 777050 528162 283548 410350 751568 872146 610249 186778 -126460 -295121
35114 -295121 -508226 -911611 -1326132 -1340133 -843880 -326905 -331186 -692606 -736663 -233415
35104 -233415 316806 459176 335570 233930 108248 -78107 -3183 504414 959317 809804
35094 809804 312922 217278 692663 1178333 1252853 1032900 656243 15791 -773157 -1198768
35084 -1198768 -977667 -466267 -161725 -126838 -156626 -158010 -79040 191617 528582 506200
35074 506200 10493 -395072 -179109 316333 279708 -425791 -1064627 -1015152 -477313 -63653
35064 -63653 -71310 -349448 -613803 -696052 -629904 -596774 -690475 -760198 -642397 -450426 -375978
35053 -375978 -316867 -77127 143112 -37324 -441734 -400949 239742 774379 659298 319448
35043 319448 407486 749333 741288 479486 639306 1267710 1533762 908801 -74446 -581300
35033 -581300 -487084 -267652 -277159 -511061 -800288 -905281 -642888 -181303 50392 -9637
35023 -9637 139962 792978 1432160 1390327 848572 579608 817409 1018547 780194 360216
35013 360216 85586 -185072 -655825 -1078175 -1065637 -659915 -191441 227648 671511 996847
35003 996847 916566 492359 175549 257433 568449 828217 1009373 1172913 1171475 782606
34993 782606 68666 -591024 -826261 -562123 -70466 178876 -113079 -660541 -705903 144991
34983 144991 1281778 1681396 1177647 672947 870752 1286485 997377 41629 -600703
34974 -600703 -377032 158325 235763 -117405 -329413 -165982 85265 125476 -53336 -306324
34964 -306324 -476300 -432889 -196350 19006 47307 -36426 -111563 -235153 -474105 -698444
34954 -698444 -781032 -806151 -801535 -508885 176835 757727 662608 134191 -12584 442251
34944 442251 824744 622373 223865 234352 546991 595521 235921 -116549 -95746 267513
34934 267513 734304 1082486 1196314 1162415 1188410 1246503 984516 241706 -551274 -823402
34924 -823402 -566119 -225650 -14798 245059 626492 885543 848345 651942 465040 264139
34914 264139 34922 -63742 77366 302509 349992 113579 -318398 -721123 -774487 -274052
34904 -274052 551288 1106957 1002041 468553 89648 188440 579547 827639 638465 66994
34894 66994 -546354 -864145 -823785 -598962 -327256 -5523 344908 592722 650924 567486
34884 567486 392768 123880 -134616 -161218 72210 262466 157589 -60331 -14249 335266
34874 335266 647088 646026 371457 10098 -252159 -206252 239794 789444 909381 437064
34864 437064 -177155 -421900 -292910 -61841 267645 827307 1306580 1083094 130347 -681959
34854 -681959 -584025 108911 471896 231169 -25830 109118 255584 -46435 -529506 -574622
34844 -574622 -121702 280046 230581 -125200 -423019 -433562 -104209 397377 666318 433535
34834 433535 -21431 -192295 -90694 -197829 -563438 -528121 292762 1222912 1271621 418778
34824 418778 -406856 -549068 -287808 -220074 -456203 -666484 -641782 -529668 -573435 -773368
34814 -773368 -866093 -667894 -393151 -457023 -916309 -1352108 -1436796 -1311329 -1169276 -842216
34804 -842216 -225825 211394 -39183 -650046 -793257 -316919 133757 234698 400235 806994
34794 806994 854134 179675 -463025 -117986 989907 1754326 1639181 1102485 702831 518663
34784 518663 476452 588249 727433 698697 637626 832954 1065767 711866 -286823 -1116792
34774 -1116792 -1098437 -543270 -219043 -334815 -512199 -508753 -463537 -483617 -419345 -159028
34764 -159028 95159 -4178 -529122 -1063875 -1016684 -292268 440475 447467 -124703 -408109
34754 -408109 -13758 422802 190340 -480992 -858302 -826112 -914057 -1312792 -1546024 -1264610
34744 -1264610 -795793 -609134 -655290 -588543 -344728 -98248 171927 632047 1137828 1256030
34734 1256030 880433 494045 570531 936348 1044261 768984 551607 710363 986917 977703
34724 977703 710062 490355 407211 360403 434412 784751 1167511 1070104 456663 -38906
34714 -38906 94153 591656 834207 641679 320392 109521 -59175 -303018 -570836 -705747
34704 -705747 -592395 -286858 -69208 -210747 -576973 -670524 -246985 325128 548821 440194
34694 440194 401993 618492 896602 1012427 904334 576879 109390 -253338 -275313 -7221
34684 -7221 283706 413494 353760 124912 -165813 -290184 -142131 61973 18920 -332207
34674 -332207 -853518 -1347398 -1468915 -867729 224260 919172 690165 134769 117225 470409
34664 470409 350848 -315086 -714151 -502382 -243590 -231262 81937 937533 1486161 930490
34654 930490 -230475 -933759 -993066 -917730 -723049 22034 1081123 1520896 985089 189585
34644 189585 -129523 -88019 -134563 -243128 -101687 238938 370525 56226 -549743 -1125286
34634 -1125286 -1401607 -1234752 -665460 63140 630362 825625 677455 463818 511164 840503
34624 840503 1073409 864028 374803 106004 259844 509543 455171 101476 -218139 -252563
34614 -252563 -71132 40639 -105721 -351867 -335470 7412 234418 -41823 -476071 -272222
34604 -272222 767020 1860969 2182216 1891541 1879112 2585675 3472948 3739149 3233437
34595 3233437 2436786 1751797 1182874 730926 693503 1267972 2098915 2679477 3164170 4247209
34585 4247209 6029254 7506286 7622313 6509090 5182767 4244301 3482289 2661874 1993501
34576 1993501 1651391 1435433 1202436 1130757 1235995 1127511 681354 487615 1040625 1832217
34566 1832217 1952003 1396577 1003330 1103686 1092697 566100 49950 84604 265474 -68320
34556 -68320 -639283 -591605 134015 681322 602578 426407 597431 677959 203896 -307286
34546 -307286 -36106 777637 1039793 334929 -565175 -886395 -788069 -761924 -747035 -391762
34536 -391762 220323 686893 897973 1016552 1018498 765589 440398 392591 563651 548942
34526 548942 264265 69844 147791 240595 161449 93489 163508 167953 -3010 -105239 -33875
34515 -33875 -128189 -543422 -748333 -250642 491849 603858 79001 -249605 -26477 190371
34505 190371 38439 30111 587016 1101945 749842 -174824 -588035 -144334 391095 359518
34495 359518 2811 -234040 -473311 -956257 -1336728 -1096135 -427843 -26332 -20909 204123
34485 204123 925428 1442000 1001239 -30547 -553855 -176345 377482 407158 149232 175989
34475 175989 407169 342243 1577 -89615 163325 225271 -144568 -435511 -210770 196034
34465 196034 308943 339205 742701 1292179 1336583 849676 489571 600646 833551 853216
34455 853216 763046 630689 230501 -411177 -737253 -321651 550993 1273967 1541372 1334913
34445 1334913 719204 2196 -275515 89322 667310 965079 971171 871902 663914 425958
34435 425958 510077 966473 1215768 879903 517947 812875 1374408 1228566 330803 -353637
34425 -353637 -307260 -49458 -48570 32605 540023 1042679 988981 638296 653524 1048192 1191478
34414 1191478 779605 246208 125360 399723 638535 561731 313858 254323 557657 1012975
34404 1012975 1204299 887813 203760 -421939 -560668 -92847 632544 1033052 838486
34395 838486 350105 38667 -2460 -28914 -194377 -378896 -416049 -253155 94709 537983
34385 537983 877658 973746 933243 964629 1091635 1173974 1137490 1008010 799851 545270
34375 545270 345551 251974 239930 416587 973514 1706793 1925054 1234133 167683 -411316
34365 -411316 -360705 -250253 -444954 -711206 -720120 -489739 -261489 -241566 -466614 -708581
34355 -708581 -642443 -333754 -298034 -752770 -1144574 -889113 -271817 -30591 -272640 -442607
34345 -442607 -227342 148787 465097 730591 876472 758755 475587 257700 126465 36753
34335 36753 128729 393872 408554 -60369 -533650 -504132 -240603 -216817 -194748 275595 863568
34324 863568 930842 652841 661296 888422 834970 680202 958704 1383501 1226364 683882
34314 683882 589653 907574 826779 256256 -118322 -181930 -411677 -642880 -267760 404669
34304 404669 500946 217738 504879 1207332 1265329 716079 621789 1003818 859707 297625
34294 297625 489212 1343234 1525097 1030237 1278181 2294778 2432735 1409378 870546
34285 870546 1294104 1229924 377136 331023 1358978 1710073 1166098 1711486 3444909 3775270
34275 3775270 2265860 1982734 4002486 5198050 4028223 3597224 5807920 7702931
34267 7702931 7450604 8413906 12674434 16544625 18113690 22519485 32702384 43090901
34259 43090901 53040899 77792649 128439401 183640149 201766166 167384641 109986529
34252 109986529 68514098 51422352 42238205 30745351 21581276 18225856 15963428
34245 15963428 11821935 9091412 9316976 8829616 5772435 3313300 3481528 3886928 2754053
34236 2754053 1881132 2440997 2534007 1069826 31023 830041 1904134 1743563 1187130
34227 1187130 1119157 791590 -100419 -361910 378330 801845 437847 528831 1371361 1446669
34217 1446669 329349 -181611 848980 1783243 1243852 324482 391947 799262 482725
34208 482725 17092 360122 1025198 1081082 738923 584661 376369 -173138 -488797 -116947
34198 -116947 363225 344564 133946 109857 -10600 -333115 -311627 179864 412009 95072
34188 95072 -62415 265843 355356 -130094 -345660 226789 743637 437543 -84767 -21926
34178 -21926 214060 -111503 -643092 -545092 115631 580842 508866 113111 -341009 -605470
34168 -605470 -507367 -318270 -472812 -720627 -393836 314075 433285 -132119 -313305 274010
34158 274010 543829 -250307 -1196818 -1149876 -371510 208901 373998 292948 -217459 -1073892
34148 -1073892 -1426955 -816630 -62717 -25907 -270948 8340 523464 514967 185670 273522
34138 273522 642661 504840 -202324 -721796 -629201 -207853 193670 446182 454349 308949
34128 308949 377787 703527 698752 25695 -694900 -741393 -381411 -321971 -501287 -323149
34118 -323149 181829 347209 -51572 -493747 -516863 -214433 107536 305715 410513 562010
34108 562010 853847 1073030 867571 334192 2069 16840 -79499 -430627 -426418 282897
34098 282897 997956 899675 230827 -203722 -254505 -327352 -429201 -198975 280152 515828
34088 515828 409564 333532 417422 377231 92412 -163285 -129621 170479 544758 713313
34078 713313 413019 -244941 -694820 -554600 -157408 -59845 -221700 -136083 346818 810387
34068 810387 893665 728077 664625 822664 1013331 999947 777317 581048 591998 730317
34058 730317 859514 1008438 1145926 978991 382220 -204172 -338520 -321710 -707634 -1251236
34048 -1251236 -1176344 -433350 227204 476739 707119 966059 699830 -98074 -578710 -374396
34038 -374396 -193422 -494226 -635218 -103181 432578 236939 -194667 -10609 528954 571477
34028 571477 146910 12619 334850 537672 305950 -103135 -421587 -551429 -354939 134909
34018 134909 513885 537876 546667 871092 1235149 1265133 1098481 925937 506276 -211835
34008 -211835 -611637 -319937 22845 -239689 -638050 -411845 116202 140627 -153391 9133
33998 9133 466366 368345 -194260 -232514 379920 588346 -59032 -605969 -259754 319536
33988 319536 97672 -723270 -1030219 -353347 626550 1017579 676166 190647 142275 466318
33978 466318 575995 129841 -518268 -789971 -561921 -112830 363740 843951 1256744 1531223
33968 1531223 1714569 1770633 1486903 863828 309237 127973 138888 124697 250151 608283
33958 608283 792936 478462 58658 105755 479570 569178 188711 -317777 -629828 -581119
33948 -581119 -1625 995951 1766615 1701962 918041 11271 -603432 -773330 -449606 99489
33938 99489 330556 141307 111998 602101 1151686 1273299 1209906 1311169 1319120 970029
33928 970029 656312 738248 839606 586202 334487 359111 138912 -602181 -1039652 -559464
33918 -559464 8773 -187324 -309193 808593 2362493 2577212 1521908 901675 1240338
33909 1240338 1344687 653234 68643 92546 41069 -345972 -265967 544108 1166871 1121657
33899 1121657 1104956 1446906 1352625 492896 -72545 505133 1553062 2057340 2062224 2060692
33889 2060692 2028228 1886186 2002319 2502073 2925931 3109717 3500084 4222529 4913682 5774279
33879 5774279 7516112 10020384 12560699 15527586 20025722 25689368 31713827 40580066
33871 40580066 56548073 77589657 92383039 90210886 72864404 52663966 39171106
33864 39171106 31915360 26089320 20239189 15920333 13429116 11445649 9497281 8084589
33856 8084589 7029318 5698752 4397256 3873773 3799378 3201172 2162728 1716897 2109713
33847 2109713 2421305 2054025 1545647 1608533 2155146 2617085 2675680 2382239 1938174 1572594
33837 1572594 1384951 1223354 933350 678743 718280 924962 888108 485378 -1251 -346768
33827 -346768 -587863 -717686 -558440 -74113 487956 890549 1089142 1066963 808123 518245
33817 518245 513920 758241 860507 671942 471687 393539 166784 -290045 -537983 -263532
33807 -263532 252895 731176 1361861 2165253 2587545 2452754 2542969 3298682 3835353 3543860
33797 3543860 3680227 5520207 7933545 9562805 12866922 21958252 35125643 43462859
33789 43462859 40081002 28280710 17297045 11795631 9317705 6762523 4556943 3761442
33781 3761442 3299165 2088394 1124790 1409536 1878225 1300366 538070 979061 2030058
33772 2030058 2078087 1031866 157633 34442 235269 543076 1043508 1341598 948864
33763 948864 216709 -150053 -204325 -433205 -713236 -579502 -190329 -41257 -19187 309618
33753 309618 758972 815487 607612 642108 811350 614992 174498 58923 236211 174059
33743 174059 -83459 61058 605195 787075 291564 -217927 -71045 566967 1111910 1288567
33733 1288567 1188506 1018766 990816 1159242 1307528 1259052 1201748 1345771 1430643 1071566
33723 1071566 481452 283553 623861 1014815 1088753 968823 805808 470509 -101737 -664092
33713 -664092 -964951 -1027544 -983015 -856650 -640805 -421584 -349779 -526145 -835254 -858747
33703 -858747 -221565 789659 1270429 710518 -270977 -611882 -75245 594153 696503
33694 696503 315120 -15627 -11742 148076 138886 -103268 -290537 -129360 295772 648152
33684 648152 783612 777472 558334 -29188 -715774 -880523 -364226 248665 421915 296466
33674 296466 256015 339188 419731 522689 605496 451676 115979 17257 261414 391324
33664 391324 163042 -19832 141718 309846 222080 220296 457169 341582 -429103 -1022533
33654 -1022533 -634273 142142 219888 -235498 -212030 368614 637760 399992 377799 752557
33644 752557 798950 257645 -160379 -56312 2181 -365671 -585361 -165603 391363 465226
33634 465226 373869 747884 1385364 1544985 1061926 456845 123585 19305 53205 248123
33624 248123 512324 628044 499394 210377 -98117 -265844 -186358 -6637 -59789 -402957
33614 -402957 -624380 -357200 173516 393230 89908 -368343 -518228 -299578 -25883 -1017
33604 -1017 -251164 -572172 -736359 -631032 -290963 100353 290476 174142 -91126 -311756
33594 -311756 -512851 -741526 -732703 -184471 610417 894947 398170 -280616 -485002 -279697
33584 -279697 -127149 -222549 -527164 -1053516 -1656217 -1877446 -1499898 -998010 -961625 -1287300
33574 -1287300 -1386032 -976741 -250186 505492 997772 921060 350538 -90279 64569 500674
33564 500674 673407 636184 727950 771944 329742 -430128 -860678 -759277 -504049 -358757
33554 -358757 -293495 -384456 -680406 -749525 -128400 772734 995280 355249 -311802 -375051
33544 -375051 -129578 -60195 -104668 -18732 99946 65039 -21335 11162 91529 59619 -96224
33533 -96224 -265121 -247331 220434 1134268 1939561 1986138 1310911 613367 439463 712793
33523 712793 1008335 924881 284183 -643109 -1227470 -1180882 -954409 -1003167 -1007277 -469711
33513 -469711 249200 347446 -154648 -484806 -382760 -334457 -511360 -482162 -167618 -111696
33503 -111696 -501204 -806546 -732931 -668020 -817177 -766318 -360133 -168121 -515356 -815767
33493 -815767 -515376 -57062 -218410 -959610 -1553315 -1521902 -974242 -331934 -49752 -228329
33483 -228329 -304023 329316 1219121 1157610 -68939 -1119159 -858717 159235 711655
33474 711655 623047 554327 701432 728460 599352 500207 221283 -457178 -1021087 -825943
33464 -825943 -259915 -294633 -939087 -1188033 -616075 13959 35206 -182730 -63872 195806
33454 195806 110293 -195950 -234027 37483 244899 249723 244105 301326 293040 218957 210216 194279
33442 194279 -58140 -477296 -640221 -320192 198876 522536 579012 448900 82960 -460694
33432 -460694 -762825 -511494 -85436 -124243 -562838 -718000 -400704 -216520 -497975 -690929
33422 -690929 -288206 301188 448651 280525 212723 48729 -549465 -1097037 -837329 -49093
33412 -49093 269115 -43025 -167259 197524 343006 -149230 -686602 -706056 -501171 -484480
33402 -484480 -473423 -288872 -270200 -541306 -494605 242314 940077 691337 -241991 -808803
33392 -808803 -577354 -4074 460738 764375 848046 573825 133162 -7940 298726 694758
33382 694758 791434 580801 332411 253666 284862 203782 -6757 -2580 455774 1002105 1072406
33371 1072406 765630 722526 1087460 1257874 864106 304766 -10521 -260006 -627090 -784976
33361 -784976 -498281 -162075 -176233 -304176 -215840 -135210 -332540 -498619 -308387 -108458
33351 -108458 -292203 -464072 -82328 465057 393270 -123239 -152602 496176 977045 733134
33341 733134 217394 28866 100835 106486 59378 93634 56420 -295795 -895274 -1372329 -1354836
33330 -1354836 -755413 55265 455885 230357 -99761 78593 646441 985050 880154
33321 880154 676878 599874 496979 320183 297240 445141 406066 28105 -294546 -185965
33311 -185965 93819 -28908 -609626 -1030767 -780803 -169673 1576 -502768 -963272 -661828
33301 -661828 49125 187215 -438083 -959373 -756897 -255225 -35565 66645 347964 411894
33291 411894 -189484 -966423 -1063901 -522065 -78985 17267 51001 -69998 -649347 -1181444
33281 -1181444 -713699 560473 1252716 737549 35385 141491 558035 374940 -88871
33272 -88871 116285 851707 996532 170786 -713870 -785702 -243301 246219 514533 828536
33262 828536 1260118 1551090 1472130 1053898 515093 97846 -68078 -12088 172482 438080
33252 438080 745161 996591 1123226 1163701 1140044 963191 640193 457084 678094 1097632
33242 1097632 1203361 845539 449249 432564 686654 828443 727532 513613 244734 -91750
33232 -91750 -327153 -217980 164937 458028 475932 372008 257895 4797 -401607 -634190
33222 -634190 -439430 -60875 51033 -189228 -479168 -537835 -286676 222089 765717 972200
33212 972200 693750 263196 96762 179737 259178 353454 625137 874538 692498 126344
33202 126344 -311640 -382647 -405097 -675693 -1022587 -1090083 -741183 -94362 520514 649080
33192 649080 159973 -415551 -469809 -207247 -339164 -876960 -1003389 -374118 234663 12454
33182 12454 -792704 -1342945 -1218294 -507190 515070 1264361 1005405 -186142 -1104266
33173 -1104266 -784737 210085 641680 340816 176561 497045 648801 170864 -457921
33164 -457921 -620639 -424130 -324390 -362558 -230609 138613 412686 243538 -340797 -897106
33154 -897106 -932932 -420305 126367 240078 48021 13919 293259 668388 1009932 1397141
33144 1397141 1787102 1970172 1938957 1945467 2069873 2079041 1915530 2015481 2796156 3946708
33134 3946708 4573053 4119169 2933676 1818097 1192994 899463 683828 529311 447140
33125 447140 293000 20356 -147174 -70701 13022 -131125 -316249 -281811 -213145 -411868
33115 -411868 -651819 -465197 44439 316551 202260 48968 -40330 -278557 -516828 -348493
33105 -348493 -3654 -219059 -976090 -1318832 -783428 -41726 322179 640645 1162382 1301482
33095 1301482 740226 301095 678827 1156206 776321 79120 294507 1257744 1574870
33086 1574870 720772 -377996 -902186 -1043232 -1156964 -1131914 -935688 -885364 -1036760 -1040234
33076 -1040234 -834185 -765844 -849096 -669540 -238095 -137632 -509940 -678260 -218036 281632
33066 281632 79381 -602164 -913809 -544635 -20137 67362 -261007 -498153 -269370 265075
33056 265075 639858 642833 428727 80895 -501632 -1078054 -993749 -130171 581447 301820
33046 301820 -450773 -523438 150280 550009 239650 -32715 339921 852186 719673 -19018
33036 -19018 -745781 -1103138 -1134211 -972344 -789362 -765519 -823735 -665183 -265515 -12889
33026 -12889 -162549 -495775 -722162 -876379 -1085997 -1262687 -1282448 -1226123 -1205482 -1142559
33016 -1142559 -918007 -592304 -339624 -272571 -381942 -513222 -408620 40141 579997 818124
33006 818124 646377 302808 92088 199380 629858 1122075 1287775 1060577 801727 744897
32996 744897 657379 359798 167416 328299 424506 -4033 -534661 -346976 487990 1004612
32986 1004612 669933 -15255 -367044 -306034 -99545 111136 277844 345997 349841 309520
32976 309520 64113 -427978 -777967 -667168 -471894 -718113 -1066991 -708944 214915 567742
32966 567742 -119642 -869677 -664590 132522 438731 -5350 -490237 -456401 -80695 200430
32956 200430 226394 75340 -182093 -523084 -852520 -958328 -695843 -256230 -80358 -342092
32946 -342092 -686693 -705864 -477102 -328733 -275901 -104284 114783 48060 -385259 -897199
32936 -897199 -1193710 -1134190 -649230 117511 689360 672120 211869 -282609 -680928 -1007241
32926 -1007241 -1033390 -536322 170666 478461 196831 -340922 -714223 -622704 1913 675941
32916 675941 623452 -90875 -261320 845010 2155409 2133442 1026329 505566 1225507
32907 1225507 2069731 1953320 1136020 421951 128458 254677 759087 1249279 1147197
32898 1147197 493262 -65461 -235030 -293499 -309175 -38952 293543 100448 -520074 -848696
32888 -848696 -839540 -1218917 -2011322 -2213822 -1436378 -642830 -600061 -772830 -571261 -540171
32878 -540171 -1243718 -1932267 -1573825 -572954 -209646 -733830 -1190832 -1000414 -651202
32869 -651202 -729684 -1074754 -1132701 -671048 35330 501725 508270 367784 541463 945207
32859 945207 1006255 514311 -52585 -227646 -68937 240842 724357 1211486 1181395 446908
32849 446908 -429095 -791152 -608958 -279137 -147074 -452385 -1210780 -1859776 -1593277 -416235
32839 -416235 657361 816062 341749 -38282 -93571 32998 304488 620847 622408 157621
32829 157621 -399783 -664784 -691063 -620039 -356552 76267 336302 257941 111240 105622
32819 105622 119647 122176 263572 345797 -69122 -735192 -725289 209832 1087509 1025385 366740
32808 366740 -92524 -227276 -274257 -148853 167191 216368 -160760 -258951 436572 1204288
32798 1204288 1042723 211685 -196888 73389 240758 -150452 -623100 -607357 -115951 543760
32788 543760 1097352 1221567 701193 -148131 -632117 -430364 71577 287270 41258 -374075
32778 -374075 -566699 -407212 -104737 56656 37476 30190 178715 422517 537249 237430
32768 237430 -534883 -1262433 -1182197 -300136 387188 192658 -271377 -121262 356213 312076
32758 312076 -87621 17749 539950 561129 68729 41025 602512 673653 -99675 -632875
32748 -632875 -282685 59740 -370158 -841483 -482803 194189 300311 98348 303906 655738
32738 655738 405694 -338624 -854660 -933388 -839023 -600266 -191554 32251 -140869 -285949
32728 -285949 -63364 105204 -222660 -675116 -688630 -379264 -75386 397994 1183823 1713814
32718 1713814 1382061 461518 -320486 -658380 -580786 -109446 417041 368231 -222354 -470213
32708 -470213 -23480 242664 -329536 -971198 -691594 117848 367158 -74747 -473388 -481699
32698 -481699 -300852 -814 410880 597117 350295 83445 220517 548335 731473 870696
32688 870696 976803 609211 -302289 -1009668 -994816 -709034 -626196 -441311 69690 359685
32678 359685 123049 28719 516621 836979 310986 -400272 -394279 -3989 -21725 -275992
32668 -275992 -170279 105985 71792 -29977 197032 421000 293686 251470 584531 606788
32658 606788 -148075 -869195 -796736 -585058 -1012375 -1370496 -673494 439484 646020 39293
32648 39293 -331031 -341654 -584937 -865906 -562709 -36719 -117585 -580763 -614136 -381339
32638 -381339 -654850 -1283194 -1453154 -1127170 -886091 -726873 -283265 196371 294718 316977
32628 316977 591311 574136 -151647 -809597 -640457 -256016 -421232 -554323 -1291 342202
32618 342202 -484950 -1481093 -1174627 -198752 -202718 -1004619 -1117735 -467835 -231875 -446359
32608 -446359 -147804 421570 97927 -889635 -1154843 -613096 -521678 -1117940 -1346602 -925261
32598 -925261 -620622 -495652 89477 785454 602845 -100461 -10025 835889 1161787 774028
32588 774028 671643 944068 731562 240245 576795 1529591 1711184 984971 575924 730356
32578 730356 515437 1153 282818 1164101 1210786 394654 298423 1301947 1917884 1416275
32568 1416275 839808 873396 887150 624561 716030 1029632 632986 -169156 48709 1229602
32558 1229602 1607847 618039 -259440 -192083 -223177 -999838 -1488715 -935425 -145473 136902
32548 136902 364334 874674 1099429 798733 552795 510413 169378 -296109 -110354 529726
32538 529726 663859 392247 640457 1156432 798295 -201719 -446499 133596 253216
32529 253216 -244356 -229703 345647 360219 -136630 10476 623657 431083 -230712 255818
32519 255818 1653976 1989960 1027725 614634 1219225 1223077 180236 -306752 369205 867566
32509 867566 651585 785934 1373984 1107583 -36738 -523692 -131348 -165726 -531133 239004
32499 239004 1754277 1953188 858071 646881 1619017 1749641 674262 292910 903553
32490 903553 665135 -532316 -690596 264316 246168 -687222 -214197 1508795 1673261
32481 1673261 76389 -341386 983753 1304072 69945 -12705 1439261 1461546 -345240
32472 -345240 -658453 1239875 1908915 281496 -339591 1231619 1825887 306496 -172337
32463 -172337 1437829 1931789 412508 261395 2224836 2625483 825120 880452 3310717
32454 3310717 3437844 604008 127796 3077720 3774180 905660 593858 4363855 5506206
32445 5506206 2184026 1770373 6514857 8345403 4567779 4065749 10078405 13042221
32437 13042221 9889683 12214430 23796845 30971350 30089936 40021560 67032738 86661808
32429 86661808 92842187 134503512 250596934 383234426 418698633 324536086 190986184
32422 190986184 116367867 102017096 91044367 63454588 43773573 41682944 38208248
32415 38208248 25264462 17024235 19325899 19729147 12524047 7735861 10117920 10930983
32407 10930983 5904513 2665148 5036419 6285295 3040736 1372242 4157273 5546443
32399 5546443 2700530 1058112 3378358 4567212 1851214 -98361 1467804 2387346
32391 2387346 234513 -911366 1343748 2941317 1098243 -693327 434189 1739215
32383 1739215 793004 -53320 1007850 1458337 -267587 -1324250 145580 1404096 331947
32374 331947 -723288 368453 1647687 1075709 98872 258015 347179 -363153 -140818
32365 -140818 1434342 1791625 -28316 -1148767 221260 1650279 931749 -211294 307017
32356 307017 1264101 918384 226108 465797 599496 -361305 -1114006 -627086 -269885 -1084544
32346 -1084544 -1578560 -509731 680292 450034 -250677 -120011 110350 -468174 -925732
32337 -925732 -377531 186271 -167553 -564407 -224562 -76590 -807693 -1341590 -891194 -519600
32327 -519600 -1066117 -1499023 -892880 -120365 -90260 -200434 65499 -52664 -824907 -1041913
32317 -1041913 -149900 565225 215022 -251298 -77539 -74351 -666682 -734399 174459 612850
32307 612850 -274720 -1120492 -749782 -160801 -447317 -773387 -198401 377184 -42039 -571235
32297 -571235 -94012 647876 448834 -242022 -336453 -9373 19698 -47255 190631 253317
32287 253317 -252316 -685261 -552677 -463869 -852777 -1047459 -646168 -432465 -874410 -1159529
32277 -1159529 -779288 -562091 -1033851 -1302203 -717844 -95804 -139219 -238950 19626 -130650
32267 -130650 -871147 -831093 662523 2062601 1862772 779894 148344 -222595 -915478
32258 -915478 -1225291 -470286 378819 215706 -268676 80105 804998 856572 558103 782453
32248 782453 1195886 1039807 685580 769024 786916 179315 -273639 166903 549171 -193821
32238 -193821 -1113195 -717305 371544 415557 -490975 -724442 35892 493907 127144 -176774
32228 -176774 25165 95549 -216565 -294240 40334 135612 -229344 -398193 -5491 408777
32218 408777 297612 -142771 -374791 -129560 459211 927322 818144 296296 101474 549392
32208 549392 1075018 1146658 982516 899764 718057 384667 380799 833511 1027177 507180
32198 507180 -136083 -275177 -150755 -60602 332841 1027464 1085182 58214 -961422 -829644
32188 -829644 9522 472175 490452 529564 370476 -297054 -839652 -560327 57926 204195
32178 204195 94792 251747 266460 -337811 -816864 -292121 571959 540031 -166563 -424303
32168 -424303 -219807 -392183 -804790 -577687 84697 82331 -608739 -847533 -289899 162573
32158 162573 48925 -33354 224891 272151 -170097 -611115 -763728 -941861 -1229189 -1261974
32148 -1261974 -1040514 -990620 -1090572 -900519 -508033 -408620 -412908 189708 1261738 1778189
32138 1778189 1365516 744671 398056 -20826 -588092 -626568 101669 768680 721600 462862
32128 462862 681114 1083004 992072 519968 296434 393417 328022 752 -96605 286496
32118 286496 660134 416407 -319970 -814789 -670420 -287484 -179390 -173348 229219 906966
32108 906966 1218651 1048320 972078 1197622 1176832 655317 261804 473404 763390 492267
32098 492267 -18423 -85493 235593 459986 577507 816672 948294 658300 227345 40882
32088 40882 -168730 -764197 -1307538 -1127782 -444341 -19468 14345 83595 213549 62632
32078 62632 -299389 -529226 -710158 -1049315 -1127823 -397220 745347 1307866 1020518 456747
32068 456747 18231 -301133 -312100 224799 892705 963994 451190 18687 -58870 -36823
32058 -36823 42992 336018 554985 277955 -178135 -112784 407314 694637 645988 776214
32048 776214 1082628 981227 480757 319874 684679 805810 185464 -645610 -957680 -672296
32038 -672296 -99023 486974 768354 545551 169783 210545 605863 788882 652005 605328
32028 605328 660915 359192 -250989 -472772 -72430 294060 82429 -436862 -770471 -829362
32018 -829362 -706129 -451987 -280599 -390783 -472955 -50987 628203 807557 386258 21821
32008 21821 -31990 -222395 -620091 -594477 12775 377957 -61822 -704588 -760730 -403024
31998 -403024 -268294 -427226 -541816 -571667 -674673 -767816 -742538 -794095 -1042750 -1125254
31988 -1125254 -628270 293426 1087642 1375164 1100871 414500 -329998 -725708 -693234 -489221
31978 -489221 -263175 41755 297815 191033 -240472 -549241 -538440 -501298 -621931 -654014
31968 -654014 -439662 -254346 -343756 -536464 -579690 -482197 -322832 -109917 12188 -152113
31958 -152113 -416660 -332095 122556 457424 404851 197658 1854 -299907 -581017 -406720
31948 -406720 229106 750860 873721 959951 1189295 1120015 536398 30527 171781 680850
31938 680850 971586 941831 693179 113160 -605351 -678945 196568 1019788 675156 -424922
31928 -424922 -910401 -451165 -76989 -454421 -952278 -820925 -405851 -535180 -1226988 -1687082
31918 -1687082 -1403257 -700600 -199200 -95241 -110170 43560 332594 538677 586786 582958
31908 582958 532878 239062 -367949 -950746 -1072364 -761546 -521520 -686387 -969415 -836673
31898 -836673 -223717 373866 559334 525030 701730 1116281 1399374 1345185 1115268 883956
31888 883956 645752 432479 330115 177796 -307570 -941300 -1109449 -670268 -288000 -479354
31878 -479354 -861395 -859260 -637425 -659592 -767176 -504466 -79783 -151116 -764222 -1281413
31868 -1281413 -1317694 -1038484 -605788 -73985 219617 -51532 -512097 -461846 38871 261386
31858 261386 13928 -126892 92815 202180 -63328 -308166 -259765 -160461 -47800 474560
31848 474560 1311881 1597900 920026 74596 -25019 455781 784630 750289 570273 252322
31838 252322 -233833 -541966 -367501 17421 184666 180289 239951 244970 -6832 -318768
31828 -318768 -395960 -324725 -302611 -247533 -123283 -226821 -630840 -788841 -318308 228104
31818 228104 84958 -542197 -770767 -333333 163439 199370 -111013 -424560 -534037 -309327
31808 -309327 201390 581027 404621 -198583 -724288 -957212 -1048002 -1045695 -834761 -472666
31798 -472666 -119239 305250 903771 1321603 1063037 323606 -81881 221960 709113 777040
31788 777040 561920 587410 923165 1097695 766460 182457 -66391 283490 840229 983429
31778 983429 631128 345654 519186 763512 491916 -124090 -352647 -35717 110144 -433090
31768 -433090 -1154581 -1199221 -532801 108596 283651 297462 515708 736566 549323 11536
31758 11536 -412702 -479885 -391726 -401687 -499045 -550961 -515212 -419241 -313897 -300777 -415892
31747 -415892 -488795 -377443 -304349 -555948 -843906 -542038 272220 686983 248076 -300763
31737 -300763 -158000 300484 232951 -248326 -366119 -67128 -37548 -437062 -693415 -604440
31727 -604440 -593274 -711348 -433654 267717 640434 320456 -128670 -233232 -249646 -353618
31717 -353618 -141467 491340 857628 498463 -100694 -406416 -602245 -832831 -639721 44240
31707 44240 293008 -429877 -1167250 -877725 -130832 -83283 -477266 -210979 555362 585175
31697 585175 -232941 -585965 91521 728474 459864 -27395 198524 756708 684207 24890
31687 24890 -274020 265726 1126245 1527845 1214122 551847 99999 38973 19987 -262998
31677 -262998 -542095 -429076 -201391 -481517 -1177499 -1495296 -1123739 -649817 -564195 -608896
31667 -608896 -463666 -353904 -489185 -517794 -105307 427797 604597 528789 584683 747575
31657 747575 732948 547294 365575 108692 -327490 -627672 -397275 159258 417689 163981
31647 163981 -195562 -246190 7038 327783 499206 350624 -145348 -734863 -1072638 -1069638
31637 -1069638 -861820 -499039 67361 712858 1132519 1133690 738265 55118 -667259 -914620
31627 -914620 -252721 1040523 2008359 1943182 1124029 416540 275341 406802 369466 175946
31617 175946 119900 206788 87845 -385728 -833012 -811852 -462672 -349410 -670379 -995269
31607 -995269 -911013 -567057 -325789 -199499 -23042 62110 -183301 -499118 -326120 303812
31597 303812 649426 276508 -334908 -569570 -561895 -746915 -922145 -516487 336977 798850
31587 798850 516836 105706 162993 443924 415573 86396 -218828 -485766 -864713 -1213140
31577 -1213140 -1317916 -1302788 -1288190 -953805 -78267 757822 783880 212703 -30263 286860
31567 286860 469381 158721 -152355 -152457 -268974 -704558 -864808 -434713 -164946 -709091
31557 -709091 -1401293 -1227285 -459802 -158360 -382670 -176939 724733 1439455 1391446 1087284
31547 1087284 1053079 1014805 660054 336718 377823 465615 298920 215273 460033 486355
31537 486355 -182788 -926684 -818808 -88631 243783 20368 112720 835340 1297125 769929
31527 769929 -191793 -609266 -393548 -124834 -1989 237572 593125 714764 517852 312758
31517 312758 262391 169966 -92945 -323709 -291586 -41140 208474 277494 118942 -99649
31507 -99649 -36036 449952 974914 970446 358211 -382318 -810633 -881438 -720467 -433920
31497 -433920 -210492 -233818 -385229 -378356 -241095 -232990 -235216 177559 850581 916112 -3364
31486 -3364 -1050974 -1196623 -584498 -153171 -277512 -544557 -657989 -764439 -911317 -894854
31476 -894854 -715535 -596594 -511939 -255084 19026 -76585 -457818 -617347 -435256 -289106
31466 -289106 -259779 45862 655816 941659 537424 -70708 -296712 -251120 -323559 -461055
31456 -461055 -410983 -335720 -615301 -1189923 -1546296 -1317436 -644129 -16253 125224 -207989
31446 -207989 -494214 -297670 93050 14467 -593492 -1104643 -1180783 -1169424 -1304948 -1224099
31436 -1224099 -688893 -152924 -95222 -335646 -531205 -796201 -1225473 -1350236 -825406 -238239
31426 -238239 -390281 -1022055 -1100740 -299439 592429 789092 376885 -57072 -132425 125333
31416 125333 395371 286576 -244413 -717419 -657600 -195129 178309 274564 229213 42786
31406 42786 -382919 -820031 -842783 -433878 -67645 -133305 -564637 -1014298 -1122934 -714943
31396 -714943 -37233 310666 13513 -500104 -541355 35950 812627 1377761 1572767 1378333
31386 1378333 954674 612391 390510 -80843 -920334 -1551867 -1426142 -839880 -445604
31377 -445604 -294996 -77539 20831 -410147 -1038979 -1064717 -493261 -217635 -649965 -1136826
31367 -1136826 -1023563 -519495 -129670 97683 320117 435582 309382 95342 5690 61142
31357 61142 235314 475404 486301 -9487 -659600 -699872 -23201 531235 280938 -418102
31347 -418102 -773337 -600598 -342204 -356282 -578149 -697804 -438523 125831 416140 -139329
31337 -139329 -1293499 -2094652 -2001008 -1438036 -1030517 -815794 -588438 -499184 -741485 -981340
31327 -981340 -727047 -133881 138709 -102979 -265182 187801 910444 1038734 306189 -546750
31317 -546750 -690594 -305499 -300088 -928667 -1328048 -798509 61727 185482 -418717 -803470
31307 -803470 -543867 -119641 131600 447636 840550 806658 195997 -433279 -697944 -848252
31297 -848252 -971213 -609124 270777 767089 257959 -549928 -614719 -70813 136879 -236747
31287 -236747 -500544 -159543 500335 952434 956761 557973 29067 -230263 -109275 36699
31277 36699 -58832 -125432 136829 448093 379591 100986 92764 317425 298791 -82885 -449525
31266 -449525 -516499 -330576 -11276 272673 208018 -270379 -628828 -327747 338543 569918
31256 569918 177789 -197177 5996 666901 1321788 1624694 1437463 890659 379864 156277
31246 156277 12913 -270692 -419298 -115876 296566 250568 -83554 -53582 327730 349585
31236 349585 -203184 -671053 -529640 11926 637311 1311947 1740254 1326372 192181
31227 192181 -554520 -205173 554496 703033 321371 187244 437614 551354 389005 328545
31217 328545 423254 256461 -269073 -702927 -787467 -836915 -1140081 -1463736 -1438975 -1109924
31207 -1109924 -825471 -786458 -898320 -941061 -758607 -367340 66491 401514 609868 620214
31197 620214 266216 -385782 -848517 -711849 -247949 -136108 -581940 -1080553 -1108235 -688460
31187 -688460 -168910 213038 370713 267996 -5136 -244164 -372303 -502794 -656148 -631972
31177 -631972 -306869 129704 385326 359810 138126 -124448 -225262 -45035 248130 364932
31167 364932 335630 457134 699144 616498 99867 -293574 -194857 -122462 -676292 -1395228
31157 -1395228 -1271758 -302733 391185 165586 -294785 -130803 424873 548673 77065
31148 77065 -435620 -622046 -601519 -510346 -352825 -312528 -648698 -1169830 -1268652 -661555
31138 -661555 237982 840955 995698 933365 876754 908412 1026591 1103496 899912 333912
31128 333912 -300952 -557762 -298765 171801 461176 466725 328246 116402 -210242 -510871
31118 -510871 -426835 99293 488232 142939 -645773 -919335 -297814 509266 703549 396692
31108 396692 176483 140956 5535 -111356 224162 898088 1173770 665722 -147421 -607143
31098 -607143 -635176 -574205 -639465 -785352 -847308 -618876 -32476 593036 756887 368435
31088 368435 -138014 -386844 -425574 -383982 -191747 118291 230974 17369 -153350 48715
31078 48715 360112 330704 26869 -154835 -174414 -285298 -376688 -8668 794092 1358727
31068 1358727 1227093 749922 507618 514553 388952 41382 -259476 -378104 -423605 -395914
31058 -395914 -156868 169172 189092 -163275 -379701 -17772 674412 1104991 1106160 977690
31048 977690 909497 802990 622942 466647 243822 -243467 -793229 -868752 -378758 92710
31038 92710 131862 84116 377033 706498 490047 -148556 -487910 -195619 369157 799819
31028 799819 1036085 1080015 840363 390062 -20675 -309386 -575130 -736314 -560371 -137576
31018 -137576 77184 -151813 -529458 -633366 -374804 18161 239094 101232 -270594 -490318
31008 -490318 -395782 -326389 -567031 -746592 -336557 418879 767632 609913 613747 1045304
30998 1045304 1293335 879807 218956 -70379 -7929 53827 49434 40613 -91456 -325421
30988 -325421 -317822 -8270 58426 -454110 -982530 -804250 -109399 331774 306777 271185
30978 271185 467023 617551 503464 260905 34964 -195149 -369299 -313299 -27596 286779
30968 286779 508540 645394 651973 487010 315733 371581 617735 763662 600422 171271
30958 171271 -305892 -560967 -463104 -204395 -96101 -110950 47642 328219 269626 -206509
30948 -206509 -497288 -215685 162748 88986 -152256 -12873 300296 204197 -201284 -362724
30938 -362724 -325060 -537192 -703945 8610 1424512 2163368 1501111 452149 298657
30929 298657 835821 955833 432762 112907 488631 1020845 1064646 782315 761956 1098311
30919 1098311 1246370 721213 -280079 -1007474 -870509 -9463 861504 1175842 999477
30910 999477 746903 537411 60980 -828968 -1600640 -1477257 -482476 304340 -81567 -1251253
30900 -1251253 -1915061 -1550951 -961783 -934402 -1061702 -519015 481432 862062 189832
30891 189832 -763311 -1086341 -734772 -264331 -64836 -143569 -333899 -451659 -417879 -342562
30881 -342562 -332217 -247902 72497 404887 336818 -107997 -460785 -496638 -489652 -636464 -685140
30870 -685140 -401783 -19634 107599 15053 -42466 -49031 -176626 -410722 -543490 -492579
30860 -492579 -388814 -369045 -451296 -582853 -679534 -661196 -557725 -521909 -630537 -729812 -595886
30849 -595886 -233756 75107 53727 -263967 -549820 -560135 -457694 -580882 -855219 -732692
30839 -732692 31454 796715 674767 -311569 -1173380 -1161446 -617859 -412160 -845734 -1403392
30829 -1403392 -1422730 -761302 115826 535655 177164 -615872 -1116707 -899817 -204643 411151
30819 411151 663967 702665 773721 877565 800930 448290 49613 -74279 66097 142380
30809 142380 18384 -21321 231220 463192 299000 30084 340041 1258151 1934307 1697903
30799 1697903 899758 354826 294620 326765 230069 239066 483983 630303 360844 -48754
30789 -48754 1928 633987 1262710 1284351 771319 291323 169899 195964 49202 -247099
30779 -247099 -419384 -328796 -127116 -85884 -318994 -622666 -625688 -212066 277761 445078
30769 445078 327084 219644 125358 -192325 -625796 -719579 -373155 -26638 57812 167132
30759 167132 508223 753196 602564 310140 223384 278973 384294 743142 1265297 1260011
30749 1260011 431384 -381876 -308968 222718 254108 -67145 150043 775620 669889 -401033
30739 -401033 -1212969 -879643 -30181 384909 424884 573631 695115 430437 43317 37863
30729 37863 292051 259991 -207293 -771176 -1098892 -1031987 -536654 139111 533112 498155
30719 498155 359614 334613 240101 20174 -1345 246281 285471 -113148 -422379 -198988
30709 -198988 127327 -35999 -432142 -393725 75224 409809 399321 256958 7295 -446660
30699 -446660 -810771 -705172 -388874 -458035 -881423 -1061251 -835570 -661899 -723069 -606912
30689 -606912 -93525 404102 486476 314740 203024 121544 -66250 -227471 -141680 168144
30679 168144 501458 688363 623465 319876 3453 -89821 -35703 -54259 -45326 298736 875978
30668 875978 1159784 968362 767628 927093 1114572 834032 246819 -7297 344324 946470
30658 946470 1325571 1300259 908091 271106 -379403 -777991 -826577 -599338 -153759 458877
30648 458877 957562 884016 125915 -745828 -969727 -470945 14713 -150555 -693682 -807837
30638 -807837 -227159 449937 567940 184860 -159676 -163892 30034 173593 154410 -24905
30628 -24905 -257138 -352138 -238241 -82940 -46238 -38950 49917 47633 -229247 -489771 -215623
30617 -215623 525186 954855 522935 -355548 -815337 -586003 -170421 -72182 -221883 -252346
30607 -252346 -48054 190469 294417 310264 332086 327180 220210 56554 -33841 -10010 34774
30596 34774 -5106 -156037 -382792 -615151 -767908 -817912 -834344 -834232 -675530 -277606 96275
30585 96275 59055 -324260 -473776 -3639 730422 1053005 796546 416938 337898 484386
30575 484386 544345 465609 512976 879251 1366106 1526536 1140189 488444 72204 90024
30565 90024 319914 487858 554264 601591 663314 761471 899708 902372 506580 -201951 -690714
30554 -690714 -582540 -169819 -41690 -354519 -778479 -1016466 -1004807 -708437 -163414 279635
30544 279635 211740 -241715 -513834 -420681 -432577 -867763 -1273076 -1034988 -268774 423708
30534 423708 857809 1299585 1646152 1292362 90017 -1129538 -1457884 -992631 -532792
30525 -532792 -427622 -303832 107693 483377 460848 231397 233488 495741 613490 285984
30515 285984 -354718 -900648 -1014260 -702828 -354772 -381607 -726082 -890642 -561036 21571
30505 21571 465742 732458 970596 1101887 934142 542144 182250 -65664 -241494 -234440
30495 -234440 30888 258384 109326 -177140 -25577 547304 798650 277151 -488196 -635242
30485 -635242 12122 867001 1277542 1032336 373147 -213607 -317348 70082 561206 749418
30475 749418 497218 -87753 -729200 -1060804 -938940 -704782 -803503 -1116717 -1095042 -641602
30465 -641602 -337123 -520776 -666193 -144120 752203 1113863 611242 -134791 -388069 -84506
30455 -84506 318700 471123 428246 455608 667441 863082 729421 220662 -320010 -468548
30445 -468548 -127849 381908 628894 515859 426011 761826 1285847 1237619 357249 -555807
30435 -555807 -579756 81567 406383 -2612 -504615 -512843 -247377 -139129 -166627 -177781
30425 -177781 -297491 -563026 -626809 -283377 114577 216677 262170 621384 1088943 1156505
30415 1156505 752940 236755 -154456 -418411 -541508 -546357 -620918 -847110 -995400 -917418
30405 -917418 -883575 -1147801 -1439191 -1326159 -873948 -493963 -312415 -128538 131346 330531
30395 330531 403683 400198 370035 449760 818573 1298915 1339723 752826 97229 -87719 -20923
30384 -20923 -149332 -347041 -324729 -409663 -1028172 -1660371 -1326721 -135277 637428 243987
30374 243987 -619736 -959117 -766897 -640194 -705494 -581218 -125276 363975 628183 711793
30364 711793 719356 609146 336451 39210 -83264 -72538 -223453 -646084 -956440 -716434
30354 -716434 -138138 83674 -267095 -624665 -513040 -190359 -73645 -65634 37962 -24468
30344 -24468 -482148 -848303 -492165 333813 779264 565919 163563 -73651 -183420 -61279
30334 -61279 529343 1290361 1468499 842876 69481 -170907 96918 402692 383121 -23197
30324 -23197 -535703 -669088 -299293 14801 -245104 -706302 -630880 -112922 85990 -161838
30314 -161838 -187268 201429 313801 -171272 -516934 -90958 582186 656047 242843 78834
30304 78834 313969 420112 132862 -191110 -158177 201759 609575 857134 898567 782057
30294 782057 519387 53338 -510862 -751197 -348101 374904 769797 765584 937019 1526275
30284 1526275 1959092 1662611 908436 433930 531851 889789 1113807 1083055 915951 806644
30274 806644 807607 723825 406979 107829 187378 496033 504898 114803 -193504 -165958 -174141
30263 -174141 -547496 -1023966 -1195563 -1046343 -705687 -110853 687383 1274210 1359908 1213249
30253 1213249 1200855 1178262 771908 58244 -465373 -482916 -99249 433821 932812 1244773
30243 1244773 1210448 742591 -31351 -678305 -712737 -185373 195791 -67636 -488786 -250519
30233 -250519 534663 975816 794671 687574 1106968 1570504 1562303 1298959 1110479 833513
30223 833513 412286 380636 1026849 1672239 1551522 939562 632373 712078 639612 286289
30213 286289 55504 120099 262159 391390 590316 716379 541271 228561 153103 322638
30203 322638 457836 521617 666050 777023 595206 205963 -78771 -231823 -428974 -581341
30193 -581341 -467727 -239250 -252313 -437333 -356759 97759 540779 654735 505681 295019
30183 295019 171915 255674 475585 467861 21815 -484163 -526735 -190606 22215 24114 186611
30172 186611 560064 683229 323202 -147063 -340786 -366172 -472916 -571440 -435198 -151291
30162 -151291 -54352 -277616 -562703 -533497 -117873 317294 328361 -77094 -423510 -348182
30152 -348182 20061 386461 704176 1028802 1240275 1220324 1076936 890417 503911 -78736
30142 -78736 -388120 -59927 511263 610130 149298 -338943 -550929 -697484 -957599 -1172387
30132 -1172387 -1157017 -907195 -458122 100652 498580 555552 524352 751690 1077949 1051523
30122 1051523 689840 497340 709257 1048705 1291626 1520897 1691284 1492949 883131
30113 883131 298069 76522 43414 -101361 -328000 -453710 -471379 -447836 -318848 -3483
30103 -3483 429855 831260 1044592 887907 316916 -323348 -486050 7397 766015 1246177
30093 1246177 1183662 649013 -27376 -369062 -121651 404219 619851 339366 -86293 -322909
30083 -322909 -412250 -521914 -671048 -820509 -966193 -1044580 -969663 -797898 -626874 -375217
30073 -375217 22568 266986 -26370 -669319 -983304 -655793 -96886 186810 146843 -37860
30063 -37860 -298437 -536838 -533007 -260453 14231 147895 286988 435095 312667 -51724
30053 -51724 -79045 538763 1171704 998081 167476 -424747 -410353 -303678 -514360 -704681
30043 -704681 -462658 -61556 -24529 -252711 -193903 195097 263352 -386081 -1264169 -1645085
30033 -1645085 -1468557 -1159848 -852507 -386794 56837 49999 -245136 -58882 824165 1545676
30023 1545676 1336946 641887 400317 644206 644514 227824 3876 211279 226754 -422925
30013 -422925 -1230174 -1373259 -816970 -300121 -419777 -1050621 -1582953 -1548525 -1054255 -636622
30003 -636622 -634432 -828340 -852397 -711864 -557551 -233218 388984 806282 354302 -690603
29993 -690603 -1227020 -744595 62581 363146 180073 -51474 -231637 -373019 -209192 341882
29983 341882 743474 499259 -70263 -300705 -132657 31596 145663 484374 940068 1081002
29973 1081002 900094 828875 948038 843098 388372 41854 116157 318088 316214 256461
29963 256461 343531 359472 47777 -364205 -493294 -388455 -322162 -227062 119012 492254
29953 492254 419172 -17353 -168927 241241 722378 779019 547046 364269 219668 53311
29943 53311 130489 558490 813268 409274 -235982 -341827 27364 140810 -90651 13632
29933 13632 556608 658338 -107986 -848620 -680130 -143531 -333592 -1145123 -1435953 -703829
29923 -703829 369669 980156 938664 372770 -437603 -833818 -243634 877575 1302704
29914 1302704 537937 -554817 -944879 -635458 -311929 -343655 -597028 -834370 -849289 -493819
29904 -493819 62078 359878 248277 159584 472250 896720 875678 364602 -175759 -403613
29894 -403613 -349275 -165556 24219 89330 2816 -41804 136318 409280 504065 389738
29884 389738 247400 116179 -119365 -372595 -330536 54029 330713 95841 -395014 -520205
29874 -520205 -174858 53410 -253642 -725661 -808009 -640714 -770366 -1163614 -1210395 -755854
29864 -755854 -391253 -463626 -501287 -51559 534833 695446 493569 270277 -32842 -513579
29854 -513579 -727900 -272125 388057 502653 189129 138817 397072 387051 36963 -112055
29844 -112055 61898 96017 -105940 -118006 91691 78162 -91433 152687 618240 280675
29834 280675 -1017135 -1945848 -1502667 -438003 -20290 -274563 -440811 -428016 -655780
29825 -655780 -925916 -632468 76468 373356 -17194 -498552 -558414 -338272 -175383 -172697
29815 -172697 -313838 -527548 -578864 -286466 150639 387474 431389 557125 806991 939421
29805 939421 826195 580041 325783 102400 -65432 -192730 -332424 -426809 -353322 -209193
29795 -209193 -243545 -394750 -305670 39079 196047 21220 -50231 149326 46272 -739273
29785 -739273 -1578406 -1662818 -1175463 -859731 -809648 -546729 -45197 225129 199171 310690
29775 310690 650447 800960 627222 545413 828056 1219890 1420811 1444159 1323119 913649
29765 913649 185667 -613959 -1198150 -1383779 -1050217 -316302 293870 291091 -154202 -408404
29755 -408404 -194554 170283 354245 412236 531512 703135 734944 406762 -329246 -1127293
29745 -1127293 -1430792 -1146279 -869753 -1076687 -1389308 -1146573 -444397 -8315 -171680
29736 -171680 -570236 -776858 -696132 -403973 -111272 -171687 -601476 -775862 -212424 555740
29726 555740 624512 62411 -244352 -1710 204281 86597 85291 356922 355284 -124130
29716 -124130 -399432 10025 541713 503648 160973 180532 527238 678763 550235 457053
29706 457053 427220 258494 78501 178870 394695 273628 -174966 -479061 -460927 -435337
29696 -435337 -566727 -566603 -241740 100550 106689 -60385 34169 430200 697348 535229 150116
29685 150116 -102353 -222358 -467754 -878135 -1223012 -1413170 -1587734 -1690177 -1383384 -653186
29675 -653186 -102068 -233736 -739047 -946730 -739028 -520750 -494287 -531665 -605337 -736881
29665 -736881 -650215 -151319 258166 -47643 -647008 -412744 779014 1673108 1404911 694704
29655 694704 595282 886845 667413 -22226 -269847 187572 557441 266611 -190219 -58608
29645 -58608 569612 938524 680675 246870 238943 609200 796983 611570 575424 1103745
29635 1103745 1688697 1482832 573506 -38230 156921 528946 376107 -77448 -266913
29626 -266913 -256058 -439694 -700798 -601516 -190705 46439 -83649 -382867 -746985 -1158468
29616 -1158468 -1305133 -842733 -46047 376128 178479 -197845 -328157 -231447 -48774 195233
29606 195233 405357 453427 507252 868107 1370885 1425014 828037 98501 -203182 -84734
29596 -84734 137222 288875 296413 87647 -192345 -221253 -14190 -23661 -434431 -768611 -588696
29585 -588696 -211154 -211447 -516317 -589658 -352071 -251615 -413637 -380685 97488 567990
29575 567990 508064 68735 -187688 -48283 199992 219772 -90482 -637893 -1151359 -1236865
29565 -1236865 -744254 -76447 163078 -130279 -479795 -479296 -218535 43880 284478 546074
29555 546074 649022 431483 122184 75897 187000 -3220 -533019 -790379 -321682 452372
29545 452372 709775 257878 -310260 -462154 -316331 -251046 -272868 -77738 413075 888437
29535 888437 1022188 796447 413896 70033 -109370 -53882 190653 435997 490702 335020
29525 335020 129854 62833 174075 286641 139318 -311346 -737010 -730582 -279637 202960
29515 202960 353995 189014 -67293 -209331 -12397 681029 1578257 1958965 1460953 612319
29505 612319 170050 158069 74636 -152237 -116974 179258 175038 -304061 -657874 -447510
29495 -447510 -104293 -212651 -571619 -523705 114428 950894 1561590 1674087 1124926 166635
29485 166635 -433472 -163506 529102 816782 589216 410653 539866 640532 453032 143235
29475 143235 -102601 -311852 -457538 -420300 -312556 -410728 -673435 -733386 -456477 -125400
29465 -125400 10536 6750 -6076 25221 157444 326457 208725 -350076 -866299 -757282
29455 -757282 -311325 -419168 -1233604 -1853852 -1635556 -1094203 -1035393 -1378035 -1432840 -960836
29445 -960836 -364044 -29908 23626 -37003 -24832 204595 577339 774694 568879 65537
29435 65537 -487155 -914819 -1064513 -860443 -549301 -525331 -727562 -615104 9030 583888
29425 583888 555229 158623 -4412 147584 227213 122672 162461 550140 1031248 1188528
29415 1188528 862878 295413 -37180 140513 527588 529276 33349 -412290 -389583 -193217
29405 -193217 -298641 -607159 -667644 -405787 -165175 -165856 -338879 -576469 -748147 -587914
29395 -587914 11003 655459 813802 494180 194665 202849 326181 336544 296269 324137
29385 324137 331303 154047 -202523 -554027 -696746 -569080 -312853 -128207 -32918 111064
29375 111064 293615 287601 -20172 -455959 -818481 -1031382 -931624 -316658 551158 928034
29365 928034 480665 -166384 -236049 174493 401410 252487 91996 64677 -55152 -252360
29355 -252360 -190359 139971 281684 -4840 -430137 -716873 -951566 -1185225 -1173598 -811882
29345 -811882 -424819 -312620 -352987 -358977 -482369 -873996 -1222289 -1094960 -608778 -305401
29335 -305401 -371912 -415596 -139618 129069 -116091 -770625 -1134570 -765767 -31339 368651
29325 368651 218468 -138627 -386224 -491791 -394243 70143 730142 1019138 704585 320219
29315 320219 441295 831615 840529 423702 118892 70405 -202351 -897041 -1448079 -1315739
29305 -1315739 -761628 -393891 -287269 -44888 459816 897508 1009073 905429 776201
29296 776201 628064 444673 360561 489452 712716 815340 773193 747811 805662 794266
29286 794266 554762 152086 -190382 -319627 -234417 1174 318878 643425 914041 1095405
29276 1095405 1133607 993370 803453 806336 1011813 1063977 672663 28775 -464600 -696414
29266 -696414 -749241 -511021 107184 682276 630961 92087 -168930 130871 414967 183723
29256 183723 -334879 -762156 -1105821 -1319165 -1030099 -260900 233970 5548 -307676 28253
29246 28253 634308 670337 210385 -36393 -35183 -353351 -934582 -1076301 -673101 -408738
29236 -408738 -544994 -553349 -225030 -133016 -556187 -860146 -506773 83471 264700 101588
29226 101588 -30084 -191990 -582081 -959183 -1025570 -1010076 -1224362 -1346532 -837365 82020
29216 82020 529336 73181 -742673 -1085767 -727131 -161397 -15972 -385166 -726229 -517297
29206 -517297 28020 205049 -198661 -609828 -540995 -268508 -277172 -445844 -292018 221693
29196 221693 650195 740046 686506 723807 834439 923743 1008089 1137888 1277569 1317046 1173253
29185 1173253 926512 832679 1033502 1262751 1100028 563630 142430 137708 306648 300519
29175 300519 91456 -233664 -710511 -1234511 -1414013 -1052008 -524956 -353585 -614112 -1041319
29165 -1041319 -1426360 -1598087 -1326639 -654108 -79101 -4912 -210053 -247559 -125575 -150224
29155 -150224 -323429 -414996 -479811 -752341 -1084005 -1028800 -539548 -116178 -159190 -532553
29145 -532553 -843092 -849932 -556751 -172580 9316 -69333 -102154 136276 370114 215360
29135 215360 -151985 -197201 151230 384231 171830 -223370 -408511 -336269 -184808 -96946
29125 -96946 -145985 -269654 -202011 204359 594379 450335 -163543 -641020 -663248 -487755
29115 -487755 -321333 1254 464854 574796 21865 -767028 -1151376 -1021884 -660275 -206716
29105 -206716 295772 601814 476209 53591 -370498 -714709 -947307 -836986 -336384 21168
29095 21168 -318072 -1062313 -1331838 -787720 29051 544802 785852 978570 1034143 792750
29085 792750 462678 429484 744162 1073564 1121615 928701 753444 730015 666227 263191
29075 263191 -396602 -764478 -474253 71035 132400 -398852 -900820 -920341 -687432 -573979
29065 -573979 -527729 -345499 -109042 12239 80513 161775 81596 -214325 -358489 -70292
29055 -70292 290592 187686 -263918 -468707 -219240 162962 466810 775436 1034092 1061713
29045 1061713 1046464 1384263 1896727 1879419 1154740 411903 184429 156478 -86294 -276268
29035 -276268 -34178 317943 219964 -208309 -392833 -176467 186008 636144 1194547 1433146
29025 1433146 866733 -164089 -772312 -746193 -742736 -1120763 -1354798 -948474 -281919 -79520
29015 -79520 -462170 -962024 -1182533 -1070248 -738131 -332632 19415 276976 392511 187079
29005 187079 -403455 -995169 -1077199 -701417 -405190 -389162 -300018 39114 283628 217935
28995 217935 170262 415124 689807 706510 621039 535029 88056 -847351 -1555044 -1305971
28985 -1305971 -472568 -48002 -274818 -538690 -496243 -462431 -623772 -660352 -353605 81764
28975 81764 481262 940827 1325071 1187121 501393 -83225 -110364 55088 -107747 -446681
28965 -446681 -511340 -396803 -571086 -1022660 -1215388 -918524 -542220 -510807 -733780 -886546
28955 -886546 -859176 -690703 -352466 100321 359640 196504 -116100 -65519 382416 668915
28945 668915 395690 -104349 -213019 163212 563983 650029 529502 403983 272588 104883
28935 104883 -31410 -183112 -527571 -956779 -979851 -375020 328086 435416 -2482 -310502
28925 -310502 -143243 151828 173097 14167 -17538 98002 130338 -26345 -212006 -177305
28915 -177305 163664 584145 673492 266483 -290312 -502383 -321452 -120227 -105126 -109743
28905 -109743 -36292 -92576 -367844 -516386 -189294 431789 849279 854829 632300 389376
28895 389376 207095 180383 372563 620610 667937 518432 407765 410678 354003 150743
28885 150743 -97830 -414924 -995858 -1750281 -2162014 -1930694 -1451951 -1236821 -1107318 -557033
28875 -557033 188950 225030 -690541 -1525090 -1221317 -90576 679471 619918 337382 337946
28865 337946 305605 -166143 -767129 -889269 -488120 -30163 239618 520842 976997 1392911
28855 1392911 1398527 863363 48398 -539908 -528324 -49838 338205 238311 -181794 -487966
28845 -487966 -519710 -427139 -319036 -168950 -29803 -54986 -251330 -409880 -342391 -51348
28835 -51348 354182 772480 1115517 1331376 1460831 1579459 1656026 1549110 1189970 736634
28825 736634 493163 609398 840729 740667 235953 -134071 164414 884685 1235654 913068
28815 913068 431817 292359 331070 203312 28776 102979 331527 442030 471185 555359
28805 555359 521762 222296 1797 227790 588839 535668 224938 256366 597892 653842
28795 653842 410102 537306 1135135 1346705 665621 -230640 -520123 -359089 -306602 -290817
28785 -290817 52829 488813 476426 94824 -99067 13708 39143 -177694 -373793 -409201
28775 -409201 -398061 -309310 1589 340863 300782 -88545 -325030 -156809 104992 114978
28765 114978 -68259 -214379 -252700 -232264 -207814 -237596 -277415 -119142 283586 537199
28755 537199 264579 -233301 -281186 181035 469461 165721 -288614 -286212 109353 371986
28745 371986 236348 -119633 -384030 -334750 36826 403610 318364 -243900 -765708 -772954
28735 -772954 -307143 305801 812878 971899 550373 -267427 -819118 -727070 -451508 -632433
28725 -632433 -1107851 -1125689 -453576 258060 309927 -245642 -772702 -757103 -237241 304572
28715 304572 435400 235815 178098 458522 713509 631957 519970 816496 1298308 1352881
28705 1352881 942137 653859 746113 785883 431774 -17046 -153829 -39553 89963 220299
28695 220299 280015 -59046 -794376 -1209030 -716336 154657 316343 -404715 -1053694 -903746
28685 -903746 -343031 -101571 -174419 -41591 364886 527709 174090 -255091 -178422 359850
28675 359850 769156 668170 306998 179352 402732 647579 604214 320374 41299 -114340
28665 -114340 -204689 -280377 -271191 -57254 370545 796900 882093 515904 59500 26534 459520
28654 459520 848497 794992 510976 431083 542213 438922 -34994 -551774 -750465 -639420
28644 -639420 -441014 -241424 56485 520976 1035865 1352991 1313845 1045738 854933 852703
28634 852703 815008 546802 226896 155999 284196 304072 167588 143311 291639 247163
28624 247163 -271636 -986094 -1332303 -1081406 -499685 4883 221347 192045 97272 85515
28614 85515 148329 190439 230389 403045 692766 818563 556449 109824 -28526 383351
28604 383351 1052573 1456725 1346091 878201 351499 -21386 -76756 300868 923345 1217055
28594 1217055 770304 -33117 -324126 176939 792352 824204 434859 194103 134472 -137784
28584 -137784 -588223 -705805 -350559 -31884 -164565 -551751 -816648 -896646 -866879 -683798
28574 -683798 -389044 -229542 -296910 -341195 -189791 -46541 -115833 -243355 -232028 -225069 -433104
28563 -433104 -711793 -751358 -509209 -164383 164309 373161 270349 -158784 -574864 -682264
28553 -682264 -599777 -530453 -339617 121327 527953 454630 85741 -18283 188610 194561
28543 194561 -150548 -302150 122987 677380 683568 180331 -177962 -32335 271891 210546
28533 210546 -278594 -805325 -1022324 -950402 -827169 -772131 -704642 -537399 -306251 -94044
28523 -94044 36246 2485 -246475 -590855 -816676 -886108 -936231 -958370 -752322 -315877
28513 -315877 32556 111877 134048 245884 172826 -291624 -754396 -697303 -300866 -236989
28503 -236989 -691959 -1139223 -1137819 -851647 -623844 -462292 -177760 245347 611040 681903
28493 681903 328724 -299322 -763635 -749424 -475308 -400227 -555820 -549690 -257508 -68235
28483 -68235 -284108 -667768 -814835 -671346 -450723 -296706 -261237 -396990 -636714 -744853
28473 -744853 -586499 -303655 -78828 97754 267988 314701 149100 -52470 -26076 234736
28463 234736 489238 564580 530665 582494 812585 1065481 1030527 596108 90226 -29654
28453 -29654 253029 502616 472145 465544 849590 1426248 1586327 1018439 39250 -748770
28443 -748770 -947679 -557793 93037 554020 547922 196770 -69427 100870 661196 1235897
28433 1235897 1491658 1400427 1134376 818874 527292 434983 694425 1082597 1080575 535157
28423 535157 -8308 30616 442964 497578 -13825 -485911 -395339 -46570 -98387 -619558
28413 -619558 -1023000 -871393 -371901 21841 190265 286811 282200 -44670 -607470 -891596
28403 -891596 -606873 -175028 -157387 -391731 -246850 319800 625839 340192 7301 127335
28393 127335 341295 82183 -465983 -721895 -662034 -718272 -944767 -985570 -758164 -518981
28383 -518981 -316874 1378 295108 254644 -8626 -101915 -51212 -238638 -657010 -878578
28373 -878578 -778656 -622700 -421329 59456 574418 495197 -171475 -638506 -474828 -139780
28363 -139780 -91395 -137346 -55197 -85815 -313852 -269742 267377 692661 436929 -113478
28353 -113478 -205864 192852 530332 542205 390055 208025 67871 167293 560153 894870
28343 894870 821797 444316 61878 -209083 -267879 60898 568599 615821 29342 -449403
28333 -449403 -177418 410633 498495 129886 -18410 201969 304751 96462 -61779 69482
28323 69482 310240 490725 647909 733552 563244 125687 -348382 -608538 -495616 -19297
28313 -19297 480990 561990 300678 291118 736212 1055403 783689 277777 20622 -148034
28303 -148034 -462980 -544352 -87650 350387 190169 -82261 276865 841454 616369 -239035
28293 -239035 -606552 -225210 25533 -253624 -384523 86103 666257 873148 866293 765881
28283 765881 339017 -260891 -419549 -111656 -54569 -436210 -542237 -119300 22175 -564727
28273 -564727 -1029348 -590613 115955 75878 -489261 -647994 -340304 -297571 -698915 -971204
28263 -971204 -822904 -577623 -480641 -409379 -307035 -309992 -410176 -447015 -409478 -380924 -298093
28252 -298093 -103826 37551 4155 -33440 60998 112399 10055 -23357 74634 -99865 -718539
28241 -718539 -1176270 -892748 -270640 -114093 -390886 -399808 -6527 170913 -152158 -481581
28231 -481581 -397254 -169351 -205787 -389316 -319529 82292 487848 537666 184516 -230973
28221 -230973 -260537 164256 615532 691058 482096 317775 268282 183752 17834 -179445
28211 -179445 -371434 -378114 56016 713219 868338 286395 -232610 16095 430245 -60223
28201 -60223 -1234488 -1758173 -1107084 -201514 106687 107394 339097 592778 489810 318249
28191 318249 515651 806945 605712 -39040 -567170 -758024 -845080 -933489 -882605 -705454
28181 -705454 -578647 -477733 -253221 -59750 -259900 -829699 -1249275 -1122025 -622048 -203322
28171 -203322 -95799 -223484 -441777 -676983 -861520 -836229 -416173 334157 916924 748716
28161 748716 -133373 -915240 -832793 -53371 558010 489019 51266 -224528 -267290 -317583
28151 -317583 -390857 -251425 133829 427401 312588 -104601 -406557 -325716 -13336 150405
28141 150405 -29288 -370549 -555284 -524750 -530522 -750641 -1004591 -1024391 -907215 -997843
28131 -997843 -1280646 -1244251 -596253 159926 260971 -290940 -660373 -227285 631746 1004442
28121 1004442 490983 -393695 -784990 -337007 436893 702446 232715 -350588 -426065 -197619
28111 -197619 -254945 -522101 -326664 435392 968722 732358 224006 105200 165774 -147614
28101 -147614 -650160 -707326 -345288 -196612 -392188 -355877 166453 624957 469010 -165921
28091 -165921 -832044 -1296667 -1434702 -1115151 -539226 -277478 -617096 -1174323 -1416382 -1250494
28081 -1250494 -869507 -399492 -3869 33561 -285438 -461883 -77288 621158 1049702 999048
28071 999048 678645 261732 -197378 -497690 -374700 87860 411341 194920 -467018 -1049756
28061 -1049756 -1052542 -493221 20598 -102437 -715390 -1077041 -798875 -296249 -106725 -157967
28051 -157967 -69776 146079 174408 15368 12413 271396 473089 348468 35977 -137832
28041 -137832 -33747 219746 400558 417260 402794 516938 641475 468891 -29136 -487457
28031 -487457 -652083 -701705 -846208 -927673 -736933 -435207 -287384 -233594 -128738 -146827
28021 -146827 -462360 -739150 -490927 147940 543442 414124 80300 -97629 -60168 121680
28011 121680 285268 115511 -459064 -913184 -728293 -226535 -135178 -424496 -397385 62232
28001 62232 276912 -3595 -157853 152742 357063 60796 -155780 245746 764229 733092
27991 733092 467298 547023 586855 -86606 -935908 -735395 470716 1247387 839756 167920
27981 167920 278428 847615 944444 508136 207528 262492 239084 -112706 -501377 -641861
27971 -641861 -680294 -904589 -1298876 -1553905 -1427285 -994689 -539344 -227246 30012 349504
27961 349504 641947 740533 657709 533926 426665 349127 400215 600305 704775 479492
27951 479492 74185 -201794 -379384 -710636 -1104554 -1138703 -677270 -49187 456152 836418
27941 836418 1041798 891992 517924 415282 775250 1146186 1055761 632570 310119 226736
27931 226736 248332 323114 465243 567685 533043 447077 386026 217519 -187845 -718681
27921 -718681 -1182573 -1492276 -1522489 -1083858 -308782 234855 173506 -156846 -202561 3460
27911 3460 -24685 -398689 -651772 -419194 78957 392327 398767 309586 273456 205929 42427
27900 42427 -6208 326409 845590 891732 152309 -722688 -788503 -43660 548514 372177
27890 372177 -108121 -188358 106300 350576 510106 797395 1062123 967836 634376 535109
27880 535109 798797 1078260 1076947 805498 380590 -38901 -192055 4054 172583 -131102
27870 -131102 -787105 -1233094 -1155447 -701946 -110614 452295 754588 651923 380250 295734
27860 295734 339712 163703 -241793 -487040 -373542 -116086 78524 251426 438545 544479
27850 544479 546417 518502 437552 260441 130991 162838 138702 -129754 -284875 143341 843835
27839 843835 958327 303393 -343898 -401591 -228564 -348241 -563471 -388147 73604 264555
27829 264555 -23477 -462366 -694681 -666084 -517489 -410274 -412304 -403650 -188383 203748
27819 203748 479174 438855 215641 82472 186723 500478 836141 906565 588230 104396
27809 104396 -262206 -509153 -677221 -515638 116692 723432 717896 388673 518297 1043315
27799 1043315 1053196 328254 -170824 171396 625334 374078 -138527 -90146 209064 -128369
27789 -128369 -908152 -1015274 -192778 502396 261899 -419563 -661534 -414665 -232027 -326689
27779 -326689 -419682 -305979 -116334 -37445 -49420 -12892 85637 72398 -173408 -491422 -647800
27768 -647800 -752191 -1128206 -1654376 -1670305 -870373 92956 390364 141253 177882 796782
27758 796782 1377524 1343192 938199 771648 968521 1124548 925852 490578 98435 -185029
27748 -185029 -472350 -722386 -669946 -217196 280986 386470 135512 -96782 -208864 -396513
27738 -396513 -554557 -232296 597474 1263843 1234716 779776 437769 268042 62451 -109353
27728 -109353 -69846 62735 105847 158447 300813 304960 91910 64043 456253 801600 664970
27717 664970 435880 623156 822337 360454 -361187 -316129 453076 800612 292526 -131538
27707 -131538 286494 988564 1141120 920127 992290 1351772 1464094 1168962 739974 318592
27697 318592 -96266 -301499 -110024 201182 182407 -93921 -94376 379580 852169 775880
27687 775880 218831 -251685 -287034 -156747 -330247 -787128 -1017792 -747645 -302358 -42247
27677 -42247 177102 589416 930936 840212 569754 589828 646761 76619 -899842 -1140520
27667 -1140520 -188860 900986 895919 -63505 -848128 -845310 -450254 -289413 -518442 -846060
27657 -846060 -891625 -530747 -50331 152210 83983 106134 299252 276511 -178232 -680632
27647 -680632 -728067 -296425 281258 711365 797734 464454 -25137 -214962 -56169 7689
27637 7689 -228889 -377069 -125528 219209 262050 132741 106106 29460 -331749 -712548
27627 -712548 -681700 -323367 -63367 -9713 50630 189315 343466 597085 982495 1172809
27617 1172809 843385 196086 -307162 -564543 -768965 -937378 -964972 -934784 -901402 -616753
27607 -616753 906 407116 86335 -560330 -708854 -337392 -158349 -389446 -476181 -155387
27597 -155387 87838 -63827 -166298 211903 732668 810170 458377 155200 168337 391493
27587 391493 593253 526458 41927 -642315 -1022708 -872875 -475480 -139683 173041 538707
27577 538707 764266 694162 525679 515305 615396 662332 661588 618555 366773 -119395 -481635
27566 -481635 -378229 55279 430522 595746 625975 548677 397239 338983 423061 389837
27556 389837 65999 -253303 -200403 75469 158605 63083 168808 510372 672179 474524
27546 474524 257862 295182 354289 110442 -334211 -626290 -611384 -346633 112035 629536
27536 629536 857958 535797 -100643 -496023 -407420 -117256 55518 203597 584535 1077432
27526 1077432 1200603 735874 80213 -223386 -141093 -51466 -78463 75808 525114 846554
27516 846554 660749 265242 235726 544392 592557 132599 -373393 -493222 -440852 -626325
27506 -626325 -966684 -1084926 -966442 -921113 -953648 -668612 69281 769934 863645 395098
27496 395098 -77333 -166384 -5151 69182 -36699 -144432 -116097 -44883 -111932 -347571
27486 -347571 -602896 -710179 -603409 -330657 -42231 78095 -9532 -131416 -140759 -146400
27476 -146400 -283829 -353283 -61470 364178 296618 -348652 -800252 -471115 121580 68585
27466 68585 -577936 -875778 -363190 350565 507866 104433 -384887 -674208 -733420 -564973
27456 -564973 -256985 -37052 -42747 -208798 -455085 -715224 -761849 -408321 65129 181110
27446 181110 40776 208769 656950 607602 -161904 -678669 -127848 851173 1104174 658951
27436 658951 452455 705336 718848 232055 -152642 -91389 -37053 -314588 -539439 -398184
27426 -398184 -244346 -402211 -532436 -271009 36747 -119607 -517857 -502121 24141 502563
27416 502563 569319 501663 715551 1126747 1189546 539473 -462463 -980818 -658416 -119515
27406 -119515 -161799 -629294 -681953 -149822 157423 -260567 -765323 -541667 228901 778473
27396 778473 849723 686397 309719 -382823 -973113 -819094 -65964 356082 -54680 -743859
27386 -743859 -942819 -636663 -351145 -359177 -513836 -652328 -741000 -664454 -243034 427502
27376 427502 897014 807669 313781 -113442 -234174 -192709 -159180 -117999 -104317 -311775
27366 -311775 -714102 -874218 -493689 73197 278468 161372 161619 300882 184841 -191668
27356 -191668 -332961 -75748 138611 75919 141850 624138 1067425 876223 135438 -591004
27346 -591004 -945403 -927594 -716060 -619148 -807439 -875906 -216311 909712 1378958 744640
27336 744640 16744 240181 992587 1155438 603595 116507 -5648 -155659 -420899 -409736
27326 -409736 -76341 186083 302565 527495 704658 412518 -92594 -22500 663511 1038242
27316 1038242 564527 -176797 -490279 -493094 -565543 -592192 -330017 5397 84404 -9752
27306 -9752 -77590 -253615 -693409 -1126404 -1176069 -899523 -623235 -432482 -164015 228665
27296 228665 563792 602738 237015 -337034 -639643 -399574 -4955 -58920 -498943 -695825
27286 -695825 -488262 -451978 -901135 -1298037 -1070121 -439215 43665 286589 454801 435935
27276 435935 111107 -180412 -70429 171543 -11431 -604392 -1061327 -1094732 -909640 -730545
27266 -730545 -589891 -538395 -589196 -478637 40986 659835 750657 239852 -225885 -155124
27256 -155124 165244 185755 -106647 -274316 -138204 3539 -109122 -306043 -295119 -136104
27246 -136104 -113810 -237045 -236042 -100099 -177574 -513168 -539314 121813 902809 946558 313556
27235 313556 -147171 -45460 185887 219024 308597 611030 804615 753248 834808 1169157
27225 1169157 1214136 674746 156713 243061 485368 94268 -776851 -1243016 -925217 -248028
27215 -248028 296441 512138 331701 -61111 -153283 221561 426491 -39783 -524935 -109615
27205 -109615 758315 713648 -425625 -1271210 -908684 -144242 -117447 -689452 -999045 -822775
27195 -822775 -492119 -40556 623703 1046696 655241 -266163 -812845 -649782 -264575 -8769
27185 -8769 387759 1108781 1653124 1377617 369748 -582988 -825215 -427831 20941 67417
27175 67417 -222883 -485346 -532482 -467614 -373391 -152817 203867 439203 341034 70561
27165 70561 -76482 -120195 -316019 -666371 -825702 -574408 -156029 -5018 -259554 -645601
27155 -645601 -764512 -431351 178206 625755 532992 -41272 -524174 -267156 804720 2008026
27145 2008026 2497815 2084351 1349689 932457 886737 872929 765678 765515 959528 1090358
27135 1090358 859550 268228 -420054 -904489 -1003518 -769843 -502318 -471658 -592553 -551992
27125 -551992 -285417 -71792 -68971 -32651 307453 784758 930382 490551 -315062 -963333
27115 -963333 -996605 -384268 387410 731153 530401 142383 -146317 -351483 -434289 -162970
27105 -162970 419544 790342 579024 100754 -142194 -215035 -525529 -1033747 -1220691 -804641
27095 -804641 -42368 649324 954585 621107 -315518 -1236192 -1383520 -745960 -91717 -17676
$$ [...]
##END NTUPLES=NMR SPECTRUM
##END=
