##TITLE=31Pdec_57-2021
 CDCl3, 24 sc
 27.07.2021
##JCAMPDX= 6.0         $$ Bruker NMR JCAMP-DX V2.0
##DATA TYPE= NMR SPECTRUM
##DATA CLASS= NTUPLES
##ORIGIN= UXNMR, Bruker Analytische Messtechnik GmbH
##OWNER= root
$$ XWIN-NMR		Version 3.5
$$ Tue Jul 27 11:40:30 2021 Russian Standard Time (UT+4h)  she@DPX200
##.OBSERVE FREQUENCY= 81.013821
##.OBSERVE NUCLEUS= ^31P
##.ACQUISITION MODE= SIMULTANEOUS
##.ACQUISITION SCHEME= undefined
##.AVERAGES= 24
##.DIGITISER RES= 16
##SPECTROMETER/DATA SYSTEM= spect
##.PULSE SEQUENCE= zgpg30
##.SOLVENT NAME= CDCl3
##.SHIFT REFERENCE= (INTERNAL, CDCl3, 0, 248.564)
##AUDIT TRAIL= $$ (NUMBER, WHEN, WHO, WHERE, WHAT)
$$ ##TITLE= Audit trail, XWIN-NMR		Version 3.5
$$ ##JCAMPDX= 5.01
$$ ##ORIGIN= Bruker BioSpin GmbH
$$ ##OWNER= she
$$ F:/spectra/data/she/nmr/P31/1/pdata/1/auditp.txt
$$ ##AUDIT TRAIL=  $$ (NUMBER, WHEN, WHO, WHERE, WHAT)
(   1,<2021-07-27 11:38:52.67 +0400>,<she>,<DPX200>,
      <created by zg, POWCHK disabled, PULCHK disabled
       configuration hash MD5:
       00 E9 B6 7A A2 85 ED C7 34 08 36 98 17 FE 4E 26
       data hash MD5: 32K
       3D E1 8A B8 71 D7 E4 84 52 3E 89 2F 87 C5 C5 A7>)
(   2,<2021-07-27 11:38:58.09 +0400>,<she>,<DPX200>,
      <Start of raw data processing
       efp BC_mod = 2 LB = 1 FT_mod = 6 PKNL = 1 PHC0 = -7312.688 PHC1 = -53.32507 SI = 64K 
       data hash MD5: 64K
       32 59 DD 55 1E 94 AD 9F 5D CA D2 FE B1 9D 8E 8E>)
(   3,<2021-07-27 11:39:39.15 +0400>,<she>,<DPX200>,
      <pk PHC0 = 86.91323 PHC1 = -208.8 
       data hash MD5: 64K
       E6 5B 51 1C 79 1E FD A5 25 52 68 78 7C 61 EA E0>)
(   4,<2021-07-27 11:39:44.98 +0400>,<she>,<DPX200>,
      <abs ABSG = 5 
       data hash MD5: 64K
       61 23 F7 BD 88 1A 4A 87 5F 6E D2 69 67 10 C2 CD>)
$$ ##END=
$$ 
$$ hash MD5
$$ BF EE 15 44 B2 B9 34 FD 10 A3 44 6E 93 B1 27 39
##$RELAX= 
##$RELAX= 
##$RELAX= 
##$RELAX= 
##$RELAX= 
##$RELAX= 
##$RELAX= 
##$RELAX= 
$$ Bruker specific parameters
$$ --------------------------
##$DU= <F:/spectra>
##$EXPNO= 1
##$NAME= <P31>
##$PROCNO= 1
##$TYPE= <nmr>
##$USER= <she>
##$AMP= (0..31)
100 100 100 100 100 100 100 100 100 100 100 100 100 100 100 100 100 100 
100 100 100 100 100 100 100 100 100 100 100 100 100 100 
##$AQSEQ= 0
##$AQ_mod= 1
##$AUNM= <au_zg>
##$AUTOPOS= <>
##$BF1= 81.014009
##$BF2= 200.13
##$BF3= 200.13
##$BF4= 200.13
##$BF5= 200.13
##$BF6= 200.13
##$BF7= 200.13
##$BF8= 200.13
##$BYTORDA= 1
##$CFDGTYP= 0
##$CFRGTYP= 5
##$CHEMSTR= <none>
##$CNST= (0..31)
1 1 145 1 1 1 1 1 1 1 1 1 1 1 1 1 1 1 1 1 1 1 1 1 1 1 1 1 1 1 1 1 
##$CPDPRG= <waltz16>
##$CPDPRG1= <>
##$CPDPRG2= <waltz16>
##$CPDPRG3= <>
##$CPDPRG4= <mlev>
##$CPDPRG5= <mlev>
##$CPDPRG6= <mlev>
##$CPDPRG7= <mlev>
##$CPDPRG8= <mlev>
##$CPDPRGB= <>
##$CPDPRGT= <>
##$D= (0..31)
0 1 0 0 0 0 0 0 0 0 0 0.03 2e-05 3e-06 0 0 0 0 0 0 0 0 0 0 0 0 0 0 0 0 
0 0 
##$DATE= 1627371532
##$DBL= (0..7)
120 120 120 11 120 120 24 19 
##$DBP= (0..7)
150 150 150 150 150 150 150 150 
##$DBP07= 0
##$DBPNAM0= <>
##$DBPNAM1= <>
##$DBPNAM2= <>
$$ [...]
##$SUBNAM3= <"">
##$SUBNAM4= <"">
##$SUBNAM5= <"">
##$SUBNAM6= <"">
##$SUBNAM7= <"">
##$SUBNAM8= <"">
##$SUBNAM9= <"">
##$SW= 501.771253377433
##$SWIBOX= (0..15)
0 1 3 0 0 0 0 0 0 0 0 0 0 0 0 0 
##$SW_h= 40650.406504065
##$TD= 32768
##$TD0= 1
##$TE= 0
##$TE2= 300
##$TE3= 300
##$TEG= 300
##$TL= (0..7)
0 120 53 12 22 120 120 120 
##$TP= (0..7)
150 150 150 150 150 150 150 150 
##$TP07= 0
##$TPNAME0= <>
##$TPNAME1= <>
##$TPNAME2= <>
##$TPNAME3= <>
##$TPNAME4= <>
##$TPNAME5= <>
##$TPNAME6= <>
##$TPNAME7= <>
##$TPOAL= (0..7)
0.5 0.5 0.5 0.5 0.5 0.5 0.5 0.5 
##$TPOFFS= (0..7)
0 0 0 0 0 0 0 0 
##$TUNHIN= 0
##$TUNHOUT= 0
##$TUNXOUT= 0
##$USERA1= <user>
##$USERA2= <user>
##$USERA3= <user>
##$USERA4= <user>
##$USERA5= <user>
##$V9= 5
##$VALIST= <valist>
##$VCLIST= <CCCCCCCCCCCCCCC>
##$VD= 0
##$VDLIST= <DDDDDDDDDDDDDDD>
##$VPLIST= <PPPPPPPPPPPPPPP>
##$VTLIST= <TTTTTTTTTTTTTTT>
##$WBST= 1024
##$WBSW= 4
##$XGAIN= (0..3)
0 0 0 0 
##$XL= 0
##$YL= 0
##$YMAX_a= 1515
##$YMIN_a= -2663
##$ZGOPTNS= <>
##$ZL1= 120
##$ZL2= 120
##$ZL3= 120
##$ZL4= 120
##$ABSF1= 248.5645
##$ABSF2= -253.2056
##$ABSG= 5
##$ABSL= 3
##$ALPHA= 0
##$AQORDER= 0
##$ASSFAC= 0
##$ASSFACI= 0
##$ASSFACX= 0
##$ASSWID= 0
##$AUNMP= <proc_1d>
##$AZFE= 0.1
##$AZFW= 0.5
##$BCFW= 0
##$BC_mod= 2
##$BYTORDP= 0
##$COROFFS= 0
##$CY= -3
##$DATMOD= 1
##$DC= 0
##$DFILT= <>
##$DTYPP= 0
##$F1P= 0
##$F2P= 0
##$FCOR= 1
##$FTSIZE= 65536
##$FT_mod= 6
##$GAMMA= 0
##$GB= 0
##$INTBC= 1
##$INTSCL= 5.30512e-09
##$ISEN= 30
##$LB= 1
##$LEV0= 0
##$LPBIN= 0
##$MAXI= 10000
##$MC2= 0
##$MEAN= 0
##$ME_mod= 0
##$MI= 50
##$NCOEF= 0
##$NC_proc= -8
##$NLEV= 6
##$NOISF1= 182.463
##$NOISF2= 159.3651
##$NSP= 0
##$NTH_PI= 0
##$NZP= 0
##$OFFSET= 248.5645
##$PC= 4
##$PHC0= -7225.775
##$PHC1= -262.1251
##$PH_mod= 1
##$PKNL= yes
##$PPARMOD= 0
##$PSCAL= 0
##$PSIGN= 0
##$REVERSE= no
##$SF= 81.014009
##$SI= 65536
##$SIGF1= 159.3651
##$SIGF2= -187.1042
##$SINO= 113.3802
##$SIOLD= 16384
##$SREGLST= <1H.CDCl3>
##$SSB= 0
##$STSI= 65536
##$STSR= 0
##$SW_p= 40650.406504065
##$SYMM= 0
##$S_DEV= 0
##$TDeff= 32768
##$TDoff= 0
##$TI= <>
##$TILT= no
##$TM1= 0
##$TM2= 0
##$TOPLEV= 0
##$USERP1= <user>
##$USERP2= <user>
##$USERP3= <user>
##$USERP4= <user>
##$USERP5= <user>
##$WDW= 1
##$XDIM= 65536
##$YMAX_p= 395052889
##$YMIN_p= -19436421
$$ End of Bruker specific parameters
$$ ---------------------------------
##NTUPLES= NMR SPECTRUM
##VAR_NAME=  FREQUENCY,     SPECTRUM/REAL,   SPECTRUM/IMAG
##SYMBOL=    X,             R,               I
##VAR_TYPE=  INDEPENDENT,   DEPENDENT,       DEPENDENT
##VAR_FORM=  AFFN,          ASDF,            ASDF
##VAR_DIM=   65536,         65536,           65536
##UNITS=     HZ,            ARBITRARY UNITS, ARBITRARY UNITS
##FACTOR=    0.620285442955139, 1,           1
##FIRST=     20137.2065510759, 0,            0
##LAST=      -20513.1999529892, 0,           0
##MIN=       -20513.1999529892, -19436421,   0
##MAX=       20137.2065510759, 395052889,    0
$$ Real data points
##PAGE= N=1
##DATA TABLE= (X++(R..R)), XYDATA
$$ [...]
13036a0372632R300841M389073j774052j582985L162831M906298J157423k987819
13028F198978k821685N769Q91208j567542m737709n424393k790180J040291K772605
13019f432658J478075M4746J419181M199775M602058K088333m91459k038242l993914
13010H75895n446451k813147L304066O228814K185096l195983k524860K465786
13002A079216L900725j68434l620021k414966k1767m07746j561582N2450K972651
12993a89474L395504J451967k5415r77176l066160m290459p83658N367233O422995
12984G305357j90017o928820o250184j045357P01986j790135k374749Q83315K956229
12975f732375J451052J091897M914241P664228L696791l234195m826888l53904
$$ y = [-10372632, -1071791, 3317282, 1543230, -39755, 3123076, 8029374, 9186797, 6198978, 3377293, 3383062, 4274270, 2706728, -2030981, -7455374, -10245554, -9205263, -6432658, -4954583, -4909837, -3490656, 709119, 5311177, 7399510, 6908051, 4869809, 875895, -4570556, -7383703, -4079637, 2149177, 4334273, 1138290, -1386570, 1079216, 4979941, 4811507, 1191486, -1223480, -1245247, -1652993, -3214575, -3162125, -189474, 3206030, 4657997, 4632582, 3655406, 589246, -3701213, -4484871, 882362, 7305357, 7115340, 186520, -6063664, -7109021, -6407035, -8197170, -10571919, -9688604, -6732375, -5281323, -4189426, 724815, 8389043, 12085834, 8851639, 4024751, 3670847]
12967C670847K904251O86897l220424l901893j676126M95554J499936J379474
12959A838516l49807k832902l072855m3015K536172R03226k727070k729268J676435
12950d800568M875473K811599j265696j841799P68212J493548j357660l791276
12942c108167k799085p29958n38141p12997J259486L563860K933682O38332K83376
12933G90388J160231j96341k580342j181673L351808M356955k04360l923886k241289
12924f68509O10176k66776k193361j056033L56930k172078n114860k056078N126025
12915g434564Q501880O051735L189444K865385K112781r33181l719612m203595
12907F430273l177501j038435K064256K912346j450070o920433o114048K13837
$$ y = [3670847, 6575098, 7261995, 4041571, 139678, -1536448, -1040894, 459042, 1838516, 1488709, -1344193, -4417048, -4460063, -1923891, -1020665, -3747735, -6477003, -4800568, 74905, 2886504, 1620808, -220991, 547221, 2040769, 683109, -3108167, -5907252, -6637210, -7175351, -7888348, -6628862, -3065002, -131320, 507012, 790388, 1950619, 1754278, -826064, -2007737, 1344071, 5701026, 5496666, 1572780, -668509, -58333, -325109, -2518470, -3574503, -3217573, -5389651, -10504511, -12560589, -7434564, 1067316, 7119051, 10308495, 13173880, 15286661, 14353480, 10633868, 6430273, 3252772, 2214337, 4278593, 7190939, 5740869, -1179564, -7293612, -7079775]
12899g079775L287502l10010l536395n62240M276359M267756O07489j090095J95947
12890E6538J403422J627005K254135K899813J846849p41465l340925n249873n789839
12881e034340l592320P66101L789171L239441J026874j23952j54829J62061J259001
12872A337208K596553J865598j002037k542908j293580p34332l254974n161343
12864h189815k179535L306685N483248L290015N86441j76859J22546N14848Q91110
12855C648684M72196j160320k363376j766455r25769j580667k031070J53665L359339
12846b193773L772181J047352j483521j607236j16821J294975J264059r76179
12838A001037l943039m138980o17417K834943L045613K144474L066753L629754
$$ y = [-7079775, -3792273, -4102283, -7638678, -8200918, -3924559, 343197, 950686, -139409, 56538, 1459960, 3086965, 5341100, 8240913, 10087762, 9346297, 6005372, 755499, -5034340, -8626660, -7860559, -4071388, -831947, 194927, 70975, -83854, 78207, 1337208, 3933761, 5799359, 4797322, 2254414, 960834, 226502, -3028472, -8189815, -10369350, -7062665, -1579417, 1710598, 2297039, 2120180, 2242726, 2757574, 3648684, 4120880, 2960560, 597184, -1169271, -2095040, -3675707, -5706777, -5553112, -2193773, 1578408, 2625760, 1142239, -464997, -581818, 713157, 1977216, 1001037, -2942002, -7080982, -7698399, -4863456, -1817843, 326631, 3393384, 7023138]
12830G023138M64772l750695l498262N19286K391273O99082J8178J958759K124778
12821G950309j561030m341300k317225R32053J45862l362026m269230j330984
12813h153571J898104K830678K062624O68433r47404j686970l67452K061598L203997
12804A570037K258614N31590r35689k268542l234304k851253j121554M55124R23376
12795d672601J163525K122380K727298J033982k670873n272308m042351J18249
12787i492699L387386K912612m06863l009076k315680O74767K491741J191944
12779d565868j097690p10612K575166M938416L630054M89952j311357j785542
12771B162519k650865l236589j621090J060793J580765j35109p71851Q91531K303145
$$ y = [7023138, 7487910, 3737215, 238953, 758239, 3149512, 3848594, 3866772, 5825531, 7950309, 6389279, 2047979, -269246, 662807, 808669, -2553357, -6822587, -8153571, -6255467, -3424789, -1362165, -693732, -1641136, -3328106, -3695558, -1633960, 1570037, 3828651, 4360241, 3424552, 1156010, -2078294, -4929547, -6051101, -5595977, -4672601, -3509076, -1386696, 1340602, 2374584, -296289, -5568597, -9610948, -9492699, -6105313, -3192701, -3599564, -6608640, -8924320, -8249553, -5757812, -4565868, -5663558, -6374170, -3799004, 1139412, 4769466, 5259418, 3948061, 2162519, -488346, -3724935, -5346025, -4285232, -2704467, -2839576, -3611427, -2719896, -416751]
12762d16751J805944R22789P37769N1908j310085j436383l00785m87036j928576
12753b361206p12389M052278P097591M477592m38801k791720l475108n273438
12745E74799o016158k239789L157898M041349N11378j464820M63658K249291O88969
12736A966575k180875l171398j939995K47630K116809K105721j88555k068933
12728c113021m71261L458157N672390M596625J911045j044948l791148m600122
12720B617717k187031J111274K023966J325370J712051K072561o25615m657620
12712C392673n054726j776066J02949j017315j157425J387212K837085Q96887
12704c88726j339667j283752q39249j489541j106637R67746J333519j046515j430328
$$ y = [-416751, 1389193, 2311982, 3049751, 3101659, 1791574, 355191, 54406, -432630, -2361206, -3073595, 978683, 8076274, 12553866, 12115065, 9323345, 5848237, 574799, -5441359, -7681148, -4523250, -481901, 29477, -1435343, -971685, 1277606, 1966575, -214300, -3385698, -5325693, -5078063, -2961254, -855533, -1044088, -3113021, -3584282, -126125, 5546265, 10142890, 12053935, 11008987, 7217839, 2617717, 430686, 1541960, 3565926, 4891296, 6603347, 8675908, 8050293, 3392673, -1662053, -3438119, -3335170, -4352485, -5509910, -4122698, -1285613, -388726, -1728393, -3012145, -3851394, -5340935, -6447572, -5479826, -4146307, -5192822, -6623150]
12695f623150K895780O513776L384109l463986n960563k171706K468867L548272
12687E91399J793515m94919k195861k433100q04774J021837P80369j166134k248868
12678e156536j197808O29727J123256m69621k554113j987854K208885N776880
12670a627184L334335l304456n475836P70121P948471O636680j719424p238015
12662f75308m955644L70318K576226J339180l33942j112539j255295n55055R23056
12653c679003J593429L7454k605874l421563r38865L164260N783456N435757L085636
12644H454687J30750l035945n603781n307739j224222L430215M315038J450693
12636B609696j331254j973210j530976k98355K519719M652477J931678m327598
$$ y = [-6623150, -3727370, 2786406, 6170515, 2706529, -3254034, -5425740, -2956873, 591399, 2384914, 1889995, -305866, -2738966, -3543740, -2521903, -1741534, -2907668, -5156536, -6354344, -5724617, -4601361, -5070982, -7625095, -9612949, -7404064, -1627184, 1707151, -1597305, -7073141, -6303020, 1645451, 8282131, 6562707, -675308, -5630952, -5260634, -2684408, -1345228, -1679170, -2791709, -4047004, -4602059, -3679003, -2085574, -2048120, -4653994, -8075557, -9014422, -5850162, -66706, 5369051, 8454687, 8585437, 5549492, -54289, -5362028, -6586250, -3156035, 1159003, 2609696, 1278442, -694768, -2225744, -2524099, -4380, 4648097, 6579775, 2252177]
12628B252177o729917j844290M353140N117652K033413M47692L76894j672744
12620D334017m933604n237506k168389P00356J778761K178896J506064j302069
12612c143474l549242j202405M081486O112782L050160l95321p15715n4482j043974
12603C139815k316352j848024o14110k177J030863L238576M217706J419708l480637
12594D785368n879726l442452J432735M064933J998440k423986m259221j426789
12586e150698L039034N195693M661543K990938L38123k830748l374007K64968
12578E134846L346061L05515n990666p083452j183376M442647M664034K703511
12570F339120K399134J581486k208578n589280m652403j713445r05299r25751
$$ y = [2252177, -4477740, -6322030, -1968890, 3148762, 5182175, 5629867, 6006761, 4334017, -599587, -5837093, -8005482, -7305126, -5526365, -3347469, -1841405, -3143474, -6692716, -7895121, -3813635, 2299147, 5349307, 4953986, 4238271, 4183789, 3139815, 823463, -1024561, -1638671, -1640848, -609985, 2628591, 6846297, 8266005, 4785368, -1094358, -4536810, -3104075, 960858, 2959298, 535312, -3723909, -5150698, -2111664, 3084029, 7745572, 10736510, 11074633, 8243885, 4869878, 5134846, 8480907, 8786422, 2795756, -4287696, -5471072, -1028425, 3635609, 6339120, 8738254, 10319740, 8111162, 2521882, -2130521, -3843966, -4749265, -5675016]
12562e675016J625653M745250L574418j176074l786194k100432Q9959n48408k893702
12553f144546m174401k791467J590737O889288Q108661K580528m584793n438336
12545c964329N4374L789528J299259k343411j347103J829074J315337k399292
12537a766563l640957p58159J828533R92082q76485o47348O58634M62005o61393
12528d409651j69760J809789K398322O32193p58719N18328K694313K507940j893
12519E220862j788822j386718n46015r35429j737848j597139q21578k25428M21603
12510c396512J232522J165564j32434j034640l48747N91253K98860k17393K78130
12501a563397K90811j715358l373209j413920K419676L347273J173455M76313
$$ y = [-5675016, -4049363, 695887, 4270305, 3094231, -691963, -2792395, -2702436, -3250844, -6144546, -10318947, -13110414, -11519677, -4630389, 3478272, 6058800, 1474007, -3964329, -3909955, -120427, 1178832, -1164579, -2511682, -682608, 632729, -1766563, -5407520, -6165679, -4337146, -3345064, -4221549, -4868897, -4210263, -3748258, -4409651, -4579411, -2769622, -371300, 260893, -497826, 20502, 2714815, 5222755, 5220862, 3432040, 2045322, 1499307, 563878, -1173970, -2771109, -3592687, -3818115, -3396512, -2163990, -998426, -1130860, -2165500, -2514247, -1922994, -1624134, -1841527, -1563397, -1272586, -2987944, -6361153, -7775073, -5355397, -2008124, -834669, -358356]
12493c58356K476561K742035p98941l585893j936341O66213l7558j112448K440183
12484D95455P713045O867249p05309o777019n897352j803416L6002O5983J110586
12475A105224K138952M37113k825572l833798j677780R55317J899513J320112
12467d80919j09923k107429l727597l441602p88571K870349N208013M421874R35278
12458B779473k079775j506607J736428L398022J411878j546183k222458q76431
12450A094347O47144K177551L842805L832284Q93968k570617l252386j500503
12442E164593L7287Q37693J843897J758977j391563n370935n257098o22776L183736
12433A83811K302679r83482k549289j762549l49345R25854J812357J191532j089309
$$ y = [-358356, 2118205, 4860240, 4061299, 475406, -1460935, -794722, -832280, -1944728, 495455, 8208500, 15075749, 14370440, 7593421, 1696069, -107347, -71345, -5362, 1105224, 3244176, 3681289, 855717, -2978081, -4655861, -3700544, -1801031, -480919, -590842, -2698271, -6425868, -9867470, -10656041, -7785692, -2577679, 1844195, 2779473, 699698, -806909, 929519, 4327541, 5739419, 4193236, 1970778, 1094347, 1741491, 3919042, 7761847, 11594131, 12488099, 9917482, 6665096, 5164593, 5201880, 6039573, 7883470, 9642447, 8250884, 2879949, -2377149, -2999925, 183811, 2486490, 1503008, -1046281, -2808830, -3158175, -2232321, -419964, 771568, -317741]
12424c17741k567587r37328K361078L502211J037227k239388k513445N36203L017684
12415A878914J325405k880282m258004j135022J890843J122404k62484J879870
12407d38356M263325J013963m822305l932275L950612P394311L27010p596607
12399A59678n124282L496185N278769k021627p797976m882771J921327N078919
12391c891778L845535J529710m22320j859497j768144r1653J142410Q49735M68700
12382a97302Q36696L82391j666838l063147j811224N68150J393592P08912M47509
12373b401261R23210O08086r02580j799566n35292J774154K466418P50020j077280
12364a94091p44377N26882k94052k991095l604547k22665L568803L374702l2590
$$ y = [-317741, -2885328, -3822656, -1461578, 2040633, 3077860, 838472, -1674973, -1138770, 1878914, 3204319, 324037, -3933967, -5068989, -3178146, -2055742, -2318226, -438356, 3824969, 4838932, 16627, -3915648, 34964, 7429275, 7756285, 159678, -4964604, -1468419, 3810350, 1788723, -6009253, -10892024, -8970697, -3891778, -46243, 1483467, 1061147, -798350, -2566494, -2658147, -1515737, -666002, -197302, 639394, 1021785, -645053, -3708200, -5519424, -4951274, -3557682, -2848770, -2401261, -1478051, -869965, -1772545, -3572111, -4107403, -2333249, 133169, 883189, -194091, -938468, -411586, -705638, -3696733, -7301280, -7523945, -3955142, -580440, -613030]
12355f13030k154664o51548K770774M959520L517200j757328p117737o868357
12347g915170l14468N649159M677107p55062l716021k835830k077769k427344
12339i715398r79160J967332K246886o65091k368937j365999j210549k585935
12331a4676851o86918N600904Q984396L860192m394751o531530j829965K838256
12323f836267L325535J382643m57864j243720K8315L160550M691380J839455k384248
12314C505779k820615j18803K57441l012453m704732j142922L964052M434834
12306C62581m62592n456736n301987O160N285836N237182L13370l300577j166809
12297d483572L378440L600345j208578m733293k543383K127134L519483J070406
$$ y = [-613030, -2767694, -3419242, -648468, 4311052, 7828252, 6070924, -1046813, -7915170, -8229638, -2580479, 2096628, 1341566, -2374455, -5210285, -7288054, -9715398, -10694558, -8727226, -6480340, -7145431, -9514368, -10880367, -12090916, -14676851, -15363769, -9762865, -778469, 3081723, -1313028, -7844558, -9674523, -6836267, -3510732, -2128089, -2585953, -3829673, -3801358, -640808, 4050572, 5890027, 3505779, 685164, 566361, 823802, -2188651, -6893383, -8036305, -4072253, 362581, -100011, -5556747, -10858734, -10852574, -5566738, -329556, -16186, -3316763, -4483572, -1105132, 2495213, 1286635, -3446658, -5990041, -3862907, -343424, 726982]
12289G26982r90619r503K275674K968483J477302q62993k766539l435874k288780
12280b905867M4224R98158j391064m764508l845026K628328Q709783Q023922K090447
12271I588397k028708j504933l45567j839772l667807k665818K3827J525886J474025
12262E59530Q44845l08469j360832o48560J008515J85849k958517l113942J664570
12253d127011N077355J777337l452669k938938J399476J513354l070007m598603
12245h419706j26504M216967L894458K384778L631012N279328L607799l66021
12237A4102111l614529n383731n507718k838103J547447L651407J842774j018521
12229B781137k675103l992546m577158j812688K928899L620781r01754l441980
$$ y = [726982, -263637, -273140, 2002534, 4971017, 6448319, 5585326, 2818787, -617087, -2905867, -2861643, -1863485, -3254549, -8019057, -11864083, -9235755, -525972, 7497950, 9588397, 7559689, 6054756, 5709189, 3869417, 201610, -2464208, -2440381, -914495, 559530, 1404375, 1095906, -264926, -913486, 95029, 280878, -2677639, -5791581, -4127011, 950344, 2727681, -724988, -3663926, -2264450, -751096, -3821103, -8419706, -8546210, -4329243, -434785, 1949993, 5581005, 10860333, 14468132, 14102111, 10487582, 5103851, -403867, -3241970, -1694523, 1956884, 3799658, 2781137, 106034, -3886512, -8463670, -10276358, -7347459, -3726678, -4628432, -8070412]
12221h070412L49419M065761Q14798m765594l684833K571265M478537k44735l926925
12212h412719j710103K321446L570452L239591L332975K349808m85581k356038
12204A849831j756955j466892l204274l757977k71844M252947M805459J240276
12196A690571k260944k765534n82412K768912N680469O364440L903787o90798
12188A4108491n172267p163749n027159K56027M315093L434927m62326k140496
12180B148541m38292Q42952j06979n92975M88353l1696l016174l732797K11494
12171d227573L278213M32211l808679k269591K910656M087067J335080J698606
12163C435990N675962N430875j237754n822183k758772J507241q3572l176463
$$ y = [-8070412, -7720993, -3655232, -2840434, -7606028, -11290861, -8719596, -4241059, -4485794, -8412719, -10122822, -7801376, -4230924, -991333, 2341642, 4691450, 4205869, 1849831, 92876, -1374016, -4578290, -8336267, -8608111, -4355164, 450295, 1690571, -570373, -3335907, -3918319, -1149407, 4531062, 10895502, 14799289, 14108491, 8936224, 1772475, -3254684, -2998657, 1316436, 4751363, 4289037, 2148541, 1710249, 2553201, 2446222, 1853247, 2341600, 2309904, -706270, -4439067, -4227573, -949360, -517149, -4325828, -6595419, -3684763, 402304, 1737384, 3435990, 9111952, 14542827, 13305073, 7482890, 4724118, 6231359, 6147787, 2971324]
12155B971324l13474N097072L776414l797792p685458l860003R07722J027484
12147a876711l56793R17438K772009K052433P07364J580570K782107J480179n26029
12138I532567l07874L24645j875775m785962l568822Q74154K309112j430611m981921
12129c910487l159287K234133N645456M652684J242510j500325j763981L63883
12121C804586K754686K741159P8362k519019k687736j098308P8749Q8667k61252
12112B979894l70428l48805j91616L56093J087903J201430J22206j636075k567023
12103F33579j529411P67974K233979J801129O02259J23882K53689J79782L442
12094E070304r700n37891j696475j693109O34923L075832K712117M24107o69833
$$ y = [2971324, 2657850, 7754922, 11531336, 7733544, 48086, -3811917, -2904195, -1876711, -2233504, -1316066, 1455943, 3508376, 4215740, 5796310, 8578417, 10058596, 9532567, 9224693, 9549338, 7673563, 2887601, -681221, 192933, 2502045, 1071434, -3910487, -7069774, -4835641, 809815, 5462499, 6705009, 5204684, 3440703, 3804586, 6559272, 9300431, 9378793, 6859774, 4172038, 3073730, 3152479, 3241146, 2979894, 2609466, 2260661, 2069045, 2425138, 3513041, 4714471, 4836677, 3200602, 633579, -895832, -127858, 2106121, 3907250, 4509509, 4633391, 4887080, 5066862, 5070304, 5060604, 4522713, 2826238, 1133129, 1768052, 4843884, 7556001, 7980108, 7310275]
12085G310275o60555k565169o258257p156980k659584L708753O587829M424629
12077B730941n46000m806862m758008P30905P003402O904748j9782n757818m389144
12068b907618J58258J213307n11082j26769J778153N60584l017168l120634R14943
12059e058026K813078k3720j860125J455046M818985J996344l739755m316014
12051c914187N96812L437406P50732k150229n38711K261950J115000j914535q70082
12042a225844L822244N185484O34396l290449n92452M779042M621025j436923
12034A2496523n973752m867359j543973N06810K406922M522723L227183k400940
12026H374137o270371l485537J473229J293148k739755l189654J417619M585432
$$ y = [7310275, 6649720, 4084551, -2173706, -9330686, -11990270, -8281517, -1693688, 2730941, 2184941, -2621921, -7379929, -6649024, 354378, 7259126, 7239344, 1481526, -2907618, -2749360, -1536053, -2047135, -2173904, -395751, 164833, -2852335, -5972969, -5058026, -2244948, -2268668, -4128793, -2673747, 2145238, 4141582, 401827, -3914187, -3317375, 120031, 870763, -1279466, -1818177, 443773, 1558773, -355762, -1225844, 2596400, 7781884, 8416280, 5125831, 4533379, 9312421, 13933446, 12496523, 6522771, 1655412, 111439, 618249, 3025171, 7547894, 10775077, 8374137, 2103766, -1381771, 91458, 1384606, -1355149, -4544803, -3127184, 1458248]
12018A458248K017204l052293n746074m928701j523590L150999O013158M192140
12010A581091k35043k052696l20368R51773J59082K37704K073304K095143j125679
12001C364311l859770l616739k677227k247257M65321N345020O215416J62937
11993C152012n799915l973215K722901N561307K470052j358840k516700j941577
11985a683975l45096K081993K595049j088661n504002n050491j52608L666916
11977e480875L801804K098916j84542k754510k874486J519294N928513L775732
11969E829846l137511o036835j771686L427768M131816K129049N44477j036768
11961D080156k559710j479210J809509K827228O31519R7589L003421L902286l77050
$$ y = [1458248, 3475452, 423159, -5322915, -10251616, -11775206, -8624207, -2611049, 1581091, 1346048, -706648, -1027016, -75243, 83839, 321543, 2394847, 4489990, 3364311, -495459, -4112198, -6789425, -9036682, -8571361, -3226341, 2989075, 3152012, -2647903, -6621118, -3898217, 1663090, 4133142, 2774302, 257602, -1683975, -2029071, 52922, 2647971, 1559310, -3944692, -8995183, -9147791, -5480875, -1679071, 419845, 235303, -2519207, -5393693, -3874399, 2054114, 5829846, 2692335, -3344500, -5116186, -1688418, 2443398, 4572447, 5116924, 4080156, 1520446, 41236, 1850745, 4677973, 5309492, 5407081, 8410502, 12312788, 11935738]
11952A1935738m175236k065195J893883J171471k365754k695578n43918j238233
11944A917178m282389m044405J06107K775372J807955Q06439J544045J221590
11936A851892j027353j704865N32096J947150K45024j298030M08214K885536K173618
11927F013282j135366l459323l200848j195713J405470L017926J764098j556342
11919A653184k889168j28520L214817K633550q75138k396032j39761K622105K537836
11910F232873L4273k315487k944094k038947p15306o2113k7564P84391L090390
11901B038416M894291L101701k359122p321957p202154j656626M890890P112856
11893C498295L373130k765687n566186k435788L462535O362368L683570j863935
$$ y = [11935738, 7760502, 5695307, 7589190, 8760661, 6394907, 3699329, 3155411, 1917178, -2365211, -6409616, -6303509, -3528137, -1720182, -913743, 630302, 1851892, 824539, -880326, -348230, 1598920, 1843944, 545914, 954128, 3839664, 6013282, 4877916, 1418593, -1782255, -2977968, -1572498, 1445428, 3209526, 1653184, -1235984, -1364504, 1850313, 4483863, 3608725, 1212693, 1072932, 3695037, 6232873, 6267146, 3951659, 1007565, -1031382, -1746688, -1808801, -1836365, -1051974, 2038416, 6932707, 10034408, 7675286, 353329, -6848825, -8505451, -3614561, 3498295, 6871425, 4105738, -1460448, -3896236, -433701, 5928667, 9612237, 7748302]
11885G748302n675388n501201k132944K338530N528536N341245J831808j805160
11877G673728k420050j219090k198565n578898o334371j594530M023857M638504
11869c009415J921953J896538M315285K735982l690554o679889j287607N320347
11861A522640M246347j592060k765663J442824L029623n10767k426978Q80512
11853C826478L516831O03174l233395k037930J439466J116202j904208k042934
11845A283684O40540J089840j396298k242308j25154P95526j430861k952836n86550
11836d924417L216012M531299L066109O95843j499438k485286j029196J433769
11828C004695J041162k821697n376084k991362J231245K082216j27318r01051
$$ y = [7748302, 2072914, -3428287, -5561231, -3222701, 2305835, 7647080, 9478888, 7673728, 5253678, 4034588, 1836023, -3742875, -10077246, -11671776, -7647919, -3009415, -1087462, 809076, 5124361, 7860343, 4169789, -2510100, -3797707, 1522640, 5768987, 4176927, 1411264, 2854088, 5883711, 5372944, 2945966, 3826478, 7343309, 7946483, 4713088, 2675158, 4114624, 5230826, 3326618, 1283684, 1924224, 3014064, 1617766, -624542, -749696, 45830, -1385031, -4337867, -4924417, -1708405, 2822894, 5889003, 6584846, 5085408, 2600122, 1570926, 3004695, 4045857, 1224160, -4151924, -7143286, -5912041, -3829825, -3957143, -4858194]
11820d858194J075101K610291J775770N30330O51415Q12545m33398j597763o73996
11811a07899J129901R45127r82082j104810J821629L697574M65150m957176n378450
11802d471036M72987N238380L189209j361609r91478K966121K703410l149039
11794D596945p067099m332864O85948K804825L006299L010988M10738m801883
11786a686103n751189J477163R032588P278273n64675l523414K43971K455741
11778H962355m24925k693698j094502j31871k475133l776419j356395N69840r02062
11769c322810j876418N88239K832795K048111J748623L858871L246485k592580
11761F531316o208547j529995M495960K238882m321485l881472L201374N562450
$$ y = [-4858194, -3783093, -1172802, 602968, 1133298, 1784713, 2597258, 2163860, 566097, -107899, 1022002, 1967129, 985047, -119763, 1701866, 5399440, 5864590, 907414, -4471036, -3998049, 1240331, 4429540, 3067931, 2076453, 5042574, 7745984, 4596945, -2470154, -6803018, -6117070, -3312245, -305946, 2705042, 3115780, -1686103, -7437292, -5960129, 3072459, 10350732, 9786057, 6262643, 6506614, 8962355, 8537430, 5843732, 4749230, 4617359, 2142226, -1634193, -2990588, -2420748, -3322810, -5199228, -4610989, -1778194, 269917, 2018540, 5877411, 9123896, 6531316, 322769, -1207226, 3288734, 5527616, 1206131, -2675341, 526033, 6088483]
11753F088483l34561n347217l512224l06244r49726j548435K018702N383882L071303
11744D563963j974101l362577r88512Q53067J396300K909650M554716K891504
11736A0844010k063678n963297n482099j576977K389249L631765J604564j602721
11728A780816l046449j983072j89106Q93227J357133J026507p46773k741178k293180
11719e942075P09958K944666J966950j016950l450192l826648j440537K946405
11711g108423N816747M176075O08310M80919L361612K847947l151213q053681
11703a021707n988925r2160K978141K210316J056978Q27260L65565k60375k11351
11694a36258p508O7901J074473K235955M95446l615082m436614K99939M572587
$$ y = [6088483, 5753922, 406705, -3105519, -3411763, -4361489, -5909924, -3891222, 1492660, 4563963, 2589862, -772715, -1761227, -908160, 488140, 3397790, 7952506, 10844010, 8780332, 2817035, -2665064, -4242041, -1852792, 1778973, 3383537, 1780816, -1265633, -3248705, -3437811, -2544584, -1187451, -160944, -907717, -3648895, -5942075, -5232117, -2287451, -320501, -1337451, -4787643, -8614291, -10054828, -7108423, -1291676, 2884399, 3492709, 3973628, 7335240, 10183187, 7031974, -1021707, -7010632, -7102792, -4124651, -1914335, -857357, -30097, 335468, 75093, -136258, -143766, -75865, 998608, 3234563, 3730009, 114927, -4321687, -4021748, 550839]
11685E50839L026444m11847M04832L069237J206231l833061n148067k055727j46404
11676c337523m75386J472831N518179N413810r196l575151j229213J583017l27693
11667E033675l166010j130450L532449M041750p13477n390098n860653k977852
11659f630666L92393K475919K961091K438787J416033m56977k998963l904848
11651d307231j264231K617989L456169J083469p35495p48796j508948l357160
11643d764234k773570J150650M088624L222765J378892J084282l5670l527407
11635a75668n147332j522498K623917R94125l473110k320942M724189Q055803
11627C758484K130053n983611o285308O06990N122126K139452k958386k922178
$$ y = [550839, 3577283, 3165436, 3570268, 6639505, 7845736, 4012675, -1135392, -3191119, -3337523, -3812909, -2340078, 3178101, 8591911, 8582715, 5007564, 3778351, 5361368, 5033675, 1867665, 737215, 4269664, 8311414, 7597937, 2207839, -3652814, -6630666, -6238273, -3762354, -801263, 1637524, 3053557, 2596580, -402383, -4307231, -5571462, -2953473, 502696, 1586165, 850670, 101874, -1407074, -4764234, -7537804, -6387154, -2298530, 924235, 2303127, 3387409, 3351739, -175668, -5323000, -6845498, -4221581, -3227456, -6700566, -9021508, -4297319, 3758484, 5888537, -95074, -6380382, -5773392, -651266, 1488186, -1470200, -4392378]
11619d392378J189230K522399p86441k841756O24495N253624M469828q09428m285792
11610I43781l764753k320842j263220J070658L524378K513605p53509j039245
11602a089147J286232j41638n555373o127077J559848P702412L760894l825709
11594b429558m223050P70887J901417r46863o45628J987549n84848o675289n580863
11585a6426246L714913Q505023K346412m319154j371185N089317M325620j250934
11577F13766k154716J090187L64361m053105l565474K822613N546773K88230m536461
11568c583826j306104M957919N220184J79481k566101r50000K21993j245741j945379
11559a017574m6582J213991m27340j963983k14109K591133K230003r34506k840565
$$ y = [-4392378, -3203148, -680749, -1467190, -4308946, -3684451, 1569173, 6039001, 5229573, 943781, -2820972, -5141814, -6405034, -5334376, -1809998, 703607, -49902, -1089147, 197085, 55447, -5499926, -11627003, -10067155, -2364743, 1396151, -2429558, -6652608, -5881721, -3980304, -4927167, -5572795, -3585246, -4170094, -10845383, -16426246, -12711333, -4206310, -1859898, -6179052, -7550237, -2460920, 1864700, 613766, -1540950, -450763, -86402, -4139507, -7704981, -4882368, 664405, 952635, -3583826, -4889930, 67989, 5288173, 5467654, 2901553, 1951553, 2173546, 927805, -1017574, -1064156, 149835, -277505, -2241488, -2455597, 135536, 2365539, 1431033, -1409532]
11550a409532j836880P4908J529558L219728M620831L314114q74907m343822m326080
11541c2082k359449j107292m53344N80161N83137j969978m792027m012492K65637
11532a3297729M182457N575224N571764M689792J500400l463319o157207l866592
11524e265210P66727L019121J820099m4793k93261O83105J588358J934064J554050
11515E762260J9127k441737m133804l196263M560K595116K177777k86236j753740
11506a252940j086231m3683q179j153Q20500J084497j82085q95380J133851L945548
11496C514745L589500M2936k514208j578206P36759J364207M6692j631651k593822
11487I76952k437339j070010P41277J696943J352682K11057j204023k029655q81115
$$ y = [-1409532, -3246412, -3171504, -1641946, 1577782, 6198613, 9512727, 8637820, 4293998, -32082, -2391531, -3498823, -3952167, -3372006, -2788869, -4758847, -9550874, -13563366, -13297729, -9115272, -3540048, 2031716, 6721508, 8221908, 4758589, -1398618, -5265210, -4498483, -1479362, 340737, 295944, 2683, 685788, 2274146, 4208210, 5762260, 5781387, 3339650, -794154, -3990417, -3985857, -1390741, 787036, 500800, -1252940, -2339171, -2382854, -2391033, -2392186, -1571686, -487189, -669274, -1564654, -430803, 3514745, 7104245, 7147181, 4632973, 3054767, 3791526, 5155733, 5202425, 3570774, 976952, -1460387, -2530397, -1789120, -92177, 1260505, 1471562, 267539, -1762116, -2643231]
11478b643231J883621L026326N33620k435946j568523J720130K281695l54821
11470B442871j414658O54673J641806m50168j549484P84425K178075r65728m281415
11461i59603k201451K459422K876851p88742k379866j85773J271543k07837j437038
11452a552494m42285L84556m15798o69490N83915P34160j327788k491258o60841
11443e857323J555172J502067Q77549K038616L528039L109139J999341J808813
11435A0561413K68237m771057r227490o916475N49061M318889L62061m644456
11427i499817k685248M682554R157539O770199J305586k306430l165873k406686
11419A851824m10110J950467K415568K09074k260058k738100k099900j680858
$$ y = [-2643231, -759610, 2266716, 2800336, 364390, -1204133, 515997, 2797692, 2442871, 1028213, 1682886, 3324692, 2874524, 1325040, 2109465, 4287540, 3321812, -959603, -3161054, -701632, 2175219, 1386477, -993389, -1179162, 92381, -115456, -1552494, -1994779, -1610223, -2026021, -2695511, -2111596, -1377436, -2705224, -5196482, -5857323, -4302151, -2800084, -1922535, 116081, 3644120, 6753259, 8752600, 10561413, 10829650, 6058593, -3168897, -10085372, -9536311, -5217422, -4855361, -9499817, -12185065, -7502511, 1655028, 8425227, 9730813, 7424383, 4258510, 1851824, 1441714, 3392181, 5807749, 6016823, 3756765, 1018665, -1081235, -2762093]
11411b762093j89584L210693M982093J285183m953855o536959j969509K578257
11403d355774K631621R77111J291405J958178L87886j388718n37791J042935L86351
11394B393204p09213O90175K168242l65219m701253n024254j253450J394335J300133
11385d107300J397998J627187j274694n678970n425905k74103K642678O92907
11377a0400202P8007M030781O002577J092179m276426k556484K044227P68799
11369c216542m668243n056495J034953N728500M978991L147847L416761K839270
11361H205042n14666l157682k148914M88962K048015K638116K255054m08255l969750
11352E435922m297946q44303J872389J415936Q22818K100201J979608j795402
$$ y = [-2762093, -2951677, 259016, 5241109, 6526292, 1572437, -4964522, -6934031, -4355774, -1724153, -747042, 544363, 2502541, 2890427, 1501709, 963918, 2006853, 2393204, 1683991, 2374166, 4542408, 4177189, -524064, -5548318, -6801768, -5407433, -4107300, -2709302, -1082115, -2356809, -8035779, -13461684, -13735787, -11093109, -10400202, -10322195, -6291414, -288837, 803342, -3473084, -6029568, -3985341, -3216542, -7884785, -12941280, -11906327, -6177827, -1198836, 1949011, 5365772, 8205042, 7690376, 4532694, 2383780, 2872742, 4920757, 7558873, 9813927, 9405672, 5435922, 1137976, 293673, 2166062, 3581998, 4404816, 6505017, 8484625, 6689223]
11344F689223n002409k896309K088704L914765J582247r66176j642455j691419
11336B076171j415482L94537K585628J797954k220782m907298k422818L104461
11328a007629N829492L062552j601791k647798M87922K671551K02881l551895
11320C445285k835837J605098L243909j99166l127683r98106K505990J651525
11312E291015k231262l464966j132803O70195L65272M00985J280574K89011k485284
11303a017263k636007J413259M669385K669563j498151j781553J722477L358379
11295F900089Q07098j883771j322016o7349j697120l903256j472737M661130O874344
11286H896412J390495n303448m885949R72451L165734j220877m747360j341275
$$ y = [6689223, 1686814, -1209495, 879209, 4793974, 6376221, 5410045, 3767590, 2076171, 660689, 1055226, 3640854, 5438808, 3218026, -1689272, -4112090, -1007629, 4821863, 7884415, 6282624, 3634826, 4122748, 6794299, 6997180, 3445285, 609448, 2214546, 5458455, 5259289, 2131606, 1133500, 3639490, 5291015, 3059753, -405213, -1538016, -867821, -502549, -101564, 1179010, 1468021, -1017263, -3653270, -2240011, 2429374, 5098937, 3600786, 1819233, 3541710, 6900089, 7707187, 5823416, 4501400, 4434051, 2736931, -1166325, -2639062, 2022068, 8896412, 10286907, 4983459, 97510, 1069961, 4235695, 3014818, -1732542, -3073817]
11278c073817M169001L387659k934596o186196k508321K560831L022332J60077
11270a403030j403104q92015o02869o80653P63976L179336L520689J284677j24288
11261C642719J223286K197423o56311m997075n346645j187774K130302J446589
11253a547486L3075J255477K567964M10426k404427n58498M037150L652879l198786
11244D247774q163914m629406K951711N844805K769837m87816m58383O77703L19399
11235C071710r02112j300914n74882P71656K214564K839626J752329o88097k832211
11226D351669l030980r90664J467661J556016r04929j952651J499135N903221
11218G898478M853502j323633n480741m438178l129006m940903n233726P3301
$$ y = [-3073817, 1095184, 4482843, 1548247, -4637949, -7146270, -4585439, -1563107, -1403030, -2806134, -3698149, -4301018, -4981671, -4217695, -1038359, 2482330, 3767007, 3642719, 4866005, 7063428, 6407117, 1410042, -3936603, -5124377, -2994075, -1547486, -1514411, -258934, 2309030, 2719456, 315029, -243469, 3793681, 7446560, 4247774, -3916140, -8545546, -5593835, 250970, 3020807, 2532991, 2074608, 2752311, 3071710, 2169598, 868684, 293802, 1065458, 3280022, 6119648, 7871977, 7183880, 4351669, 1320689, 330025, 1797686, 3353702, 2448773, 496122, 1995257, 7898478, 12751980, 11428347, 5947606, 1509428, -1619578, -6560481, -11794207, -11720906]
11210a1720906N999005N756696J296706j272636k161993m772037o024695o36326
11202a3536186O888230O298903j903134n750218j10992N765641L720641j012601
11194C60284q6326M196609M253998L18362j097246J477111L095059J027396k131183
11185A1414064l646030l563146k605671j322324r20113j665181j581159K58479
11177c631081J170972q10721k484785n6962L779167L057500j819646l772970N17675
11168d050851N419408M296635j445406m848218k646452J586127K975363J071837
11160B358443q09658k90878J585743K393122J440717p5211j253188k277099l036335
11151C5656k556459m90923J864732K741703J544113p84362k405742j936741j05508
$$ y = [-11720906, -5721901, 34795, 1331501, 58865, -2103128, -6875165, -12899860, -13536186, -6647956, -349053, -2252187, -8002405, -8113397, -2347756, 1372885, 360284, 273958, 4470567, 8724565, 9042927, 7945681, 9422792, 12517851, 13545247, 11414064, 7768034, 4204888, 1599217, 276893, -643220, -2308401, -3889560, -3631081, -2460109, -3270830, -5755615, -5812577, -2033410, 1024090, -795556, -4568526, -4050851, 1368557, 5665192, 4219786, -628432, -3274884, -1688757, 1286606, 2358443, 1548785, 1257907, 2843650, 5236772, 6677489, 6602278, 5349090, 3071991, 35656, -2520803, -3011726, -1146994, 1594709, 3138822, 2354460, -51282, -1988023, -2093531]
11142b093531N90681p70709j558344Q81056M627953N142745J581696k119545k808859
11133C473143j436521r2978Q18139J113718k48598k936817m442010l187538m22618
11124g362080J959265L173156K566160o8175k438634j496119J720521K761746
11116H15840N68593p09705J421250L762409K971070N94274p96601j998117l654498
11107B974515k805088J921388N476434K762799k920741m194071n62566J627487
11099D280157m66988k755900j984722n26174j013897j377492J254274N019692
11091B428950N386109J370670l078321l697957l40914L340225L879383J206104
11083A0494249k176986m349388m910174l359004O52690M757635M799268L47165
$$ y = [-2093531, -1502850, -2273559, -3831903, -2950847, 1677106, 6819851, 8401547, 6282002, 3473143, 2036622, 1943644, 2761783, 3875501, 3626903, 690086, -3751924, -6939462, -7362080, -5402815, -2229659, 336501, 268326, -2170308, -3666427, -1945906, 815840, 1384433, 674728, 2095978, 5858387, 8829457, 9423731, 8627130, 6629013, 2974515, 169427, 2090815, 7567249, 10330048, 7409307, 3215236, 2652670, 4280157, 3813169, 1057269, -927453, -1453627, -2467524, -3845016, -2590742, 2428950, 7815059, 9185729, 6107408, 2409451, 2068537, 5408762, 9288145, 10494249, 8317263, 3967875, -942299, -4301303, -3648613, 1109022, 5908290, 6255455]
11075F255455l544809k758671K95784Q12876j034821j215952R16716J475003j349044
11066a47463l952644k642618P79955J624419q19197k062305J212653N850995N892561
11057E736356J009286k406705k70384K975478J167613l735441m670663p22899
11049i17359J888774K28697j656314j071709p67340j758061j93276M213178M749246
11040D715836j364374o357194l575257J504030P98995k433181j8755N664166N043161
11031C977427k005748n447525j355520K876358J741285o50545L20007K145963
11023A601702J247967o57332p35314K44115J008132K309283L418750J465901k963474
11014F939730m947141k591676J46377M87746P74375K491811K595168l85756k504492
$$ y = [6255455, 2710646, -48025, 247759, 1060635, 25814, -1190138, -273422, 1201581, -147463, -4100107, -6742725, -5962770, -4338351, -5157548, -7219853, -6007200, -156205, 5736356, 6745642, 4338937, 4068553, 7044031, 8211644, 4476203, -194460, -917359, 971415, 1200112, -456202, -1527911, -2295251, -4053312, -4246588, -33410, 4715836, 3351462, -3005732, -6580989, -5076959, -4277964, -6711145, -6729900, -1065734, 3977427, 1971679, -3475846, -4831366, -1955008, -213723, -864268, -544261, 1601702, 2849669, 2192337, 1457023, 1701138, 2709270, 5018553, 8437303, 9903204, 6939730, 1992589, -599087, -452710, 35036, 809411, 3301222, 5896390, 5510634, 3006142]
11005C006142j121904K9058k433408m738232j800210L864370N271215R47772l672938
10996f48135l863406l70762K848019K678422o12080l077898r86124L749068M941003
10987D658107O00816l730522k741702J414212L144236J237368j357415k732885
10979D92215k801431j124431J946275L756384K636874Q01303N12292j19476l259055
10970B840950n782126l049241L047558N579709K132858k472437l707982k435793
10962c846504r84988Q41296L045825K933900p24287l791799j498188M151883O204479
10953F331617K145516k845954l496572j276316o67200j867440j750208l39039
10945c765596q31321l076653k697246J545799M816206L571117J023061J355730
$$ y = [3006142, 1884238, 1913296, -520112, -5258344, -7058554, -3194184, 2077031, 3024803, -648135, -4511541, -4882303, -2034284, 644138, 32058, -3045840, -4031964, -282896, 4658107, 5258923, 1528401, -1213301, 200911, 3345147, 4582515, 3225100, 492215, -2309216, -3433647, -1487372, 2269012, 4905886, 5707189, 6219481, 6100005, 2840950, -2941176, -5990417, -2942859, 2636850, 4769708, 2297271, -1410711, -3846504, -4831492, -3990196, -944371, 1989529, 1265242, -2526557, -4024745, 127138, 6331617, 8477133, 5631179, 2134607, 858291, 191091, -1676349, -3426557, -3765596, -4596917, -7673570, -10370816, -8825017, -4008811, -437694, 585367, 1941097]
10937A941097K886302J811025r37592j948072j367984j150238k48427K414027
10929C400138L212013r66273n518512m119568M03806L51977l356551k723172K440724
10920f875418L280622k137210m159243K117500P678223M165779k720084l401890
10912b051721O24898J977453N07894O70858J238766j453507m051213j070310L556927
10903d9955J290207n857098o644806J890151R222682O739130r66295m581587k449943
10894a407514N92382J414813O44756k95937m53682M34748J024933k77882k226852
10885e50235j767665J250532L589251L438416K285453J327118k43170k339226
10877F990474l103102k320967k274294l652443l863785j131841K614244M598986
$$ y = [1941097, 4827399, 6638424, 5700832, 3752760, 2384776, 1234538, 986111, 3400138, 6612151, 5645878, 127366, -3992202, -3588396, -3236419, -6592970, -9316142, -6875418, -3594796, -5732006, -9891249, -7773749, -95526, 4070253, 1350169, -2051721, -1426823, 550630, 1058524, 1729382, 2968148, 1514641, -2536572, -3606882, -49955, 1240252, -4616846, -11261652, -9371501, -148819, 6590311, 5624016, 1042429, -1407514, -815132, 599681, 1244437, 948500, 494818, 929566, 1954499, 1676617, -550235, -2317900, -1067368, 2521883, 5960299, 8245752, 9572870, 9329700, 6990474, 3887372, 1566405, -707889, -4360332, -8224117, -9355958, -6741714, -2142728]
10869b142728M347574K598878j60153k545086k429148q7566J265903l5915j427609
10860f15850m2853K719046L098801K29743k937031l561834j889120j42671L25365
10851b816404J56437M90350J098012J007981P41173J852223L521072K402861k041462
10842F412243n054203k961745O02600k10799m039856m251314J85136K977978J063710
10833e276250n57007K080542M920260L191337k04868j84216J288558q12303m448815
10824b762l053928K807215N102468P11154m003106l478778l91624Q06904R97405
10815e05052K221657K253307q13622l131806o13627L567550L518637j7626j692047
10806D787371q96673j579639l627967k415397K364264N040358K919262j50107
$$ y = [-2142728, 2204846, 4803724, 4643571, 2098485, -330663, -418229, 847674, 811759, -615850, -658703, 2060343, 5159144, 5388887, 2451856, -1109978, -2999098, -3141769, -2816404, -2659967, -2169617, -1071605, -63624, 677549, 2529772, 6050844, 8453705, 6412243, 1358040, -1603705, -1001105, -1211904, -5251760, -9503074, -9317938, -6339960, -5276250, -5833257, -3752715, 1167545, 4358882, 4154014, 3969798, 5258356, 4446053, -2762, -3056690, -249475, 4852993, 5564147, 1561041, -1917737, -2309361, -1502457, -505052, 1716605, 3969912, 3156290, 24484, -589143, 2978407, 6497044, 6479418, 4787371, 3890698, 2311059, -1316908, -3732305, -1368041, 3672317, 6591579, 6441472]
10798F441472j384890l089272n907588n258612P69014O158168N168178P70500
10790C666970q02209N29610P73293m78950q92481r38381k264386k909947l79175
10781c695656K557449J433864k183545k880121q8363J737319Q64386n9407K20941
10772b093133J30636l75746M13991J763181J189796q26317j725299j640239k154105
10763e317235j717011J700199M841799K928542j863665l038374r9601J680688
10755h84658J208017K325028M400094J997808m344006o915341l289308k32853
10747e735219j424760j249355L814970P222171L020318l453988l701359J115374
10739c91848L554436J619736n83381q02896m35457m11670o24857j561161k533881
$$ y = [6441472, 5056582, 1967310, -3940278, -9198890, -8429876, -2271708, 2896470, 3666970, 2864761, 3394371, 4167664, 3688714, 2796233, 1857852, -406534, -3316481, -3695656, -1138207, 295657, -1887888, -4768009, -4856372, -3119053, -2254667, -2314074, -2093133, -1962497, -2338243, -1924252, -161071, 1028725, 202408, -1522891, -3163130, -5317235, -7034246, -5334047, -492248, 2436294, 572629, -2465745, -2565346, -884658, 323359, 2648387, 7048481, 9046289, 4702283, -2213058, -5502366, -5735219, -7159979, -8409334, -4594364, 2627807, 5648125, 2194137, -1507222, -391848, 3162588, 4782324, 4198943, 3396047, 2960590, 2548920, 1924063, 362902, -2170979]
10730b170979r59829L132270N281594K837448o92173j188227L4534m54426k483591
10721C336621l550910k589083K04434L629804M007335j300904p370710n721698
10713i355111K702222O833944J615561m314650k745883J772967J666084m35844
10705b260710J656995M856817K144419l816123m048792J967187N498303J856969
10697G855065m452031p652342o261433j330211M174006N290261O18196l684504
10689e442993j539594L799131M715345P52564k242972k155156j748999j353470
10681e216144J358758M780543M357836M90488j415049O14848K558103Q80298l235850
10672E173831o248718n166443O05227O886549O954433Q6861n910026n210057j969879
$$ y = [-2170979, -3130808, 1462, 5283056, 8120504, 7428331, 6240104, 6274638, 5820212, 3336621, -214289, -2803372, -2598938, 1030866, 5038201, 3737297, -3633413, -9355111, -6652889, 181055, 1796616, -2518034, -5263917, -3490950, -1824866, -2260710, -603715, 4253102, 6397521, 2581398, -1467394, 499793, 5998096, 7855065, 3403034, -4249308, -10510741, -11840952, -7666946, -2376685, -1758489, -5442993, -6982587, -3183456, 1531889, 2284453, 41481, -2113675, -3862674, -5216144, -3857386, 923157, 5280993, 5771481, 4356432, 4971280, 7529383, 8409681, 5173831, -1074887, -6241330, -5636103, 1250446, 8204879, 8291740, 2381714, -2828343, -4798222]
10663d798222k080520l001724R1285L678232J525933l199407k448844K819821
10655g413446M592378J928758J386189L844914L108748j184749j382943M354821
10647I234670P219179J529403o046771o692186j446938K660442K793678J230675
10639A0482152N0809n40842p96556j052081j310802o32037J183407K239921J528078
10630A1152049J216114K420406J750892k913083o640605m119076Q69343N92444
10622D328484m117306n370553j318827J677287N56083j12287K509929M263361
10614B416171J524973k749899m163635k849962j160852L98008K161915L321913
10606a101368K946620J140498j175306k151951p4300L466081L973967K09541l378930
$$ y = [-4798222, -6878742, -9880466, -9789181, -6110949, -4585016, -7784423, -10233267, -7413446, -2821068, -892310, 493879, 4338793, 7447541, 6262792, 4879849, 9234670, 16453849, 17983252, 11936481, 5244295, 3797357, 6457799, 9251477, 10482152, 10532961, 9992119, 9195563, 8143482, 6832680, 6200643, 7384050, 9623971, 11152049, 12368163, 14788569, 16539461, 13626378, 6985773, 2866697, 3736040, 4328484, 211178, -5159375, -6478202, -4800915, -4244832, -4357119, -1847190, 2416171, 3941144, 1191245, -2972390, -5822352, -6983204, -6585196, -4423281, -1101368, 1845252, 2985750, 1810444, -341507, -415807, 3050274, 7024241, 7233782, 3854852]
10597C854852l385505k302863k904282k940360l23811J808130R06725L48098K789115
10588b149901M169540J245504j228367J389903M748398L098942p44018j744406
10580H785595j863454l715997l057415K022017L335865l915287r412868l559291
10572a1380835M728257K657466l473125L95703R589012P869618l676891q323980
10564a614775k337708J473942j057844k27150N415340M944723k645600m377104
10556d26176K770497N330998k333964p865512l172658K589147J173443j783306
10548c717531j023468j711611o004310n836704J688417O906292M043590L13597
10540e341728J069775J100150k013819j619066L487081M234606j484238l081932
$$ y = [3854852, 469347, -1833516, -4737798, -7678158, -8001969, -6193839, -5287114, -4939016, -2149901, 2019639, 3265143, 2036776, 3426679, 8175077, 11274019, 10530001, 8785595, 6922141, 3206144, 148729, 2170746, 5506611, 1591324, -7821544, -11380835, -6652578, -3995112, -7468237, -7072534, 2516478, 10386096, 6709205, -1614775, -3952483, -2478541, -3536385, -3763535, 1651805, 6596528, 3950928, -426176, 2344321, 7675319, 5341355, -2524157, -5696815, -3107668, -1934225, -3717531, -4740999, -6452610, -12456920, -18293624, -16605207, -9698915, -5655325, -5341728, -4271953, -3171803, -5185622, -6804688, -3317607, 916999, -567239, -3649171]
10532c649171L345083O539780k89947p462783n572740P10960L946188M648048
10524B215418L769555q96850n305779j704852N454921L573774n288609n868989
10516d051411L076579N960442j173201m398647N11485Q55750o061996o561846
10508a1842845J546898L753886j346912J548625J1217188Q134106o277453p864039
10500a130546L993290L005504j0672162o022557J5347649J2762910j4552119j3905434
10492a1173465K1604644K4234282k2411723k0999877Q4520341J73542565R6692729
10485C46009496q8847193j76902917r5108776J5435402K5401550j9613058j9924127
10478a3549623J6136300K0856394n540301j2720207L009085N039077q812993r500810
$$ y = [-3649171, -304088, 6235692, 5945745, -1517038, -7089778, -6378818, -2432630, 2215418, 5984973, 5088123, -217656, -1922508, 3532413, 7106187, 1817578, -4051411, -974832, 4985610, 3812409, -586238, -74753, 780997, -5280999, -11842845, -10295947, -6542061, -7888973, -6340348, 4876840, 13010946, 6733493, -1130546, 2862744, 5868248, -4803914, -10826471, 4521178, 17284088, 2731969, -11173465, 10431179, 34665461, 12253738, -8746139, 75774202, 249316767, 346009496, 257162303, 80259386, -14849390, 586012, 25987562, 6374504, -13549623, 2586677, 23443071, 17902770, 5182563, 8191648, 13230725, 4417732, -5083078]
10470e083078L446456N178693m593176n399301K037135J501073k984109K986218
10462b910089J0973073M055925q048724m865422O139346L320509q040415n671322
10454e047119P535945Q583735l993948r374182k430074J348228k115523o37939
10446f130877O232035M639759n527203p921946J143659O458369J186721l376094
10438c295577m55534J729955j827505l829998j85355K392289K05245r86730J512840
10429d740370J916265k269941m983356k195812K312889M472751M465206K741872
10421A719504m12862j862401K71409J807061o45173k443595Q49323L823101J29536
10412C235903n125293l594784J721660K777460J423558M185162P499807L243696
$$ y = [-5083078, -1636622, 3542071, -1051105, -6450406, -4413271, -2912198, -5896307, -2910089, 8062984, 12118909, 4070185, -795237, 5344109, 8664618, 624203, -5047119, 2488826, 11072561, 7078613, -2295569, -4725643, -3377415, -5492938, -6130877, 101158, 4740917, -786286, -8708232, -7564573, -1106204, 80517, -3295577, -3751111, -2021156, -3848661, -7678659, -7864014, -5471725, -5266480, -6253210, -4740370, -2824105, -5094046, -10077402, -12273214, -9960325, -5487574, -1022368, 1719504, 1306642, -555759, -284350, 1522711, 877538, -1566057, -716734, 3106367, 3235903, -1889390, -5484174, -3762514, -985054, 438504, 4623666, 12123473, 15367169]
10404A5367169n029711o663127j794161K37860k108551k073084R24625J193890
10396E4910l26928K189695O046096L177482m075245n294010J60852K560808o89619
10387C804041k034270Q07957J498197j030781k26246L940754L150308l439917
10379F470043n867609m40926L552736q4250m389228k099421K511124K311278j010363
10370I53384j458830J544095M131482L899934P76014l660070n589219k569913
10362a973123J428288L74519m274928n114781k5504N411908O941817N496981K002260
10353A0267437l473947p110032m554504N92838M45772m228040m407411K201879
10345a0266008O860551L809543j158986j022987J956631J914095q57664j863866
$$ y = [15367169, 10337458, 3674331, 1880170, 2118030, 9479, -2063605, -1138980, 54910, -272018, 1917677, 7963773, 11141255, 7066010, 1772000, 1932852, 4493660, 3804041, 1769771, 2577728, 4075925, 3045144, 2818898, 6759652, 9909960, 6470043, 602434, 161508, 3714244, 3629994, -759234, -2858655, -347531, 1963747, 953384, -505446, 1038649, 5170131, 9070065, 9846079, 6186009, 596790, -1973123, -544835, -170316, -4445244, -9560025, -9585529, -4173621, 2768196, 8265177, 10267437, 6793490, -316542, -4871046, -4278208, -3832436, -8060476, -12467887, -10266008, -3405457, 404086, -754900, -1777887, 178744, 2092839, 1235175, -628691]
10337f28691N7610K194612K458129J094027m52442q83072o41628j709401l926780
10328b437636l717971L44141L811552K670976r6641K16170J966530R63618j405854
10319B314885j432293q19622k747463l855563K58833M891721K462206l656074
10311b583370l508567K646137M767829L29516k211918Q42522K504889j225664
10303A561374m092300j349168K011026R22697j083115P82488M178606M529948
10295G461556K108697n69419k786641l443675o49260L560175M072941N60077j918501
10286H395950j735294k542063m576913k941143K514839M652049M88248l449985
10278H05688j979437P93016j76107k227624q65771K186163K900974J634181O04487
$$ y = [-628691, -571081, 1623531, 4081660, 5175687, 4723245, 3840173, 3198545, 1489144, -2437636, -6155607, -5811466, -1999914, 671062, 574421, 790591, 2757121, 3720739, 2314885, 882592, 62970, -2684493, -6540056, -6281223, -1389502, 1072704, -2583370, -6091937, -3445800, 1322029, 1651545, -560373, 282149, 2787038, 1561374, -2530926, -3880094, -1869068, -946371, -2029486, -1246998, 2931608, 7461556, 9570253, 9000834, 6214193, 2770518, 2121258, 5681433, 9754374, 10314451, 8395950, 6660656, 4118593, -458320, -3399463, -884624, 3767425, 4255673, 805688, -1173749, -380733, -556840, -2784464, -3650235, -1464072, 1436902, 3071083, 3675570]
10269C675570m60618j739553j378182R0472j016246m307333l828526K016275O057012
10260h91129L163848j359326n57941L156966L162151q8414r33176J364162K074912
10251I092053n75148k986465k348050m20509l61243k561800m282242k598819J866011
10242e176212M655976K776866q71218j579932J56660M11802q39829l44442J300719
10233D90390M36847j796400n86463K824224J741266l624207m392279K481217P883564
10224E458159M499446k096677l513271j517946k339445m586776k532728K598071
10216d031167L921989l00193m726230m970612j817397J691251K907530O87616
10208f637213k646141k601799J314843L990874K263104k09964N80535K393849
$$ y = [3675570, 3214952, 1475399, 97217, 187689, -828557, -5135890, -8964416, -6948141, -891129, 2272719, 913393, 355452, 3512418, 6674569, 6586155, 5652979, 7017141, 9092053, 8516905, 5530440, 3182390, 2761881, 2400638, -161162, -4443404, -7042223, -5176212, -520236, 2256630, 1385412, -194520, -37860, 373942, -465887, -810329, 490390, 927237, -869163, -1455626, 1368598, 3109864, -514343, -4906622, -2425405, 5458159, 9957605, 7860928, 4347657, 2829711, 490266, -4096510, -6629238, -4031167, -109178, -409371, -5135601, -10106213, -11923610, -10232359, -7324829, -6637213, -9283354, -11885153, -10570310, -6579436, -4316332, -4526296, -3945761, -1551912]
10200a551912J456439o45366l52359J281807J060130m23690p47220o11285j586112
10191b119568j913440J76826K100983J325174P02490L269167N191622J335834
10183A0069088m676326m461675J824202M814812j57353o346015n899085n81480
10175e413832K267050M73912j221629J039774M663383M029624j957274p605081
10167c724073o718990j13462N468218N778229L185161J523811P75597o03461j614324
10158C956706p84453J13456j405788l731337l110889J81523J834584O8345j673045
10149d550898j48973K653382K575390l23385j785083O7258J608168n60269l522771
10140c987181k054806K487339L205351j432087m402970j162558K891693J572028
$$ y = [-1551912, -95473, -740839, -1093198, 188609, 1248739, 825049, 77829, -533456, -2119568, -4033008, -3856182, -1755199, -430025, 272465, 3541632, 8733254, 10069088, 5392762, 931087, 2755289, 7570101, 7412748, 1066733, -4832352, -5413832, -3146782, -2672870, -3894499, -2854725, 1808658, 5838282, 3881008, -3724073, -10443063, -10556525, -5088307, 689922, 3875083, 5398894, 6174491, 5571030, 3956706, 3172253, 3285709, 1879921, -1851416, -4962305, -4780782, -2946198, -2877853, -4550898, -4699871, -2046489, 528901, 205516, -1579567, -1512309, 95859, -464410, -3987181, -6041987, -3554648, -349297, -1781384, -6184354, -7346912, -4455219, -2883191]
10132b883191j707416m10760L308697K676647j325861k081855K37492l92567l192256
10123e771070r86231N581601O781738o0102n376194l077138M46550o40647j233615
10114d335108L556108P216946K295212n839600o719015p33202L195643J935757
10106E72741J27566L92582P15382L16573M90342M92334j207102k863606j968684
10097b931872L0087L07991m43378j77395M04978J75379M52045J486712N24881
10088a70572k423915k435786J788641L750844l23020l864701o19491M174700K746472
10079B623172j585358r00667K560366P40801m632413m228335K345023N418360
10071B340949J381332k516880j563662j97206j884489k762282K33477L434880
$$ y = [-2883191, -4590607, -5001367, -1692670, 983977, -341884, -2423739, -2186247, -2578814, -5771070, -6757301, -1175700, 5606038, 5545936, 169742, -2907396, -2460846, -3101493, -4335108, -779000, 6437946, 8733158, 2893558, -3825457, -4558659, -1363016, 572741, 700307, 1092889, 1808271, 2124844, 2615186, 3107520, 1900418, -963188, -2931872, -2901785, -2593794, -3037172, -3214567, -2809589, -2634210, -2182165, -695453, -170572, -2594487, -5030273, -3241632, 509212, 186192, -3678509, -4298000, -123300, 2623172, 1037814, 137147, 2697513, 3438314, -1194099, -5422434, -3077411, 2340949, 3722281, 1205401, -358261, -555467, -2439956, -5202238, -4968761, -1533881]
10063a533881L021492O36479r76056j665601q21452K803664O176900L894027k792164
10054H743408o041299k927185N72046j10615j617310k53624J466858O78350j48911
10045C61718J296088J856233j260586m366297k862528J142515K553764J362185
10037H3092J306114K801249K684531j13420l158691m293730l494498j505723P06556
10028d984520J689538P96276o99551j068839l0163J382950J744609N5551k638577
10019c752726k998113N60798M256511L210864r70553j858144J817856L665584
10011C932077k95532m682482k482301M277786P239945L244984k332194l843860
10003E058423k316585k271902m453159m766341m76128M919771N341849L01143
$$ y = [-1533881, 1487611, 2124090, 1148034, -517567, -1339019, 1464645, 7641545, 11535572, 8743408, 2702109, -225076, 346970, 236355, -1380955, -1634579, -167721, 510629, 361718, 1657806, 3514039, 2253453, -2112844, -4975372, -3832857, -1279093, 83092, 1389206, 4190455, 6874986, 6761566, 3602875, -690855, -4185353, -5691076, -4984520, -3294982, -2498706, -3198257, -4267096, -4297259, -2914309, -1169700, -1114149, -3752726, -6750839, -6190041, -1933530, 1277334, 306781, -1551363, 266493, 3932077, 3636545, -1045937, -3528238, 749548, 7989493, 11234477, 8902283, 5058423, 2741838, 469936, -3983223, -8749564, -9225692, -4305921, 1035928, 1337071]
9995A337071l747305j840146K846297M097918J785478R07107K715117K766803
9987A0868340j244404n239577m828615j367441J078392J553267J669624J534160
9979D023746j87705k877401l610081q47508K962607L628085K71582k774107q69666
9970b80448M277843N892240J245100m274536m955761k606026k117832k886378
9962e705798r59573K586348K749870n83221k246493n91502N56772j63463P44182
9953c612878L837793L948052j162065n865297m873895r18709N39900l88058j49919
9944h645076J373941J291879j027424l123398k605872J065087N911756P361433
9936A602326K348430n105486o886784j344770M158048L728260L19160p89477Q2679
$$ y = [1337071, -2410234, -4250380, -1404083, 2693835, 4479313, 5386420, 8101537, 10868340, 9623936, 4384359, -444256, -1811697, -733305, 819962, 2489586, 4023746, 3836041, 958640, -2651441, -3498949, -536342, 3091743, 3363325, 589218, -280448, 3997395, 9889635, 11134735, 6860199, 1904438, -701588, -2819420, -5705798, -6665371, -4079023, -1329153, -1912374, -4158867, -4750369, -4193597, -4357060, -3612878, 224915, 4172967, 3010902, -2854395, -7728290, -8646999, -8107099, -8495157, -8645076, -7271135, -5979256, -7006680, -10130078, -12735950, -11670863, -5759107, 1602326, 3950756, -1154730, -8041514, -9386284, -5228236, -1499976, -1180816, -1970293, -1887614]
9927a887614K84480N17568J820657J730412r47407k193118O57676L275684J525014
9918D783352r10336O40942K666452j56804m231198k871008R97999m30949m911381
9909d422931k941810M810159O653286j088195p472072m199076K585137M134610
9901a940892J935061J106770N03334k068366k798930J046744L887691O03463l701983
9892a427108j939103K718769K592073j550869l420567k543018k160908k20636
9884g951367O008407J0301007N337189k967487l205339J868789j40332p860149
9876A390718o645130M491880P819893k721241p494702P495524K3790992J5811185
9868D3939119r572123k2300194j1879341K590619M454145p59892k173525q98136
$$ y = [-1887614, -1603134, -1085566, 735091, 2465503, 1518096, -675022, -17346, 3258338, 4783352, 3873016, 4513958, 7180410, 7023606, 2792408, -78600, 919399, 488450, -4422931, -7364741, -2554582, 4098704, 3010509, -4461563, -8660639, -6075502, -1940892, -5831, 1100939, 1604273, -464093, -3263023, -2216279, 1671412, 2274875, -1427108, -3366211, -647442, 1944631, 393762, -3026805, -5569823, -7730731, -7951367, -1942960, 8358047, 13695236, 10727749, 7522410, 9391199, 9250867, 1390718, -5254412, -762532, 7057361, 4336120, -3158582, 4336942, 28127934, 43939119, 34366996, 12066802, 187461, 2778080, 7232225, 6472333, 4298808, 3400672]
9860C400672k033866l499184j958639O0183K65284J318689L684085K432772l123433
9851E46563n406447m39106M752707L452510k29247J14142J836297n22757l962817
9842A41845k001573L286899M109460m91556l949590k957944r04030p07380j134068
9833d607937o69507M25947K139001M314609M698371J550854k534742l398237j007960
9824I10399J198347J416082M94869o01201j094663M0295J918459J615419j080473
9815D817533k285754m61513L76723k040042l186491K88998L124896m27968n757871
9806e551489m217032K923864O531000L867590R74156J231428J261714q03661j940443
9797D277127r30821n59028j321859l12936K050916J625610j479794k125957O51261
$$ y = [3400672, 1366806, -2132378, -4091017, -4030834, -3765550, -2446861, 1237224, 3669996, 546563, -4859884, -5298990, -546283, 2906227, 2676980, 2791122, 4627419, 4104662, 141845, -1859728, 1427171, 5536631, 5045075, 1095485, -1862459, -2766489, -3473869, -4607937, -5277444, -4851497, -2712496, 1602113, 6300484, 7851338, 5316596, 1918359, 910399, 2108746, 3524828, 4019697, 3418496, 2323833, 2364128, 4282587, 5898006, 4817533, 2531779, 2070266, 2446989, 406947, -2779544, -2490546, 634350, 206382, -5551489, -9768521, -6844657, -313657, 3553933, 4528089, 5759517, 7021231, 6217570, 4277127, 3346306, 2787278, 1465419, 1152483, 3203399, 4829009, 3349215, 1223258, 1874519]
9788A874519J414762k117362m966729l482373n98733R67255L303827O933594P177492
9779A0506252J997756l005902k856732o34709j232686l343059l537308l035560
9771e141948l988803l683005P14815N493622N379705J927368J41227o8551j619575
9762h45145k334411J964551P726517O444944j943943p434231m403952O79957M67454
9753C21741j962032J78299M890122M404841j509478m432731o16081K985000K2679
9744D282360m824166l333677K899277M902669M67975l131888j680829k43111k907804
9735c569194m612807N8006O271191N617966n84555l694608j376330M07411j298519
9726b781439k335059j54609J748547R87288N90990K650487L930091J688196j467359
$$ y = [1874519, 3289281, 1171919, -3794810, -7277183, -7875916, -6908661, -3604834, 3328760, 10506252, 12504008, 9498106, 6641374, 6006665, 4773979, 1430920, -2106388, -5141948, -9130751, -12813756, -12098941, -6605319, -1225614, 701754, 842981, 774430, -845145, -3179556, -1215005, 6511512, 12956456, 11012513, 3578282, -825670, -145713, 321741, -1640291, -1461992, 3428130, 7832971, 6323493, 1890762, 1274681, 4259681, 4282360, -541806, -3875483, -976206, 3926463, 4394438, 1262550, -418279, -661390, -3569194, -8182001, -8123995, -1852804, 3765162, 3180607, -514001, -1890331, -1482920, -2781439, -5116498, -5271107, -3522560, -2535272, -1944282, 706205, 4636296, 6324492, 4857133]
9717D857133k344320k008519k224379j660898N26844J618924j36994j719764p6316
9708c168289K734972L040779J074864p16968j868341k704186j901317R78365L120509
9699E90388K184824o8279j005805j049593j169604N8301K950099L790760J80542
9690F461633l775222k994129L75564K59314l426739m607736o46787M012320M924734
9681E82952L139865J751249J252063P30916M86831Q70230O21870j276119l329667
9672D830190l068735k78270K733233L853981L065482J571670Q021j758409l433433
9663G523730m041474l263154k011143r91664J83838J540734J879269Q20443O4256
9654A704835O29780O67269j328881l024080j464230J767972K709145J170390K71939
$$ y = [4857133, 2512813, 504294, -1720085, -3380983, -2854139, -1235215, -1372209, -3091973, -3168289, -433317, 2607462, 3682326, 2965358, 1097017, -1607169, -3508486, -2530121, 590388, 2775212, 2706933, 1701128, 651535, -518069, -459768, 2490331, 6281091, 6461633, 2686411, -307718, 67846, 327160, -3099579, -7707315, -8354102, -4341782, 582952, 3722817, 5474066, 6726129, 7457045, 7943876, 8814106, 9435976, 8159857, 4830190, 1761455, 1483185, 4216418, 8070399, 11135881, 12707551, 12715572, 10957163, 7523730, 3482256, 219102, -1792041, -2783705, -2599867, -1059133, 820136, 1640579, 1704835, 2334615, 3001884, 1673003, -1351077, -2815307, -1047335, 1661810, 2832200, 3104139]
9645C104139P16459M09320p65045r49300o64758j650780j941792J428134N159646
9636D846023K923484l464802m908764P49721M698614J254501l342903k002467
9628G53407J978646K012961q60540k183087k751800m580521m046834J596162N910038
9619b171568J731226n844012n789637J899931O733433M257335P58402P23553P36849
9610C035512j469196k030384Q46816K348434m49279k873531o01006L025281L149717
9601D982364J481471K176654L779964J715468l544695o789946n607633k571477
9593d377830j76816J800069L215864J961338k428541o139639m879079M02196M170201
9584f452237L274743R13463J670576M433942L930730q55173m308619k195329J991155
$$ y = [3104139, 3820598, 4229918, 3464873, 2515573, 1850815, 200035, -1741757, -313623, 4846023, 7769507, 4304705, -604059, 145662, 4844276, 6098777, 2755874, 753407, 2732053, 4745014, 3884474, 1701387, -1050413, -5630934, -9677768, -8081606, -2171568, -440342, -6284354, -12073991, -10174060, -3440627, 816708, 1575110, 2298663, 3035512, 1566316, -464068, 382748, 2731182, 2281903, -591628, -1192634, 1832647, 4982364, 6463835, 8640489, 12420453, 14135921, 10591226, 3801280, -1806353, -4377830, -4554646, -2754577, 461287, 2422625, -5916, -6145555, -11024634, -10622438, -6452237, -3177494, -2264031, -593455, 3840487, 7771217, 6916044, 2607425, 412096, 2403251]
9575B403251K316965q39602j979058Q25491L298557J626303k194080l551340j489506
9566D16981M47662p93512l619981l841321n45924K373599K014291R54020K432621
9557a61564L795762O42654m173369l672834J034561J270155m093326m900134L384444
9548f873651J0100305N653189k638628k831389J805494p1144o516451n122678
9540f494953M408879Q238496J386736m170573k31306M391754L37328n961452m061349
9531b156440K459317K838370k535806l904038R16096L793279K47834m411811m535641
9522g288840j404257J190681K111026J343632j335961l910833k798238J776398
9514a0316392M807523L122519j96733l22594K925265N617652M846391J003652
$$ y = [2403251, 4720216, 3880614, 1901556, 2727047, 6025604, 7651907, 5457827, 1906487, 416981, 864643, 71131, -3548850, -7390171, -7936095, -5562496, -3548205, -2594185, -161564, 3634198, 4276852, 103483, -3569351, -2534790, -1264635, -5357961, -10258095, -6873651, 3226654, 8879843, 6241215, 3409826, 5215320, 5144176, -1372275, -6494953, -2086074, 6152422, 7539158, 3368585, 3137279, 7529033, 7866361, 1904909, -2156440, 302877, 3141247, 605441, -3298597, -2382501, 1410778, 1658612, -2753199, -7288840, -8693097, -7502416, -5391390, -4047758, -5383719, -9294552, -12092790, -10316392, -5508869, -2386350, -2583083, -2905677, 19588, 5637240, 10483631, 11487283]
9506A1487283l795264p193639p093252l104519K051182M382665K761542n1648
9498e55650j329084j631692k465274k554625K02224L861700L912830L10237j734879
9489a984213O1353J247838j425222l534873j70385M714035L677462j989057l951221
9480c354283j81708K304062l96557k833642J55253M831760M718110J64419l426210
9471A981204l339972j075514J072937J378411p85191l083449j962280J581593
9463d232261K119519j748322m174136j087617L002933K507210p8059O95815L098424
9454A03506J421323l140409l675110Q34973L792925K048519L43169J941261K595967
9445F266124j492069o007072m815359L20775K719615J027074N0873K030450L243751
$$ y = [11487283, 7692019, 498380, -6594872, -9699391, -7648209, -3265544, -504002, -555650, -1884734, -3516426, -5981700, -8536325, -8334101, -4472401, -559571, -249334, -1984213, -1922860, -675022, -2100244, -5635117, -5805502, -1091467, 2585995, 596938, -3354283, -3535991, -1231929, -1628486, -4462128, -4306875, 524885, 5242995, 5407414, 1981204, -1358768, -2434282, -1361345, 17066, -768125, -3851574, -5813854, -4232261, -2112742, -3861064, -8035200, -9122817, -6119884, -3612674, -3690733, -2994918, 103506, 1524829, -1615580, -5290690, -4455717, -662792, 1385727, 1728896, 3670157, 6266124, 4774055, -1233017, -6048376, -5727601, -3007986, -1980912, -1930039, 100411, 3344162]
9436C344162O42642l049239l470236o37746J998076K536989J896999J152445K30354
9427D644446q54259j453521j224647l30838J173435K895488L471376K047573L2751
9418A0401804o19128n33320j796445l880544l984397j928014q07807j426315m84608
9409e058774L121332M855596J485777k764232k475392L2274j202782n060815m673226
9400a1740242R00159M574079K436098o14350M65708L236947K979377J65019j717254
9391F85541j641647l53839K013173M006211K490204k071378m160242j097584K073802
9382A944241M12486k867627k240520M85833j26313k870585j908935K320419L237623
9373a613378m07885k175222P69904K583479r62217m702674k399099L031993M426456
$$ y = [3344162, 3986804, 937565, -2532671, -3170417, -1172341, 1364648, 3261647, 4414092, 4644446, 3790187, 2336666, 1112019, 781181, 1954616, 4850104, 8321480, 10369053, 10401804, 9782676, 9249356, 7452911, 3572367, -412030, -2340044, -3147851, -4574166, -5058774, -1937442, 2918154, 4403931, 1639699, -835693, -803419, -2006201, -7067016, -11740242, -10840083, -6266004, -3829906, -4444256, -3978548, -741601, 2237776, 2402795, 685541, -956106, -1309945, 703228, 4709439, 7199643, 5128265, 968023, -129561, 1944241, 2356727, -510900, -2751420, -2265587, -2391900, -5262485, -7171420, -4851001, -1613378, -2021263, -4196485, -3426581, -843102, -1805319, -6507993, -8907092, -5875099, -1448643]
9364a448643J513028j71331O76623j70372l649565m540928J06428N324433M987871
9355B627544N78868j437177Q09385K603140N30574k263121j256377K079563K119679
9346F392078k477296o340024m696942K61971L058020K650683K609603M232075
9338E690168L973491n90790n793508o175065k036025J011824o6972j861149Q158
9329e839868M269724N591192J755118l470799m957760j803979K430640L795904
9321A770172J499498j757065k462893l2019K077832K15452m407726o498956l363266
9312a2958971J454023L012329J425429O99370K416876M007504L249059J226193
9304D531812n9811l66759k80394J85766O42501k12346k631180m665580m404722
$$ y = [-1448643, 64385, -106946, 569677, 399305, -3250260, -7791188, -7684760, -2360327, 2627544, 3206412, 1769235, 2578620, 5181760, 5712334, 3449213, 2192836, 4272399, 6392078, 3914782, -2425242, -7122184, -6860213, -3802193, -1151510, 1458093, 5690168, 9663659, 9072869, 3279361, -2895704, -4931729, -3919905, -3986877, -5848026, -5839868, -1570144, 4021048, 5776166, 2305367, -2652393, -4456372, -2025732, 1770172, 3269670, 1512605, -950288, -982307, 1095525, 1310977, -3096749, -9595705, -12958971, -11504948, -8492619, -7067190, -6367820, -3950944, 56560, 3305619, 4531812, 4472001, 4105242, 3824848, 4010614, 4653115, 4440769, 1809589, -2855991, -7260713]
9295g260713k302953j19700J314483K094252K188969J735704J376399J079037
9287A05478k02116k330719k939843o30701K044984J524713j494047k867353j145163
9278g934767O35073L49266K15725K312019M014516J939173j746846j985445R77423
9269a223863J752804j048926k067420J503328L955185j56033n983138m594559
9261g862622L117595P017614K407437l870030m217536m6154K874982K811944J307668
9252C540898j098696l537396l132667M95666K536052l12912l827531k349211K227760
9243e458037L750526J689841Q22351K276776K174544n22686j752409M68659K618457
9234F068022J749859q4097k42677j14404k123396n090842n734169l234810m2341
$$ y = [-7260713, -9563666, -9683366, -8368883, -6274631, -4085662, -2349958, -973559, 105478, -96638, -2427357, -5367200, -5997901, -3952917, -2428204, -3922251, -6789604, -7934767, -7299694, -6950428, -6734703, -4422684, -408168, 1531005, -215841, -2201286, -1223863, 528941, -519985, -2587405, -1084077, 2871108, 2715075, -3268063, -7862622, -4745027, 2272587, 4680024, 809994, -3407542, -3453696, -578714, 2233230, 3540898, 2442202, -1095194, -4227861, -3732195, -1196143, -1509055, -5336586, -7685797, -5458037, -1707511, -17670, 804681, 3081457, 5256001, 4733315, 2980906, 3449565, 6068022, 7817881, 7733784, 7491107, 7376703, 5253307, 162465, -5571704, -8806514, -8848855]
9225h848855J133875j0329j263469m06798J719161J876030p33985k448215k61268
9216i243853L319827L805777J171599r44826q37885L26574J527503J917327j90937
9207H51106m113122n072146p28970L463846J689910k414129j222962L925676M738887
9198A118096J30020k134234Q73873K597672q22907l873133j900416J054382L81913
9189b574734j092354M83914K417012Q29148k087452k365021q64163n0307R21873
9180d382084K681830K302901j271217l630298j882524L15600k7467O11069M602770
9171f79420O411013J436780m440455l337660J518697J127903m339422o351069
9163h653633k043864K548553L051503J602057O20097m62188j403937p33892L49846
$$ y = [-8848855, -7714980, -7725309, -8988778, -9395576, -7676415, -5800385, -6534370, -8982585, -9243853, -5924026, -2118249, -946650, -1891476, -2729361, -2402787, -875284, 1042043, 851106, -3262016, -8334162, -9063132, -5599286, -3909376, -6323505, -7546467, -3620791, 1118096, 1248116, -886118, -12245, 2585427, 1762520, -2110613, -4011029, -2956647, -2574734, -3667088, -3183174, -766162, 62986, -2024466, -4389487, -5253650, -5303957, -4382084, -1700254, 602647, -668570, -4298868, -6181392, -5865792, -5893259, -5282190, -679420, 5731593, 7168373, 2727918, -609742, 908955, 2036858, -2302564, -8653633, -10697497, -8148944, -5097441, -3495384, -2875287, -3337475, -4741412, -5475304, -5125458]
9154e125458n26312j802738j73409K914576L074961M38158r48382j70424N15711
9145a803317J373557L868720M968271O72500n444442n697950m28843K080260j184203
9136a595447l833980j376884K103210K146828J058550K358507M311569L543031
9128H715384M26047k723995m757148m568962j307081K393834K266151q52316j594777
9119b002863J046444J831601j438378l805954j870679L42915j051128k741383
9111i689425l80124L585355M325887K463710J451226J035712m55914q56010K074229
9102C554646M447553J184471m498811m333697K186474N871840Q37442p045825
9094B204093q492696l014510J913043J534445j172762j204379J632568L512258
$$ y = [-5125458, -5651770, -7454508, -7627917, -4713341, -1638380, -1200222, -2148604, -2319028, -1803317, -429760, 3438960, 8407231, 9079731, 3635289, -2062661, -2491504, -411244, -1595447, -5429427, -6806311, -4703101, -2556273, -1497723, 860784, 5172353, 8715384, 9141431, 6417436, 1660288, -2908674, -4215755, -1821921, 444230, -408086, -2002863, -956419, 875182, -563196, -4369150, -6239829, -5896914, -6948042, -9689425, -10069549, -6484194, -2158307, 305403, 1756629, 2792341, 2336427, 1480417, 3554646, 8002199, 9186670, 4687859, 354162, 2540636, 8412476, 9249918, 2204093, -6288603, -9303113, -7390070, -5855625, -7028387, -8232766, -6600198, -3087940]
9086c087940K214634n64592k177568j999311q21241P20870J835309J351636n55034
9077c083237j778656j084647l2864k53728n37388R65862L281236M078642L103923
9068D659143J391233j084113l777213l839878q2043L453511K604575k89565l84559
9059B651091J163115l63822l627340k448367K905777M584857k01923l998869q62731
9050a98212M274154L714029j503602m512666k779604O53263L000351L385921J036302
9041G069936l340401o199455n181423k592127j484414p93197J872494N099214
9033e549373N553849L203224P47998o67242j630447j808487n83725Q07625Q35957
9024I09379K64535M95880O79384p94275l072907l698172j881204R57955K961972
$$ y = [-3087940, -873306, -1437898, -3615466, -5614777, -6436018, -5715148, -3879839, -2528203, -3083237, -4861893, -5946540, -5979404, -6233132, -6770520, -5804658, -2523422, 1555220, 4659143, 6050376, 4966263, 1189050, -2650828, -2732871, 720640, 3325215, 3035650, 2651091, 3814206, 3450384, -176956, -2625323, 280454, 4865311, 4663388, 664519, -198212, 4075942, 7789971, 6286369, 1773703, -1005901, -352638, 2647713, 6033634, 7069936, 3729535, -2469920, -7651343, -10243470, -11727884, -12521081, -10648587, -5549373, 4476, 3207700, 3955698, 3288456, 1658009, -150478, -734203, 73422, 909379, 1173914, 1669794, 2349178, 1554903, -1518004, -5216176, -7097380, -6139425, -3177453]
9015c177453K875539P68922j279207j035035P52539J444858R16628J405831K625281
9006E297903J561933j725010l158588j367139j21305j658261k995906j763401
8998e929774n6552P44998K842656N858905M673552j454299m677223j21770N086456
8989F966949K478238m096920n028126m62092J411508j207911k017643J380689
8981e75308M011456K828530O25170n00128j786031k939260j820253L49645L01400
8972D95221q00304O21333K629532J51592m947531n362208m92440K592571J557037
8963c555197J695332M124697K447137m404827p259020j228424M998157K537877
8955f44268l732535l905500J319646L765908J466718p68958j086074j425237q66131
$$ y = [-3177453, -301914, 467008, -812199, -1847234, -1094695, 350163, 1266791, 2672622, 5297903, 6859836, 5134826, 1976238, 609099, 487794, -1170467, -4166373, -5929774, -5986326, -5241328, -2398672, 3460233, 8133785, 6679486, 2002263, 1880493, 6966949, 9445187, 5348267, 320141, -141951, 1269557, 61646, -1955997, -575308, 3436148, 6264678, 6889848, 6389720, 4603689, 1664429, -155824, 193821, 495221, -305083, 316250, 2945782, 3097374, -1850157, -7212365, -7704805, -5112234, -3555197, -1859865, 2264832, 4711969, 307142, -6951878, -8180302, -3182145, -644268, -4376803, -8282303, -6962657, -3196749, -1730031, -2498989, -3585063, -5010300, -5876431]
8946e876431K957670P015411N664899j77877l944365l159480j443855j028010
8938G962j17171J838386K558674J500011O13077R0824j428061k437240j53945
8929B472517L229555K241950k881336n412917k286501J368606Q12250j256547
8921a712423m50347J609084O62847k466450l062327M8842L005500K678243L85444
8912F98413o49912O00904J969921N13082l726530o561671m094347J616130M290189
8903e343821J762147j110612k1340K308942J124922k183836k346836R33621K439329
8894b437484N5267j856551L03003L613395L304227l03105l096114l107514j670577
8885e195453j81764R43437R97938k91705j400253j095932j005335k940856m561990
$$ y = [-5876431, -2918761, 4096650, 9761549, 9583672, 5639307, 2479827, 1035972, 7962, -109209, 1729177, 4287851, 5787862, 6400939, 6491763, 5063702, 2626462, 2472517, 5702072, 7944022, 5062686, -350231, -2636732, -1268126, -455876, -1712423, -2162770, -553686, 109161, -2357289, -5419616, -5370774, -2365274, 312969, 698413, 48501, 649405, 2619326, 3132408, -594122, -7155793, -11250140, -9634010, -5343821, -3581674, -4692286, -4713626, -2404684, -1279762, -3463598, -5810434, -4876813, -2437484, -2382217, -4238768, -3935765, -322370, 2981857, 2678752, -417362, -3524876, -5195453, -5377217, -4433780, -3435842, -3727547, -5127800, -6223732, -7229067, -10169923, -14731913]
8876a4731913j814653M221088P383868M585800j87377j901675o12019Q10008J253937
8867i92936O19937j832991m658400l306760L322007Q616539O127822r09895m315445
8858B669878l018279k637618m178467k519970K654939M355369L87709j599735
8850c886174K966296O586558J829060n232432m303400J878091J968776m736664
8842b929889o739712Q44496Q465645P337619J673772m21600O35523J53898j094288
8833G925464K02244J953951O9002l260003k772803L26082J94809l066385k983932
8824a411571K166717N625187K242697m161509p097980n758949l056319J52230
8816a1299497L984383N860494L290430j060622j939163J159539L409083J734114
$$ y = [-14731913, -16546566, -12325478, -4941610, -355810, -543187, -2444862, -3056881, -2246873, -992936, -372999, -2205990, -6864390, -10171150, -6849143, 1767396, 7895218, 6985323, 2669878, -348401, -2986019, -7164486, -9684456, -7029517, -2674148, -2286439, -3886174, -919878, 5666680, 7495740, 2263308, -2040092, -162001, 1806775, -2929889, -9669601, -8825105, -359460, 6978159, 8651931, 8230331, 8865854, 9019752, 7925464, 8127708, 10081659, 10150661, 6890658, 4117855, 4443937, 4638746, 1572361, -1411571, 755146, 6380333, 8623030, 4461521, -2636459, -8395408, -11451727, -11299497, -7315114, -1454620, 1835810, 775188, -1163975, -4436, 3404647, 5138761]
8808E138761j323047j887542K62301K572197L136294J552095j583891m112657
8800C754511l018054J938143O473081O226420K229847p66928r40876r56065k518271
8791A2421808l394419j850286m02189j800869m016600l360210p36341l8105j276082
8782d453293o41246K367676L482315Q66713j565237o32290J208061Q04451l49631
8773A087519J55848O55737r75575k214900M1079L074099K115205j473842k312567
8764A52603j06907L05302k118109k771045L70284L293075K744098O48514m22154
8755B095661p47296l79693J769937L551031M60275o088434p866177j424845N542319
8746c087222M692572j544640m964290l249462j12944K279893M038043L571509
$$ y = [5138761, 3815714, 1928172, 2190473, 4762670, 7898964, 9451059, 7867168, 3754511, 736457, 2674600, 9147681, 15374101, 17603948, 16837020, 15896144, 14940079, 12421808, 9027389, 7177103, 6774914, 4974045, 957445, -2402765, -3139106, -3177211, -4453293, -5094539, -2726863, 755452, 1622165, 56928, -575362, 632699, 1437150, 1087519, 1243367, 1899104, 923529, -1291371, -1250292, 1823807, 3939012, 2465170, 152603, 45696, 350998, -1767111, -4538156, -4167872, -874797, 1869301, 2517815, 2095661, 1348365, 968672, 2738609, 6289640, 6749915, 661481, -7204696, -8629541, -3087222, 1605350, 60710, -4903580, -8153042, -8265986, -5986093, -1948050, 1623459]
8738A623459j75263l493759k265234J306513K307866J125328J323583K028832
8730C781325J0581k566195r02976K909929K062956l255451n502243k123446J121269
8721d464251J048978J519363L896720L059659k216972m496566L08772M985836
8713C641539K671865j739184q57854J964333m18369m565776j764301N395024N431969
8704I759246k967757p831405k929129K740110N69335l623337l26495O909638O712004
8695I012210j836167p490422l750623K362563J901531l079281l927857J383194
8687e424852N892129L892706j762448m305560j641657K339587L493592J785893
8679D269390l4888j88847N05636O6231k017274l663605k448289P11437J712349
$$ y = [1623459, 1448196, -2045563, -4310797, -3004284, -696418, 428910, 1752493, 3781325, 3791906, 1225711, 322735, 3232664, 5295620, 2040169, -3462074, -5585520, -4464251, -3415273, -1895910, 2000810, 5060469, 2843497, -1653069, -1344297, 3641539, 6313404, 4574220, 3716366, 5680699, 5262330, 696554, -1067747, 4327277, 9759246, 6791489, -1039916, -3969045, -1228935, -659600, -4282937, -4609432, 2300206, 9012210, 7176043, -314379, -4065002, -1702439, 199092, -2880189, -6808046, -5424852, 467277, 4359983, 2597535, -1708025, -3349682, -1010095, 2483497, 4269390, 4234502, 4045655, 4551291, 4617522, 2600248, -1063357, -3511646, -2800209, -1087860]
8670a087860j402226m843812l459860K136186O069183M832432R70978j502001
8662A713020j697029m20033K046813M167515K503584l551947q641789p003022
8654a0882888p2712N084360M478265R68523o98190N43788K347433K497797R41965
8645E208341o96574r62051j89227N8127n99066p49429K31763O56873r56751l309969
8635a307963l975451k397129K66608K747409L541115J278559k552890l475616
8627e875358M60832N007822M951246J226924j081233k81769R70723J272631J831128
8618H482946K245145K95317l034290l430921O8966K963257K074599m6163l22824
8609I296032l75837k637463m764199k706273K500935N466831L326469j525790
$$ y = [-1087860, -2490086, -7333898, -10793758, -8657572, -2588389, 2244043, 3215021, 1713020, 15991, -404042, 1642771, 5810286, 8313870, 4761923, -3879866, -10882888, -10955600, -5871240, -1392975, -424452, -1122642, -578854, 1768579, 4266376, 5208341, 4511767, 3549716, 3360489, 3418616, 2819550, 2070121, 2301884, 2958757, 2002006, -1307963, -5283414, -7680543, -7413935, -4666526, -1125411, 153148, -2399742, -5875358, -5414526, -406704, 4544542, 5771466, 4690233, 4408464, 5379187, 6651818, 8482946, 10728091, 11023408, 7989118, 4558197, 4627163, 7590420, 9665019, 9618856, 9296032, 8920195, 6282732, 1518533, -1187740, 1313195, 6780026, 10106495, 8580705]
8601H580705n094380n302430k410553J335208K779772Q92518j660257j859693
8593b739110k61861N82578K80812L15674P71602O92220Q49823K353185L051870
8584E896793j07166m882805n106882J51831M088556J871217k153340j565565K020260
8575B12899K210211j310799k481575P48213K990011L74626l375982l326860o74220
8566d633476P06851J055746K806590M517132K572156j864304l182773N79434M527176
8557G084532L514060j347413m778430l763361p8240K390854J634021o67429j172471
8548B816123P82033J948044k76293l572686l667434n02876J958616J696016O14805
8539A796348K50827n77032k572924l893890l082294j417185o70153o69938l96888
$$ y = [8580705, 3486325, -1816105, -4226658, -2891450, -111678, 780840, -879417, -2739110, -3000971, -2418393, -2137581, -1821907, -1050305, -358085, 491738, 2844923, 5896793, 5789627, 906822, -4200060, -4048229, 40327, 1911544, -241796, -1807361, 212899, 2423110, 1112311, -1369264, -621051, 2368960, 2743586, -632396, -3959256, -4633476, -3926625, -2870879, -64289, 4452843, 7024999, 5160695, 1977922, 2557356, 7084532, 10598592, 9251179, 4472749, 709388, 631148, 3022002, 4656023, 3988594, 2816123, 3598156, 5546200, 5269907, 1697221, -1970213, -2473089, -514473, 1181543, 1796348, 2047175, 1470143, -1102781, -4996671, -8078965, -9496150, -10166303, -10836241, -11233129]
8530a1233129M39116J751518L093092L101636J170877p05649o57772n31176k613855
8521f185342l951660o783O140822N877099j774000p072613l444045L298087M898156
8512b220279K423328J169961N26371k364443l995750M51525O524596N330539k106126
8503E739722n444483o96431M291717K532037k364496l283472j05023J767404k79079
8494B157896l293332k925755J471818N387635L627152k442727n035955m69595
8486a522863M494582K363554l089838k669386L062077M463109j508878o664864
8478a072507m719443M62889L070490L160751K358317k35490l465685k919832J234129
8469b126381K528718j147319k988437J238745N249737K667854k172459k063507
$$ y = [-11233129, -10794013, -9042495, -5949403, -2847767, -1676890, -2382539, -3040311, -3571487, -6185342, -10137002, -10143785, -4002963, 1874136, 100136, -6972477, -10416522, -7118435, -2220279, 203049, 1373010, 1899381, -465062, -4460812, -4009287, 2515309, 7845848, 5739722, 295239, -401192, 3890525, 6422562, 4058066, 774594, 669571, 2436975, 2157896, -1135436, -4061191, -2589373, 2798262, 6425414, 3982687, -1053268, -1522863, 2971719, 5335273, 2245435, -423951, 2638126, 7101235, 5592357, -1072507, -5791950, -5329061, -2258571, 902180, 3260497, 3025007, -440678, -3360510, -2126381, 402337, -744982, -3733419, -2494674, 2755063, 5422917, 3250458, 1186951]
8461A186951R25455K82925l091888l436617p63566M68301M04248K176016L590714
8452A742539J15246n256632m983397N43253L321924J108208M16485M124774N991441
8443G123841J623826l645590l298529N84739J894585r8238j627826j282996p18386
8434E55426o63290n18525n20421j074702j224142k06952R48658J321193J717425
8425C34670K565683K389912M94210j038361m75478M04702r35049l321455l175712
8416b756878J65038L029513J770208k880765o330868m732255P62274M641626K985586
8407c346521j566918k719731J467811N977554N299307O8955m582535n307615k788198
8398g497891Q68595M038949N164590L274357j31768j658163R5585K318151J261312
$$ y = [1186951, 2112406, 2395331, -696557, -4133174, -4896740, -4428439, -4024191, -1848175, 1742539, 1857785, -3398847, -8382244, -7838991, -4517067, -3408859, -2992374, 1132400, 7123841, 8747667, 5102077, 1803548, 2388287, 4282872, 4184634, 2556808, 1273812, 555426, -107864, -626389, -1146810, -2221512, -3445654, -3652606, -2703948, -1382755, 334670, 2900353, 5290265, 5784475, 4746114, 4270636, 4675338, 3740289, 418834, -2756878, -2591840, 437673, 2207881, -672884, -7003752, -11736007, -10973733, -6332107, -3346521, -4913439, -7633170, -6165359, -187805, 5111502, 5180457, 597922, -4709693, -7497891, -6629296, -2590347, 2574243, 5848600, 5716832, 4058669, 4154254, 6472405, 7733717]
8389G733717k714889n204557l295600P16434K433328P03936k120496m086193m855814
8380a0690134l526529Q94662N937385O634748K287509j379270M8623L149534K108884
8371E465412k036224l082259N18555L342339J238908l093506m629576k439599
8363d715950M48679J099128r55810l530843l319523M68834M087693L427786j37072
8354c127078j485127P72474K759190J959400P24197J345251K034120N83512j559885
8345D006054j920232q10158K37250J079423J367061n96282m276588n234241q35177
8336f982890M850621N939271K511940o74452j447549j525167j757661j109294
8328a95181k03621j060352k767474j900916J698600L758995J758618j458610k203857
$$ y = [7733717, 5018828, -185729, -3481329, -2764895, -331567, 372369, -1748127, -5834320, -10690134, -14216663, -13322001, -7384616, -749868, 1537641, 158371, 206994, 3356528, 5465412, 3429188, 346929, 865484, 4207823, 5446731, 2353225, -2276351, -4715950, -4267271, -3168143, -4123953, -7654796, -10974319, -10505485, -6417792, -2990006, -3127078, -4612205, -3839731, -1080541, 878859, 1603056, 2948307, 4982427, 5565939, 4006054, 2085822, 1275664, 1512914, 2592337, 3959398, 3363116, -913472, -6147713, -6982890, -2132269, 3807002, 6318942, 5644490, 4196941, 2671774, 914113, -195181, -398802, -1459154, -4226628, -6127544, -4428944, -669949, 1088669, -369941, -2573798]
8319b573798p98603L83153R21864J675302K042448P10119j738095l100165k129066
8310d606841L60112K454844K563967P16878j129629j129518N5340M24455m4678
8301c35070L14374J280243Q33121n07757L86793L181356K690806k865665o793658
8292a815457k631558N385709P438915K089506k446937j199822J289606p278k641496
8283E461188k156857K02055O05120o16616p16724L029l62752r23505q5910L22060
8273A731088j675319l112071l17029L595258K394432k935859n005328j514705
8265f839533J737118Q91921o38632L18368J318973L74504L92146K685496K744042
8256B984403j572280l956935Q16376O688458M458940l634286p099450k928120
$$ y = [-2573798, -3372401, -2989248, -2067384, -392082, 1650366, 2360485, 622390, -2477775, -4606841, -4246729, -1791885, 772082, 1488960, 359331, -770187, -714847, -290392, -335070, -20696, 1259547, 2092668, 1584911, 1971704, 5153060, 7843866, 4978201, -1815457, -4447015, 938694, 8377609, 10467115, 8020178, 6820356, 8109962, 8102684, 5461188, 3304331, 3506386, 4111506, 3494890, 2778166, 2781195, 2418443, 1494938, 1409028, 1731088, 55769, -3056302, -3373331, 221927, 2616359, -319500, -5324828, -6839533, -5102415, -4210494, -4849126, -4530758, -3211785, -2837281, -2445135, 240361, 2984403, 1412123, -2544812, -1728436, 4960022, 9418962, 5784676, -1314774, -4242894]
8248d242894J814411K744873L232060N013369L721491k144049o198045l560278
8240C80938J351514K233973N56033J300378L332221J408284m209771p193818m258245
8231e098493P77802L038329K375190J575586J896032K265421J415348n20667k107681
8222E616867k036263o09752O52184R32706N30406n85455k605788l930530k198390
8213d234015J548392K863802J23134k477568j159421J337715J72537l440136l896832
8204i162392k06949K425276R10099j142100M67652M001381M654926J289505k935464
8195C01934m988667m103364p00087L777332O322156M551764L4046k671932j214352
8186A308830J825683K423538P9639k157528k014458n63586q3215q26304j166369
$$ y = [-4242894, -2428483, 316390, 3548450, 8561819, 12283310, 10139261, 3941216, 380938, 1732452, 3966425, 4522458, 5822836, 9155057, 10563341, 6353570, -840248, -5098493, -4320691, -1282362, 1092828, 2668414, 4564446, 6829867, 8245215, 7724548, 5616867, 3580604, 2970852, 3623036, 4555742, 5086148, 4500693, 1894905, -2035625, -4234015, -2685623, 178179, 301313, -2176255, -3335676, -1997961, -1825424, -5265560, -9162392, -9369341, -6944065, -6033966, -7176066, -6708414, -2707033, 1947893, 3237398, 301934, -4686733, -8790097, -9490184, -5712852, 609304, 5161068, 5195114, 2523182, 1308830, 3134513, 5558051, 5637690, 3480162, 1465704, 902118, 818903, -7401, -1173770]
8177a173770k92105P65879R47235O85515R22994J470157J252188j84406k132678
8168B261009l490315l533970k174939l7907J754043K327235J732095Q00067L70576
8159G894N93234Q15313L03652p24325j219723q54757o66593j228837j217549L71632
8149c820059J414423r61250m941595m621558J940759Q408220P427869M23546m106143
8140A164212j834520K304162J903623j881985k750233J077948M154657J791042
8132E928906k981365l659915L26907K847443K29364l290736k148997K067396L389457
8123B708460P22006j384933q89796q54609k447890j955184J755493L060026j602403
8114h88830o023250k756642M288513M749722k028179n563458m83921N422497L792369
$$ y = [-1173770, -1465875, -699996, 247239, 932754, 1855748, 3325905, 4578093, 4393687, 2261009, -1229306, -4763276, -6938215, -6976122, -5222079, -2894844, -1162749, -362682, 7894, 601128, 1416441, 1720093, 995768, -223955, -1078712, -1745305, -2974142, -4191691, -3820059, -2405636, -3366886, -8308481, -12930039, -10989280, -2581060, 4846809, 5270355, 1164212, -670308, 1633854, 3537477, 1655492, -1094741, -16793, 4137864, 5928906, 2947541, -712374, -385467, 2461976, 2691340, -599396, -2748393, -680997, 2708460, 3430466, 2045533, 1155737, 301128, -2146762, -4101946, -2346453, 713573, -888830, -6912080, -9668722, -5380209, -630487, -2658666, -8222124, -8706045, -3283548, 508821]
8105E08821j937215l394215l77153R89970m48799j08390K867250L700762Q12357
8096B613388p46546K221610M991247J824199m935432p772129m180905Q75235K425883
8087b683450J146302M79921J491114K711247L054792K497683Q99146j516203k953451
8078E127101j762405N19173M56163k178002l511726j540119K15637j626839l754434
8069h055451n40510O134436P926411K139122l713455k855807J130348J024249
8061C189343k380033k575015J165589K660602o69905l712417k160249J270857
8053c211228K292974J450812J271079J250963j24408j595326j494143j281336
8045a440613k660404l477130q20566L517267N047802K859495k41584k642754m443090
$$ y = [508821, -1428394, -4822609, -5199762, -4209792, -4658591, -4766981, -1899731, 1801031, 2613388, 1866842, 4088452, 9079699, 10903898, 5968466, -1803663, -5984568, -5109333, -2683450, -1537148, -1057227, 433887, 3145134, 6199926, 8697609, 9596755, 8080552, 5127101, 3364696, 3883869, 4340032, 2162030, -1349696, -2889815, -2674178, -4301017, -8055451, -8595961, -2461525, 5464886, 7604008, 3890553, 1034746, 2165094, 3189343, 809310, -1765705, -600116, 2060486, 1390581, -2321836, -4482085, -3211228, -918254, 532558, 1803637, 3054600, 2930192, 1334866, -159277, -1440613, -4101017, -7578147, -8398713, -4881446, 166356, 3025851, 2784267, 141513, -4301577]
8036d301577l997573P19405O887416Q107393K536316m250579o243178l425461
8028c967838L29178K409966K570400J643938J006632J264016P05184k274241n040856
8019a353621l126856K329740M582015R07553l051882k092682P01524N4860k174101
8010c223450o06602L587064L916250q23375m496753l142213r5335M03029p75542
8001e256927q02163K51966P89465Q60070J249084J607799J536595J661625K212249
7992D109763K325800J581145K85669j816124m433897m755157o21432M272219L575012
7983D522998k099881m576312K05279N784527M622417j372679n121811m682789
7975b718251k979041p68305K930826N514159L357181j069748j842354P32778M52112
$$ y = [-4301577, -8299150, -7579745, -692329, 7415064, 9951380, 5700801, -542377, -3967838, -3638660, -1228694, 1341706, 2985644, 3992276, 5256292, 5961476, 3687235, -1353621, -4480477, -2150737, 2431278, 3338831, 286949, -1805733, -1104209, -1049349, -3223450, -3830052, -242988, 3673262, 2849887, -1646866, -4789079, -4884414, -4481385, -5256927, -6059090, -5807124, -5017659, -4157589, -2908505, -1300706, 235889, 1897514, 4109763, 6435563, 8016708, 8302377, 6486253, 2052356, -2702801, -3324233, 947986, 4522998, 2423117, -2153195, -1947916, 3836611, 8459028, 7086349, 1964538, -2718251, -5697292, -6465597, -3534771, 1979388, 5336569, 4266821, 2424467, 3157245, 3609357]
7966C609357l897338n729290j322857L914948L971769R70374L03009J785026J403717
7957E008715j284658l173993l141605k525689j404210R30009K788006J951136
7949h52289M4467M67708K353523J576576j826281k620734J355513M776517K055725
7940G330725m460023p501514m179169J516219M662903M317069K321877K80999
7932D289086j059599j254903m24040N41744P56136L9223j231083k378050k505011
7923c226497j116320J008587K137880J197423j138221l017747k854848m73868
7915g483611K592536M136767L350817J736228J126456J164990J73616j647450
7907E150349k077545n74039M15165n50030j211954L19989J303771j512169n071415
$$ y = [3609357, -287981, -6017271, -7340128, -3425180, 546589, 1516963, 1819972, 3604998, 5008715, 3724057, 550064, -2591541, -5117230, -6521440, -5591431, -2803425, -852289, -807822, -340114, 2013409, 3589985, 1763704, -857030, 498483, 5275000, 7330725, 2870702, -4630812, -8809981, -7293762, -2630859, 1686210, 4008087, 4289086, 3229487, 1974584, 1550544, 2092288, 2848424, 2887647, 1656564, -721486, -3226497, -4342817, -3334230, -1196350, 1073, -1137148, -4154895, -7009743, -7483611, -4891075, -754308, 2596509, 4332737, 5459193, 6624183, 6797799, 5150349, 3072804, 2498765, 2913930, 2363900, 1151946, 1471935, 2775706, 1263537, -3807878]
7898c807878l165731L294475N814911P27334m563723k740922J964536J037133
7890a439865l816476l341366L237842N918268K04482m937191j432116M596755
7882a009667K825427m276782n398533J445663O173058K852794j925213o63066
7874B3681L743001M036076k52289l979727m608570l240354m06214L288530M406543
7865C010677N07953m425395m258529O0830J602174j735695l960985p09455L840715
$$ y = [-3807878, -6973609, -3679134, 2135777, 2863111, -1700612, -4441534, -2476998, -1439865, -5256341, -8597707, -5359865, 558403, 762885, -4174306, -5606422, -1009667, 1815760, -2461022, -7859555, -6413892, -240834, 2611960, 686747, 23681, 3766682, 7802758, 7550469, 3570742, -1037828, -4278182, -4684396, -1395866, 3010677, 3518630, -906765, -5165294, -5104464, -3502290, -5237985, -9198970, -9908425, -6067710]
$$ [...]
##END NTUPLES=NMR SPECTRUM
##END=
