##TITLE=31Pdec_56-2025
 CDCl3, 24 sc
 28.5.2025
##JCAMPDX= 6.0         $$ Bruker NMR JCAMP-DX V2.0
##DATA TYPE= NMR SPECTRUM
##DATA CLASS= NTUPLES
##ORIGIN= UXNMR, Bruker Analytische Messtechnik GmbH
##OWNER= root
$$ XWIN-NMR		Version 3.5
$$ Wed May 28 14:38:32 2025 Russian Standard Time (UT+4h)  she@DPX200
##.OBSERVE FREQUENCY= 81.013821
##.OBSERVE NUCLEUS= ^31P
##.ACQUISITION MODE= SIMULTANEOUS
##.ACQUISITION SCHEME= undefined
##.AVERAGES= 24
##.DIGITISER RES= 17
##SPECTROMETER/DATA SYSTEM= spect
##.PULSE SEQUENCE= zgpg30
##.SOLVENT NAME= D2O
##.SHIFT REFERENCE= (INTERNAL, D2O, 0, 198.062)
##AUDIT TRAIL= $$ (NUMBER, WHEN, WHO, WHERE, WHAT)
$$ ##TITLE= Audit trail, XWIN-NMR		Version 3.5
$$ ##JCAMPDX= 5.01
$$ ##ORIGIN= Bruker BioSpin GmbH
$$ ##OWNER= she
$$ F:/spectra/data/she/nmr/P31/2/pdata/1/auditp.txt
$$ ##AUDIT TRAIL=  $$ (NUMBER, WHEN, WHO, WHERE, WHAT)
(   1,<2025-05-28 14:37:25.15 +0400>,<she>,<DPX200>,
      <created by zg, POWCHK disabled, PULCHK disabled
       configuration hash MD5:
       00 E9 B6 7A A2 85 ED C7 34 08 36 98 17 FE 4E 26
       data hash MD5: 32K
       A6 A1 6A B9 D0 24 34 11 31 CC E0 28 C5 B2 E2 07>)
(   2,<2025-05-28 14:37:28.92 +0400>,<she>,<DPX200>,
      <Start of raw data processing
       efp BC_mod = 2 LB = 1.5 FT_mod = 6 PKNL = 1 PHC0 = 1544.673 PHC1 = -278.9066 SI = 64K 
       data hash MD5: 64K
       14 ED 10 7A A4 45 AF FC 62 F2 DD 38 19 C3 00 45>)
(   3,<2025-05-28 14:37:54.67 +0400>,<she>,<DPX200>,
      <pk PHC0 = -26.69466 PHC1 = 0 
       data hash MD5: 64K
       B5 8D 19 10 3C 87 4B A0 44 6C 08 CF A8 33 3F 85>)
(   4,<2025-05-28 14:38:02.62 +0400>,<she>,<DPX200>,
      <abs ABSG = 5 
       data hash MD5: 64K
       D2 ED E9 B2 0A 55 C7 D9 81 52 CE 5A AC 46 F0 E9>)
$$ ##END=
$$ 
$$ hash MD5
$$ E1 89 39 93 AB 66 7D 97 DC 36 D7 5B 73 68 A5 03
##$RELAX= 
##$RELAX= 
##$RELAX= 
##$RELAX= 
##$RELAX= 
##$RELAX= 
##$RELAX= 
##$RELAX= 
$$ Bruker specific parameters
$$ --------------------------
##$DU= <F:/spectra>
##$EXPNO= 2
##$NAME= <P31>
##$PROCNO= 1
##$TYPE= <nmr>
##$USER= <she>
##$AMP= (0..31)
100 100 100 100 100 100 100 100 100 100 100 100 100 100 100 100 100 100 
100 100 100 100 100 100 100 100 100 100 100 100 100 100 
##$AQSEQ= 0
##$AQ_mod= 1
##$AUNM= <au_zg>
##$AUTOPOS= <>
##$BF1= 81.014009
##$BF2= 200.13
##$BF3= 200.13
##$BF4= 200.13
##$BF5= 200.13
##$BF6= 200.13
##$BF7= 200.13
##$BF8= 200.13
##$BYTORDA= 1
##$CFDGTYP= 0
##$CFRGTYP= 5
##$CHEMSTR= <none>
##$CNST= (0..31)
1 1 145 1 1 1 1 1 1 1 1 1 1 1 1 1 1 1 1 1 1 1 1 1 1 1 1 1 1 1 1 1 
##$CPDPRG= <waltz16>
##$CPDPRG1= <>
##$CPDPRG2= <waltz16>
##$CPDPRG3= <>
##$CPDPRG4= <mlev>
##$CPDPRG5= <mlev>
##$CPDPRG6= <mlev>
##$CPDPRG7= <mlev>
##$CPDPRG8= <mlev>
##$CPDPRGB= <>
##$CPDPRGT= <>
##$D= (0..31)
0 1 0 0 0 0 0 0 0 0.06 0 0.03 2e-05 3e-06 0 0 0.0002 0 0 0 0 0 0 0 0 0 
0 0 0 0 0 0 
##$DATE= 1748428644
##$DBL= (0..7)
120 120 120 11 120 120 24 19 
##$DBP= (0..7)
150 150 150 150 150 150 150 150 
##$DBP07= 0
##$DBPNAM0= <>
##$DBPNAM1= <>
##$DBPNAM2= <>
$$ [...]
##$SUBNAM3= <"">
##$SUBNAM4= <"">
##$SUBNAM5= <"">
##$SUBNAM6= <"">
##$SUBNAM7= <"">
##$SUBNAM8= <"">
##$SUBNAM9= <"">
##$SW= 400.765351723535
##$SWIBOX= (0..15)
0 1 3 0 0 0 0 0 0 0 0 0 0 0 0 0 
##$SW_h= 32467.5324675325
##$TD= 32768
##$TD0= 1
##$TE= 0
##$TE2= 300
##$TE3= 300
##$TEG= 300
##$TL= (0..7)
0 120 53 12 22 120 120 120 
##$TP= (0..7)
150 150 150 150 150 150 150 150 
##$TP07= 0
##$TPNAME0= <>
##$TPNAME1= <>
##$TPNAME2= <>
##$TPNAME3= <>
##$TPNAME4= <>
##$TPNAME5= <>
##$TPNAME6= <>
##$TPNAME7= <>
##$TPOAL= (0..7)
0.5 0.5 0.5 0.5 0.5 0.5 0.5 0.5 
##$TPOFFS= (0..7)
0 0 0 0 0 0 0 0 
##$TUNHIN= 0
##$TUNHOUT= 0
##$TUNXOUT= 0
##$USERA1= <user>
##$USERA2= <user>
##$USERA3= <user>
##$USERA4= <user>
##$USERA5= <user>
##$V9= 5
##$VALIST= <valist>
##$VCLIST= <CCCCCCCCCCCCCCC>
##$VD= 0
##$VDLIST= <DDDDDDDDDDDDDDD>
##$VPLIST= <PPPPPPPPPPPPPPP>
##$VTLIST= <TTTTTTTTTTTTTTT>
##$WBST= 1024
##$WBSW= 4
##$XGAIN= (0..3)
0 0 0 0 
##$XL= 0
##$YL= 0
##$YMAX_a= 7045
##$YMIN_a= -8926
##$ZGOPTNS= <>
##$ZL1= 120
##$ZL2= 120
##$ZL3= 120
##$ZL4= 120
##$ABSF1= 198.0616
##$ABSF2= -202.7028
##$ABSG= 5
##$ABSL= 3
##$ALPHA= 0
##$AQORDER= 0
##$ASSFAC= 0
##$ASSFACI= 0
##$ASSFACX= 0
##$ASSWID= 0
##$AUNMP= <proc_1d>
##$AZFE= 0.1
##$AZFW= 0.5
##$BCFW= 0
##$BC_mod= 2
##$BYTORDP= 0
##$COROFFS= 0
##$CY= -3
##$DATMOD= 1
##$DC= 0
##$DFILT= <>
##$DTYPP= 0
##$F1P= 0
##$F2P= 0
##$FCOR= 1
##$FTSIZE= 65536
##$FT_mod= 6
##$GAMMA= 0
##$GB= 0
##$INTBC= 1
##$INTSCL= 9.790993e-09
##$ISEN= 30
##$LB= 1.5
##$LEV0= 0
##$LPBIN= 0
##$MAXI= 10000
##$MC2= 0
##$MEAN= 0
##$ME_mod= 0
##$MI= 50
##$NCOEF= 0
##$NC_proc= -7
##$NLEV= 6
##$NOISF1= 182.463
##$NOISF2= 159.3651
##$NSP= 0
##$NTH_PI= 0
##$NZP= 0
##$OFFSET= 198.0616
##$PC= 4
##$PHC0= 1517.978
##$PHC1= -278.9066
##$PH_mod= 1
##$PKNL= yes
##$PPARMOD= 0
##$PSCAL= 0
##$PSIGN= 0
##$REVERSE= no
##$SF= 81.0140089999434
##$SI= 65536
##$SIGF1= 159.3651
##$SIGF2= -187.1042
##$SINO= 113.3802
##$SIOLD= 16384
##$SREGLST= <1H.CDCl3>
##$SSB= 0
##$STSI= 65536
##$STSR= 0
##$SW_p= 32467.5324675325
##$SYMM= 0
##$S_DEV= 0
##$TDeff= 32768
##$TDoff= 0
##$TI= <>
##$TILT= no
##$TM1= 0
##$TM2= 0
##$TOPLEV= 0
##$USERP1= <user>
##$USERP2= <user>
##$USERP3= <user>
##$USERP4= <user>
##$USERP5= <user>
##$WDW= 1
##$XDIM= 65536
##$YMAX_p= 366426950
##$YMIN_p= -40792858
$$ End of Bruker specific parameters
$$ ---------------------------------
##NTUPLES= NMR SPECTRUM
##VAR_NAME=  FREQUENCY,     SPECTRUM/REAL,   SPECTRUM/IMAG
##SYMBOL=    X,             R,               I
##VAR_TYPE=  INDEPENDENT,   DEPENDENT,       DEPENDENT
##VAR_FORM=  AFFN,          ASDF,            ASDF
##VAR_DIM=   65536,         65536,           65536
##UNITS=     HZ,            ARBITRARY UNITS, ARBITRARY UNITS
##FACTOR=    0.49542278885378, 1,            1
##FIRST=     16045.7642231865, 0,            0
##LAST=      -16421.768244346, 0,            0
##MIN=       -16421.768244346, -40792858,    0
##MAX=       16045.7642231865, 366426950,    0
$$ Real data points
##PAGE= N=1
##DATA TABLE= (X++(R..R)), XYDATA
$$ [...]
$$ plain form
47886 -268284 119987 454691 484068 478499 782728 1217803 1197948 440829 -687176 -1626734
47876 -1626734 -2195602 -2483831 -2343750 -1411613 192341 1544360 1763311 1103784 674300
47867 674300 917358 948981 -148673 -1873488 -2852158 -2567060 -1698033 -851441 22930
47858 22930 753526 630431 -374413 -1009660 -294827 1010828 1513611 1211358 1208386 1741082
47848 1741082 1866777 1129566 167741 -584209 -1421863 -2127792 -1668665 -68055 717036
47839 717036 -820074 -3314862 -4041725 -2446726 -637479 -400725 -1233181 -1671543 -1252056
47830 -1252056 -481464 149192 316698 -322311 -1698710 -3064148 -3723265 -3734936 -3474541
47821 -3474541 -2936441 -2020191 -1135091 -848574 -1101725 -1377163 -1543618 -1915755 -2452485
$$ packed form
47886b68284L88271L34704K9377n569L04229M35075j9855p57119j128005r39558
47876a626734n68868k88229J40081R32137J603954J352019K18951o59527m29484
47867F74300K43058L1623j097654j724815r78670K85098Q69027Q46592Q74371
47858B2930P30596j23095j004844o35247P14833J305655N02783l02253k972N32696
47848A741082J25695p37211r61825p51950q37654p05929M59127J600610P85091
47839G17036j537110k494788p26863J594999J809247K36754q32456m38362M19487
47830a252056P70592O30656J67506o39009j376399j365438o59117j1671K60395
47821c474541N38100R16250Q85100K86517k53151k75438j66455l72137n36730
$$ plain form
47812 -2452485 -2517932 -1703906 -501459 149829 -185190 -1112877 -1908566 -2181149 -2087315 -1997123
47802 -1997123 -2032064 -2027939 -1930460 -1988573 -2392572 -2908095 -3115370 -2909147 -2528817 -2185128
47792 -2185128 -1902033 -1633780 -1251728 -503802 637857 1598477 1617312 701505 -231850
47783 -231850 -432587 -193511 -261861 -629812 -478156 639332 2080961 2848424 2663574
47774 2663574 1974792 1213617 585359 456055 1214182 2483845 3081896 2288331 818794
47765 818794 -8824 174318 668568 936696 1176978 1619788 2036707 2217676 2264455 2084698
47755 2084698 1284622 36570 -629351 -108745 692543 370654 -1149823 -2589876 -2968857
47746 -2968857 -2494158 -1812696 -1171022 -566110 -179366 -344138 -1272140 -2786101 -4097729
$$ packed form
47812b452485o5447Q14026J202447O51288l35019r27687p95689k72583R3834R0192
47802a997123l4941M125R7479n8113m03999n15523k07275K06223L80330L43689
47792b185128K83095K68253L82052P47926J141659R60620J8835r15807r33355
47783b31850k00737K39076o8350l67951J51656J117488J441629P67463j84850
47774B663574o88782p61175o28258j29304P58127J269663N98051p93565j469537
47765H18794q27618J83142M94250K68128K40282M42810M16919J80969M6779j79757
47755B084698q00076j248052o65921N20606Q01288l21889j520477j440053l78981
47746b968857M74699O81462O41674O04912L86744j64772r28002j513961j311628
$$ plain form
47737 -4097729 -4156240 -2762504 -1103241 -477462 -634755 -200312 1277785 2656916 2774701
47728 2774701 1783482 575374 -233032 -265122 774389 2477939 3593654 3289640 2144435
47719 2144435 1251308 839099 511841 350622 793377 1612707 1963562 1509560 764286
47710 764286 236780 -106095 -439459 -771765 -1173226 -1740259 -2169669 -1917311 -1005363 -178151
47700 -178151 18914 -112618 6584 423004 817075 1190729 1859088 2759242 3214197 2644883
47690 2644883 1355428 323281 144496 397327 241356 -503001 -1191566 -1242548 -807199
47681 -807199 -450448 -513872 -949829 -1421939 -1360631 -322583 1372162 2693928 2952585
47672 2952585 2510527 2140054 2056877 2010491 1911649 1771112 1327313 423566 -407196 -406309
$$ packed form
47737d097729n8511J393736J659263O25779j57293M34443J478097J379131J17785
47728B774701r91219j208108q08406l2090J039511J703550J115715l04014j145205
47719B144435q93127m12209l27258j61219M42755Q19330L50855m54002p45274
47710G64286n27506l42875l33364l32306m01461n67033m29410K52358R11948Q27212
47700a78151J97065j31532J19202M16420L94071L73654O68359R00154M54955n69314
47690B644883j289455j032147j78785K52831j55971p44357o88565n0982M35349
47681h07199L56751o3424m35957m72110O1308J038048J694745J321766K58657
47672B952585m42058l70473q3177m6386r8842j40537m43799r03747q30762Q87
$$ plain form
47662 -406309 417558 1323474 1747629 1592123 815984 -447669 -1397173 -1079122 368968
47653 368968 1715450 2123623 1978220 1979985 2147779 2147034 1989174 1862610 1679028 1266906
47643 1266906 710735 112775 -670470 -1652819 -2330293 -2099267 -1017813 81877 262299
47634 262299 -668518 -1791114 -1745041 -202023 1459610 1547483 76427 -1306506 -1426154
47625 -1426154 -719323 -93554 281344 488294 174781 -751245 -1439195 -1098816 -238678
47616 -238678 45883 -301275 -341084 373669 1305523 1910115 2239860 2472722 2591793 2677928
47606 2677928 2856808 2816034 2039612 736600 -99777 99163 700818 682550 -121732 -945720
47596 -945720 -1043284 -395624 440147 934890 984732 784170 429817 -166169 -957790 -1655659
$$ packed form
47662d06309Q23867R05916M24155j55506p76139j263653r49504L18051J448090
47653C68968J346482M08173j45403J765J67794p45j57860j26564j83582m12122
47643A266906n56171n97960p83245r82349o77474K31026J081454J099690J80422
47634B62299r30817j122596M6073J543018J661633Q7873j471056j382933j19648
47625a426154P06831O25769L74898K06950l13513r26026o87950L40379Q60138
47616b38678K84561l47158l9809P14753R31854O04592L29745K32862J19071Q6135
47606B677928J78880m0774p76422j303012q36377J98940O01655j8268q04282q23988
47596i45720r7564O47660Q35771M94743M9842k00562l54353n95986p91621o97869
$$ plain form
47586 -1655659 -2097993 -2440757 -2759536 -2792598 -2374332 -1760136 -1155175 -360097 598728 988058
47576 988058 326408 -519754 -221023 1083705 1796931 1023357 -261467 -640316 -14817
47567 -14817 644347 650892 61037 -745561 -1311591 -1263150 -774273 -565778 -930412 -1115941
47557 -1115941 -312444 1030163 1635971 1071259 201822 -116737 -27763 -8090 93252 695108
47547 695108 1524511 1780864 1281669 805243 1041539 1693271 2017298 1889625 1763805 1732359
47537 1732359 1316496 349183 -515909 -540427 227545 1162326 1811982 2074121 1944844 1561209
47527 1561209 1278017 1231734 996861 158186 -919291 -1423557 -1134232 -609600 -365372
47518 -365372 -396942 -539010 -756175 -965059 -1034837 -1071061 -1273996 -1457319 -1168360 -349896
$$ packed form
47586a655659m42334l42764l18779l3062M18266O14196O04961P95078R58825L89330
47576I88058o61650q46162K98731J304728P13226p73574j284824l78849O25499
47567a4817O59164O545n89855q06598n66030M8441M88877K08495l64634j85529
47557a115941Q03497J342607O05808n64712q69437l18559Q8974J9673J01342O01856
47547F95108Q29403K56353m99195m76426K36296O51732L24027j27673j25820l1446
47537A732359m15863r67313q65092k4518P67972R34781O49656K62139j29277l83635
47527A561209k83192m6283k34873q38675j077477n04266K89325N24632K44228
47518c65372l1570j42068k17165k08884o9778l6224k02935j83323K88959Q18464
$$ plain form
47508 -349896 586513 1370402 2007197 2289570 1894539 1162023 1015660 1689822 2171385 1441051
47498 1441051 -193502 -1515668 -1776761 -1179058 -327617 282633 439915 309931 234805
47489 234805 194533 -269362 -1339576 -2464905 -2933327 -2606407 -1815439 -913038 -272415
47480 -272415 -326672 -1134965 -2140411 -2699508 -2613996 -1964322 -912081 28341 141846 -546447
47470 -546447 -1045632 -714306 -232394 -536506 -1364697 -1808796 -1860089 -2245237 -2910124 -2914779
47460 -2914779 -1992067 -1071268 -851008 -817163 -256555 507288 616115 -613 -487715 -148136
47450 -148136 813337 1699337 2194006 2580361 3009837 2844956 1331760 -948215 -2088126
47441 -2088126 -959560 1253687 2434669 2020480 1185505 898775 954951 860850 510728
$$ packed form
47508c49896R36409P83889O36795K82373l95031p32516j46363O74162M81563p30334
47498A441051j634553j322166k61093N97703Q51441O10250J57282j29984p5126
47489B34805m0272m63895j070214j125329m68422L26920P90968R02401O40623
47480b72415n4257q08293j005446n59097Q5512O49674J052241R40422J13505o88293
47470e46447m99185L31326M81912l04112q28191m44099n1293l85148o64887m655
47460b914779R22712R20799K20260L3845N60608P63843J08827o16728m87102L39579
47450a48136R61473Q86000M94669L86355M29476j64881j513196k279975j139911
47441b088126J128566K213247J180982m14189q34975k86730N6176r4101l50122
$$ plain form
47432 510728 -157097 -1101885 -1625364 -995579 155539 267569 -960016 -2081443 -2100200
47423 -2100200 -1775701 -1976877 -2143499 -1533057 -778589 -787450 -1030834 -478326 459759 564074
47413 564074 -61086 -156364 589320 1248996 1450931 1795282 2279335 1988995 864381 200787
47403 200787 635483 1053633 466781 -274791 136852 1329217 1849535 1309099 578335
47394 578335 135094 -466402 -1430791 -2155600 -2141050 -1666700 -1226551 -885436 -524130 -265705
47384 -265705 -297968 -521142 -648848 -558214 -397732 -381827 -494041 -387525 298111 1465708
47374 1465708 2588807 3268116 3467683 3111598 1947903 176318 -1255941 -1577289 -1151104
47365 -1151104 -929075 -1169327 -1376319 -1377285 -1616518 -2207995 -2445011 -1679861 -268084 717307
$$ packed form
47432E10728o67825r44788n23479O29785J151118J12030j227585j121427j8757
47423b100200L24499k01176j66622O10442P54468q861k43384N52508R38085J04315
47413E64074o25160r5278P45684O59676K01935L44351M84053k90340j124614o63594
47403B00787M34696M18150n86852p41572M11643J192365N20318n40436p30764
47394E78335m43241o01496r64389p24809J4550M74350M40149L41115L61306K58425
47384b65705l2263k23174j27706R0634J60482J5905j12214J06516O85636J167597
47374A465708J123099O79309J99567l56085j163695j771585j432259l21348M26185
47365a151104K22029k40252k06992r66k39233n91477k37016P65150J411777R85391
$$ plain form
47355 717307 482202 -879879 -2402794 -2784857 -1424207 818494 2295718 2257602 1487399
47346 1487399 1086334 1164915 1094181 539438 -281867 -1041073 -1512103 -1606571 -1605940 -2045056
47336 -2045056 -2927898 -3423743 -2882152 -1799832 -1141126 -1018934 -822660 -424316 -324676
47327 -324676 -588092 -552191 180157 1236389 2206445 3118679 3862653 3889915 2971661 1678301
47317 1678301 670647 47364 -245995 -41482 493241 594458 -100727 -828089 -696206
47308 -696206 60825 606526 819782 1169678 1600939 1564380 1045876 606603 427579 233009
47298 233009 132119 513451 1014568 701033 -439611 -1252754 -1087392 -654764 -641646 -528769
47288 -528769 360039 1526330 2048578 2014453 2128530 2381608 2254868 1948334 2206026 2957066
$$ packed form
47355G17307k35105j362081j522915l82063J360650K242701J477224l8116p70203
47346A487399m01065P8581p0734n54743q21305p59206m71030r4468O31m39116
47336b045056q82842m95845N41591J082320O58706J22192J96274L98344R9640
47327c24676k63416L5901P32348J056232R70056R12234P43974K7262r18254j293360
47317A678301j007654o23283k93359K04513N34723J01217o95185p27362J31883
47308f96206P57031N45701K13256L49896M31261l6559n18504m39273j79024j94570
47298B33009j00890L81332N01117l13535j140644q13143J65362M32628J3118J12877
47288e28769Q88808J166291N22248l4125J14077K53078j26740l06534K57692P51040
$$ plain form
47278 2957066 3255031 2731374 2129273 2135401 2541269 2850802 2899890 2527935 1455822 -3981
47268 -3981 -821470 -448582 373158 584346 122196 -346487 -570417 -830704 -1142390 -1140951
47258 -1140951 -812347 -691794 -1144603 -1870921 -2278301 -2041661 -1241820 -291909 206930
47249 206930 -93370 -835579 -1232686 -942693 -416134 -246742 -462585 -648899 -503952 -17094
47239 -17094 685456 1347985 1548706 982884 -191323 -1460832 -2346790 -2524409 -1776805
47230 -1776805 -268347 1174585 1600044 984932 348114 505141 1072211 1110352 430924
47221 430924 -299112 -550648 -359058 199515 1185334 2236329 2585785 2106180 1733637
47212 1733637 2254052 3152196 3394266 2992858 2894902 3410148 3702291 3070310 1934154
$$ packed form
47278B957066K97965n23657o02101O128M05868L09533M9088l71955j072113j459803
47268c981q17489L72888Q21740K11188m62150m68683k23930k60287l11686J439
47258a140951L28604J20553m52809p26318m07380K36640P99841R49911M98839
47249B06930l00300p42209l97107K89993N26559J69392k15843j86314J44947M86858
47239a7094P02550O62529K00721n65822j174207j269509q85958j77619P47604
47230a776805J508458J442932M25459o15112o36818J57027N67070L8141o79428
47221D30924p30036k51536J91590N58573R85819J050995L49456m79605l72543
47212A733637N20415Q98144K42070m01408r7956N15246K92143o31981j136156
$$ plain form
47203 1934154 1127232 807221 555368 136513 -320090 -619884 -589258 -110163 589383 958120
47193 958120 818245 782726 1544134 2928102 4061417 4302312 3589830 2112832 249589
47184 249589 -1213052 -1470378 -560692 537156 831562 81422 -1319062 -2711854 -3335928
47175 -3335928 -2730526 -1368340 -462769 -675252 -1277939 -1063400 105654 1174964 1271942
47166 1271942 655606 148339 93331 237763 397406 764423 1463156 2100490 2038492 1128522
47156 1128522 18262 -390746 209679 1266329 1918054 1770781 1160607 744976 860150
47147 860150 1231093 1304217 902770 513853 816688 1912541 3136181 3687086 3355915
47138 3355915 2555931 1746721 1016509 273030 -343557 -497577 -164804 138920 -94228
$$ packed form
47203A934154q06922l20011k51853m18855m56603k99794L0626M79095O99546L68737
47193I58120j39875l5519P61408J383968J133315K40895p12482j476998j863243
47184B49589j462641k57326R09686J097848K94406p50140j400484j392792o24074
47175c335928O05402J362186R05571k12483o02687K14539J169054J069310R6978
47166A271942o16336n07267n5008J44432J59643L67017O98733O37334o1998r09970
47156A128522j110260m09008O00425J056650O51725j47273o10174m15631J15174
47147H60150L70943P3124m01447l88917L02835J095853J223640N50905l31171
47138C355915p99984q09210p30212p43479o16587j54020L32773L03724k33148
$$ plain form
47129 -94228 -665602 -854249 -359334 295820 489932 287745 174987 297287 405551 394780
47119 394780 420782 541993 688583 932107 1318184 1499592 1098790 407019 54920 -44560
47109 -44560 -595717 -1563870 -1894989 -1115240 -277242 -489972 -1275951 -1414914 -833246 -460709
47099 -460709 -575748 -628221 -633271 -1340412 -2704160 -3425737 -2597552 -882653 478395 1008341
47089 1008341 852637 202460 -476433 -437228 369803 979084 780605 474605 817577 1201523
47079 1201523 644245 -385944 -538823 231500 491577 -470143 -1553814 -1458324 -405662
47070 -405662 348137 69800 -889091 -1594944 -1226455 284013 2017666 2894316 2863889
47061 2863889 2728387 2713196 2078675 540870 -800258 -715145 500233 1389494 1055073
$$ packed form
47129i4228n71374j88647M94915O55154J94112k02187j12758J22300J08264j0771
47119C94780K6002J21211J46590K43524L86077J81408m00802o91771l52099r9480
47109d4560n51157r68153l31119P79749Q37998k12730p85979j38963N81668L72537
47099d60709j15039n2473n050p07141j363748p21577Q28185J714899J361048N29946
47089A008341j55704o50177o78893L9205Q07031O09281j98479l06000L42972L83946
47079A201523n57278j030189j52879P70323K60077r61720j083671R5490J052662
47070d05662P53799k78337r58891p05853L68489J510468J733653Q76650l0427
47061B863889j35502j5191o34521j537805j341128Q5113J215378Q89261l34421
$$ plain form
47052 1055073 -149234 -1398712 -2169087 -2272000 -1734090 -832235 12065 473250 436478
47043 436478 50158 -271531 -204715 -5446 -282364 -1126397 -1919548 -2233114 -2379921 -2725679
47033 -2725679 -3009660 -2832600 -2321228 -1779865 -1169670 -508619 -266052 -657597 -1025415
47024 -1025415 -705017 -63468 190224 270861 840981 1629267 1759149 1306722 1211858 1569506
47014 1569506 1359529 175117 -1077151 -1664802 -1979685 -2415473 -2525728 -2101364 -1960464
47005 -1960464 -2679181 -3488894 -3495063 -3121700 -3145006 -3066054 -1893016 -93866 740002 83700
46995 83700 -1017979 -1671995 -2054505 -2400714 -2346347 -1758043 -1209332 -1093382 -1089017 -1007571
46985 -1007571 -1357647 -2433909 -3501740 -3611580 -2832001 -2068510 -1928840 -2236972 -2408709
$$ packed form
47052A055073j204307j249478p70375j02913N37910R01855Q44300M61185l6772
47043D36478l86320l21689O6816J99269k76918q44033p93151l13566j46807l45758
47033b725679k83981J77060N11372N41363O10195O61051K42567l91545l67818
47024a025415L20398O41549K53692Q0637N70120P88286J29882m52427r4864L57648
47014A569506k09977j184412j252268n87651l14883m35788j10255M24364J40900
47005a960464p18717q09713o169L73363k3306P8952J173038J799150Q33868o56302
46995H3700j101679o54016l82510l46209N4367N88304N48711J15950M365Q1446
46985a007571l50076j076262j067831j09840P79579P63491J39670l08132j71737
$$ plain form
46976 -2408709 -1906206 -605028 881412 1505010 837830 -339448 -832551 -251228 798212
46967 798212 1437314 1113439 -191517 -1868780 -2967830 -3030448 -2576893 -2404106 -2508621
46958 -2508621 -2134632 -890732 598220 1298479 767507 -589235 -2055545 -3170812 -3774193
46949 -3774193 -3723235 -2900250 -1638416 -827320 -1122801 -2068990 -2468795 -1751227 -568798
46940 -568798 97549 -21411 -528647 -935024 -868455 -218038 479254 254708 -1110781 -2450681
46930 -2450681 -2361049 -759125 1233219 2638688 3189596 2880268 1906267 1028485 1053854
46921 1053854 1727688 1923340 1182141 293574 39478 209544 381777 838107 1846175
46912 1846175 2599928 1942848 41760 -1579513 -1836601 -1220766 -899324 -1264227 -1769915
$$ packed form
46976b408709N02503J301178J486440O23598o67180j177278m93103N81323J049440
46967G98212O39102l23875j304956j677263j099050o2618M53555J72787j04515
46958b508621L73989J243900J488952P00259n30972j356742j466310j115267o03381
46949c774193N0958Q22985J261834Q11096k95481r46189l99805P17568J182429
46940e68798O66347j18960n07236m06377O6569O50417O97292k24546j365489j339900
46930b450681Q9632J601924J992344J405469N50908l09328r74001q77782K5369
46921A053854O73834J95652p41199q88567k54096J70066J72233M56330J008068
46912A846175P53753o57080j901088j621273k57088O15835L21442l64903n05688
$$ plain form
46903 -1769915 -1847138 -1500919 -1059347 -679368 -250665 314641 861400 1155716 1216286 1319421
46893 1319421 1634856 2031209 2342365 2635807 3017642 3295581 3091725 2307793 1323752
46884 1323752 698467 728345 1253070 1807757 1989251 1723408 1170077 462403 -273762 -723345
46874 -723345 -598957 -190015 -286054 -1214349 -2251809 -2429876 -1739746 -1049291 -906798 -983441
46864 -983441 -788937 -383536 -84478 105842 352510 525081 367020 65956 181452 871388
46854 871388 1567084 1688809 1435959 1499608 2084993 2640036 2642474 2256951 1960289 1846689
46844 1846689 1699991 1551400 1684962 2124258 2550379 2746445 2701330 2273795 1302483 176037
46834 176037 -318667 -32990 210704 -249625 -953275 -1034813 -492657 -82670 -202634 -560612
$$ packed form
46903a769915p7223L46219M41572L79979M28703N65306N46759K94316O0570J03135
46893A319421L15435L96353L11156K93442L81835K77939k03856p83932r84041
46884A323752o25285K9878N24725N54687J81494k65843n53331p07674p36165m49583
46874g23345J24388M08942r6039r28295j037460j78067O90130O90455J42493p6643
46864i83441J94504M05401K99058J90320K46668J72571j58061l01064J15496O89936
46854H71388O95696J21725k52850O3649N85385N55043K438l85523k96662j13600
46844A846689j46698j48591J33562M39296M26121J96066m5115m27535r71312j126446
46834A76037m94704K85677K43694m60329p03650q1538N42156M09987j19964l57978
$$ plain form
46824 -560612 -830452 -994314 -1072488 -1095677 -1310786 -1825039 -2076706 -1332294 196990 1390117
46814 1390117 1551558 1110168 770185 599991 335852 49679 14923 223335 452081 594529
46804 594529 617061 424462 77862 -43288 415753 1381187 2436836 3172389 3399325 3279677
46794 3279677 3294793 3757256 4290719 4214747 3570400 3255706 3851946 4756674 4869300 3840015
46784 3840015 2304746 1130008 701168 723125 514124 -250134 -970478 -690706 627742
46775 627742 1886083 2118200 1447613 530399 -297728 -904135 -1071512 -939438 -1186658
46766 -1186658 -2126709 -3100330 -3396947 -3244362 -3154404 -2872306 -1951827 -945996 -889552 -1741030
46756 -1741030 -2415864 -2385359 -2247656 -2588831 -3190481 -3576482 -3559919 -3043943 -1988143 -753302
$$ packed form
46824e60612k69840j63862p8174k3189k15109n14253k51667P44412J529284J193127
46814A390117J61441m41390l39983j70194k64139k86173l4756K08412K28746J42448
46804E94529K2532j92599l46600j21150M59041R65434J055649P35553K26936j19648
46794C279677J5116M62463N33463p5972o44347l14694N96240R04728J12626j029285
46784C840015j535269j174738m28840K1957k09001p64258p20344K79772J318448
46775F27742J258341K32117o70587r17214q28127o06407j67377J32074k47220
46766a186658r40051r73621k96617J52585Q9958K82098R20479J005831N6444q51478
46756a741030o74834L0505J37703l41175o01650l86001J6563N15976J055800J234841
$$ plain form
46746 -753302 154076 759696 1386762 1779339 1316252 183023 -602061 -583723 -427470 -773445
46736 -773445 -1352791 -1599776 -1380198 -769116 125733 765143 405196 -848278 -1941499
46727 -1941499 -2198681 -1974505 -1679961 -1157699 -528526 -569564 -1463516 -2144422 -1816948 -1243448
46717 -1243448 -1450163 -1939019 -1451236 28358 1354330 2016917 2569201 3333312 3871932
46708 3871932 3866582 3511889 2851616 1601753 -112448 -1544070 -2100681 -1853680 -1215544
46699 -1215544 -592454 -336980 -544731 -906721 -1125699 -1272184 -1358985 -1027833 -267418 89007
46689 89007 -564213 -1499565 -1617206 -1080089 -816653 -775389 -141367 825560 808899 -446471
46679 -446471 -1604860 -1826943 -1881629 -2471006 -2920103 -2551472 -2087474 -2426746 -2996497 -2666510
$$ packed form
46746g53302R07378O05620O27066L92577m63087j133229p85084J8338J56253l45975
46736g73445n79346k46985K19578O11082Q94849O39410l59947j253474j093221
46727a941499k57182K24176K94544N22262O29173m1038q93952o80906L27474N73500
46717a243448k06715m88856M87783J479594J325972O62587N52284P64111N38620
46708C871932n350l54693o60273j249863j714201j431622n56611K47001O38136
46699a215544O23090K55474k07751l61990k18978j46485q6801L31152P60415L56425
46689H9007o53220r35352j17641N37117K63436M1264O34022R66927j6661j255370
46679d46471j158389k22083n4686n89377m49097L68631M63998l39272n69751L29987
$$ plain form
46669 -2666510 -1609954 -900683 -706343 -215766 807981 1594478 1528709 845470 143962
46660 143962 -73465 489270 1525574 2012164 1291480 108434 -271182 189848 386561
46651 386561 -180796 -828463 -965741 -835052 -664067 -187309 423705 179607 -1313457
46642 -1313457 -2801489 -2752093 -1363871 -220856 -137910 -363758 -23706 613807 775787
46633 775787 403422 60569 -60348 -351830 -984716 -1431609 -1055312 99343 1336807
46624 1336807 1971845 1777221 961221 -17465 -689895 -904974 -911778 -933527 -788304 -243220
46614 -243220 389895 511816 120992 -108226 189714 585304 692671 899470 1641797 2358419
46604 2358419 1974183 372261 -1310851 -1981131 -1642143 -1022286 -667741 -662550 -844136
$$ packed form
46669b666510J056556P09271J94340M90577J023747P86497o5769o83239p01508
46660A43962k17427N62735J036304M86590p20684j183046l79616M61030J96713
46651C86561n67357o47667j37278J30689J70985M76758O11014k44098j493064
46642a313457j488032M9396J388222J143015Q2946k25848L40052O37513J61980
46633G75787l72365l42853j20917k91482o32886m46893L76297J154655J237464
46624A336807O35038j94624q16000r78686o72430k15079o804k1749J45223N45084
46614b43220O33115J21921l90824k29218K97940L95590J07367K06799P42327P16622
46604B358419l84236j601922j683112o70280L38988O19857L54545N191j81586
$$ plain form
46595 -844136 -944736 -697921 -53262 769635 1485086 1867716 1745357 1186929 711844 891907
46585 891907 1571341 1881751 1332489 553659 537600 1336146 1986740 1718816 798083 43000
46575 43000 -137735 43269 292679 625754 1159734 1759257 2086242 1963733 1532780 1009986
46565 1009986 434165 -218773 -767477 -898577 -566938 -151749 -83959 -410668 -850023 -1186419
46555 -1186419 -1435300 -1654473 -1805283 -1851565 -1812349 -1632656 -1186799 -537393 -3301 202995
46545 202995 197529 53827 -492273 -1501245 -2231484 -1842097 -769453 -549623 -1834205
46536 -1834205 -3336728 -3444912 -2272294 -1203870 -832687 -473390 374785 1268185 1765013
46527 1765013 2072947 2314538 2095852 1407946 1123046 1823823 2764792 2796889 1842461 680960
$$ packed form
46595h44136j00600K46815O44659Q22897P15451L82630j22359n58428m75085J80063
46585H91907O79434L10410n49262p78830j6059P98546O50594k67924r20733p55083
46575D3000j80735J81004K49410L33075N33980N99523L26985j22509m30953n22794
46565A009986n75821o52938n48704j31100L31639M15189O7790l26709m39355l36396
46555a186419k48881k19173j50810m6282L9216J79693M45857O49406N34092K06296
46545B02995n466j43702n46100j008972p30239L89387J072644K19830j284582
46536a834205j502523j08184J172618J068424L71183L59297Q48175Q93400M96828
46527A765013L07934K41591k18686o87906k84900P00777R40969L2097r54428j161501
$$ plain form
46517 680960 -254314 -966497 -1144915 -365289 1009194 2014919 2221710 1941739 1372656
46508 1372656 417346 -597946 -1027797 -1031692 -1649088 -3224845 -4554897 -4298275 -2674219
46499 -2674219 -1025487 -112660 360839 758742 931524 770055 672202 1085464 1879202
46490 1879202 2444234 2282161 1355212 4312 -1290436 -2119372 -2312647 -2017019 -1561160
46481 -1561160 -1142619 -659096 15082 591410 505763 -274637 -843118 -218629 1384275
46472 1384275 2604210 2428924 1296947 457958 504665 876386 706510 -172514 -1132228
46463 -1132228 -1466986 -1097689 -577947 -432455 -560079 -407287 286859 1113381 1455166
46454 1455166 1169103 652168 327470 260288 270834 225497 113555 -41944 -193174 -227185
$$ packed form
46517F80960r35274p12183j78418P79626J374483J005725K06791k79971n69083
46508A372656r55310j015292m29851l895o17396j575757j330052K56622J624056
46499b674219J648732R12827M73499L97903J72782j61469r7853M13262P93738
46490A879202N65032j62073r26949j350900j294748q28936j93275K95628M55859
46481a561160M18541M83523O74178N76328q5647p80400n68481O24489J602904
46472A384275J219935j75286j131977q38989M6707L71721j69876q79024r59714
46463a132228l34758L69297N19742J45492j27624J52792O94146Q26522L41785
46454A455166k86063n16935l24698o7182J0546m5337j11942j55499j51230l4011
$$ plain form
46444 -227185 -91264 15673 -221191 -789733 -1247369 -1272729 -1142446 -1352633 -1893243 -2278086
46434 -2278086 -2225399 -1876799 -1394182 -894089 -797910 -1511466 -2504263 -2495157 -1089156 442965
46424 442965 716088 1661 -382933 4315 455200 554847 749236 1273119 1497672 828538
46414 828538 -382654 -1302838 -1607805 -1643616 -1839421 -2199622 -2279124 -1677417 -689584 -197881
46404 -197881 -560400 -948686 -356525 1054943 2327885 3065608 3451178 3188770 1747842
46395 1747842 -219570 -1089478 -392230 487507 377769 -100596 107391 668200 613002
46386 613002 135662 263912 1078049 1527764 1004258 82072 -396593 -194453 423559 993315
46376 993315 1011905 384248 -279002 -327988 31045 52688 -432416 -850826 -840931 -744665 -987455
$$ packed form
46444b27185J35921J06937k36864n68542m57636k5360J30283k10187n40610l84843
46434b278086N2687L48600M82617N00093R6179p13556r92797R106J406001J532121
46424D42965K73123p14427l84594L87248M50885R9647J94389N23883K24553o69134
46414H28538j211192r20184l04967l5811j95805l60201p9502O01707R87833M91703
46404a97881l62519l88286N92161J411468J272942P37723L85570k62408j440928
46395A747842j967412q69908O97248Q79737j09738m78365K07987N60809n5198
46386F13002m77340J28250Q14137M49715n23506r22186m78665K02140O18012N69756
46376I93315J8590o27657o63250m8986L59033K1643m85104m18410R895R6266k42790
$$ plain form
46365 -987455 -1441797 -1607485 -1154722 -217201 653982 875524 361969 -442113 -1169111 -1841800
46355 -1841800 -2391557 -2384250 -1674373 -852225 -451213 -136379 627583 1489023 1628953 1027855
46345 1027855 430385 158674 -138383 -547502 -621405 -227671 141898 167794 99964 82259
46335 82259 -239421 -1044996 -1806707 -1848724 -1123318 -167877 427676 362309 -234612 -842733
46325 -842733 -987888 -717273 -449290 -477141 -918791 -1889710 -3197698 -4096102 -4022178 -3449288
46315 -3449288 -3258537 -3355665 -2793614 -1319799 148702 819294 869282 660173 43841
46306 43841 -1008799 -1914211 -2298885 -2670095 -3532650 -4334376 -4074715 -2686771 -1106837
46297 -1106837 -82737 502095 1113532 1822590 2224825 1976359 1328390 955876 1077934
$$ packed form
46365i87455m54342j65688M52763R37521Q71183K21542n13555q04082p26998o72689
46355a841800n49757P307P09877Q22148M01012L14834P63962Q61440J39930o01098
46345A027855n97470k71711k97057m09119p3903L93734L69569K5896o7830j7705
46335H2259l21680q05575p61711m2017P25406R55441N95553o5367n96921o08121
46325h42733j45155K70615K67983k7851m41650r70919j307988q98404P3924N72890
46315c449288J90751r7128N62051J473815J468501O70592M9988k09109o16332
46306D3841j052640r05412l84674l71210q62555q01726K59661J387944J579934
46297a106837J024100N84832O11437P09058M02235k48466o47969l72514J22058
$$ plain form
46288 1077934 1060528 379514 -352551 -157649 691888 978187 596064 961696 2750092
46279 2750092 4485671 4418638 2849575 1393503 674194 130283 -333288 -38628 1070897
46270 1070897 2056619 2343456 2436370 2909223 3564083 4038902 4460238 4906116 4835828 3788115
46260 3788115 2354653 1736860 2270841 2886808 2286889 437829 -1400506 -2111345 -1863516
46251 -1863516 -1621768 -1833841 -2115996 -2150448 -2199440 -2471157 -2597198 -2231120 -1726633 -1648065
46241 -1648065 -1880826 -1800452 -1182860 -427559 68451 319302 541328 873176 1299740 1637206
46231 1637206 1669785 1429458 1125525 691628 -182523 -1316994 -1838783 -1178264 108581
46222 108581 1006368 1215217 1197899 1389157 1839840 2312186 2281090 1298889 -108169 -491871
$$ packed form
46288A077934j7406o81014p32065J94902Q49537K86299l82123L65632J788396
46279B750092J735579o7033j569063j456072p19309n43911m63571K94660J109525
46270A070897R85722K86837R2914M72853O54860M74819M21336M45878p0288j047713
46260C788115j433462o17793N33981O15967n99919j849060j838335p10839K47829
46251a863516K41748k12073k82155l4452m8992k71717j26041L66078N04487P8568
46241a648065k32761Q0374O17592P55301M96010K50851K22026L31848M26564L37466
46231A637206L2579k40327l03933m33897q74151j134471n21789O60519J286845
46222A08581Q97787K08849j7318J91258M50683M72346l1096r82201j407058l83702
$$ plain form
46212 -491871 798842 2478254 2841434 1979254 1387753 1703918 2123520 2000089 1654757
46203 1654757 1365574 853152 245616 379506 1448311 2301342 1887945 696045 -43738
46194 -43738 -57389 -112913 -684117 -1269258 -1086281 -67154 942549 985246 92326 -643974
46184 -643974 -465502 -65306 -584686 -1778091 -2259378 -1578425 -801731 -707188 -700721 -170729
46174 -170729 322778 164628 -72789 309366 632648 -268873 -2115690 -3427578 -3492704
46165 -3492704 -2946049 -2492713 -2147611 -1778323 -1430268 -990646 -326045 198420 90568
46156 90568 -415336 -691367 -833444 -1474481 -2431525 -2647659 -1820417 -1045848 -1252083 -1836376
46146 -1836376 -1596824 -429240 670466 958664 621490 257951 227569 492287 774059
$$ packed form
46212d91871J290713J679412L63180q62180n91501L16165M19602j23431l45332
46203A654757k89183n12422o07536J33890J068805Q53031m13397j191900p39783
46194d3738j3651n5524n71204n85141J82977J019127J009703M2697q92920p36300
46184f43974J78472M00196n19380j193405m81287O80953P76694R4543O467N29992
46174a70729M93507j58150k37417L82155L23282r01521j846817j311888o5126
46165c492704N46655M53336L45102L69288L48055M39622O64601N24465j07852
46156I0568n05904k76031j42077o41037r57044k16134Q27242P74569k06235n84293
46146a836376K39552J167584J099706K88198l37174l63539l0382K64718K81772
$$ plain form
46137 774059 866448 892960 1112740 1466522 1655120 1715042 2030034 2595974 2814342 2323231
46127 2323231 1496869 717018 -270113 -1651206 -2702493 -2525853 -1454964 -844357 -1342573
46118 -1342573 -2120354 -2095989 -1323920 -736354 -875739 -1348581 -1439882 -955168 -396663 -372293
46108 -372293 -848684 -1119320 -678588 44032 178425 -450015 -1175441 -1538251 -1884832 -2620690
46098 -2620690 -3393022 -3530616 -2976504 -2242688 -1633557 -1056614 -484748 -31260 420780
46089 420780 1091172 1736386 1787069 1217027 717748 760748 1036959 1161578 1355404 1891566
46079 1891566 2338183 2050783 1170733 441165 147527 -68189 -353785 -348526 53632 275238
46069 275238 -225217 -1189865 -1858785 -1781537 -1092589 -223718 414961 642188 590327 491097
$$ packed form
46137G74059R2389K6512K19780L53782J88598N9922L14992N65940K18368m91111
46127B323231q26362p79851r87131j381093j051287J76640J070889O10607m98216
46118a342573p77781K4365P72069N87566j39385m72842r1301M84714N58505K4370
46108c72293m76391k70636M40732P22620J34393o28440p25426l62810l46581p35858
46098b620690p72332j37594N54112P33816O09131N76943N71866M53488M52040
46089D20780O70392O45214N0683n70042m99279M3000K76211J24619J93826N36162
46079A891566M46617k87400q80050p29568k93638k15716k85596N259M02158K21606
46069B75238n00455r64648o68920P7248O88948Q68871O38679K27227n1861r9230
$$ plain form
46059 491097 357138 80709 -192483 -152860 170846 419788 506588 712499 997664 790246
46049 790246 -142421 -1110594 -1320252 -910272 -598111 -572805 -402789 71241 424221 302242
46039 302242 -142298 -581296 -824798 -712000 -168978 439449 453424 -309015 -1248424 -1730694
46029 -1730694 -1851896 -2133697 -2679535 -3041518 -2872135 -2331570 -1769209 -1307931 -922599
46020 -922599 -691794 -659939 -530542 108985 1102819 1613837 1066570 25153 -350564 263943
46010 263943 979031 926046 368814 190788 659613 1251589 1524732 1582884 1660960 1780328
46000 1780328 1958906 2298816 2608466 2317382 1152805 -290102 -1049061 -846802 -330509
45991 -330509 -219277 -523665 -776974 -754756 -606058 -391557 29883 538873 664687 305787
$$ packed form
46059D91097j33959k76429k73192L9623L23706K48942Q6800K05911K85165k07418
46049G90246r32667r68173k09658M09980L12161K5306J70016M74030L52980j21979
46039C02242m44540m38998k43502J12798N43022O08427J3975p62439r39409m82270
46029a730694j21202k81801n45838l61983J69383N40565N62361M61278L85332
46020i22599K30805L1855J29397O39527R93834N11018n47267j041417l75717O14507
46010B63943P15088n2985n57232j78026M68825N91976K73143N8152P8076J19368
46000A780328J78578L39910L09650k91084j164577j442907p58959K02259N16293
45991c30509J11232l04388k53309K2218J48698K14501M21440N08990J25814l58900
$$ plain form
45981 305787 146121 814761 1873856 2299323 1879882 1388477 1279901 1068227 372172
45972 372172 -218849 16177 774803 1150488 863959 384709 96681 53982 366577 1066606
45962 1066606 1658476 1544974 935444 634579 848431 908989 375006 -262066 -270831 472567
45952 472567 1637063 2928269 4055321 4607774 4368343 3543573 2487840 1478688 882969
45943 882969 1084997 1939067 2652434 2570229 1865439 1227802 1128350 1569835 2206969 2452841
45933 2452841 1819203 477520 -794650 -1486831 -1831530 -2128861 -2070121 -1263515 -108978
45924 -108978 480161 118446 -806463 -1808520 -2642979 -3003427 -2549178 -1491126 -681528
45915 -681528 -765753 -1472119 -1995318 -1903484 -1417536 -898211 -333760 555621 1780308 2799626
$$ packed form
45981C05787j59666O68640J059095M25467m19441m91405j08576k11674o96055
45972C72172n91021K35026P58626L75685k86529m79250k88028m2699L12595P00029
45962A066606N91870j13502o09530l00865K13852O0558n33983o37072q765P43398
45952D72567J164496J291206J127052N52453k39431q24770j055733j009152n95719
45943H82969K02028Q54070P13367q2205p04790o37637r9452M41485O37134K45872
45933B452841o33638j341683j272170o92181l44699k97331N8740Q06606J154537
45924a08978N89139l61715r24909j002057q34459l60448M54249J058052Q09598
45915f81528q4225p06366n23199R1834M85948N19325N64451Q89381J224687J019318
$$ plain form
45905 2799626 2954757 2237251 1429149 1261149 1533016 1349348 231911 -1290784 -2314523
45896 -2314523 -2538093 -2402910 -2387348 -2427074 -2096953 -1221934 -176592 442431 421309 189225
45886 189225 428431 1363052 2447951 2863460 2360821 1508068 1012719 945566 825373 336543
45876 336543 -368150 -1037253 -1556802 -1720901 -1283503 -557997 -480803 -1526917 -2859251
45867 -2859251 -3185346 -2327088 -1312176 -957402 -1048448 -1030574 -818685 -606301 -409257 -191367
45857 -191367 -78995 -113666 -72048 220276 681450 1249204 1970584 2596436 2560953 1741213
45847 1741213 822667 435838 248526 -543271 -1994453 -3208409 -3340289 -2421058 -1187847
45838 -1187847 -398686 -304302 -538093 -503905 -2247 593422 861876 846276 895809 1195010
$$ packed form
45905B799626J55131p17506q08102j68000K71867j83668j117437j522695j023739
45896b314523k23570J35183J5562l9726L30121Q75019J045342O19023k1122k32084
45886A89225K39206R34621J084899M15509n02639q52753m95349o7153j20193m88830
45876C36543p04693o69103n19549j64099M37398P25506P7194j046114j332334
45867b859251l26095Q58258J014912L54774r1046J7874K11889K12384J97044K17890
45857a91367J12372l4671M1618K92324M61174N67754P21380O25852l5483q19740
45847A741213r18546l86829j87312p91797j451182j213956j31880R19231J233211
45838a187847P89161R4384k33791L4188N01658N95669K68454j5600M9533K99201
$$ plain form
45828 1195010 1626685 1938960 1934030 1690493 1629658 2018140 2375574 1920773 789032 141098
45818 141098 639631 1463867 1482229 868700 717338 1349140 1891608 1526934 451337 -464641
45808 -464641 -443356 721201 2411645 3481240 3325438 2546575 2033931 1678306 803414
45799 803414 -346309 -660599 121595 821640 418383 -649251 -1386746 -1683948 -2034585
45790 -2034585 -2322569 -1838280 -431855 1108676 1992397 2236499 2313276 2318099 1837903 638511
45780 638511 -779757 -1563884 -1431045 -920933 -606891 -411744 -15075 418901 448224 86135
45770 86135 -242775 -351212 -293556 144219 1185159 2258054 2302976 1146353 -173584
45761 -173584 -782768 -930756 -1141516 -1180550 -597155 218102 359439 -348035 -1053225 -835643
$$ packed form
45828A195010M31675L12275m930k43537o0835L88482L57434m54801j131741o47934
45818A41098M98533Q24236J8362o13529j51362O31802N42468l64674j075597r15978
45808d64641K1285J164557J690444J069595j55802p78863n12644l55625q74892
45799H03414j149723l14290P82194P00045m03257j067634p37495k97202l50637
45790b034585k87984M84289J406425J540531Q83721K44102P6777M823m80196j199392
45780F38511j418268p84127J32839N10112L14042J95147L96669M33976K9323l62089
45770H6135l28910j08437N7656M37775J040940J072895M4922j156623j319937
45761a73584o09184j47988k10760l9034N83395Q15257J41337p07474p05190K17582
$$ plain form
45751 -835643 400023 1897383 2643944 2155518 929896 -18858 -204669 11595 191327
45742 191327 381685 677617 829086 749774 899454 1569071 2185508 2000196 1244429 956247
45732 956247 1719452 3049391 3967933 3839413 2785957 1585787 953697 695739 -19164
45723 -19164 -1266043 -1884026 -982554 670854 1578156 1351630 715005 109800 -526896
45714 -526896 -794101 15334 1552421 2379163 1764925 602651 75356 260792 588292
45705 588292 879217 1247181 1550830 1627214 1666680 1809624 1771580 1377791 1044418 1168883
45695 1168883 1416737 1187415 458056 -401886 -1306851 -2289826 -2948814 -2811541 -2134379
45686 -2134379 -1623624 -1403678 -973975 -218234 308244 297553 182263 372176 634730 693994
$$ packed form
45751h35643J235666J497360P46561m88426j225622r48754j85811K16264J79732
45742A91327J90358K95932J51469p9312J49680O69617O16437j85312p55767k88182
45732I56247P63205J329939R18542j28520j053456j200170o32090k57958p14903
45723a9164j246879o17983R01472J653408R07302k26526o36625o05205o36696
45714e26896k67205Q09435J537087Q26742o14238j162274n27295J85436L27500
45705E88292K90925L67964L03649P6384L9466J42944l8044l93789l33373J24465
45695A168883K47854k29322p29359q59942r04965r82975o58988J37273O77162
45686b134379N10755K19946M29703P55741N26478j0691j15290J89913K62554N9264
$$ plain form
45676 693994 873770 1508905 2144654 2133851 1840412 2293549 3474312 3930073 2739920
45667 2739920 1109194 951830 2178395 2652344 1136263 -891711 -1205186 171688 1078375
45658 1078375 51068 -2105917 -3683126 -3966123 -3386365 -2631108 -2222421 -2442106 -3052156
45649 -3052156 -3372091 -3053541 -2462251 -1946348 -1196936 127109 1539350 2160635 1793670
45640 1793670 937931 -78836 -1297465 -2548644 -3411070 -3816819 -4032096 -3916733 -2913650
45631 -2913650 -1078319 515376 888447 294425 -206703 -55405 346098 340944 -179778
45622 -179778 -696816 -633734 -21605 444182 205073 -380963 -449283 183231 779064 774716
45612 774716 469103 251204 -190057 -1222805 -2336909 -2683224 -2279650 -1818273 -1412017
$$ packed form
45676F93994J79776O35135O35749j0803k93439M53137J180763M55761j190153
45667B739920j630726j57364J226565M73949j516081k027974l13475J376874R06687
45658A078375j027307k156985j577209k82997N79758P55257M08687k19685o10050
45649c052156l19935L18550N91290N15903P49412J324045J412241O21285l66965
45640A793670q55739j016767j218629j251179q62426m05749k15277J15363J003083
45631b913650J835331J593695L73071n94022n01128J51298M01503n154n20722
45622a79778n17038O3082O12129M65787k39109n86036o8320O32514N95833m348
45612G74716l05613k17899m41261j032748j114104l46315M03574M61377M06256
$$ plain form
45603 -1412017 -505913 868750 1767261 1683062 1399069 1893283 3004412 3821009 3926459
45594 3926459 3592179 3085292 2475934 1927211 1545247 1087153 390581 -97899 118863
45585 118863 651656 610006 -87510 -577274 -325419 289851 923398 1929744 3558197
45576 3558197 5147605 5759174 5186631 3841484 2134961 561626 -131520 301118 949694
45567 949694 681408 -383353 -1115626 -1045967 -909718 -1349470 -1916533 -1826415 -1129934 -580635
45557 -580635 -612300 -882560 -733581 133423 1367510 2256791 2402884 2054640 1597986 955631
45547 955631 -28390 -795520 -454310 886010 1941294 1820465 1119990 933864 1354295
45538 1354295 1648980 1521998 1393109 1549300 1733220 1635157 1281582 884452 704510 1029143
$$ packed form
45603a412017R06104J374663Q98511q4199k83993M94214J111129Q16597J05450
45594C926459l34280n06887o09358n48723l81964m58094o96572m88480K16762
45585A18863N32793m1650o97516m89764K51855O15270O33547J006346J628453
45576C558197J589408O11569n72543j345147j706523j573335o93146M32638O48576
45567I49694k68286j064761p32273O9659J36249m39752n67063R0118O96481N49299
45557e80635l1665k70260J48979Q67004J234087Q89281J46093l48244m56654o42355
45547I55631r84021p67130L41210J340320J055284j20829p00475j86126M20431
45538A354295K94685j26982j28889J56191J83920r8063l53575l97130j79942L24633
$$ plain form
45528 1029143 1852750 2600185 2624157 2032028 1634681 2018904 2979202 3836909 3987535 3239342
45518 3239342 2066782 1466139 2023749 3092572 3418243 2636996 1587150 1048438 835983
45509 835983 373923 -504769 -1686577 -3040333 -4055758 -3848049 -2211586 -215434 990411
45500 990411 1607060 2611474 4018131 4712728 4069537 2776869 1746622 1034406 340131
45491 340131 -100288 168255 947379 1478422 1322062 717391 172969 80134 602218 1511619
45481 1511619 2170075 2081706 1506863 1170225 1299018 1320386 675521 -370293 -976869 -635044
45471 -635044 365502 1269663 1506531 1091797 526087 263814 233140 -13858 -620738 -1100680
45461 -1100680 -912120 -251029 50540 -486855 -1333637 -1494877 -628446 603861 1334610
$$ packed form
45528A029143Q23607P47435K3972n92129l97347L84223R60298Q57707J50626p48193
45518C239342j172560o00643N57610J068823L25671p81247j049846n38712k12455
45509H35983m62060q78692j181808j353756j015425K07709J636463J996152J205845
45500I90411O16649J004414J406657O94597o43191j292668j030247p12216o94275
45491C40131m40419K68543P79124N31043j56360o04671n44422r2835N22084R09401
45481A511619O58456q8369n74843l36638J28793K1368o44865j045814o06576L41825
45471f35044J000546R04161K36868m14734n65710k62273l0674k46998o06880m79942
45461a100680J88560O61091L01569n37395q46782j61240Q66431J232307P30749
$$ plain form
45452 1334610 1410198 1315426 1320154 1076542 223086 -893166 -1443052 -1004342 76852 1206557
45442 1206557 2083414 2628855 2762592 2543390 2293396 2229595 2091310 1487301 565267 -40977
45432 -40977 3620 337447 422825 175997 -107499 -200389 -52951 371591 1050269 1720243
45422 1720243 2017867 1857546 1504125 1238255 1116431 1098765 1210355 1441033 1624067 1592330
45412 1592330 1393545 1176524 892883 335380 -443538 -955844 -739280 53336 713974
45403 713974 656045 -72635 -911179 -1246573 -783946 266717 1264608 1643161 1523812 1622321
45393 1622321 2323396 3057572 2938530 1922403 956860 945600 1872239 2997204 3604642
45384 3604642 3449744 2783776 2147723 1937125 1966955 1600784 482986 -936000 -1705174
$$ packed form
45452A334610P5588r4772M728k43612q53456j116252n49886M38710J081194J129705
45442A206557Q76857N45441J33737k19202k49994o3801j38285o04009r22034o06244
45432d0977M4597L33827Q5378k46828k83496r2890J47438M24542O78678O69974
45422A720243K97624j60321l53421k65870j21824j7666J11590K30678J83034l1737
45412A592330j98785k17021k83641n57503p78918n12306K16564P92616O60638
45403G13974n7929p28680q38544l35394M62627J050663R97891L78553j19349R8509
45393A622321P01075P34176j19042j016127r65543j1260R26639J124965O07438
45384C604642j54898o65968o36053k10598K9830l66171j117798j418986p69174
$$ plain form
45375 -1705174 -1152971 581010 2564557 3637551 3319936 2311356 1795437 2102862 2409321
45366 2409321 1939274 995535 392514 301623 275226 148601 167714 256378 -58560 -763863
45356 -763863 -1080172 -479696 520009 1076374 1174977 1489847 2272929 2990074 3114408 2762645
45346 2762645 2314023 1765644 822673 -499272 -1681463 -2159431 -1796412 -856446 298445
45337 298445 1314212 1778862 1391741 370582 -498209 -491948 353684 1346260 1916610 2095846
45327 2095846 2200117 2324395 2348700 2271374 2242890 2256981 2037894 1357217 362074 -514955
45317 -514955 -912508 -724027 -35614 889655 1550370 1447111 653122 -38591 69599 638752
45307 638752 602230 -456641 -1689769 -2057067 -1623043 -1313113 -1636721 -2224938 -2540047
$$ packed form
45375a705174N52203J733981J983547J072994l17615j008580n15919L07425L06459
45366B409321m70047r43739o03021r0891k6397j26625J9113Q8664l14938p05303
45356g63863l16309O00476R99705N56365R8603L14870P83082P17145J24334l51763
45346B762645m48622n48379r42971j321945j182191m77968L63019R39966J154891
45337B98445J015767M64650l87121j021159q68791O261Q45632R92576N70350J79236
45327B095846J04271J24278K4305p7326k8484J4091k19087o80677r95143q77029
45317e14955l97553J88481O88413R25269O60715j03259p93989o91713J08190N69153
45307F38752l6522j058871j233128l67298M34024L09930l23608n88217l15109
$$ plain form
45298 -2540047 -2422549 -1840825 -697537 803340 2000993 2347924 1936901 1250299 616769
45289 616769 119215 -204401 -335086 -326210 -241285 -178281 -363297 -884584 -1255876 -714658
45279 -714658 783811 2304390 3000142 3023107 2988719 3029873 2957924 2911186 3075006 3063354
45269 3063354 2461959 1832420 2195260 3473166 4466387 4593050 4577567 4939585 4893034 3619154
45259 3619154 1829735 1004479 1513507 2460787 3052005 3136202 2654035 1661857 878616
45250 878616 1102476 1899853 1895321 654721 -715725 -1234190 -1256605 -1420975 -1430807 -841810
45240 -841810 -226495 -353843 -711762 -143579 1209816 1877113 1101559 -217227 -951431
45231 -951431 -1094069 -1174418 -1202465 -897575 -383331 43901 470470 1088914 1644027 1709298
$$ packed form
45298b540047J17498N81724J143288J500877J197653L46931m11023o86602o33530
45289F16769m97554l23616j30685Q876Q4925O3004j85016n21287l71292N41218
45279g14658J498469J520579O95752K2965l4388M1154p1949m6738J63820j1652
45269C063354o01395o29539L62840J277906R93221J26663j5483L62018m6551j273880
45259C619154j789419q25256N09028R47280N91218Q4197m82167r92178p83241
45250H78616K23860P97377m532j240600j370446n18465k2415j64370r832N88997
45240h41810O15315j27348l57919N68183J353395O67297p75554j318786p34204
45231i51431j42638q0349k8047L04890N14244M27232M26569O18444N55113O5271
$$ plain form
45221 1709298 1350255 1066072 1189763 1655211 2169884 2362556 2047684 1622538 1838364
45212 1838364 2841981 3867900 4284232 4420551 4777288 4984702 4439351 3600036 3568525
45203 3568525 4439206 5111971 4885820 4260065 3891004 3713747 3536381 3629507 4120486 4489656
45193 4489656 4304897 3919760 3867111 4081688 4309918 4758464 5654870 6621083 7205416 7631232
45183 7631232 8243415 8583290 7922207 6519216 5436020 5161075 5273781 5429559 5725265
45174 5725265 5978709 5649024 4840106 4525393 5284110 6517553 7438237 8176819 9240948
45165 9240948 10359711 10637292 9713625 8222911 7154942 7100000 7969617 9127629 9912157
45156 9912157 10240501 10506075 10781276 10592396 9784479 9070935 9181198 9877018 10449226
$$ packed form
45221A709298l59043k84183J23691M65448N14673J92672l14872m25146K15826
45212A838364J003617J025919M16332J36319L56737K07414n45351q39315l1511
45203C568525Q70681O72765k26151o25755l69061j77257j77366R3126M90979L69170
45193D489656j84759l85137n2649K14577K28230M48546Q96406R66213N84333M25816
45183G631232O12183L39875o61083j402991j083196k74945J12706J55778K95706
45174E725265K53444l29685q08918l14713P58717J233443R20684P38582J064129
45165I240948J118763K77581r23667j490714j067969n4942Q69617J158012P84528
45156I912157L28344K65574K75201j88880q07917p13544J10263O95820N72208
$$ plain form
45147 10449226 10849038 11561328 12540144 13114880 13004214 12669003 12499092 12333246 12018636
45138 12018636 11804721 11850240 11900499 11860730 12226704 13482561 15388841 17274458 18753014
45129 18753014 19768764 20258013 20303491 20484014 21528528 23544008 25926183 28108525 30156151
45120 30156151 32565784 35680117 39402566 43454564 47916266 53453718 60825695 70182560
45112 70182560 81173350 93830900 108956752 127452057 149750235 176216671 207402557
45105 207402557 242925334 280097157 314383937 341514421 359050778 366426950 364508019
45098 364508019 355446132 342288318 328062120 315009465 304234048 295391299 286814777
45091 286814777 276857090 265483923 254029567 243321178 232946515 222711585 213728132
$$ packed form
45147A0449226L99812P12290R78816N74736j10666l35211j69911j65846l14610
45138A2018636k13915M5519N0259l9769L65974J255857J906280J885617J478556
45129A8753014J015750M89249M5478J80523J044514K015480K382175K182342K047626
45120C0156151K409633L114333L722449M051998M461702N537452P371977R356865
45112G0182560J0990790J2657550J5125852J8495305K2298178K6466436L1185886
45105B07402557L5522777L7171823L4286780K7130484J7536357P376172j918931
45098C64508019r061887j3157814j4226198j3052655j0775417q842749q576522
45091B86814777r957687j1373167j1454356j0708389j0374663j0234930q983453
$$ plain form
45084 213728132 207128100 202380257 197937717 193211861 188884918 185376962 181950425 177454273
45076 177454273 171259609 163383430 154331321 144934548 135823560 127011908 118417529 110571348
45068 110571348 104082569 98508499 92647647 86096712 79695282 74199706 69334449 64517035
45060 64517035 59771380 55452258 51676481 48484787 46016654 44082649 42085825 39794233
45052 39794233 37675048 36064778 34595249 32897232 31235619 29884592 28509957 26842161
45044 26842161 25351576 24474416 23728902 22491760 21157154 20496339 20232159 19405210 18020083
45035 18020083 17164392 17394283 18028064 18216127 17766443 16711230 15023433 13112079 11750165
45026 11750165 11125845 10710703 10363638 10673666 11729791 12435131 11774458 10142580 8698963
$$ packed form
45084B13728132o600032m747843m442540m725856m326943l507956l426537m496152
45076A77454273o194664p876179r052109r396773r110988q811652q594379p846181
45068A10571348o488779n574070n860852o550935o401430n495576m865257m817414
45060F4517035m745655m319122l775777l191694k468133j934005j996824k291592
45052C9794233k119185j610270j469529j698017j661613j351027j374635j667796
45044B6842161j490585q77160p45514j237142j334606o60815k64180q26949j385127
45035A8020083q55691K29891O33781J88063m49684j055213j687797j911354j361914
45026A1750165o24320m15142l47065L10028J056125P05340o60673j631878j443617
$$ plain form
45017 8698963 7898157 7364085 6807010 6299911 5842913 5305813 4746949 4361969 4229130
45008 4229130 4384853 4854260 5281571 4968116 3814618 2881780 3367547 5173344 7020721
44999 7020721 7847318 7588722 6782679 6035339 5817324 6139863 6321880 5592390 4070699
44990 4070699 2727731 2229028 2208016 1912642 1295231 1156621 2202511 4070242 5431514
44981 5431514 5233100 3786898 2323037 1481236 801953 -83698 -519846 216373 1533243
44972 1533243 2062913 1458939 731060 684813 935237 859008 760649 1402223 2718916 3676966
44962 3676966 3446084 2310127 1251133 813103 613416 43358 -794701 -1245143 -1159586
44953 -1159586 -1185014 -1662031 -1837214 -837584 967292 2383207 2935102 3066468 2869243
$$ packed form
45017H698963q00806n34072n57075n07099m56998n37100n58864l84980j32839
45008D229130J55723M69407M27311l13455j153498r32838M85767J805797J847377
44999G020721Q26597k58596q06043p47340k18015L22539J82017p29490j521691
44990D070699j342968m98703k1012k95374o17411j38610J045890J867731J361272
44981E431514j98414j446202j463861q41801o79283q85651m36148P36219J316870
44972A533243N29670o03974p27879m6247K50424p6229r8359O41574J316693R58050
44962C676966k30882j135957j058994m38030j99687n70058q38059m50442Q5557
44953a159586k5428m77017j75183R99630J804876J415915N51895J31366j97225
$$ plain form
44944 2869243 1751617 -231555 -1689562 -1294043 624182 2490825 3154111 2628904 1548415
44935 1548415 533334 17443 138551 629698 1014071 985209 598932 202935 163153 475670
44925 475670 709570 584866 432506 622855 728215 470 -1313029 -2031991 -1673348
44916 -1673348 -1088475 -1026362 -1048492 -617215 -324599 -927902 -1805832 -1674325 -567897 171247
44906 171247 -114085 -602733 -402400 325503 1019468 1547230 1870350 1677149 991219 579790
44896 579790 1088461 2097828 2616845 2330566 1871740 1899674 2269158 2228640 1387691 405167
44886 405167 427305 1602633 2550449 1930732 283639 -607697 -190970 132354 -819955
44877 -819955 -2197166 -2344891 -1112448 108449 292955 -237872 -603841 -263194 859133
$$ packed form
44944B869243j117626j983172j458007L95519J918225J866643O63286n25207j080489
44935A548415j015081n15891J21108M91147L84373k8862l86277l95997l9782L12517
44925D75670K33900j24704j52360J90349J05360p27745j313499p18962L58643
44916a673348N84873O2113k2130M31277K92616o03303q77930J31507J106428P39144
44906A71247k85332m88648K00333P27903O93965N27762L23120j93201o85930m11429
44896E79790N08671J009367N19017k86279m58826K7934L69484m0518q40949r82524
44886D05167K2138J175328R47816o19717j647093q91336M16727L23324r52309
44877h19955j377211j47725J232443J220897J84506n30827l65969L40647J122327
$$ plain form
44868 859133 2347306 3291793 2983097 1784287 799620 577013 643742 389554 -180496
44859 -180496 -751193 -1193951 -1458325 -1377020 -885178 -188813 441018 810759 754422 331608
44849 331608 45941 316113 690987 292823 -767314 -1235848 -418511 782613 1229084
44840 1229084 1182688 1573797 2185441 1891509 633287 -175942 416990 1692545 2561631
44831 2561631 3093360 3885106 4659683 4617180 3887122 3505037 3827246 3893686 2746465 744252
44821 744252 -892561 -1453771 -1249158 -1023695 -1264531 -1952921 -2659334 -2889509 -2517540
44812 -2517540 -1856688 -1266606 -875542 -732233 -842229 -798238 161074 2121754 3774997
44803 3774997 3535227 1487399 -528677 -1082064 -673440 -593606 -1026764 -1238926 -1178140
$$ packed form
44868H59133J488173R44487l08696j198810r84667k22607O6729k54188n70050
44859a80496n70697m42758k64374Q1305M91842O96365O29831L69741n6337m22814
44849C31608k85667K70172L74874l98164j060137m68534Q17337J201124M46471
44840A229084m6396L91109O11644k93932j258222q09229N92932J275555Q69086
44831B561631N31729P91746P74577m2503p30058l82085L22209O6440j147221k002213
44821G44252j636813n61210K04613K25463k40836o88390p06413k30175L71969
44812b517540O60852N90082L91064J43309j09996M3991R59312J960680J653243
44803C774997k39770k047828k016076n53387M08624P9834m33158k12162O0786
$$ plain form
44794 -1178140 -1587240 -2436544 -2541316 -1342233 -19102 88875 -596586 -697302 -123850
44785 -123850 -137453 -1175437 -2019825 -1644287 -740887 -586084 -1220095 -1733068 -1816998 -1948951
44775 -1948951 -2239222 -2153441 -1487277 -749172 -330908 -17057 379223 546419 257441 -105236
44765 -105236 -97721 92570 1599 -353947 -618006 -821557 -1357251 -2169073 -2516538 -1854708
44755 -1854708 -652940 26592 -292253 -1025794 -1291249 -892828 -342054 -56145 82564
44746 82564 286973 369034 -8650 -801132 -1627766 -2194540 -2349551 -1933859 -1064565 -448878
44736 -448878 -819014 -1987709 -2999877 -3305803 -3203651 -2998202 -2449664 -1428969 -459401
44727 -459401 -56173 -10554 124340 274488 152860 -81076 -118485 -120768 -363735 -568130
$$ packed form
44794a178140m09100q49304j04772J199083J323131J07977o85461j00716N73452
44785a23850j3603j037984q44388L75538R03400J54803o34011n12973q3930j31953
44775a948951k90271Q5781O66164P38105M18264L13851L96280J67196k88978l62677
44765a05236P515J90291r0971l55546k64059k03551n35694q11822l47465O61830
44755a854708J201768O79532l18845p33541k65455L98421N50774K85909J38709
44746H2564K04409Q2061l77684p92482q26634n66774j55011M15692Q69294O15687
44736d48878l70136j168695j012168l05926J02152K05449N48538J020695R69568
44727d59401M03228M5619J34894J50148j21628k33936l7409k283k42967k04395
$$ plain form
44717 -568130 -330542 40738 -28497 -267315 124130 1002493 1145692 -64651 -1651643
44708 -1651643 -2205504 -1436874 -147725 814030 1112742 845475 369065 40658 -56192
44699 -56192 62373 627501 1776229 2925820 3244138 2852227 2688238 2914237 2476086
44690 2476086 812239 -1002647 -1690051 -1510792 -1516085 -1709890 -1216442 50128 1143089
44681 1143089 1436203 1094031 234569 -1167268 -2410820 -2386566 -1204574 -366767 -705720
44672 -705720 -1204104 -661171 454790 937790 902724 1500179 2797705 3414391 2611207
44663 2611207 1509331 1464302 2106595 2061207 1194088 897054 1933519 3096220 2760831
44654 2760831 1124102 -97295 6427 561805 464829 -68486 -94365 630996 1587388
$$ packed form
44717e68130K37588L71280o9235k38818L91445Q78363J43199j210343j586992
44708a651643n53861P68630J289149R61755K98712k67267m76410l28407r6850
44699e6192J18565N65128J148728J149591L18318l91911j63989K25999m38151
44690B476086j663847j814886o87404J79259n293j93805M93448J266570J092961
44681A143089K93114l42172q59462j401837j243552K4254J181992Q37807l38953
44672g05720m98384N42933J115961M83000l5066N97455J297526O16686q03184
44663B611207j101876m5029O42293m5388q67119k97034J036465J162701l35389
44654B760831j636729j221397J03722N55378r6976n33315k5879P25361R56392
$$ plain form
44645 1587388 2384120 2868170 2628064 1353678 -286911 -1017120 -463229 359675 339011
44636 339011 -526758 -1474647 -1966594 -1954783 -1590907 -1093153 -691875 -458624 -334769 -331392
44626 -331392 -389735 -156032 529072 963794 230040 -1304581 -2054511 -1257387 -53776
44617 -53776 173334 -314055 -380691 3849 -113784 -809359 -937250 95872 1374290 1821064
44607 1821064 1619975 1617598 1927284 1909965 1276882 516488 218871 454380 915107 1330545
44597 1330545 1570290 1533889 1186512 729922 560062 870684 1325785 1330463 689631 -189265
44587 -189265 -824542 -1156539 -1375709 -1504834 -1383345 -898336 -43469 1053447 1978793
44578 1978793 2178718 1531808 557002 -202432 -745581 -1306057 -1817063 -2053712 -2012218 -1780627
$$ packed form
44645A587388P96732M84050k40106j274386j640589p30209N53891Q22904k0664
44636C39011q65769r47889m91947J1811L63876M97754M01278K33251J23855L377
44626c31392n8343K33703O85104M34722p33754j534621p49930P97124J203611
44617e3776K27110m87389o6636L84540j17633o95575j27891J033122J278418M46774
44607A821064k01089k377L09686j7319o33083p60394k97617K35509M60727M15438
44597A330545K39745l6401l47377m56590j69860L10622M55101M678o40832q78896
44587a89265o35277l31997k19170j29125J21489M85009Q54867J096916R25346
44578A978793J99925o46910r74806p59434n43149n60476n11006k36649M1494K31591
$$ plain form
44568 -1780627 -1367129 -1016703 -1200018 -1760359 -1671256 -450917 742777 542490 -464039
44559 -464039 -348604 1398834 3128381 3342064 2407028 1435867 761055 355354 640932
44550 640932 1756704 2738516 2504467 1208160 -238455 -1458375 -2513783 -3045960 -2608379
44541 -2608379 -1596942 -842678 -455190 -18660 260921 -303543 -1581903 -2531020 -2589256
44532 -2589256 -2228731 -1881068 -1270751 -256410 506014 382570 -290543 -685407 -595456
44523 -595456 -574276 -1125481 -2087887 -2738904 -2395299 -1113064 160123 428337 -301813
44514 -301813 -1146023 -1511289 -1631198 -1810232 -1736727 -950417 399919 1702964 2560982
44505 2560982 2947767 2853442 2154874 882047 -557499 -1500859 -1485506 -751085 -197210
$$ packed form
44568a780627M13498L50426j83315n60341Q9103J220339J193694k00287j006529
44559d64039J15435J747438J729547K13683r35036r71161o74812m05701K85578
44550F40932J115772R81812k34049j296307j446615j219920j055408n32177M37581
44541b608379J011437P54264L87488M36530K79581n64464j278360r49117n8236
44532b589256L60525L47663O10317J014341P62424j23444o73113l94864Q9951
44523e95456K1180n51205r62406o51017L43605J282235J273187K68214p30150
44514c01813q44210l65266j19909j79034P3505P86310J350336J303045Q58018
44505B560982L86785r4325o98568j272827j439546r43360J5353P34421N53875
$$ plain form
44496 -197210 -548198 -1563215 -2349394 -2405468 -2005752 -1623177 -1456282 -1546183 -1817487 -1881202
44486 -1881202 -1342363 -485953 -102562 -398368 -667399 -362971 142391 344748 544054
44477 544054 1291310 2292797 2631786 1949026 775593 -232639 -823557 -956777 -665020
44468 -665020 -218051 6833 -41558 -66399 111998 336611 404064 340004 325077 484358
44458 484358 742071 803403 403932 -294778 -713875 -412177 519880 1703483 2813660
44449 2813660 3521686 3497736 2833764 2181146 2063080 2203951 1835779 502298 -1610143
44440 -1610143 -3778721 -4951994 -4402978 -2662899 -1324883 -1328234 -1872468 -1668876 -738704
44431 -738704 -66753 104941 472651 1261531 1790420 1623228 1152799 798560 556830 601626
$$ packed form
44496a97210l50988j015017p86179n6074L99716L82575J66895q9901k71304o3715
44486a881202N38839Q56410L83391k95806k69031L04428N05362K02357J99306
44477E44054P47256J001487L38989o82760j173433j008232n90918j33220K91757
44468f65020M46969K24884m8391k4841J78397K24613O7453o4060j4927J59281
44458D84358K57713O1332l99471o98710m19097L01698R32057J183603J110177
44449B813660P08026k3950o63972o52618j18066J40871l68172j333481k112441
44440a610143k168578j173273N49016J740079J338016l351n44234K03592R30172
44431g38704O71951J71694L67710P88880N28889j67192m70429l54239k41730M4796
$$ plain form
44421 601626 1339689 2460391 2880410 2184276 1299462 1167227 1521873 1609986 1356246 1085545
44411 1085545 773508 383144 362297 958449 1542775 1492785 1283541 1721565 2446378 2291364
44401 2291364 1033415 -256282 -683254 -432743 -34391 443146 1154078 2030268 2834171
44392 2834171 3250900 2911527 1843238 863084 887165 1816395 2753598 3324080 3988605
44383 3988605 4941473 5616655 5662290 5604367 6051233 6919096 7964690 9427553 11498566
44374 11498566 13675558 15327741 16487160 17408948 17738929 16916907 15213592 13597914
44366 13597914 12613352 12036748 11604025 11360172 11172518 10550680 9242900 7599300 6132740
44357 6132740 5071875 4503314 4555889 5163918 5881793 6159748 5699383 4534883 3047731
$$ packed form
44421F01626P38063J120702M20019o96134q84814j32235L54646Q8113k53740k70701
44411A085545l12037l90364k0847N96152N84326m9990k09244M38024P24813j55014
44401B291364j257949j289697m26972K50511L98352M77537P10932Q76190Q03903
44392B834171M16729l39373j068289r80154K4081R29230R37203N70482O64525
44383C988605R52868O75182M5635n7923M46866Q67863J045594J462863K071013
44374A1498566K176992J652183J159419R21788L29981q22022j703315j615678
44366A3597914r84562n76604m32723k43853j87654o21838j307780j643600j466560
44357F132740j060865n68561N2575O08029P17875K77955m60365j164500j487152
$$ plain form
44348 3047731 1947283 1842841 2603862 3401925 3579117 3217578 2672663 1917171 764357
44339 764357 -463258 -1008953 -525488 465345 1094919 966777 382191 -96321 -199651
44330 -199651 -137815 -298618 -766083 -1201440 -1269098 -1064720 -927637 -885370 -566764 247862
44320 247862 1245822 1934125 2184004 2197099 2090426 1846428 1627196 1743903 2185453 2510757
44310 2510757 2431496 2210851 2160306 1985874 1129955 -274297 -1326406 -1437984 -1070521
44301 -1070521 -1064512 -1517401 -1743223 -1240047 -305792 335042 222794 -560263 -1520328 -2055954
44291 -2055954 -1872527 -1263974 -856356 -954282 -1242170 -1194794 -623884 274397 1198633 1853493
44281 1853493 1952121 1445804 751595 428891 510310 437304 -115574 -598334 -172188 1083356
$$ packed form
44348C047731j100448j04442P61021P98063J77192l61539n44915p55492j152814
44339G64357j227615n45695M83465R90833O29574j28142n84586m78512j03330
44330a99651O1836j60803m67465m35357o7658K04378J37083M2267L18606Q14626
44320B47862R97960O88303K49879J3095j06673k43998k19232J16707M41550L25304
44310B510757p9261k20645n0545j74432q55919j404252j052109j11578L67463
44301a070521O009m52889k25822N03176R34255O40834j12248p83057r60065n35626
44291b055954J83427O08553M07618r7926k87888M7376N70910Q98281R24236O54860
44281A853493R8628n06317o94209l22704Q1419p3006n52878m82760M26146J255544
$$ plain form
44271 1083356 1973634 1411291 -428912 -2420198 -3700434 -4193305 -4056058 -3191666 -1581973
44262 -1581973 242442 1486618 1830821 1649587 1451649 1239674 532246 -926075 -2510062
44253 -2510062 -3025521 -1964142 -288025 525965 232220 -7500 613682 1380283 1233128
44244 1233128 426337 38136 203008 11939 -797788 -1250936 -646101 358068 805711
44235 805711 773015 880992 1156905 1267369 1400377 1949902 2594151 2647885 2229010 2147856
44225 2147856 2611730 2947066 2772596 2575175 2791185 3085354 3008342 2778184 2903180 3439263
44215 3439263 4042376 4399593 4241809 3312335 1775595 408053 -37600 449633 1286670
44206 1286670 1975738 2429282 2798505 3139050 3133047 2243457 501172 -1032376 -1261762
$$ packed form
44271A083356Q90278n62343j840203j991286j280236m92871J37247Q64392J609693
44262a581973J824415J244176L44203j81234j97938k11975p07428j458321j583987
44253b510062n15459J061379J676117Q13990k93745k39720O21182P66601j47155
44244A233128q06791l88201J64872j91069q09727m53148O04835J004169M47643
44235H05711l2696J07977K75913J10464J33008N49525O44249N3734m18875q1154
44225B147856M63874L35336j74470j97421K16010K94169p7012k30158J24996N36083
44215C439263O03113L57217j57784r29474j536740j367542m45653M87233Q37037
44206A286670O89068M53544L69223L40545o003q89590j742285j533548k29386
$$ plain form
44197 -1261762 -506329 -120896 -554045 -836412 -382856 -68558 -665342 -1342655 -955185
44188 -955185 66206 576505 803915 1841394 3337565 3586184 2149768 648284 377715
44179 377715 715801 687387 672292 1439322 2570595 3086849 2942086 2780631 2728155 2449749
44169 2449749 2020100 1816359 1863615 2074066 2745046 4004471 5169992 5553804 5556674 6026094
44159 6026094 6827405 7076716 6628924 6279815 6472555 6762764 6675099 6243350 5589401 4762625
44149 4762625 4114916 4075974 4420571 4425283 3783987 2703329 1250003 -469864 -1608905
44140 -1608905 -1270332 -53856 359779 -460242 -1082848 -528901 171709 -242119 -1087841
44131 -1087841 -739372 861169 2109451 1919091 788028 -262228 -764862 -747447 -484818
$$ packed form
44197a261762P55433L85433m33149k82367M53556L14298n96784o77313L87470
44188i55185J021391N10299K27410J037479J496171K48619j436416j501484k70569
44179C77715L38086k8414j5095P67030J131273N16254j44763j61455n2476k78406
44169B449749m29649k03741M7256K10451O70980J259425J165521L83812K870M69420
44159F026094Q01311K49311m47792l49109J92740K90209q7665m31749o53949q26776
44149D762625o47709l8942L44597M712o41296j080658j453326j719867j139041
44140a608905L38573J216476M13635q20021o22606N53947P00610m13828q45722
44131a087841L48469J600541J248282j90360j131063j050256n02634J7415K62629
$$ plain form
44122 -484818 -490748 -1081903 -1815104 -1906904 -1258236 -538215 -262953 -349482 -578194 -889222
44112 -889222 -1107166 -890556 -130318 924906 1957039 2682274 2794746 2240230 1447846
44103 1447846 855694 347578 -378075 -1116872 -1451294 -1516498 -1719442 -1834993 -1261092 -172978
44093 -172978 522681 540580 570799 994142 1200394 641824 -314568 -1131350 -1854511 -2481048
44083 -2481048 -2403165 -1326476 -91511 318142 73547 -65112 -71086 -363454 -615298 -71913
44073 -71913 1066104 1773664 1780518 1863313 2341979 2455802 1726121 899783 819204 1149529
44063 1149529 1036700 461251 105295 224566 435124 451846 382958 385673 570932 1133731
44053 1133731 2038337 2661894 2309581 1091656 -193630 -1040277 -1588639 -1982278 -1976156
$$ packed form
44122d84818n930n91155p33201r1800O48668P20021K75262q6529k28712l11028
44112h89222k17944K16610P60238J055224J032133P25235J12472n54516p92384
44103A447846n92152n08116p25653p38797l34422o5204k02944j15551N73901J088114
44093a72978O95659J7899L0219M23343K06252n58570r56392q16782p23161o26537
44083b481048P7883J076689J234965M09653k44595j38659n974k92368k51844N43385
44073g1913J138017P07560O854Q2795M78666J13823p29681q26338q0579L30325
44063A149529j12829n75449l55956J19271K10558J6722o8888K715J85259N62799
44053A133731R04606O23557l52313j217925j285286q46647n48362l93639O122
$$ plain form
44044 -1976156 -1428772 -714334 -301447 -204480 -141176 -7165 99792 186568 421365 908423
44034 908423 1543493 2047876 2094700 1543834 647699 -120273 -549251 -860970 -1303411 -1775888
44024 -1775888 -2029880 -2049243 -1964391 -1689307 -950250 268852 1498552 2092616 1732528
44015 1732528 688709 -324715 -665286 -335319 -12721 -317712 -1059305 -1424207 -938335
44006 -938335 1679 652426 744184 595271 588825 800236 1083369 1258962 1169595 759371
43996 759371 204381 -173052 -207634 16675 426649 1066818 1756018 1919147 1210423 222445
43986 222445 15885 777401 1484801 1275831 653625 709943 1468322 1828980 1175712 206208
43976 206208 -151686 33508 38397 -466331 -1289246 -2280053 -3369723 -4209153 -4382729 -3990373
$$ packed form
44044a976156N47384P14438M12887R6967O3304J34011J06957Q6776K34797M87058
44034I08423O35070N04383M6824n50866q96135p67972m28978l11719m42441m72477
44024a775888k53992j9363Q4852K75084P39057J219102J229700N94064l60088
44015A732528j043819j013424l40571L29967L22598l04991p41593l64902M85872
44006i38335R40014O50747R1758j48913o446K11411K83133J75593q9367m10224
43996G59371n54990l77433l4582K24309M09974O40169O89200J63129p08724r87978
43986B22445k06560P61516P07400k08970o22206N6318P58379L60658o53268r69504
43976B06208l57894J85194M889n04728q22915r90807j089670q39430j73576L92356
$$ plain form
43966 -3990373 -3531130 -3168532 -2541272 -1385735 12605 1095362 1511158 1300354 845843
43957 845843 616690 713234 729401 305165 -354921 -842529 -1171059 -1529646 -1645874 -1122705
43947 -1122705 -347127 -207881 -739064 -915064 -182887 634695 592281 97626 314027 1480475
43937 1480475 2650102 2940475 2326721 1257137 161970 -574329 -717869 -458869 -244828
43928 -244828 -242665 -227105 -5600 331070 584593 624650 424855 166003 228893 820866
43918 820866 1683487 2405733 2874396 3116231 2894586 1923920 449623 -796525 -1267060
43909 -1267060 -968120 -258565 377163 468939 -77492 -742835 -891202 -516010 -151782 -86137
43899 -86137 -73625 140239 418310 466138 191452 -213661 -354604 73135 795049 998120
$$ packed form
43966c990373M59243L62598O27260J155537J398340J082757M15796k10804m54511
43957H45843k29153R6544J6167m24236o60086m87608l28530l58587j16228N23169
43947a122705P75578J39246n31183j76000P32177Q17582m2414m94655K16401J166448
43937A480475J169627K90373o13754j069584j095167p36299j43540K59000K14041
43928b44828K163J5560K21505L36670K53523M0057j99795k58852O2890N91973
43918H20866Q62621P22246M68663K41835k21645r70666j474297j246148m70535
43909a267060K98940P09555O35728R1776n46431o65343j48367L75192L64228O5645
43899h6137J2512K13864K78071M7828k74686m05113j40943M27739P21914K03071
$$ plain form
43889 998120 299847 -567950 -646815 -139065 -145909 -1048458 -2006363 -2267368 -2157883 -2376095
43879 -2376095 -2959144 -3408588 -3341862 -2643455 -1477146 -528380 -690216 -2006712 -3351690
43870 -3351690 -3643373 -3006186 -2271165 -1745487 -1092723 -195202 492813 476500 -239552 -1136407
43860 -1136407 -1569784 -1350148 -1018350 -1226389 -1785523 -1842932 -1152439 -478411 -365375 -243367
43850 -243367 611021 1838645 2507763 2425526 2129412 1882166 1505142 1038085 783023 763879
43840 763879 795931 955319 1308145 1337817 412450 -1217369 -2590681 -3168150 -3124418 -2626068
43830 -2626068 -1635107 -459814 297285 470969 344168 -80027 -1032729 -2158204 -2630550
43821 -2630550 -2308121 -1954965 -2074921 -2347035 -2476894 -2702868 -3052688 -2979116 -2260345 -1470564
$$ packed form
43889I98120o98273q67797p8865N07750o844r02549r57905k61005J09485k18212
43879b376095n83049m49444O6726O98407J166309R48766j61836j316496j344978
43870c351690k91683O37187P35021N25678O52764Q97521O88015j6313p16052q96855
43860a136407m33377K19636L31798k08039n59134n7409O90493O74028J13036J22008
43850b43367Q54388J227624O69118q2237k96114k47246l77024m67057k55062j9144
43840G63879L2052J59388L52826K9672r25367j629819j373312n77469M3732M98350
43830b626068R90961J175293P57099J73684j26801m24195r52702j125475m72346
43821b630550L22429L53156j19956k72114j29859k25974l49820P3572P18771P89781
$$ plain form
43811 -1470564 -1025409 -585464 -19078 -53074 -1088506 -2133955 -1977210 -898801 -161272
43802 -161272 -207847 -498209 -834376 -1539274 -2269921 -1952412 -354685 1263456 1658235
43793 1658235 1044710 464471 334370 326671 291295 487493 912077 1037748 456814 -562278
43783 -562278 -1404130 -1778777 -1795557 -1510790 -847639 -111540 -121534 -1316237 -2926481 -3661254
43773 -3661254 -3224785 -2490480 -2049940 -1431233 -221772 856184 847427 28202 -501672
43764 -501672 -432387 -451374 -893590 -1201164 -918128 -314986 294279 1012399 1683027 1534482
43754 1534482 169749 -1594200 -2540453 -2401606 -1872408 -1595777 -1686170 -1983183 -2175516
43745 -2175516 -1844870 -973162 -281034 -447802 -1063522 -1062554 -299844 62545 -858461 -2289402
$$ packed form
43811a470564M45155M39945N66386l3996j035432j045449J56745J078409P37529
43802a61272m6575k90362l36167p04898p30647L17509J597727J618141L94779
43793A658235o13525n80239j30101p699l5376J96198M24584J25671n80934j019092
43783e62278q41852l74647j6780K84767O63151P36099r994j194703j610244p34773
43773c661254M36469P34305M40540O18707J209461J077956q757q19225n29874
43764e01672O9285j8987m42216l07574K83036O03142O09265P18120O70628j48545
43754A534482j364733j763949r46253J38847N29198K76631r0393k97013j92333
43745b175516L30646Q71708O92128j66768o15720R68P62710L62389r21006j430941
$$ plain form
43735 -2289402 -2629891 -1374393 421963 1516918 1677791 1353227 791334 27256 -583721
43726 -583721 -564919 -148470 -239802 -1143106 -1832579 -1165306 424853 1263656 544880 -716033
43716 -716033 -1198179 -970691 -969919 -1332936 -1240289 -329418 661293 895819 397360 -298061
43706 -298061 -857107 -1156718 -1098528 -867280 -967282 -1535955 -1980983 -1801543 -1417373 -1548134
43696 -1548134 -2013273 -1895874 -868978 343152 914299 693471 -71713 -1099825 -1922500
43687 -1922500 -2032025 -1559287 -1255233 -1437658 -1552150 -1221098 -1055207 -1732243 -2825460
43678 -2825460 -3404856 -3415117 -3499989 -3682188 -3278591 -2153262 -1014746 -245277 567292
43669 567292 1532115 1869650 1120898 198272 341720 1404446 2010381 1294987 -205508
$$ packed form
43735b289402l40489J255498J796356J094955J60873l24564n61893p64078o10977
43726e83721J8802M16449r1332r03304o89473O67273J590159Q38803p18776j260913
43716g16033m82146K27488P72l63017R2647R10871R90711K34526m98459o95421
43706b98061n59046k99611N8190K31248j00002n68673m45028J79440L84170j30761
43696a548134m65139J17399J026896J212130N71147k20828p65184j028112q22675
43687a922500j09525M72738L04054j82425j14492L31052J65891o77036j093217
43678b825460n79396j0261q4872j82199M03597J125329J138516P69469Q12569
43669E67292R64823L37535p48752r22626J43448J062726O05935p15394j500495
$$ plain form
43660 -205508 -1418702 -1901200 -1947331 -1905582 -1711386 -1137476 -383427 -119580 -672921 -1384456
43650 -1384456 -1277407 -313535 572981 685510 146748 -735254 -1783323 -2435013 -1992050
43641 -1992050 -902932 -687097 -1762266 -2423826 -1127449 1152132 2257226 1789343 1045800
43632 1045800 530079 -491830 -1969714 -2645826 -2147088 -1692460 -1982776 -2054105 -1163823
43623 -1163823 -231394 -200233 -386725 102076 533428 -192288 -1390749 -1546723 -818750
43614 -818750 -695558 -1457345 -1917124 -1692882 -1769018 -2403369 -2338919 -883753 783161 1333015
43604 1333015 1004589 603702 30120 -950020 -1478819 -631907 935097 1800138 1865921
43595 1865921 2200999 2936665 2840909 1293877 -607679 -1517284 -1464433 -1369629 -1663893 -2085510
$$ packed form
43660b05508j213194m82498m6131M1749J94196N73910P54049K63847n53341p11535
43650a384456J07049R63872Q86516J12529n38762q82002j048069o51690M42963
43641a992050J089118K15835j075169o61560J296377K279581J105094m67883p43543
43632A045800n15721j021909j477884o76112M98738M54628k90316p1329Q90282
43623a163823R32429L1161j86492M88801M31352p25716j198461j55974P27973
43614h18750J23192p61787m59779K24242p6136o34351O4450J455166J666914N49854
43604A333015l28426m00887n73582r80140n28799Q46912J567004Q65041O5783
43595A865921L35078P35666r5756j547032j901556r09605N2851R4804k94264m21617
$$ plain form
43585 -2085510 -2350914 -2354316 -1996751 -1369689 -880263 -729780 -529712 53586 533973 164362
43575 164362 -801458 -1162327 -348130 661619 485460 -944875 -2376798 -2805662 -2440871
43566 -2440871 -1997419 -1649008 -1160528 -665188 -585683 -795543 -583566 255756 924244 731320
43556 731320 206330 374085 1222509 1777323 1639968 1447275 1549234 1267517 131344
43547 131344 -989321 -955886 -88031 224877 -533182 -1456433 -1653125 -1257777 -741225 -92196
43537 -92196 797942 1558982 1735888 1410056 989513 669816 448173 354967 320614 114610
43527 114610 -246314 -342034 63687 626659 980393 1285195 1728003 1865476 1130221 -221465
43517 -221465 -1335206 -1818207 -1918982 -1726710 -951980 356597 1578407 2322076 2935934
$$ packed form
43585b085510k65404l402L57565O27062M89426J50483K00068N83298M80387l69611
43575A64362r65820l60869Q14197J009749j76159j430335j431923m28864L64791
43566b440871M43452L48411M88480M95340P9505k09860K11977Q39322O68488j92924
43556G31320n24990J67755Q48424N54814j37355j92693J01959k81717j136173
43547A31344j120665L3435Q67855L12908p58059r23251j96692L95348N16552O49029
43537i2196Q90138P61040J76906l25832m20543l19697k21643r3206l4353k06004
43527A14610l60924r5720M05721N62972L53734L04802M42808J37473p35255j351686
43517b21465j113741m83001j00775J92272P74730J308577J221810P43669O13858
$$ plain form
43508 2935934 3849267 4787130 5058946 4485079 3754069 3838028 5029944 6455252 6710946
43499 6710946 5297108 3259540 2010225 1725753 1548246 1207646 1449405 2578273 3584825
43490 3584825 3446412 2605622 2265619 2619887 2733671 2060920 1153090 716130 757503 990689
43480 990689 1422040 2040632 2397960 2125462 1665756 1842417 2652745 3079447 2387575 1146656
43470 1146656 494465 679004 941578 744395 372803 138470 -251019 -1030251 -1699497
43461 -1699497 -1693388 -1279835 -1019625 -695457 263925 1463014 1745618 885402 69254 344399
43451 344399 1442410 2522521 3206611 3364180 2717736 1372156 110384 -501536 -756736
43442 -756736 -1002701 -908143 -262085 228827 -80569 -556076 -143819 904724 1296266 531581
$$ packed form
43508B935934R13333R37863K71816n73867p31010Q3959J191916J425308K55694
43499F710946j413838k037568j249315k84472j77507l40600K41759J128868J006552
43490C584825j38413q40790l40003L54268J13784o72751r07830m36960M1373K33186
43480I90689M31351O18592L57328k72498m59706J76661Q10328M26702o91872j240919
43470A146656o52191J84539K62574j97183l71592k34333l89489p79232o69246
43461a699497O109M13553K60210L24168R59382J199089K82604q60216q16148K75145
43451C44399J098011J080111O84090J57569o46444j345580j261772o11920k55200
43442g56736k45965R4558O46058M90912l09396m75507M12257J048543L91542p64685
$$ plain form
43432 531581 -589114 -1261243 -1465236 -1404608 -1111752 -774206 -636498 -454181 186009 956348
43422 956348 1044666 394389 -209056 -404848 -637580 -1068945 -1164141 -768402 -595320 -1082703
43412 -1082703 -1634207 -1605298 -1243479 -1004679 -702172 -67696 519181 643882 615884 837662
43402 837662 979339 641440 348113 913848 2128546 3008760 3154120 2945382 2538397
43393 2538397 1630208 285519 -861701 -1397947 -1440038 -1092606 -360349 254730 -83806
43384 -83806 -1359598 -2319308 -1815442 -162160 1292605 1661837 1165276 493589 7710
43375 7710 -382421 -849768 -1338689 -1573162 -1295402 -478861 632588 1613174 2060129 1918543
43365 1918543 1581284 1391429 1078786 158866 -1025874 -1354758 -452672 496221 214319
$$ packed form
43432E31581j120695o72129k03993O0628K92856L37546J37708J82317O40190P70339
43422I56348Q8318o50277o03445j95792k32732m31365r5196L95739J73082m87383
43412a082703n51504K8909L61819K38800L02507O34476N86877J24701k7998K21778
43402H37662J41677l37899k93327N65735J214698Q80214J45360k08738m06985
43393B538397r08189j344689j147220n36246m2091L47432P32257O15079l38536
43384h3806j275792r59710N03866J653282J454765L69232m96561o71687m85879
43375G710l90131m67347m88921k34473K77760Q16541J111449R80586M46955j41586
43365A918543l37259j89855l12643r19920j184740l28884R02086R48893k81902
$$ plain form
43356 214319 -854957 -1155514 -223430 797469 931328 563868 440076 448231 148896 -154158
43346 -154158 226255 1210556 1966782 2038709 1818067 1819739 2025793 2137439 2069534 1908437
43336 1908437 1595577 954755 36997 -734459 -883704 -373516 279853 486765 193031
43327 193031 -107552 -22534 223061 83163 -556034 -1141565 -1090353 -541348 -252970 -695289
43317 -695289 -1453117 -1744656 -1400626 -979173 -889823 -828212 -329299 444014 839929 488933
43307 488933 -389013 -1315866 -1864558 -1767461 -1122203 -479215 -384477 -828466 -1411834 -1929214
43297 -1929214 -2375131 -2472182 -1782881 -422185 865173 1578768 1974588 2429585 2724077
43288 2724077 2366910 1364550 264965 -396047 -353131 480660 1888759 3139571 3358548
$$ packed form
43356B14319j069276l00557R32084J020899J33859l67460j23792Q155k99335l03054
43346a54158L80413R84301P56226P1927k20642J672K06054J11646o7905j61097
43336A908437l12860o40822r17758p71456j49245N10188O53369K06912k93734
43327A93031l00583Q5018K45595j39898o39197n85531N1212N49005K88378m42319
43317f95289p57828k91539L44030M21453Q9350O1611M98913P73313L95915l50996
43307D88933q77946r26853n48692R7097O45258O42988R4738m43989n83368n17380
43297a929214m45917r7051O89301J360696J287358P13595L95820M54997K94492
43288B724077l57167j002360j099585o61012M2916Q33791J408099J250812K18977
$$ plain form
43279 3358548 2364983 976731 288058 655552 1459194 1817319 1435167 729018 248837
43270 248837 161321 283448 373021 259239 -96656 -480086 -552696 -312634 -209250 -538683
43260 -538683 -981986 -1107119 -1065425 -1291140 -1715343 -1893952 -1820739 -1933321 -2286090 -2412251
43250 -2412251 -2139374 -1877017 -1915573 -2083002 -2250334 -2442944 -2278813 -1230996 163698
43241 163698 387306 -1071293 -2739798 -3063145 -2424886 -2153469 -2262473 -1648255 -188252
43232 -188252 940320 1136698 1131885 1490480 1641717 1034534 213673 -50035 29907 -306450
43222 -306450 -1210715 -2171174 -2727580 -2683324 -1977019 -905026 -187314 -292040 -883583 -1312667
43212 -1312667 -1386044 -1292599 -1106920 -816150 -563902 -424219 -178139 275847 573727 395534
$$ packed form
43279C358548r93565j388252o88673L67494Q03642L58125l82152p06149m80181
43270B48837q7516J22127Q9573j13782l55895l83430p2610K40062J03384l29433
43260e38683m43303j25133M1694k25715m24203j78609P3213j12582l52769j26161
43250b412251K72877K62357l8556j67429j67332j92610J64131J047817J394694
43241A63698K23608j458599j668505l23347O38259K71417j09004O14218J460003
43232a88252J128572J96378m813L58595J51237o07183q20861k63708P9942l36357
43222c06450r04265r60459n56406M4256P06305J071993P17712j04726n91543m29084
43212a312667p3377R3445J85679K90770K52248J39683K46080M53986K97880j78193
$$ plain form
43202 395534 34415 -36142 112618 108401 -20749 17289 198889 419587 1053253 2402536
43192 2402536 3681860 3569013 1986693 382972 -164773 -226654 -806014 -1679952 -1851341
43183 -1851341 -1145954 -376192 -111773 -192278 -433010 -936480 -1520200 -1603084 -1012727 -336911
43173 -336911 -120647 -209724 -259055 -385139 -795057 -1176507 -1122694 -952491 -1372362 -2291789
43163 -2291789 -2690244 -1958350 -819664 -447975 -988780 -1497630 -1274327 -739543 -785154
43154 -785154 -1577052 -2357031 -2395463 -1817763 -1285682 -1039495 -632577 297811 1368645 1887212
43144 1887212 1731771 1368261 1062636 563695 -335860 -1376781 -2177378 -2622869 -2705610
43135 -2705610 -2406048 -2038837 -2252202 -3176642 -3920540 -3528306 -2237362 -1133597 -681084
$$ packed form
43202C95534l61119p0557J48760m217j29150L8038J81600K20698O33666J349283
43192B402536J279324j12847j582320j603721n47745o1881n79360q73938j71389
43183a851341P05387P69762K64419q0505k40732n03470n83720q2884N90357O75816
43173c36911K16264q9077m9331j26084m09918l81450N3813J70203m19871r19427
43163b291789l98455P31894J138686L71689n40805n08850K23303N34784m5611
43154g85154p91898p79979l8432N77700N32081K46187M06918R30388J070834N18567
43144A887212j55441l63510l05625m98941q99555j040921q00597m45491q2741
43135b705610K99562L67211k13365r24440p43898L92234J290944J103765M52513
$$ plain form
43126 -681084 -352958 212074 507954 2926 -921320 -1391704 -1077947 -382597 180303 462310
43116 462310 702733 1278947 2209589 2799890 2217475 670513 -493873 -289617 776577
43107 776577 1584007 1884682 2135427 2262420 1699798 678269 362716 1267813 2375352
43098 2375352 2414336 1407739 326106 -305186 -725350 -1136400 -1318393 -1049556 -395975
43089 -395975 442299 1200498 1546522 1438121 1408426 2004951 2955332 3419439 3128100 2675274
43079 2675274 2476090 2073126 952585 -418857 -1021644 -580347 152425 412026 224214
43070 224214 81193 229695 502892 617983 442717 91793 -141055 -65555 146888 121069
43060 121069 -315530 -1065902 -2029605 -3090305 -3831696 -3754100 -3001303 -2412805 -2465439 -2556057
$$ packed form
43126f81084L28126N65032K95880n05028r24246m70384L13757O95350N62900K82007
43116D62310K40423N76214R30642N90301n82415j546962j164386K04256J066194
43107G76577Q07430L00675K50745J26993n62622j021529l15553R05097J107539
43098B375352L8984j006597j081633o31292m20164m11050j81993K68837O53581
43089c95975Q38274P58199L46024j08401k9695N96525R50381M64107k91339m52826
43079B675274j99184m02964j120541j371442o02787M41297P32772K59601j87812
43070B24214j43021J48502K73197J15091j75266l50924k32848P5500K12443k5819
43060A21069m36599p50372r63703j060700p41391P7596P52797N88498n2634r0618
$$ plain form
43050 -2556057 -1865891 -640688 66549 -192449 -856939 -1415300 -2027099 -2742847 -2910137
43041 -2910137 -2079130 -1023479 -1021283 -2247984 -3595488 -4070312 -3689963 -2919839 -1975952
43032 -1975952 -1037538 -525843 -597765 -705308 -236229 562575 836666 267809 -534348 -874371
43022 -874371 -753418 -596720 -574690 -561371 -603482 -1044142 -2096888 -3471005 -4499421 -4600809
43012 -4600809 -3679352 -2211976 -944998 -363028 -376604 -557337 -645458 -711607 -832635 -822138
43002 -822138 -453889 136880 499371 389591 111784 184134 675570 1044160 776166 108509
42992 108509 -134397 471499 1358319 1628329 1164340 685517 699445 903505 872283 846253
42982 846253 1296706 1972875 2063302 1340600 524484 266138 259930 -288554 -1649441 -3365640
$$ packed form
43050b556057O90166J225203P07237k58998o64490n58361o11799p15748j67290
43041b910137Q31007J055651K196j226701j347504m74824L80349P70124R43887
43032a975952R38414N11695p1922j07543M69079P98804K74091n68857q02157l40023
43022h74371J20953J56698K2030J3319m2111m40660j052746j374117j028416j01388
43012d600809R21457J467376J266978N81970j3576j80733q8121o6149j21028J0497
43002h22138L68249N90769L62491j09780k77807P2350M91436L68590k67994o67657
42992A08509k42906O05896Q86820K70010m63989m78823J3928K04060l1222k6030
42982H46253M50453O76169R0427p22702q16116k58346o208n48484j360887j716199
$$ plain form
42972 -3365640 -4782709 -5425918 -5106382 -4100712 -3107975 -2611828 -2344449 -1772193 -1030220
42963 -1030220 -840843 -1385678 -1790064 -1108282 462475 1761643 1972857 1413188 1003374
42954 1003374 1261725 1978736 2665430 3016240 2940936 2482699 1946649 1902176 2671878 3814972
42944 3814972 4464285 4247271 3536101 2720349 1722510 496651 -504174 -854077 -786369
42935 -786369 -734087 -522785 308653 1532296 2299023 2193451 1573386 853814 177759 -133603
42925 -133603 334320 1240257 1508322 656473 -548402 -1200464 -1322679 -1302268 -1031793 -390419
42915 -390419 72109 -111904 -358289 157457 1043788 1165437 422766 -126199 13935 145521
42905 145521 -226672 -556496 -406583 -400700 -1185703 -2215140 -2532222 -2267638 -2358476 -3011816
$$ packed form
42972c365640j417069o43209L19536J005670R92737M96147K67379N72256P41973
42963a030220J89377n44835m04386O81782J570757J299168K11214n59669m09814
42954A003374K58351P17011O86694L50810p5304m58237n36050m4473P69702J143094
42944C814972O49313k17014p11170q15752r97839j225859j000825l49903O7708
42935g86369N2282K11302Q31438J223643P66727j05572o20065p19572o76055l11362
42925a33603M67923R05937K68065q51849j204875o52062j22215K0411K70475O41374
42915c90419M62528j84013k46385N15746Q86331J21649p42671n48965J40134J31586
42905A45521l72193l29824J49913N883p85003j029437l17082K64584r0838o53340
$$ plain form
42895 -3011816 -3428230 -3101150 -2545735 -2452963 -2718200 -2697581 -2103734 -1298584 -817823 -842084
42885 -842084 -1136257 -1387701 -1517694 -1624804 -1711827 -1655172 -1450028 -1259475 -1154902 -1043086
42875 -1043086 -925041 -930904 -979563 -781313 -417154 -501869 -1338817 -2213825 -2086964 -894056
42865 -894056 345729 720790 265151 -444144 -1041467 -1490918 -1784874 -1845777 -1645075 -1247325
42855 -1247325 -756742 -262755 211843 687980 1065222 1049485 444926 -455713 -959643 -578479
42845 -578479 494685 1553589 1997946 1780394 1286944 867620 613914 590521 971407
42836 971407 1652016 1981172 1421882 435499 77051 573630 981753 567937 -184723 -478496
42826 -478496 -423493 -565177 -701563 -163620 928261 1658628 1576052 1108993 671533 197472
$$ packed form
42895c011816m16414L27080N55415R2772k65237K0619N93847Q05150M80761k4261
42885h42084k94173k51444j29993j07110q7023N6655K05144J90553J04573J11816
42875a043086J18045n863m8659J98250L64159q4715q36948q75008J26861J192908
42865h94056J239785L75061m55639p09295n97323m49451k93956o0903K00702L97750
42855a247325M90583M93987M74598M76137L77242j5737o04559r00639n03930L81164
42845e78479J073164J058904M44357k17552m93450m19324k53706k3393L80886
42836I71407O80609L29156n59290r86383l58448M96579M08123m13816p52660k93773
42826d78496N5003j41684j36386N37943J091881P30367q2576m67059m37460m74061
$$ plain form
42816 197472 -287701 -447700 -239188 -29793 95436 425376 841636 795158 357347 363757
42806 363757 1036664 1424755 917010 397415 904605 1848251 1759316 462451 -699100
42797 -699100 -751967 -135643 258972 133459 -411410 -1294730 -2259493 -2833248 -2897013 -2901299
42787 -2901299 -3197295 -3500909 -3348796 -2842893 -2616847 -3119930 -4088688 -4722981 -4402128
42778 -4402128 -3275861 -2030868 -1017227 79680 1461402 2520474 2462147 1414006
42770 1414006 329415 -129767 -54239 265711 654289 747164 96473 -1143761 -2173623
42761 -2173623 -2444128 -2143527 -1645209 -1067594 -632625 -797621 -1567924 -2206969 -2147326 -1759471
42751 -1759471 -1702536 -1952476 -2101913 -2239517 -2725581 -3245614 -2944599 -1665329 -382557
$$ packed form
42816A97472m85173j59999K08512K09395J25229L29940M16260m6478m37811O410
42806C63757O72907L88091n07745n19595N07190R43646q8935j296865j161551
42797f99100n2867O16324L94615j25513n44869q83320r64763n73755o3765m286
42787b901299k95996l03614J52113N05903K26046n03083r68758o34293L20853
42778d402128J126267J244993J013641J096907J381722J059072n8327j048141
42770A414006j084591m59182P5528L19950L88578R2875o50691j240234j029862
42761b173623k70505L00601M98318N77615M34969j64996p70303o39045N9643L87855
42751a759471N6935k49940j49437j37604m86064n20033L01015J279270J282772
$$ plain form
42742 -382557 -96753 -730313 -1389091 -1377028 -704934 108641 463163 110197 -569513 -840200
42732 -840200 -358447 469374 1039162 1272883 1499896 1726161 1455682 421275 -802994
42723 -802994 -1267509 -696539 187656 454953 -104691 -934205 -1416565 -1453414 -1405004 -1621394
42713 -1621394 -2070661 -2384341 -2263625 -1812934 -1396930 -1215882 -1190059 -1234069 -1378058 -1572862
42703 -1572862 -1691746 -1816256 -2118831 -2299715 -1699818 -387267 449759 -73387 -1112285
42694 -1112285 -1011643 489219 1954279 2231870 1701561 1201813 751239 57112 -479604
42685 -479604 -211316 670845 1343867 1493413 1534896 1762213 1952044 1918459 1934520 2389599
42675 2389599 3299519 4264259 4755812 4487316 3678598 2876483 2340852 1748807 705515
$$ packed form
42742c82557K85804o33560o58778J2063O72094Q13575L54522l52966o79710k70687
42732h40200M81753Q27821N69788K33721K27013K26265k70479j034407j224269
42723h02994m64515N70970Q84195K67297n59644q29514m82360l6849M8410k16390
42713a621394m49267l13680J20716M50691M16004J81048K5823m4010j43989j94804
42703a572862j18884j24510l02575j80884N99897J312551Q37026n23146j038898
42694a112285J00642J500862J465060K77591n30309m99748m50574o94127n36716
42685d79604K68288Q82161O73022J49546M1483K27317J89831l3585J6061M55079
42675B389599R09920R64740M91553k68496q08718q02115n35631n92045j043292
$$ plain form
42666 705515 -624566 -1635497 -1883201 -1378985 -488245 252072 458219 265762 90860
42657 90860 -154255 -1110343 -2843253 -4230085 -4172353 -3049102 -2155156 -1937297 -1729989
42648 -1729989 -1204168 -1009974 -1608353 -2338154 -2286803 -1581149 -1173398 -1563790 -2237168 -2314918
42638 -2314918 -1449387 -79797 1017924 1408628 1238438 806993 140566 -727593 -1277357
42629 -1277357 -849324 478074 1824255 2425567 2217312 1481229 502904 -224628 -105363
42620 -105363 766376 1345789 729274 -696853 -1660384 -1410690 -295644 939413 1903754
42611 1903754 2518672 2669815 2230169 1307228 220491 -793220 -1704950 -2459861 -2780288
42602 -2780288 -2427301 -1606429 -798104 -125856 709473 1671847 2070461 1488482 640752
$$ packed form
42666G05515j330081j010931k47704N04216Q90740P40317K06147j92457j74902
42657I0860k45115r56088j732910j386832N7732J123251Q93946K17859K07308
42648a729989N25821J94194n98379p29801N1351P05654M07751l90392o73378p7750
42638b314918Q65531J369590J097721L90704j70190m31445o66427q68159n49764
42629a277357M28033J327398J346181O01312k08255p36083r78325p27532J19265
42620a05363Q71739N79413o16515j426127r63531K49694J115046J235057R64341
42611A903754O14918J51143m39646r22941j086737j013711r11730p54911l20427
42602b780288L52987Q20872Q08325O72248Q35329R62374L98614n81979q47730
$$ plain form
42593 640752 595614 1289143 1557386 689682 -736484 -1692015 -1701894 -842110 548533 1793992
42583 1793992 2141269 1586925 1042638 1289477 2130399 2877410 3213890 3184628 2779193 2010282
42573 2010282 1100910 200146 -789319 -1804664 -2478730 -2758813 -3140857 -3780167 -3909669
42564 -3909669 -2851518 -1206220 -219757 -176251 -224721 264298 952434 1241898 1081950
42555 1081950 875560 1027231 1704007 2687514 3414636 3469060 2996228 2374823 1695315 943698
42545 943698 395417 255293 162473 -251011 -504609 191038 1589015 2520088 2487366 2218071
42535 2218071 2313827 2282923 1488891 301696 -421900 -478557 -222212 246101 1004384 1689695
42525 1689695 1801524 1609845 1969032 3016012 3710913 3070075 1413249 -84900 -811301
$$ packed form
42593F40752m5138O93529K68243q67704j426166r55531r879Q59784J390643J245459
42583A793992L47277n54344n44287K46839Q40922P47011L36480k9262m05435p68911
42573B010282r09372r00764r89465j015345o74066k80083l82044o39310j29502
42564c909669J058151J645298R86463M3506m8470M89019O88136K89464j59948
42555A081950k06390J51671O76776R83507P27122N4424m72832o21405o79508p51617
42545I43698n48281j40124r2820m13484k53598O95647J397977R31073l2722k69295
42535B218071R5756l0904p94032j187195p23596n6657K56345M68313P58283O85311
42525A689695J11829j91679L59187J046980O94901o40838j656826j498149p26401
$$ plain form
42516 -811301 -1133767 -1474270 -1600875 -1149836 -384794 121460 361799 804631 1406164 1420258
42506 1420258 491338 -699596 -1367156 -1656940 -2125111 -2659603 -2742854 -2496310 -2516045 -2730041
42496 -2730041 -2393135 -1374691 -509782 -307478 -153758 657280 1763397 2244504 1862437
42487 1862437 1208903 896801 1071250 1491928 1728192 1503096 1113893 1174337 1661299 1675261
42477 1675261 591790 -942558 -1687674 -1209975 -139132 680871 784859 111039 -948630
42468 -948630 -1634138 -1490567 -894402 -478401 -215139 363785 1167755 1474199 976392 294787
42458 294787 157752 486645 614694 191185 -391690 -409496 449612 1715518 2562537 2668598
42448 2668598 2468712 2403371 2225606 1449661 272270 -499055 -428223 135987 691062 1116595
$$ packed form
42516h11301l22466l40503j26605M51039P65042N06254K40339M42832O01533J4094
42506A420258r28920j190934o67560k89784m68171n34492q3251K46544j9735k13996
42496b730041L36906J018444Q64909K02304J53720Q11038J106117M81107l82067
42487A862437o53534l12102J74449M20678K36264k25096l89203O0444M86962J3962
42477A675261j083471j534348p45116M77699J070843Q20003J03988o73820j059669
42468i48630o85508J43571N96165M16001K63262N78924Q03970L06444m97807o81605
42458B94787j37035L28893J28049m23509n82875j7806Q59108J265906Q47019J06061
42448B668598j99886o5341j77765p75945j177391p71325P0832N64210N55075M25533
$$ plain form
42438 1116595 1396206 1307939 808592 457926 965868 2260989 3323768 3159792 1863878
42429 1863878 524224 36630 256083 530792 787403 1518501 2698388 3424311 3011237
42420 3011237 1893833 940365 344946 -178370 -535212 -440067 -277157 -840800 -2110177
42411 -2110177 -3090161 -3102006 -2507084 -1830780 -883780 682880 2411336 3273603 2784550
42402 2784550 1500671 450829 267448 770861 1231547 1086910 440223 -215336 -634296
42393 -634296 -927873 -1171034 -1299670 -1358615 -1435550 -1381774 -1072197 -912098 -1492092 -2658961
42383 -2658961 -3549440 -3711296 -3570337 -3578093 -3561549 -3222270 -2631107 -1878668 -901225 -47795
42373 -47795 -86977 -1119893 -2192121 -2573517 -2663613 -2926147 -2819366 -1856191 -969977 -1417932
$$ packed form
42438A116595K79611q8267m99347l50666N07942J295121J062779j63976j295914
42429A863878j339654m87594K19453K74709K56611P31098J179887P25923m13074
42420C011237j117404r53468n95419n23316l56842R5145J62910n63643j269377
42411b110177r79984j1845N94922O76304R47000J566660J728456Q62267m89053
42402B784550j283879j049842j83381N03413M60686j44637o46687o55559m18960
42393f34296k93577k43161j28636n8945p6935N3776L09577J60099n79994j166869
42383b658961q90479j61856J40959p756J6544L39279N91163P52439R77443Q53430
42373d7795l9182j032916j072228l81396r0096k62534J06781R63175Q86214m47955
$$ plain form
42363 -1417932 -2704206 -3068489 -1985171 -762436 -507114 -879220 -1237793 -1686873 -2324716
42354 -2324716 -2555416 -1945514 -974626 -283137 64177 582 -913063 -2472698 -3322863
42345 -3322863 -2504134 -877465 37139 84772 196933 558638 418804 -385414 -1056596
42336 -1056596 -1167401 -1181081 -1333210 -1100168 -262949 486741 632149 686669 1216462 1680683
42326 1680683 1142180 -218237 -1146178 -805438 384367 1388856 1581222 1139163 779132
42317 779132 1081488 1853444 2285279 1935172 1300926 1110743 1323306 1249501 482136 -702317
$$ packed form
42363a417932j286274l64283J083318J222735K55322l72106l58573m49080o37843
42354b324716k30700O09902R70888O91489L47314o3595r13645j559635q50165
42345c322863Q18729J626669R14604M7633J12161L61705j39834q04218o71182
42336a056596j10805j3680j52129K33042Q37219P49690J45408N4520N29793M64221
42326A680683n38503j360417r27941L40740J189805J004489J92366m42059l60031
42317G79132L02356P71956M31835l50107o34246j90183K12563p3805p67365j184453
$$ [...]
##END NTUPLES=NMR SPECTRUM
##END=
