##TITLE=31Pdec_56-2021
 CDCl3, 24 sc
 27.07.2021
##JCAMPDX= 6.0         $$ Bruker NMR JCAMP-DX V2.0
##DATA TYPE= NMR SPECTRUM
##DATA CLASS= NTUPLES
##ORIGIN= UXNMR, Bruker Analytische Messtechnik GmbH
##OWNER= root
$$ XWIN-NMR		Version 3.5
$$ Tue Jul 27 11:21:27 2021 Russian Standard Time (UT+4h)  she@DPX200
##.OBSERVE FREQUENCY= 81.013821
##.OBSERVE NUCLEUS= ^31P
##.ACQUISITION MODE= SIMULTANEOUS
##.ACQUISITION SCHEME= undefined
##.AVERAGES= 24
##.DIGITISER RES= 16
##SPECTROMETER/DATA SYSTEM= spect
##.PULSE SEQUENCE= zgpg30
##.SOLVENT NAME= CDCl3
##.SHIFT REFERENCE= (INTERNAL, CDCl3, 0, 248.564)
##AUDIT TRAIL= $$ (NUMBER, WHEN, WHO, WHERE, WHAT)
$$ ##TITLE= Audit trail, XWIN-NMR		Version 3.5
$$ ##JCAMPDX= 5.01
$$ ##ORIGIN= Bruker BioSpin GmbH
$$ ##OWNER= she
$$ F:/spectra/data/she/nmr/P31/1/pdata/1/auditp.txt
$$ ##AUDIT TRAIL=  $$ (NUMBER, WHEN, WHO, WHERE, WHAT)
(   1,<2021-07-27 11:18:12.18 +0400>,<she>,<DPX200>,
      <created by zg, POWCHK disabled, PULCHK disabled
       configuration hash MD5:
       00 E9 B6 7A A2 85 ED C7 34 08 36 98 17 FE 4E 26
       data hash MD5: 32K
       CA CC A2 C7 49 5D E6 9B 6F A4 8E 0D 42 69 D0 05>)
(   2,<2021-07-27 11:18:26.73 +0400>,<she>,<DPX200>,
      <Start of raw data processing
       efp BC_mod = 2 LB = 1 FT_mod = 6 PKNL = 1 PHC0 = -7344.801 PHC1 = -53.32507 SI = 64K 
       data hash MD5: 64K
       6D 22 6B 63 0E 42 6A 30 19 94 4A AB 98 20 F2 4F>)
(   3,<2021-07-27 11:19:03.60 +0400>,<she>,<DPX200>,
      <abs ABSG = 5 
       data hash MD5: 64K
       69 2D 84 D9 C9 0C 1F C9 4F 44 0D 52 1D 73 62 82>)
(   4,<2021-07-27 11:19:17.01 +0400>,<she>,<DPX200>,
      <pk PHC0 = 21.32117 PHC1 = 0 
       data hash MD5: 64K
       9A F7 BC 35 BE 60 71 B2 7A 5A 41 45 91 A5 19 F8>)
(   5,<2021-07-27 11:19:36.93 +0400>,<she>,<DPX200>,
      <pk PHC0 = 10.79041 PHC1 = 0 
       data hash MD5: 64K
       E7 17 CA 11 E5 BF A4 3F 3D 42 CE 37 B2 D4 1E 97>)
(   6,<2021-07-27 11:19:39.32 +0400>,<she>,<DPX200>,
      <abs ABSG = 5 
       data hash MD5: 64K
       01 DB 87 62 12 55 C5 60 8B B7 C6 A2 66 DA CD FE>)
$$ ##END=
$$ 
$$ hash MD5
$$ A0 77 B3 37 B5 8A 69 FF 52 47 88 33 32 FF AB A2
##$RELAX= 
##$RELAX= 
##$RELAX= 
##$RELAX= 
##$RELAX= 
##$RELAX= 
##$RELAX= 
##$RELAX= 
$$ Bruker specific parameters
$$ --------------------------
##$DU= <F:/spectra>
##$EXPNO= 1
##$NAME= <P31>
##$PROCNO= 1
##$TYPE= <nmr>
##$USER= <she>
##$AMP= (0..31)
100 100 100 100 100 100 100 100 100 100 100 100 100 100 100 100 100 100 
100 100 100 100 100 100 100 100 100 100 100 100 100 100 
##$AQSEQ= 0
##$AQ_mod= 1
##$AUNM= <au_zg>
##$AUTOPOS= <>
##$BF1= 81.014009
##$BF2= 200.13
##$BF3= 200.13
##$BF4= 200.13
##$BF5= 200.13
##$BF6= 200.13
##$BF7= 200.13
##$BF8= 200.13
##$BYTORDA= 1
##$CFDGTYP= 0
##$CFRGTYP= 5
##$CHEMSTR= <none>
##$CNST= (0..31)
1 1 145 1 1 1 1 1 1 1 1 1 1 1 1 1 1 1 1 1 1 1 1 1 1 1 1 1 1 1 1 1 
##$CPDPRG= <waltz16>
##$CPDPRG1= <>
##$CPDPRG2= <waltz16>
##$CPDPRG3= <>
##$CPDPRG4= <mlev>
##$CPDPRG5= <mlev>
##$CPDPRG6= <mlev>
$$ [...]
##$SUBNAM3= <"">
##$SUBNAM4= <"">
##$SUBNAM5= <"">
##$SUBNAM6= <"">
##$SUBNAM7= <"">
##$SUBNAM8= <"">
##$SUBNAM9= <"">
##$SW= 501.771253377433
##$SWIBOX= (0..15)
0 1 3 0 0 0 0 0 0 0 0 0 0 0 0 0 
##$SW_h= 40650.406504065
##$TD= 32768
##$TD0= 1
##$TE= 0
##$TE2= 300
##$TE3= 300
##$TEG= 300
##$TL= (0..7)
0 120 53 12 22 120 120 120 
##$TP= (0..7)
150 150 150 150 150 150 150 150 
##$TP07= 0
##$TPNAME0= <>
##$TPNAME1= <>
##$TPNAME2= <>
##$TPNAME3= <>
##$TPNAME4= <>
##$TPNAME5= <>
##$TPNAME6= <>
##$TPNAME7= <>
##$TPOAL= (0..7)
0.5 0.5 0.5 0.5 0.5 0.5 0.5 0.5 
##$TPOFFS= (0..7)
0 0 0 0 0 0 0 0 
##$TUNHIN= 0
##$TUNHOUT= 0
##$TUNXOUT= 0
##$USERA1= <user>
##$USERA2= <user>
##$USERA3= <user>
##$USERA4= <user>
##$USERA5= <user>
##$V9= 5
##$VALIST= <valist>
##$VCLIST= <CCCCCCCCCCCCCCC>
##$VD= 0
##$VDLIST= <DDDDDDDDDDDDDDD>
##$VPLIST= <PPPPPPPPPPPPPPP>
##$VTLIST= <TTTTTTTTTTTTTTT>
##$WBST= 1024
##$WBSW= 4
##$XGAIN= (0..3)
0 0 0 0 
##$XL= 0
##$YL= 0
##$YMAX_a= 3633
##$YMIN_a= -4163
##$ZGOPTNS= <>
##$ZL1= 120
##$ZL2= 120
##$ZL3= 120
##$ZL4= 120
##$ABSF1= 248.5645
##$ABSF2= -253.2056
##$ABSG= 5
##$ABSL= 3
##$ALPHA= 0
##$AQORDER= 0
##$ASSFAC= 0
##$ASSFACI= 0
##$ASSFACX= 0
##$ASSWID= 0
##$AUNMP= <proc_1d>
##$AZFE= 0.1
##$AZFW= 0.5
##$BCFW= 0
##$BC_mod= 2
##$BYTORDP= 0
##$COROFFS= 0
##$CY= -3
##$DATMOD= 1
##$DC= 0
##$DFILT= <>
##$DTYPP= 0
##$F1P= 0
##$F2P= 0
##$FCOR= 1
##$FTSIZE= 65536
##$FT_mod= 6
##$GAMMA= 0
##$GB= 0
##$INTBC= 1
##$INTSCL= 5.30512e-09
##$ISEN= 30
##$LB= 1
##$LEV0= 0
##$LPBIN= 0
##$MAXI= 10000
##$MC2= 0
##$MEAN= 0
##$ME_mod= 0
##$MI= 50
##$NCOEF= 0
##$NC_proc= -7
##$NLEV= 6
##$NOISF1= 182.463
##$NOISF2= 159.3651
##$NSP= 0
##$NTH_PI= 0
##$NZP= 0
##$OFFSET= 248.5645
##$PC= 4
##$PHC0= -7312.688
##$PHC1= -53.32507
##$PH_mod= 1
##$PKNL= yes
##$PPARMOD= 0
##$PSCAL= 0
##$PSIGN= 0
##$REVERSE= no
##$SF= 81.014009
##$SI= 65536
##$SIGF1= 159.3651
##$SIGF2= -187.1042
##$SINO= 113.3802
##$SIOLD= 16384
##$SREGLST= <1H.CDCl3>
##$SSB= 0
##$STSI= 65536
##$STSR= 0
##$SW_p= 40650.406504065
##$SYMM= 0
##$S_DEV= 0
##$TDeff= 32768
##$TDoff= 0
##$TI= <>
##$TILT= no
##$TM1= 0
##$TM2= 0
##$TOPLEV= 0
##$USERP1= <user>
##$USERP2= <user>
##$USERP3= <user>
##$USERP4= <user>
##$USERP5= <user>
##$WDW= 1
##$XDIM= 65536
##$YMAX_p= 553132011
##$YMIN_p= -72412244
$$ End of Bruker specific parameters
$$ ---------------------------------
##NTUPLES= NMR SPECTRUM
##VAR_NAME=  FREQUENCY,     SPECTRUM/REAL,   SPECTRUM/IMAG
##SYMBOL=    X,             R,               I
##VAR_TYPE=  INDEPENDENT,   DEPENDENT,       DEPENDENT
##VAR_FORM=  AFFN,          ASDF,            ASDF
##VAR_DIM=   65536,         65536,           65536
##UNITS=     HZ,            ARBITRARY UNITS, ARBITRARY UNITS
##FACTOR=    0.620285442955139, 1,           1
##FIRST=     20137.2065510759, 0,            0
##LAST=      -20513.1999529892, 0,           0
##MIN=       -20513.1999529892, -72412244,   0
##MAX=       20137.2065510759, 553132011,    0
$$ Real data points
##PAGE= N=1
##DATA TABLE= (X++(R..R)), XYDATA
$$ [...]
39873B839931j415771j751144j560820M44053L008418K897941m74821l491342
39865D96445k873627J28817J873953J251575L68916Q94321J835677J408000l30562
39856E053515j690983j646403r41578p66340j051797p96786J61139P09250J37699
39847h32284o84501n98826O3249K5685r73147j854732j758595r63162j86697K15944
39837g547066K58331K03228M96664J250987J850732J623198P58732O0954P6787
39828i67453R15626K256480K862652J149291k459243m745385l166359N33036K376433
39819a244922J447726M85247J081425J431879M5986j286886m46629J295674J184201
39810C993701o95362j694609o36320Q97457J258068N72721l89064j365124k023746
$$ y = [2839931, 1424160, -326984, -1887804, -1443751, 1564667, 4462608, 3987787, 496445, -2377182, -2248365, -374412, 877163, 1246079, 2140400, 3976077, 5384077, 5053515, 3362532, 1716129, 774551, 8211, -1043586, -1840372, -1679233, -969983, -832284, -1516785, -2115611, -2052362, -2026677, -2999824, -4854556, -6613151, -7576313, -7763010, -7547066, -7288735, -7085507, -6588843, -5337856, -3487124, -1863926, -1105194, -1044240, -967453, -51827, 2204653, 5067305, 6216596, 3757353, -988032, -4154391, -3621355, -1244922, 202804, 688051, 1769476, 3201355, 3247341, 1960455, 1513826, 2809500, 3993701, 3298339, 1603730, 967410, 1864867, 3122935, 3695656, 3306592, 1941468, -82278]
39801h2278j635850j23844J354790J535752M64291n11009j47330J158697J420044
39792C433263o07787l186889l096363Q7010K900844K419203R6723o86139M98526
39783A858391J211891K97924q63713j157616j084603r37188j26891R78288Q55003
39774A031486o19331j495590o21549Q00499J503767J871022K139629J182633j160348
39765D632218k632927j621711J12308J87335n41673J84761J575454P74056j917538
39756G52283k595880M09729L519340K736620q10157k671918j166843R61905Q21883
39747A956962j006915j974472j163069N4986M40541M02277O46183O33752l41076
39738c50831j300620o32940J070216J331136m05867j524620k42859J323237M78663
$$ y = [-82278, -1718128, -1841972, -487182, 1048570, 1512861, 1001852, 854522, 2013219, 3433263, 2825476, -361413, -3457776, -3370766, -469922, 1949281, 2046004, 1359865, 1858391, 3070282, 3368206, 2504493, 1346877, 262274, -674914, -801805, 176483, 1031486, 412155, -1083435, -1704984, -904485, 599282, 2470304, 4609933, 5792566, 4632218, 1999291, 377580, 489888, 677223, 135550, 320311, 1895765, 2669821, 752283, -1843597, -1433868, 2085472, 4822092, 4011935, 1340017, 173174, 1135079, 1956962, 950047, -1024425, -2187494, -2132508, -1691967, -1289690, -643507, -9755, -350831, -1651451, -2284391, -1214175, 116961, -288906, -1813526, -2056385, -733148, -254485]
39729b54485j434891j023081J439764K129495j49052j802795p2746K566403K254554
39720C653166m31183j686839k29127J384412R60211n82278j192146l89389P76080
39711B262907J135286J95248j504161k539131j995658p50365l35880o52140k47458
39702d431352J008235J356735N1473r26505M00712K721931K851699J14849k571809
39693E75968k384543J33437K239075K317041J025151j86487n20423L0633R34902
39684D164754J286763M61933j038777j854829j172297M11701J538055J277205
39676E074508k91750k124790k746812j449169P11365J723822Q37748n78918p71462
39667C84542M13568J669162J690800J17098k136625l054007j236682J779466K399376
$$ y = [-254485, -1689376, -2712457, -1272693, 856802, 707750, -1095045, -1167791, 1398612, 3653166, 3221983, 1535144, 1306017, 2690429, 3650640, 3068362, 1876216, 1486827, 2262907, 3398193, 3593441, 2089280, -449851, -2445509, -3195874, -3531754, -4183894, -4431352, -3423117, -2066382, -2014909, -2941414, -2540702, 181229, 3032928, 3147777, 575968, -1808575, -1675138, 563937, 2880978, 3906129, 3719642, 3199219, 3229852, 4164754, 5451517, 5913450, 4874673, 3019844, 1847547, 2259248, 3797303, 5074508, 4782758, 2657968, -88844, -1538013, -826648, 897174, 1734922, 1156004, 384542, 798110, 2467272, 4158072, 4275170, 2138545, -915462, -2152144, -372678, 2026698]
39658B026698m97501l390619k468748J106311K869575J222470j068608j399641
39650a600063j62636J396794K872810L198975P46589l330079m870678k084627
39642c832915J519236K052734M34417l16721k82650j169962j713016N87438M006429
39633A284990L969502J87468k430255j142317R02601K24878j874349k436592j583988
39624b898062r84136l50006J152818K102785Q35759j252155j613794m65225L24059
39615c147957Q87863K362045L318460J322113k233764l088185l87127K070631
39607A104079J796739O93684O26630J73606j634732k282778o2919J867686J13979
39598B395974k715771j558766K586617L423476j010946n069658l775838M60425
$$ y = [2026698, 1529197, -1861422, -4330170, -3223859, -354284, 868186, -200422, -1600063, -1762699, -365905, 2506905, 5705880, 6452469, 3122390, -1748288, -3832915, -2313679, -260945, 173472, -143249, -425899, -1595861, -3308877, -2721439, 1284990, 5254492, 5441960, 3011705, 1869388, 2771989, 2996867, 1122518, -1314074, -2898062, -3882198, -4232204, -3079386, -976601, -140842, -1392997, -3006791, -3472016, -3147957, -2260094, 101951, 3420411, 4742524, 2508760, -579425, -966552, 1104079, 2900818, 3594502, 4221132, 4394738, 2760006, 477228, 414309, 2281995, 2395974, -319797, -1878563, 708054, 4131530, 3120584, -1949074, -5724912, -5264487]
39590e264487K454247J672109J101870J400718O80024j049302j515153k52509
39582g72483O13124J69469Q4233J241984J943440Q91505m94172n14107O0662l25988
39572B897667j140328q11854L10024L60455r81916j892927j046930P36523J836627
39563B67341J587293L60141j059582j815566j509350o60212l2605M21755J121062
39554a319723J550261O85506j094141j932070r81241K82940K02984o53734n33577
39545c792795P05599J362472M33078r61117j141861J6055J137464J074891J31084
39536a035130l21053O54701K298716K655983Q09210j687528k456533j264391j92176
39527e38201o19808j439808j079914N2354N72090N76529J231759K317426K233337
$$ y = [-5264487, -2810240, -1138131, -36261, 1364457, 2044481, 995179, -519974, -772483, -159359, 10110, 94343, 1336327, 3279767, 4171272, 3677100, 3162993, 3223655, 2897667, 1757339, 945485, 1255509, 1615964, 634048, -1258879, -2305809, -1569286, 267341, 1854634, 2214775, 1155193, -660373, -2169723, -2829935, -2862540, -2440785, -1319723, 230538, 916044, -178097, -2110167, -3091408, -2808468, -2605484, -3259218, -3792795, -3087196, -1724724, -1291646, -2252763, -3394624, -3378569, -2241105, -1166214, -1035130, -1356183, -701482, 1597234, 4253217, 5062427, 3374899, 918366, -346025, -538201, -1158009, -2597817, -3677731, -3625377, -3053287, -2476758, -1244999, 1072427, 3305764]
39518C305764O62182o77102n31365L08263O60150N34121J52678q69353k097747
39509A447591j781784M49695J956012M22338k320579k494435J52942J951872N99993
39500C83645j866740k280233l34753J832699K503698J656415L86072j49404J41843
39491B273242R3498r59120j763605j035236j5664o86561j868942m74313K923349
39482a513352L670901j02564l904223k979588R71229K673408P94286j249712r52563
39473b592178N00379J020591K35337r70444j458268l94674J594068K389612J065731
39464A390154m84178m17128J40129n08409j084176M48928K519521J853160r48932
39455B909069k081614p30637n1041j312141j707077M41792K554084K055271J39780
$$ y = [3305764, 3967946, 3290844, 2759479, 3067742, 3727892, 4262013, 4414691, 3545338, 1447591, -334193, 115502, 2071514, 2493852, 173273, -2321162, -2168220, -216348, 383645, -1483095, -3763328, -4098081, -2265382, 238316, 1894731, 2280803, 2131399, 2273242, 2366740, 1407620, -355985, -1391221, -1406885, -2093446, -3962388, -4436701, -1513352, 2157549, 2054985, -1849238, -4828826, -3857597, -1184189, -389903, -1639615, -2592178, -2091799, -1071208, -835871, -1806315, -3264583, -3659257, -2065189, 324423, 1390154, 905976, 488848, 628977, 120568, -963608, -514680, 2004841, 3858001, 2909069, 827455, 96818, 45777, -1266364, -2973441, -2531649, 22435, 2077706, 2217486]
39446B217486j035051j585616j931738q81294J524793K322759k8569k329818j169530
39437b896578J611146J878336k61341j200347n304O37937m49620j112911j755
39428a800437J021306O6410j801176k312475r72064R32113K007787J624909K09283
39419a024344p94878k60628J088561J555182Q72935L57681N74355N07639m29167
39410B447336j137499n49535N53274O17355m06575j058616n93964j54837j074040
39401a357101k562273k324630J62620K362737J948241K02523N1548J457479J700655
39392A641799K34817l05651J012367J320223j095424l311489k373163k15253p7337
39383c169111p49400P88607K976948J618685k464991l692481l81073K490734J074383
$$ y = [2217486, 1182435, -403181, -2334919, -3216213, -1691420, 631339, 602770, -1727048, -2896578, -1285432, 592904, 331563, -868784, -874088, -236151, -685771, -1798682, -1800437, -779131, -712721, -2513897, -4826372, -5798436, -4866323, -2858536, -1233627, -1024344, -1819222, -2079850, -991289, 563893, 1436828, 1794509, 2368864, 2876503, 2447336, 1309837, 760302, 1313576, 1930931, 1524356, 465740, -128224, -283061, -1357101, -3919374, -6244004, -6081384, -3718647, -1770406, -1567883, -1516335, -58856, 1641799, 1876616, 1570965, 2583332, 3903555, 2808131, -503358, -2876521, -3091774, -3169111, -3918511, -3129904, -152956, 1465729, -999262, -4691743, -5072816, -2582082, -1507699]
39374a507699j790635j604849J241365L195068K834753J262358n89903k145612
39366H94846k301621p88748Q58269J388838J344484J216563L15421j058185r82269
39357H87598O34373Q63658j535161l218270j200219K134834K769383J333724J195608
39348C865528K153159J105875j862175l259974k097335j093759j385675q38441
39340c412797J163376J930360L67042o80004N79525J523409k03794k198008j176947
39331b107838J422603J845314J43133l67901J162344K084783R06861p17767j204339
39322C167193j072982r30127k17381R25364J041450o0625l51614J148155K138095
39313E787528K21673l097044m118283k070095J5706j95854j322673q92884Q03144
$$ y = [-1507699, -3298334, -4903183, -3661818, -466750, 2368003, 3630361, 3040458, 894846, -1406775, -2195523, -1337254, 51584, 1396068, 2612631, 2928052, 1869867, 887598, 1521971, 2385629, 850468, -2367802, -3568021, -1433187, 1336196, 2669920, 3865528, 6018687, 7124562, 5262387, 2002413, -94922, -1188681, -2574356, -3412797, -2249421, -319061, 47981, -632023, -52498, 1470911, 1267117, -930891, -2107838, -685235, 1160079, 1303212, 935311, 2097655, 4182438, 5089299, 4371532, 3167193, 2094211, 1164084, 946703, 1872067, 2913517, 2852892, 2501278, 3649433, 5787528, 6009201, 2912157, -1206126, -3276221, -3260515, -3456369, -4779042, -5671926, -4868782]
39304d868782J430996M43445k8937J388264K848428J779919j113095k391358n75974
39295a087094J662279J135884j502128k856642j539089L82173Q75783O50422J170214
39286a108198J780624Q72522r80247j435275k364J026233R3864j186067o21107
39277a560015J096083J565323L88346o46936p75491j102201j876829j550531K64875
39268d197376J288676q2773j862396j328127O47847J038347l50781o57879J096401
39259d408061K229486Q00496j128962p22022J257882J814051K62581j129499p04465
39250a728513O02857J134371P15785L33460M95075N43094m83204k313795l055799
39241c756669j233131J731647K575869M27877j733990j193489O83921Q75100m71852
$$ y = [-4868782, -3437786, -2994341, -3023278, -1635014, 1213414, 2993333, 1880238, -511120, -1087094, 575185, 1711069, 208941, -2647701, -4186790, -3804617, -2928834, -2278412, -1108198, 672426, 1544948, 564701, -870574, -872938, 153295, 247159, -938908, -1560015, -463932, 1101391, 1489737, 842801, 67310, -1034891, -2911720, -4462251, -4197376, -2908700, -2991473, -4853869, -6181996, -5534149, -4495802, -4846583, -5504462, -4408061, -2178575, -1378079, -2507041, -3229063, -1971181, -157130, 105451, -1024048, -1728513, -1125656, 8715, 724500, 1057960, 1553035, 2096129, 1612925, -700870, -3756669, -4989800, -3258153, -682284, -254407, -1988397, -3181886, -2497965, -1622865, -2094717]
39232b094717n35339J391001K739606J717698k67693j195505j094445q78468m72932
39223f90794M56319J317924J395684P78015k49420j467590j923328o47201J220032
39214A89641J202625o88851j449014K36450J696368P81624m27004M40980J339151
39205C321970o09901l064406j480711K756240L353647j030813m097561j426966
39197b278501K888528K941065j87753j237662O32193J479184m75094k563962k360554
39188a162556n95350J060311J870661J314164o05622k066372j235492N68051N46380
39179c05825p94673k81063K045375K128549j305166l641408j203654K600359K195742
39170A438236j721569l507314j028971K126632K820339K051179J489192M89508
$$ y = [-2094717, -2630056, -1239055, 1500551, 3218249, 2950556, 1755051, 660606, -217862, -690794, -234475, 1083449, 2479133, 3257148, 3007728, 1540138, -383190, -1030391, 189641, 1392266, 703415, -745599, -509149, 1187219, 1968843, 1541839, 1982819, 3321970, 2712069, -352337, -1833048, 923192, 4276839, 3246026, -851535, -2278501, 610027, 3551092, 3363339, 2125677, 2757870, 4237054, 3761960, 1197998, -1162556, -1757906, -697595, 1173066, 2487230, 1881608, -184764, -1420256, -852205, -305825, -1100498, -1381561, 663814, 2792363, 1487197, -2154211, -3357865, -757506, 1438236, -283333, -3790647, -4819618, -2692986, 127353, 2178532, 3667724, 4157232]
39162D157232j474602k620680j492288M22081R09289J70256k58321j94962l78838
39153g60833o07036l66006l02731j054440j552429n94709P81999Q59094L89011
39144c208080J366730L000066K246110j058242l017424j241903J403742J072054
39136E63053j368963k029223j7245J694737J189426Q0983K96130J122855R30186
39127B461939j55248j005741j549034k240229k316504n13592K573691M442118
39119A697400L372515K09721k741640l724313k346506M43344K640837K435984
39111A987342J30284j735529j142877Q41936J399454j63519j279566L31591L092213
39102C461329L150109n43210m360561m147959l08282K686244J796051j034310
$$ y = [4157232, 2682630, 61950, -1430338, -1008257, -98968, 71288, -187033, -381995, -760833, -1367869, -1733875, -2036606, -3091046, -4643475, -5238184, -4456185, -3597091, -3208080, -1841350, 1158716, 3404826, 2346584, -670840, -1912743, -509001, 563053, -805910, -2835133, -2852378, -1157641, 31785, 112768, 408898, 1531753, 2461939, 2306691, 1300950, -248084, -2488313, -4804817, -5318409, -2744718, 1697400, 5069915, 5279636, 2537996, -1186317, -3532823, -3089479, -448642, 1987342, 2117626, 382097, -760780, 81156, 1480610, 1317091, 37525, 369116, 3461329, 6611438, 6068228, 1707667, -2440292, -2748574, -62330, 1733721, 699411]
39094F99411j712915N63917K413686J065634j664879j813716J088356L150806
39086C790300J533530j506475j900611L61146J465369l79736k463651k012537
39078a112665l07851j61192j267343j033918Q28258J711307L72494j024113k32016
39069b227039J862141K840823K051586O83919m26194j368933j974962j605734
39061a64393k82857R55306J130265L46817l29560J02323J457227K283178J434643
39052F932949l36281j270075j107088j318438k397560k679988j070116P16021
39044b530576N59534o17958k49176J614430K181514L52349j395187p09894J165422
39035C70458J356178n37043k156663j712275j6389R09549K83318p46766n93647
$$ y = [699411, -1013504, -449587, 1964099, 3029733, 1364854, -448862, 639494, 3790300, 5323830, 3817355, 1916744, 2277890, 3743259, 3363523, 899872, -1112665, -1420516, -1581708, -2849051, -3882969, -3054711, -1343404, -970910, -1995023, -2227039, -364898, 2475925, 4527511, 5211430, 4785236, 3416303, 1441341, -164393, -447250, 508056, 1638321, 1985138, 1655578, 1757901, 3215128, 5498306, 6932949, 6596668, 5326593, 4219505, 2901067, 503507, -2176481, -3246597, -2530576, -1971042, -2589000, -2838176, -1223746, 957768, 1310117, -85070, -794964, 370458, 1726636, 1189593, -967070, -2679345, -2695734, -1786185, -1502867, -2249633, -2843280]
39026b843280P64727J594086N99054j188358j689621n90560N40085Q11273Q58300
39017a144294Q78866K9070j317673j017410J507173L433772K214369n90452j634654
39008B358767n53042M24099N23798Q07572J044432j83838k078689j955053K40332
38999F28378J284265j57559j231711L03366K283979J763190l51442j284461p89915
38990B448090m25002k77365L37259M79502p45936j518700J14120K215113J487663
38981D114744j123797j817742m10694l82395k143729j793957J797224M077533
38973B317187J830888j633651j949097k71715j17446r95628j21562J858795J974529
38964B892300L69308l03633m3729j057682k530582j165916K466722L452841R6333
$$ y = [-2843280, -2078553, -484467, 114587, -1073771, -2763392, -3353952, -2813867, -2002594, -1144294, -265428, -236358, -1554031, -2571441, -1064268, 2369504, 4583873, 3993421, 2358767, 1805725, 2229824, 2753622, 3561194, 4605626, 4421788, 2343099, 388046, 628378, 1912643, 1755084, 523373, 826739, 3110718, 4873908, 4522466, 3238005, 2448090, 2023088, 1745723, 2082982, 2562484, 1816548, 297848, 411968, 2627081, 4114744, 2990947, 1173205, 762511, 380116, -1763613, -3557570, -1760346, 2317187, 4148075, 2514424, 565327, 293612, 176166, -819462, -941024, 917771, 2892300, 3261608, 2957975, 2914246, 1856564, -674018, -1839934, 626788, 4079629, 4175962]
38955D175962k934482j664433J252085J173732j289360j934019J04349J497737
38947C81571L34867j286141r62553N58265Q97030o25943k337120k189005J50864
38938e078165K819317L407064J552682m91848n98445M98420L88291j408803k609095
38929a520582j342041J221802K394627J312591l81339q92802j87147O14534P74298
38920A993941L31409l60087p94697m91183K65247L29555p58416j676290j049790
38911b210311K01277Q4783j049762p42869J372796K357122M60656j790379j355329
38902b672016P07214J367600O00697O60695J481023Q24359j152416j560411L12088
38893E68833J553334L85772j098226p48016J96566k59037j305491r76870M21892
$$ y = [4175962, 1241480, -422953, 829132, 2002864, 713504, -1220515, -1116166, 381571, 716438, -569703, -1532256, -973991, -76961, -702904, -3040024, -5229029, -5078165, -2258848, 1148216, 2700898, 2209050, 1610605, 2109025, 2497316, 1088513, -1520582, -2862623, -1640821, 753806, 2066397, 1685058, 792256, 605109, 1219643, 1993941, 2325350, 1965263, 1170566, 679383, 944630, 1274185, 515769, -1160521, -2210311, -2009034, -1924251, -2974013, -3716882, -2344086, 13036, 473692, -1316687, -2672016, -1964802, -597202, 3495, 664190, 2145213, 2969572, 1817156, 256745, 568833, 2122167, 2507939, 1409713, 661697, 858263, 599226, -706265, -1683135, -1261243]
38884a261243R97620K15231q73267j409737j104531J96412J884684K536333J724012
38875B905514P44983M70563k7946j435913k481241j923375p11049l17416l08555
38866c084435M68123J488092J421993M93953j0470Q8998n5014o70225j265670
38857a124655j507486j032879N58313K379241K385592K61462j453748q22359O42236
38848B85717N62596o81664j273726j151851j187919p71374Q11851K001342J168234
38839b36794p2036P54691K393014J598054j202996k280746o32008P27006J38666
38830A186851l43635O52304J117374n00923k085199j082566J376238K116278K36408
38821B673130k197238k836109j128713J474327K720138J818672M90588N01244
$$ y = [-1261243, -263623, -48392, -921659, -2331396, -3435927, -3239515, -1354831, 1181502, 2905514, 3650497, 4121060, 4093114, 2657201, 175960, -1747415, -2458464, -2775880, -3084435, -2616312, -1128220, 293773, 787726, 777256, 866254, 811240, 141015, -1124655, -2632141, -3665020, -3106707, -727466, 1658126, 1919588, 465840, -356519, 285717, 848313, 166649, -1107077, -2258928, -3446847, -4218221, -3406370, -1405028, -236794, -308830, 445861, 2838875, 4436929, 3233933, 953187, 321179, 1048185, 1186851, 843216, 1495520, 2612894, 2111971, 26772, -1055794, 320444, 2436722, 2673130, 475892, -2360217, -3488930, -2014603, 705535, 2524207, 3014795, 3516039]
38813C516039Q27936m80923k327097j739364R75424K074192K10590j481634o94343
38804H80820N32122r9216j105712l09081R88631L50278j444655j822635o14987
38795b644435L55890N67336O13263l0060j838364k801017n88784L183426M183466
38786A000721J133582k477607l016640o98680J654358J887860n5464k393297k763334
38777e728501n37431K048773K399345Q98172L4279N36976P08839j84128m80770
38768c04446Q11134J811989M85874j968700k620435r93347M61823J87735k66374
38759b394747J105147L366068L656077J187225j619607k421493j706558j166709
38751E403p78089N77253K292509K182991k14954k463821k241923j52847J443238
$$ y = [3516039, 4343975, 3863052, 1535955, -203409, 772015, 2846207, 3056797, 1575163, 880820, 1412942, 1313726, 208014, -101067, 887564, 1237842, -206813, -2029448, -2644435, -2288545, -1721209, -1107946, -1138006, -2976370, -5777387, -6366171, -3182745, 1000721, 2134303, -343304, -3359944, -4058624, -2404266, -516406, -571870, -2965167, -5728501, -6265932, -4217159, -1817814, -919642, -885363, -348387, 360452, 176324, -304446, 506688, 2318677, 2804551, 835851, -1784584, -2777931, -2316108, -2128373, -2394747, -1289600, 2076468, 5732545, 6919770, 5300163, 2878670, 1172112, 5403, -772686, -195433, 2097076, 4280067, 4065113, 1601292, -640631, -793478, 649760]
38742F49760J371910M37279q2336R5659Q8268j072493k941760l625957k001318
38733g080988N55377J809008J479763R37223P34499M28942L46510J102945J637936
38724A951215M72791j184867q07101Q36356K94870k504569l210605K2390K974232
38715a155288J780416j041586r34257J533719K370609P53700p54436j107742j372093
38706G3042j372818q5924J234503N08581j024046l17355K053346K357229j82246
38697C244312k153710j572712m74976o95914j058111m07332R6107m47039q74002
38688d343377m29359j55968k96154O62448K678238L078956Q77669r16211J83116
38679A339358K093992J520710r75942k326547j588872k68551N73664P55670j97626
$$ y = [649760, 2021670, 2458949, 2376613, 2472272, 2560540, 1488047, -1453713, -5079670, -7080988, -6525611, -4716603, -3236840, -2299617, -1565118, -1136176, -789666, 313279, 1951215, 2424006, 1239139, 432038, 1268394, 1563264, -941305, -4151910, -4129520, -1155288, 625128, -416458, -1350715, 183004, 2553613, 3307313, 2552877, 1445135, 73042, -1299776, -1385700, -151197, 357384, -666662, -984017, 1069329, 3426558, 3244312, 1090602, -482110, -957086, -1653000, -2711111, -3118443, -3022336, -3469375, -4343377, -4772736, -4928704, -5224858, -4562410, -1884172, 1194784, 2072453, 1156242, 1339358, 3433350, 4954060, 3978118, 1651571, 62699, -205852, 367812, 1123482, 925856]
38670I25856j947132k269924J42267K894923K721436J37461j651399j576604j180541
38661a803657r12169L32673J893266J373653j133245k354410p55511J091480Q96530
38652a371390K98095J511762K943118J591396j669198k911905r29320J234721
38644F97279J050171k20510k90763N20878L56403r18306j529715m12587J476614
38635G29464K403726J530191n01354k052402j880656n04049L49188j9033n60735
38626e05660n21552p06693j526630j436296O02007K420939J241118j659328k134439
38617d226534P29831L067665J893145q14077j497296J41480J906572K554242K087915
38608E842943M10853j812635k468376p33785Q69525j06523j904634j087335J738581
$$ y = [925856, -1021276, -3291200, -3148933, -254010, 2467426, 2604887, 953488, -623116, -1803657, -2715826, -2383153, -489887, 883766, -249479, -2603889, -3359400, -2267920, -1371390, -1073295, 438467, 3381585, 4972981, 3303783, 391878, -537442, 697279, 1747450, 1526940, 1236177, 1757055, 2113458, 1195152, -334563, -747150, 729464, 3133190, 4663381, 4162027, 2109625, 228969, -275080, 74108, 55075, -505660, -1027212, -1733905, -3260535, -4696831, -4094824, -1673885, -432767, -2092095, -4226534, -3496703, -429038, 1464107, 650030, -847266, -705786, 1200786, 3755028, 5842943, 6253796, 4441161, 1972785, 1239000, 2108525, 2002002, 97368, -989967, 748614]
38599G48614K501599l6320k365063j591544N93607R98619n65537j873849j681751
38590c271625n95044M49154R47757O17651l40052r86246m85785Q17098J563611
38581a283481P39223j020796j647942O5496K333224K021752q93203k515540l23658
38572b524925K771311K370905r60684k699429j098458R72784J139341N56237P07817
38563A234899P16185l24112j176434o85851O1188k46634q76234o30359M1279K69351
38553a616722M29584P96516J88879k005274l805617k818403L93655L006961L375007
38544b055414K163013O90429k35395j95377O94046J528950J365541J34095j487431
38535B602457k592920k373297q99881L35639m7152j166807r10243P39129J517903
$$ y = [748614, 3250213, 3213893, 848830, -742714, -149107, 849512, 283975, -1589874, -3271625, -3866669, -3417515, -2469758, -1852107, -2192159, -3178405, -3664190, -2847092, -1283481, -544258, -1565054, -3212996, -3147500, -814276, 1207476, 314273, -2201267, -2524925, 246386, 2617291, 1656607, -1042822, -2141280, -1168496, -29155, 527082, 1234899, 1951084, 1626972, 450538, -235313, -174125, -420759, -1296993, -1927352, -1886073, -1616722, -1187138, -390622, -201743, -2207017, -6012634, -8831037, -8437382, -5430421, -2055414, 107599, 798028, 562633, 367256, 1061302, 2590252, 3955793, 4089888, 2602457, 9537, -2363760, -3263641, -2928002, -2975154, -4141961, -5052204, -4313075, -2795172]
38526b795172N26850l49044L43536J418500J440375R72427P69994L5736j502207
38517H60995j932673K1753K315865K239632L36095q30757n84606k60632l67333
38508A798339j59582M47770O52084J19816q88004k012215k323632q21959J353886
38499a833497J351568j007631j905781Q19958L518168J884948k130822l157893
38491b460982n26122J538060J124838O57443J358874J042190j094017k176907
38483e36623m02300J724829J318081p42321j873218j466929m52189N61998Q91880
38474i76792k96772k043598j819064P26871K634923J947042N78506Q18650J526053
38465C095819M57889j665394k301803q95743J022786K349849K704833J505706
$$ y = [-2795172, -2268322, -2617366, -2273830, -855330, 585045, 1557472, 2327466, 2363202, 860995, -1071678, -1049925, 1265940, 3505572, 3841667, 3010910, 2426304, 2165672, 1798339, 1638757, 2086527, 2738611, 2858427, 1970423, -41792, -2365424, -3187383, -1833497, -481929, -1489560, -3395341, -2575383, 942785, 2827733, 696911, -2460982, -2987104, -1449044, -324206, 333237, 1692111, 2734301, 1640284, -536623, -938923, 785906, 2103987, 1361666, -511552, -1978481, -2430670, -1868672, -976792, -1273564, -3317162, -5136226, -4409355, -1774432, 172610, 751116, 1569766, 3095819, 3553708, 1888314, -413489, -1309232, -286446, 2063403, 4768236, 6273942]
38457F273942q55570k139678j041082L31804o17750k731727k819425p85243M14625
38448c970104k31407m43936J023910K110921J012508p38079p91698L93193O91324
38439i43368j73693n52474J73855O94637Q5515o82460l79794M40889K31135j121263
38429b227021j922227j034450M86022R41844L59209P0899M46836O28202M29685
38420a821001O67380J204855O55982j019143j581818K79182K475660K230208N871
38411C097176j467419j182844m83921k46904M534K26198l66172j263165p86848
38402b469365J068736K134724J294893R5883J5638K12140m95713j293901r21402
38393c58367n8126n9584m15590K74643J496694J353252k98745j515447j285555
$$ y = [6273942, 5418372, 3278694, 2237612, 2569416, 1951666, -780061, -3599486, -4384729, -3970104, -4201511, -4645447, -3621537, -1510616, -498108, -1236187, -2027885, -1634692, -943368, -1117061, -1669535, -1495680, -801043, -715528, -1397988, -1777782, -1336893, -1105758, -2227021, -4149248, -5183698, -4697676, -3755832, -3396623, -3325724, -2878888, -2250686, -1821001, -1153621, 51234, 707216, -311927, -1893745, -1614563, 861097, 3091305, 3097176, 1629757, 446913, -37008, -283912, -279378, -53180, -419352, -1682517, -2469365, -1400629, 734095, 2028988, 2124871, 2140509, 2352649, 1856936, 563035, -358367, -416493, -476077, -891667, -617024, 879670, 2232922, 1934177, 418730, -866825]
38384h66825p51828q20654n45177R61496K493334K122781r4353k045146j995339
38375a541711l02679J209149J112874k90096j316350q01434M40844O73226l25838
38366a142015r21329l0910J317146J622603J033265O14078K78473r41040k711858
38357h81587l140443j260940J359440K329678J110455p70522j729702j482054
38349d465675m93428R32049K445244L089790J943925m59752k145489j744272m6251
38340i43859J177162J369312J182781P55049m15677j813721j945826o77336K32306
38331a079809p8034r0809J265476K182109O62457j787180k069917l55349K15474
38322a135582j302253k142449l66392K157829K849120J905177Q68500m6398j063961
$$ y = [-866825, -1618653, -2439307, -2984484, -2022988, 470346, 2593127, 2498774, 453628, -1541711, -1844390, -635241, 477633, 187537, -1128813, -1930247, -1489403, -816177, -1142015, -2063344, -2094254, -777108, 845495, 1878760, 2492838, 2771311, 1830271, -881587, -4022030, -5282970, -3923530, -1593852, -483397, -1253919, -2983621, -4465675, -4959103, -4027054, -1581810, 1507980, 3451905, 2992153, 846664, -897608, -943859, 233303, 1602615, 2785396, 3540445, 3124768, 1311047, -634779, -1312115, -1079809, -1157843, -1248652, 16824, 2198933, 2861390, 1074210, -995707, -1351056, -1135582, -2437835, -4580284, -4946676, -2788847, 60273, 1965450, 2833950, 2787552, 1723591]
38313A723591j207543J1055P29213q10692k934440k421700O86577K856308J853585
38304D85954n55694j366081k9772J473397J233024n29046j598962j99904K330601
38295A243517K462514p57241l470600j895841J883070K507337o67443k476255
38287a170942K5878K845022J280771k627856l166790M38403L215297J994867p30262
38278B104388j536121p03403n5946O04555J966046K365274l389l129147l097327
38269a485070N1402J906204M4992k503987k045615L67756J139281j87863q93056
38260c605956O7161P23380q8793p90598j6278J151152J337251J031720R56055
38251G65094L02036j425255k500996j223104J106807J799051O13190l33419j5239
$$ y = [1723591, 516048, 527103, 1256316, 445624, -2488816, -4910516, -4223939, -1367631, 485954, -69740, -1435821, -1465593, 7804, 1240828, 711782, -887180, -1087084, 1243517, 3706031, 2948790, -521810, -2417651, -534581, 1972756, 1305313, -1170942, -1145064, 1699958, 2980729, 352873, -2813917, -2375514, 839783, 2834650, 2104388, 568267, -135136, -191082, 413473, 2379519, 4744793, 4741404, 1612257, -1485070, -1433668, 472536, 517528, -1986459, -4032074, -3664318, -2525037, -2712900, -3605956, -3538795, -2815415, -2904208, -3694806, -3711084, -2559932, -1222681, -190961, 765094, 1067130, -358125, -2859121, -4082225, -2975418, -1176367, -563177, -896596, -911835]
38242i11835M84323K86918j90690o41611j318870j769625j059608L30657P54910
38233d035431P6613J06597J561988K602256J655022r0451o50289k67924n09473
38224D48908j270590q95398Q51507J955570R07374j094878j627829m9207J848509
38215A073966K040460M76544j134178j389182n56498J57760J23977l87961r57451
38206e52563j326090j136719k24201P61709Q64653J68269j82467L71109R67954
38197b88346O44064k93282q94185r39334q69350p81085l86617K23478O20521Q03955
38187b160181J144871J501227J186719Q1236r47637j146870p88537m93235k89955
38178a912362o6862l19396j329577j995700r60924J068999J850448R48338O63936
$$ y = [-911835, -427512, -140594, -331284, -972895, -2291765, -4061390, -5120998, -4790341, -4035431, -3958818, -3852221, -2290233, 312023, 1967045, 1876594, 1226305, 958381, 448908, -821682, -1717080, -865573, 1089997, 1997371, 902493, -725336, -774543, 1073966, 3114426, 3590970, 2456792, 1067610, 511112, 668872, 792849, 404888, -552563, -1878653, -3015372, -3239573, -2477864, -1613211, -1444942, -1627409, -1256300, -288346, 355718, 62436, -831749, -1771083, -2640433, -3421518, -3808135, -3584657, -2964136, -2160181, -1015310, 485917, 1672636, 1753872, 806235, -340635, -1129172, -1622407, -1912362, -1979224, -2298620, -3628197, -5623897, -6584821, -5515822, -3665374, -2717036, -2053100]
38169b053100K466139M364620L706932J036161j217029k589792m125051m909780
38161c320900k838552R92271K604927R97642j18646J676526L464047J760842j806305
38152C411852l144525j701247p6518O49744J273000J305187m28585k436893j756680
38143b904665J265905K922406J420228r26772j467297l51289Q15503R37239m99928
38134A211330k898827l773786j137895K957316M073196J155620k134213k533200
38126c080459p75336P61241J156203O15206l74541n60974R70999K593342J752860
38117C058541p97019j665822k25591N87838k30012m5332J883866K118504q30975
38108C853998k834645n32116K757388K173205j038965k154072o45956J83505m64222
$$ y = [-2053100, 413039, 4777659, 8484591, 9520752, 8303723, 5713931, 1588880, -3320900, -6159452, -5167181, -2562254, -1564612, -1683258, -6732, 3457315, 5218157, 3411852, 267327, -1433920, -1510438, -860694, 412306, 1717493, 1288908, -1147985, -2904665, -1638760, 1283646, 2703874, 1777102, 309805, -41484, 774019, 1711258, 1211330, -1687497, -5461283, -6599178, -3641862, 431334, 1586954, -547259, -3080459, -3855795, -3094554, -1938351, -1323145, -1697686, -2258660, -1287661, 1305681, 3058541, 2261522, 595700, 370109, 957947, 727935, 682603, 2566469, 4684973, 3853998, 1019353, 487237, 3244625, 5417830, 4378865, 2224793, 1578837, 1762342, 1298120]
38099A298120l72372O94719N81914q60003j488584r42901q44143j032032K10621
38090b754661K119832J893925m05473j504893j74302J065147L74642r52219j461050
38081a799052j423650p48767J415048L779447L221924l98609l063257k057262
38073a074178M40539J174702L29495j6994M89671Q04866O68660M30516N0607k79835
38063C018049P2084P78138O33973k09778k24993N53382J66522j644782k342332
38054H00263o25554J314358J405483O95863O15308J60934j512855k385500o24569
38045a56269J809227J925175L13765l77413o6198o80348j959947j626894M11474
38036d07428J485193K18128j658875k156895j388047m27396L27005R49371J335774
$$ y = [1298120, 925748, 1620467, 2202381, 1342378, -146206, -1089107, -1933250, -2965282, -2754661, -634829, 1259096, 853623, -651270, -825572, 239575, 614217, -338002, -1799052, -3222702, -3971469, -2556421, 1223026, 4444950, 4046341, 983084, -1074178, -633639, 541063, 870558, 853564, 1343235, 2148101, 2816761, 3247277, 3297884, 3018049, 3090133, 3868271, 4502244, 4292466, 4067473, 4620855, 4787377, 3142595, 800263, 174709, 1489067, 2894550, 3590413, 4205721, 4366655, 2853800, 468300, -156269, 1652958, 3578133, 3891898, 3514485, 3448287, 2767939, 807992, -818902, -407428, 1077765, 1295893, -362982, -2519877, -3907924, -4335320, -4008315, -3058944, -1723170]
38027a723170J181177J13626j679747k571515p19119K815728M133463J448195
38019B998638k036488k505538p06171K05471o5034L11857Q10393o03175k750267
38010d340314k194119Q41701K305725R36975J62647J732744K418774j00573k535026
38001g71466j129357J903644J751284j320971k553684k16685K111085J374179
37993A148029p53360j098542L66576J279438P71891L37672J005128J458208n0671
37984D464369k706342l597256j577598Q48110Q68982o29532o31426J121937J799144
37975c9612L26230p49045L11287J225176n92250l426001l469630l17986K795075
37966c936756L589505K684341J183170p96251k680507k973970j289455P26665
$$ y = [-1723170, -541993, -428367, -2108114, -4679629, -5398748, -2583020, 1550443, 2998638, 962150, -1543388, -2249559, -2044088, -2109122, -1797265, -986872, -1590047, -4340314, -6534433, -5692732, -3387007, -2450032, -2287385, -554641, 1864133, 1763560, -771466, -1900823, 2821, 1754105, 433134, -2120550, -2337235, -226150, 1148029, 394669, -703873, -337297, 942141, 1714032, 2051704, 3056832, 4515040, 4464369, 1758027, -1839229, -3416827, -2568717, -1699735, -2329267, -2960693, -1838756, -39612, 286618, -462427, -151140, 1074036, 481786, -2944215, -6413845, -6731831, -3936756, -347251, 2337090, 3520260, 2724009, 43502, -2930468, -4219923, -3493258]
37958c493258J385365P61852n8353m68669m50661j4848Q03190J702140K145880
37949B312638J586895k3011j716552k150721j223646k41789P7334N51258J510209
37940F82615J380653q53727l006895k080650J123333K545520M46299k100410j454339
37931c317601J793238L876983K632585l41990k011793j282194K24925M20794o70848
37922A324099j158026j17089R74905M83141q30982r94592J36071P85213l311j214727
37912f15298j564475r67382j33210K64336N9519M305J092552K602054K137119
37903B879520p82537k809000j013192K341684K669005j45716j873972p93498J40328
37894F12622j009186j874994l81800J408340J009597k06505K22307J407489R68225
$$ y = [-3493258, -2107893, -1346041, -1404394, -1873063, -2323724, -2338572, -1535382, 166758, 2312638, 3899533, 3876522, 2159970, 9249, -1214397, -1456186, -1378852, -827594, 682615, 2063268, 1209541, -1797354, -3878004, -2754671, -209151, 237148, -1863262, -3317601, -1524363, 2352620, 4985205, 4643215, 2631422, 1349228, 1574153, 1994947, 1324099, 166073, 48984, 1023889, 1507030, 676048, -318544, -182473, 602740, 599429, -615298, -2179773, -3147155, -3280365, -3016029, -2956510, -2952205, -1859653, 742401, 2879520, 2096983, -712017, -1725209, 616475, 3285480, 3139764, 1265792, 472294, 612622, -396564, -2271558, -2653358, -1245018, -235421, -441926, -219619, 1187870, 2156095]
37885B156095o23111j093072l57289n2143j45387N94025J425487L54849k066729
37876A92725k819567p67700J630877J691532l07522j951696j428625Q42421K474195
37867d43360J354961j564213k732942m56447K490966K512696P0030j475661q46075
37858a090045J38648Q0686k94739j50284J31686O8286k29811o31513q19913L0656
37848b766343J795085K428754N82055j644272j182465J308624K199455K64839
37840B985732j759679j462198K33868J175279P10150n57153j747953j771670j67744
37831b361368J751272K255485J566132R76117K38367j516573k866347j547993
37823a504908J244706J841844j55613j179062K63030J215603k14546j373450M6454
$$ y = [2156095, 1532984, 439912, 82623, 30480, -114907, 479118, 1904605, 2259454, 192725, -2626842, -3394542, -1763665, -72133, -379655, -2331351, -3759976, -2917555, -443360, 911601, -652612, -3385554, -3842001, -1351035, 1161661, 1231691, -243970, -1090045, -951397, -870711, -1165450, -1315734, -1184048, -1115762, -1345573, -1977086, -2796999, -2766343, -971258, 1457496, 2039551, 395279, -787186, 521438, 2720893, 2985732, 1226053, -236145, -2277, 1173002, 1883152, 1325999, -421954, -2193624, -2361368, -610096, 1645389, 3211521, 4187638, 4426005, 2909432, 43085, -1504908, -260202, 1581642, 1426029, 246967, 509997, 1725600, 1511054, 137604, 184058]
37814A84058J511663k20107l396798l794485j076118J294915J415269O72724O41311
37805b767568J253363J849777J720300N0709k608029l639108j402773J840882
37797c702447K527796O30991p69257l23300J73903n35222j031009O8583J509132
37788a450830J222670m99551j352351j94256J454478J451431j98358j439593r32185
37779a938545L44986Q28753N64122L80467q4105j501151k580541j237156J871396
37770c351774L578332K506376N97277l07620o61812j037651p23134Q6735l30714
37761C56015j875948j683390J249071L515502K184136n76367j050021K96304L87715
37752B803017j052516j679780q98722k02482M4981N45565N16401j142746k704647
$$ y = [184058, 1695721, 1475614, -1921184, -5715669, -6791787, -5496872, -4081603, -3408879, -2767568, -1514205, 335572, 2055872, 2106581, -501448, -4140556, -5543329, -3702447, -1174651, -543660, -1312917, -1636217, -1462314, -1997536, -3028545, -2959962, -1450830, -228160, -727711, -2080062, -2274318, -819840, 631591, 433233, -1006360, -1938545, -1593559, -764806, -200684, 179783, 95678, -1405473, -3986014, -5223170, -3351774, 226558, 2732934, 3330211, 3022591, 2360779, 1323128, 599994, 686729, 356015, -1519933, -3203323, -1954252, 1561250, 3745386, 3169019, 2118998, 2415302, 2803017, 1750501, 70721, -828001, -1030483, -985502, -439937, 76464, -1066282, -3770929]
37743c770929j428253J721061K957660J342566k19800p545L43916m25597r54348
37734d41269j71778O61911M33819O7474L91357M93081k46459o43865J23235P26369
37724A393875k27889j807022k101184r07309L52852O82014L80735L01512Q49572
37715a082844J444796J014509m42003j304180l89803J100812J206183J49149k28850
37706A467769M65628Q51452L56715j29115k52870o03906r66810m58641L61172
37697A091394p2022j424325j543124j2656J013049L75174l80606j3004L95498
37688e70622j4662Q7883J590401K577882J092291j394345j902085l05189Q41837
37679B003391L72457j66311M57859J033075p8328k099641k518263m49837J914920
$$ y = [-3770929, -5199182, -3478121, -520461, 822105, 602305, 594760, 938676, 513079, -441269, -613047, 48864, 482683, 550157, 941514, 1434595, 1188136, 544271, 667506, 1393875, 1165986, -641036, -2742220, -3649529, -3296677, -2614663, -2233928, -1932416, -1082844, 361952, 1376461, 934458, -369722, -759525, 341287, 1547470, 1696619, 1467769, 1933397, 2784849, 3141564, 3012449, 2759579, 2155673, 1188863, 730222, 1091394, 1019372, -404953, -1948077, -1960733, -947684, -572510, -953116, -966120, -570622, -585284, -497401, 1093000, 3670882, 4763173, 3368828, 1466743, 1161554, 2003391, 2375848, 2209537, 2667396, 3700471, 3622143, 1522502, -995761, -1445598, 469322]
37670D69322J943848n4531j359040o31376N34266M89819K9677M67502R07222k76533
37660B520176k284106k734644j174360O09001J418669J478955Q15738o61180j647988
37651a659739o43862J332945J783073M39762p18369j004636j498304j990836r75861
37642d935827Q63846Q66897j004303j514509O06204K528867K059813P29373J82640
37633C83001n96108j929537j309226K018937L962651J210659k986019l258736
37625b504378j29287J399866r5860j064862N09269K176040J622668J19326k97920
37616A734862k0479m30282j408060j889909j519699o67069J05820M2018j132279
37607e185077k169708j328051J119891K789357K171917M45206l62705J68996J051351
$$ y = [469322, 2413170, 2358639, 999599, 368223, 902489, 1392308, 1421985, 1889487, 2796709, 2520176, 236070, -2498574, -3672934, -3063933, -1645264, -166309, 649429, -11751, -1659739, -2303601, -970656, 812417, 1252179, 533810, -470826, -1969130, -3959966, -4935827, -4071981, -3205084, -4209387, -5723896, -5117692, -2588825, -529012, 200361, 383001, -213107, -2142644, -3451870, -1432933, 2529718, 3740377, 754358, -2504378, -2633665, -1233799, -1329659, -2394521, -1885252, 290788, 1913456, 2032782, 1734862, 1714383, 1284101, -123959, -2013868, -3533567, -4200636, -4094816, -4052798, -5185077, -7354785, -8682836, -7562945, -4773588, -2601671, -2156465, -2519170, -2350174, -1298823]
37598a298823J514408J371111M07253j346850k792483k349765O5964K340001K310661
37589B21477L82518j030630o97532J28941Q0856k72629M8895L96021j90958q67475
37579a800516l96067L88318Q7223k72692J102380K873601K177284n7810O6536
37570D168257K539242K403738k263584o160479m086713J359333L683725J409136
37562C052655j374846j682820m82076M30140O11317J22612o53713n87579N58524
37553e786R20713o79081k020077m88582K342247K580175r9215j995435r16140
37544c61181J141311J480314J15124j189677j228390l6369J190496P37087j585829
37535B62886l396065k463430J40326J660769J643950J712183J970733Q33040j409771
$$ y = [-1298823, 215585, 1586696, 1993949, 647099, -2145384, -4495149, -4429185, -2089184, 221477, 603995, -426635, -1124167, -995226, -914370, -1186999, -1138104, -742083, -933041, -1800516, -2196583, -1808265, -1721042, -1993734, -891354, 1982247, 4159531, 4101721, 4168257, 6707499, 9111237, 6847653, 687174, -3399539, -2040206, 1643519, 3052655, 1677809, -5011, -487087, -56947, 554370, 676982, 23269, -564310, -5786, 914927, 235846, -1784231, -2272813, 69434, 2649609, 2550394, 554959, -361181, 780130, 2260444, 2375568, 1185891, -42499, -78868, 1111628, 1848715, 262886, -3133179, -5596609, -5456283, -3795514, -2151564, -439381, 1531352, 2364392, 954621]
37526I54621k074150j19365J950573J546051o19129j883585r62451J117684K385900
37517B296149J583471p41176k565298k495132j202559L2729J211408K568391K817049
37508C505032P39199k128589k908993j273967M31127P66648M45631P1228p34974
37499a087658j617015j346254N9926J133529J187321Q33648L27138m83592q20113
37490a813070k5083N05227o47241j546987O48226M074833L712048o41016l112906
37481A154031n87741K370997R05566k458345k342656P31528J825527q2192j143186
37472C73529L53777J556192M86135r16217q55266o91937j647504j921097R1844
37463c170544K286595J715578o86496j446165K55530J887470J875007J459971
$$ y = [954621, -1119529, -1238894, 711679, 2257730, 1638601, -244984, -1207435, -89751, 2296149, 3879620, 3138444, 573146, -1921986, -3124545, -3091816, -1880408, 687983, 3505032, 4244231, 2115642, -793351, -2067318, -1636191, -869543, -423912, -352684, -1087658, -2704673, -4050927, -3991001, -2857472, -1670151, -836503, -509365, -992957, -1813070, -1838153, -1332926, -1980167, -3527154, -2878928, 1195905, 4907953, 4266937, 1154031, 566290, 2937287, 3842853, 1384508, -958148, -226620, 1598907, 1516715, 373529, 727306, 2283498, 2769633, 1853416, 998150, 306213, -1341291, -3262388, -3170544, -883949, 831629, 145133, -1301032, -1045502, 841968, 2716975, 4176946]
37455D176946J609211R93043j346105l513955l105459p03380J097855J284267
37447D92423Q43195K08968j141681k485088j897183O62426K585603K103306N38330
37438A910299k43239n81600j402107j699617r8796K192042K538864N68049j470225
37429A713670j777342n54619J166050K264946J438599j439918l913251l171496
37421d273361J9303J857794N67874j291178o39364J926018L283969J895013q10212
37412B535856k530196k293094p53691P89553J522729J543169J237439N52785o05715
37403A998835j555737j342321j35119P65380O04329J10186L34208J098271J168401
37394C046433j24076j842007k325656j133889L52125O78425J17212j50604m4819
$$ y = [4176946, 5786157, 6779200, 5433095, 1919140, -1186319, -1889699, -791844, 492423, 1335618, 1544586, 402905, -2082183, -3979366, -3316940, -731337, 1371969, 1910299, 1667060, 1085460, -316647, -2016264, -2115060, 76982, 2615846, 3183895, 1713670, -63672, -618291, 547759, 2812705, 4251304, 2811386, -1101865, -4273361, -4254058, -2396264, -1828390, -3119568, -3758932, -1832914, 1451055, 3346068, 2535856, 5660, -2287434, -3041125, -2251572, -728843, 814326, 2051765, 2604550, 1998835, 443098, -899223, -1034342, -268962, 335367, 445553, 779761, 1878032, 3046433, 2922357, 1080350, -1245306, -2379195, -2027070, -1348645, -1231433, -1382037, -1426856]
37385a426856k66023l39280Q48700K337614J535859j557299l227520j052628K302484
37376h44949K845108R28341M4299J090516J356597p19730k922101k439101L39414
37367c21606K459832J930213k13687j242768l3831J377059N24720j617166j683545
37358A179221Q60814K478787Q73877j578051j963318j307147j736318j945997
37350c138132L62659L433331L430936N55473j258233m66547M85366j10998q78513
37341B415342m29713N85858J285846J610053J154327m27967j804057j406880j99860
37332B782949q1273k13342J400847L258388J806365k214081l734557q74721K200994
37323D331569J901243K37603M03760J192598l53693l207034l390864O846L242879
$$ y = [-1426856, -1692879, -2032159, -1183459, 1154155, 2690014, 1132715, -2094805, -3147433, -844949, 2000159, 2928500, 2972799, 4063315, 5419912, 4700182, 1778081, -661020, -321606, 2138226, 4068439, 3854752, 2611984, 2578153, 3955212, 4479932, 2862766, 1179221, 2040035, 4518822, 5392699, 3814648, 1851330, 544183, -1192135, -3138132, -2775473, 657858, 4088794, 4644267, 3386034, 2919487, 3404853, 3293855, 2415342, 1985629, 2571487, 3857333, 5467386, 6621713, 6193746, 4389689, 2982809, 2782949, 2701676, 2488334, 3889181, 7147569, 8953934, 6739853, 3005296, 2130575, 4331569, 6232812, 6470415, 6874175, 8066773, 7713080, 4506046, 1115182, 1122028, 4364907]
37314D364907K815623j90574j748920q6353K044887J021049k507155m132360j695653
37305a14549J788961K642762J301658K91721l8907p33769j291572q16779l07306
37296B722220o55400m59693R52577J089365j238435k318720N94673L258868O38212
37287D583667l912580l320039J452494K955937k65783j932062N97431K380014
37279B539079M03375j487623k17363J520642J199438O18366R62852R1012k275039
37270C354739k837365q63014K34830k57439J161679M415641M131561r98973m704033
37261C637626k840691O50074J482334J373365K326507J909182r27077k209355
37253E401965K4977J646602o3518j509682K04989K144743J690084J019035J662700
$$ y = [4364907, 7180530, 6989956, 5241036, 5154683, 7199570, 8220619, 5713464, 1581104, -114549, 1674412, 4317174, 5618832, 5910553, 5871646, 5137877, 3846305, 3029526, 2722220, 2066820, 1607127, 2559704, 3649069, 2410634, 91914, 686587, 3945455, 4583667, 671087, -2648952, -1196458, 1759479, 1493696, -438366, 159065, 2539079, 2942454, 1454831, 1237468, 2758110, 3957548, 4575914, 5538766, 5629778, 3354739, 517374, -345640, -110810, -368249, 793430, 5209071, 9340632, 8341659, 3637626, 796935, 1447009, 2929343, 4302708, 6629215, 8538397, 7611320, 5401965, 5426942, 7073544, 7010026, 5500344, 5705333, 7850076, 9540160, 10559195, 12221895]
37244A2221895J657419J136852K905163N289341L699066P15629L256824Q720608
37236C9602797Q126460M090019P977225J7558157J9895196J9573590L4601193
37229A51424637N5953041M8550597J1961901j386594L6899909P5748474N6599380
37222D35751345Q958799P362862M8846011N2212994j1457731o6275567m3378916
37215D32019797K0517100M6198965K3525638L24903o974452k5523449o0472767
37208D29615735p8739374o4701503m4109053l9671355m0491511l0723691j7832809
37201A13346439j4772742j6948589j4015548q246618o698313p569648o181457
37194C8913524m444303n001413m822065k026932o59410k647236l421802p27207
$$ y = [12221895, 13879314, 15016166, 17921329, 23210670, 26909736, 27625365, 30882189, 39602797, 47729257, 51819276, 59796501, 77354658, 97249854, 116823444, 151424637, 207377678, 255928275, 267890176, 266503582, 303403491, 379151965, 435751345, 444710144, 452073006, 500919017, 553132011, 541674280, 475398713, 432019797, 452536897, 498735862, 522261500, 522586403, 515611951, 490088502, 429615735, 350876361, 286174858, 242065805, 202394450, 161902939, 131179248, 113346439, 98573697, 81625108, 67609560, 59362942, 52664629, 45094981, 38913524, 34469221, 29467808, 24645743, 22618811, 21959401, 19312165, 15890363, 15163156]
37186A5163156P67319j494245k935622p23828Q12646j373200l289515j613095
37178E313616M87772P5657l78558Q60942Q41373j360062j480551J681157K611967
37169H653313j169473l650029n96997K549745J80997l347884j409523L085221
37161D295370K735094j764462l361441m49114J823692R34653j84042L43771P03455
37152E076976j62374q50935p72737q03382o71792M29618J186821J9898j292537
37143B159556o0401K151343J479570j603318k607179k28076J723824O59104j119287
37134B555136q59871M58545O70290N0652k6386K29737l5164l90847j52880l2161
37124B467051r24084k001633j637059L43364K506544L419685K612153O24657j135561
$$ y = [15163156, 15930475, 14436230, 11500608, 10776780, 11589426, 10216226, 6926711, 5313616, 5801388, 5877045, 5498487, 6359429, 7200802, 5840740, 4360189, 6041346, 8653313, 7483840, 3833811, 3236814, 5786559, 5967556, 2619672, 1210149, 4295370, 7030464, 5266002, 1904561, 1455447, 3279139, 4213792, 4029750, 4373521, 5076976, 4914602, 4063667, 3290930, 2487548, 1815756, 2245374, 3432195, 3452093, 2159556, 2099155, 4250498, 5730068, 4126750, 1519571, 1291495, 3015319, 3674423, 2555136, 1695265, 2153810, 2824100, 2874752, 2848366, 3078103, 3042939, 2652092, 2499212, 2467051, 1542967, -458666, -2095725, -1752361, 754183, 4173868, 6786021, 7410678, 6275117]
37115F275117j310577r5215Q70907O52861P0816k7794j82776q64129j005942K45223
37105D628491J443619P73047o47287j38801J940067K143749o58972l064402k186247
37096D233264j8995p333j617280j806257l28818L48600k89335k64871P80012R24091
37086A953078n2081L444J324276J299940o70865j525601J17702J092441q67877
37077B674457k701425r14241K317496K449418l47478k092197j394283k43693N72673
37068C20727K050723L290709J917642j410169l076822j791700n6791L28002M69891
37059B042212J116733R03316o16392j444761m26663O82484J94598q76391q87398
37050F87738j29651L77343P52616J264776J157193O5538q16205m65743K76321
$$ y = [6275117, 4964540, 4869325, 5740232, 6393093, 6463909, 6436115, 6253339, 5389210, 4383268, 4628491, 6072110, 6845157, 6197870, 6059069, 7999136, 10142885, 9483913, 6419511, 4233264, 4214269, 4206936, 2589656, 783399, 454581, 803181, 513846, 248975, 1028987, 1953078, 1900997, 1904441, 3228717, 4528657, 3857792, 2332191, 2449893, 3542334, 2674457, -26968, -941209, 1376287, 3825705, 3478227, 1386030, -8253, -251946, 320727, 2371450, 5662159, 7579801, 6169632, 3092810, 1301110, 1244319, 1572321, 2042212, 3158945, 4062261, 3445869, 2001108, 1574445, 2256929, 2451527, 1575136, 687738, 558087, 935430, 1688046, 2952822, 4110015, 4175553, 3359348, 2893605, 3169926]
37041C169926L3113j143153k196397k473377j860680n20625P87756J084117M10145
37032b709175k01909k05844R2950N82146J318549J574670O52969m44239k18510
37023D41607N10225m47170k581127k586583N37165L236268K200968r35032k060480
37014a684159j46433K079208K153023M49850r93317p32478R23583K183797J500512
37005E733586n83318j998917j780641r96533p20056n61751K4616M09421j50863
36996f24456j162300j586828j088511O8381J461170K325171J959284Q06942P1043
36987B229896o5336n12586j274972j082647L24093J312886P73991j87150j79365
36978A338810K83938o1414r76706j106253l9342J177023J330991K50018r75049
$$ y = [3169926, 3203039, 2059886, -136511, -2609888, -4470568, -4991193, -4203437, -3119320, -2709175, -2911084, -3116928, -3023978, -2441832, -1123283, 451387, 1104356, 660117, 441607, 951832, 504662, -2076465, -4663048, -4125883, -889615, 1311353, 376321, -1684159, -1830592, 248616, 2401639, 2851489, 1858172, 1125694, 2049277, 4233074, 5733586, 5150268, 3151351, 1370710, 374177, -345879, -907630, -883014, -473593, -624456, -1786756, -3373584, -4462095, -4393714, -2932544, -607373, 1351911, 2158853, 2229896, 2164560, 1651974, 377002, -705645, -381552, 931334, 1705325, 1518175, 1338810, 1622748, 1561334, 584628, -521625, -560967, 616056, 1947047, 2197065, 1222016]
36969A222016q51611Q19021K281938J836189J42048q89539j068375j749409k821673
36960a079395k395043n4668J983049J951573P15376q4060r3583M38164J365721
36951B747134J714287J65806k467352l407129j665350N71424J416162J635184
36943G10166K132508J801718j07786j880381j835885r18299o64747o14094P4901
36934a301899M72079k81538r08674k02737O18544K85398J60562J661585K949987
36925C453307J545723j267129k180700r47698k10728r40228j466134p36070N73634
36916b176023J930160L040520K542377l47761l288689l153300o92150M91990m37617
36907b090493o52078J122659K313297Q91755j163479r01190J272794K372951P76080
$$ y = [1222016, 370405, 1189426, 3471364, 5307553, 5449601, 4560062, 3491687, 1742278, -1079395, -3474438, -3529106, -1546057, 405516, 1120892, 1036832, 943249, 1381413, 2747134, 4461421, 4627227, 2159875, -1247254, -2912604, -2341180, -925018, 710166, 2842674, 4644392, 4536606, 2656225, 820340, -97959, -762706, -1376800, -1301899, -829820, -1111358, -2020032, -2222769, -1604225, -1318827, -1158265, 503320, 3453307, 4999030, 3731901, 1551201, 603503, 392775, -547453, -2013587, -2749657, -2176023, -245863, 2794657, 5337034, 4989273, 1700584, -1452716, -2144866, -1652876, -2090493, -2742571, -1619912, 693385, 1585140, 421661, -479529, 793265, 3166216, 3942296]
36898C942296k087986l421963j843040J033271K034998K72470j395776k77402
36890a743132K006240J832391p96180k214130p52303R47652K89058j483497j482778
36881c396679P35563K878341K733301L84865j849057j675407M31008J583526M58793
36872B284254q00147l29197J76892j134017k048443J83875K979377J599941k632495
36863B80040l551004M6394K423324M26575j699533j47595K037449Q67677j460365
36854g77038p25889J888410K158871o087j156899l88352J06979m45046o60353
36845e404j34710K68337N58871J057895Q59656l47731o49659Q99885J620986p02919
36835C425207l374698k610217K84902J255175K14897K88840J689273J815316O42205
$$ y = [3942296, 1854310, -1567653, -3410693, -2377422, -342424, -69954, -1465730, -1743132, 263108, 2095499, 1299319, -914811, -1667114, -719462, -430404, -1913901, -3396679, -2661116, 217225, 2950526, 3335391, 1486334, -189073, 241935, 1825461, 2284254, 1484107, 1154910, 1331802, 197785, -1850658, -1666783, 1312594, 2912535, 280040, -3270964, -3224570, -801246, -374671, -2074204, -2221799, -184350, 683327, -777038, -1502927, 385483, 2544354, 2538267, 1381368, 993016, 1099995, 654949, -5404, -140114, 128223, 687094, 1744989, 2604645, 2256914, 1607255, 2507140, 4128126, 3425207, 50509, -2559708, -2274806, -1019631, -804734, -515894, 1173379, 2988695, 3630900]
36826C630900M44254O36735j307833l950045l097589N76855J586463j403893l177780
36817f061933p11173K069641J431149j85207O08720K009114P89723j720668k137705
36808c908339n73674N66818R29899J520464J802494R48445M5240J13664N8737
36799A503748q08440q40358O43386J130294r40452k924334k203500m47370m9404
36790d936430J98894J743313K244386j62496k085582l97L048569K220007n26962
36781A743302J01202K843277J761122k823457m100365l10779K167993l58414l071893
36772b048012j331774J827477J546654j098375k086524r31820L73635J453356
36764b295383K507394K140443j41654j897823j268196J58596N53747P51813J384434
$$ y = [3630900, 4075154, 4711889, 3404056, -545989, -3643578, -3066723, -1480260, -2884153, -6061933, -6773106, -4703465, -3272316, -3457523, -2848803, -839689, -49966, -1770634, -3908339, -4482013, -3915195, -2985296, -1464832, 337662, 1286107, 1331347, 1445011, 1503748, 695308, -145050, 498336, 1628630, 688178, -2236156, -4439656, -4887026, -4936430, -4737536, -2994223, -749837, -912333, -2997915, -2998312, 50257, 2270264, 1743302, 1844504, 4687781, 6448903, 3625446, -474919, -785698, 1382295, 1023881, -2048012, -3379786, -1552309, -5655, -1104030, -3190554, -4122374, -3748739, -2295383, 212011, 2352454, 2210800, 312977, -955219, -796623, -242876, 508937, 1893371]
36755A893371P63795j397093j992594K91241J687711p29622l608018k512298P54127
36746d849380J316498q40156j663193q1344J146342P07037m2788n30834j223561
36737f061379j031019J324758L920546L680511J258410m9968L92267L39242q77082
36728B896286j667186j478252j016236O1620J927748K302559l69767k923386j557532
36719a824146J532475J351715j226885p54624L047273M266068O88717k649487
36711D431106k101129n81505r50660q79059J567440L162746J136590j458081r61024
36702C366424O99769J13724j284214l94845J415001R76982o17299k86299R15475
36693D904718k65357k793044k661448Q4118J309558l23728j748412j183674m65901
$$ y = [1893371, 2657166, 1260073, -732521, -441280, 1246431, 516809, -3091209, -5603507, -4849380, -3532882, -4373038, -6036231, -6117575, -4971233, -4264196, -4306984, -4837818, -6061379, -7092398, -5767640, -1847094, 1833417, 3091827, 3041859, 3434126, 3773368, 2896286, 1229100, -249152, -1265388, -1203768, 723980, 3026539, 2656772, -266614, -1824146, -291671, 1060044, -166841, -921465, 2125808, 6391876, 7080593, 4431106, 2329977, 1748472, 797812, -81247, 1486193, 4648939, 5785529, 4327448, 3366424, 4066193, 4179917, 2895703, 2500858, 3915859, 4892841, 4275542, 3989243, 4904718, 4639361, 1846317, -815131, -731013, 578545, 254817, -1493595, -2677269, -3143170]
36684c143170p50917m24370J253821K299822J477503M10006N69434Q91017L5029
36675B618175j238376j538993r34357k45097L40108Q95562J124142Q44598L04962
36666B170724k26088m54726r628O50319J19013j734570k519401l67021K729592
36657C58214L187768Q55981j055311q28819j7686j25942n04441l13147M5145L28857
36647A930619R24517J132840n22523l278430l959420j265547J955456K359666
36639g22822K26539j688172j824472o51260Q84702K021551K108834J262750N07723
36630B125373L46733n172j141976k201417k038710q22992M35971J194589J422074
36621f85527J093404L82050k56333o72451j007879q97887K47483J880744K486785
$$ y = [-3143170, -3894087, -4318457, -3064636, -764814, 712689, 1122695, 1692129, 2583146, 2618175, 1379799, -159194, -1093551, -1338648, -998540, -102978, 1021164, 1865762, 2170724, 1944636, 1489910, 1480282, 2130601, 2249614, 515044, -2004357, -2371378, 358214, 3545982, 4401963, 3346652, 2517833, 2500147, 2374205, 1869764, 1556617, 1601762, 1930619, 2855136, 3987976, 3465453, 187023, -3772397, -5037944, -3082488, -722822, -496283, -2184455, -4008927, -4660187, -3775485, -1753934, 354900, 1617650, 2125373, 2472106, 2466934, 1324958, -876459, -2915169, -3738161, -3302190, -2107601, -685527, 407877, 789927, 533594, -138857, -1146736, -2044623, -1797140, 83604, 2570389]
36612B570389J566482K35593n20979q13131p59647j75214J59748j040215k984032
36603a761006k945172l36257J684456O45251j364983q66928J666035K776602J405336
36594I03334n63L40387J326450J436047P96333l219r56133j634761j114190K05457
36584A299142N63838m29107r18212J88198J259340N70594q39192r44836l4822
36575G14943P8265o87186p06893L27384Q97819M55003L50344J185588J415171
36566D030438o1109j672553j291463N99086J697823J159505K39737n2208j29813
36557D519443m60086o07743k56166n0741o90202j827804k432289j883948m82121
36548d171657Q00559J072946M30437p7750J65338M75670J28631j93969N31411
$$ y = [2570389, 4136871, 4372464, 3851485, 3038354, 2278707, 2103493, 2263241, 1223026, -1761006, -4706178, -5042435, -3357979, -2712728, -4077711, -4944639, -3278604, -502002, 903334, 902771, 1243158, 2569608, 4005655, 4801988, 4798769, 3842636, 2207875, 1093685, 1299142, 1862980, 1433873, 515661, 703859, 1963199, 2533793, 1694601, 749765, 714943, 793208, 106022, -600871, -273487, 624332, 1079335, 1429679, 2615267, 4030438, 3969329, 2296776, 1005313, 1604399, 3302222, 4461727, 4701464, 4649256, 4519443, 4059357, 3451614, 3195448, 3144707, 2454505, 626701, -1805588, -3689536, -4171657, -3371098, -2298152, -1867715, -1945465, -1780127, -1304457, -1175826, -1369795, -838384]
36539h38384J695063J758151O63461k32245m89508q25474j056716k56573P39959
36530A157734r5511k042814j578257J950306M003044J142009l285123l639430
36522b388042o8049K408394J705042O03805Q60227M58889j771021l208991j631088
36513c030834R38445J388493J47333k22286O47816R36930Q4217m77139N5702O04449
36503A073126j0277j341777j869877p68605J088051J933014J155030J11791J02613
36494A473089K47238r55891k513708j925406N57264J643402j2849j571520n00146
36485c558527J578520J928033R60342M89918M5510j480903k302021l7563L395026
36476A018335L569737J24524k696810k477323j328807j176555p17581R84295J868367
$$ y = [-838384, 856679, 2614830, 3278291, 3046046, 2556538, 1731064, 674348, 417775, 1157734, 1062223, -980591, -2558848, -608542, 3394502, 4536511, 1251388, -2388042, -2456091, -47697, 1657345, 2261150, 3121377, 3580266, 1809245, -1399746, -3030834, -2092389, -703896, -556563, -778849, -131033, 805897, 890114, 412975, 468677, 1073126, 1062849, -278928, -2148805, -2917410, -1829359, 103655, 1258685, 1370476, 1473089, 1720327, 764436, -1749272, -3674678, -3117414, -1474012, -1486861, -3058381, -3558527, -1980007, -51974, 908368, 1398286, 1443796, -37107, -2339128, -2376691, 1018335, 4588072, 4712596, 2015786, -461537, -1790344, -2966899, -3684480, -2700185, -831818]
36467h31818N45336p34270J63840J377371L16807j581376j179114J027678J899445
36458A003899Q46128m3257l81081j661385l086544j773425J916537L609940J300101
36449A730913j411373r05391J093892R01644j167800j946144p31146L58126M56610
36440a620669P62167J463949J136216m67864j751765j831809j362486n30817J232744
36431b970334L051721K767706K65947j767847j578358n70153m78381o05069K84348
36422a600420J301520R61130m3279m343P42288L57134j260777k093802j070326
36413b710875M56355Q61033L37320N1282L11321N11910L27462Q6965L2537j41324
36403A23986o76074j019284l89787Q25829J148433R9245p72393j23432Q97710
$$ y = [-831818, -286482, -1020752, -856912, 520459, 837266, -744110, -1923224, -895546, 1003899, 1850027, 1806770, 1425689, -235696, -3322240, -5095665, -3179128, 430812, 1730913, 319540, -585851, 508041, 1409685, 241885, -1704259, -2435405, -2077279, -1620669, -858502, 605447, 1741663, 1273799, -477966, -2309775, -3672261, -4203078, -2970334, 81387, 2849093, 3115040, 1347193, -231165, -801318, -1279699, -1884768, -1600420, -298900, 662230, 618951, 614608, 1356896, 1714030, 453253, -1640549, -2710875, -2254520, -1393487, -1056167, -1004885, -693564, -181654, 145808, 232773, 265310, 123986, -552088, -1571372, -1961159, -1135330, 13103, 112348, -660045, -783477, 114233]
36394A14233M08053r35046q94396M01283N20472q40260r18310J293511K787350
36385A936890J359180o16201l46141M12230j379052m033850l302281M81553K532918
36376b954754J047039m53131O90381K369272K039497R07191J003834J300755m9333
36367E900751j941521k099796j004511p64247j132922k5776K297632K863529M36269
36358D529408k335916k444327k93248J416831J261517J07015o57822m81202M60442
36349A562698J471360J433598j48221j971105j978782j08144J263347N77850n50274
36340A552327M9660J320068N04953j911414k202594P49847L055102J438528j691967
36331B864510j971543K86247J052812q76851k423684j442843L52034P22183J24344
$$ y = [114233, 522286, -412760, -1307156, -905873, -385401, -1225661, -2143971, -850460, 1936890, 3296070, 2679869, 2333728, 2745958, 1366906, -2666944, -5969225, -5487672, -2954754, -1907715, -2360846, -1670465, 698807, 2738304, 3645495, 4649329, 5950084, 5900751, 3959230, 1859434, 854923, 90676, -1042246, -1068022, 1229610, 4093139, 4529408, 2193492, -250835, -544083, 872748, 2134265, 2241280, 1583458, 1102256, 1562698, 3034058, 4467656, 4319435, 2348330, 369548, 261404, 1524751, 2102601, 1552327, 1601987, 2922055, 3427008, 1515594, -687000, 62847, 3117949, 4556477, 2864510, 892967, 1179214, 2232026, 1355175, -1068509, -2511352, -2159318, -1437135, -1312791]
36322a312791J07296P25647J087681R47760N10440k37705j140479j690505j638920
36313b641576j002443L29370J879639K094222K55779j757544j744160n45509n09923
36304c642145j206074j10114K422283K872491K67858j789033p03360J122473N09905
36295b55716j365763j313473N91819J508333M31194p85151n65395N93557J303655
36286A43060P03772q86988j752280k78608K377157K805678o3893k816105j996289
36277a764496J070981K420276J042805n14211m65483J68614k0065o76113n92564
36268F69744N76057J947813K141376O05668j328382j559995J8988J112909K37800
36259D421978j170772j130818l2481M70716J25471k00704l42853n80930n64893
$$ y = [-1312791, -1205495, -479848, 607833, 1555593, 2066033, 1828328, 687849, -1002656, -2641576, -3644019, -3314649, -1435010, 659212, 914991, -842553, -2586713, -3132222, -3642145, -4848219, -4958333, -2536050, 336441, 604299, -1184734, -1888094, -765621, -255716, -1621479, -2934952, -2343133, -834800, -403606, -1188757, -1754152, -1160595, 143060, 846832, -40156, -1792436, -2071044, 306113, 3111791, 3047898, 231793, -1764496, -693515, 1726761, 2769566, 2255355, 1789872, 1958486, 1938421, 1262308, 669744, 1245801, 3193614, 5334990, 5940658, 4612276, 3052281, 3071269, 4184178, 4421978, 3251206, 2120388, 2087907, 2558623, 2684094, 2483390, 2140537, 1559607, 994714]
36250I94714j89086m50900j716335k336495r15440J194836J724648P66747J17355
36241h09956L21810N66037O49591Q86053Q37090K35492K09734J381527J891925
36232F169303m6492k653304k678814l83570Q29861l21334j348078j36732K081168
36223A512008K839056J397676j152040l055263k797173m64185J671598J498632
36215A450309j95029j024939n34960k58387o88484p18318m5872L86293M90894
36206a138493J107208J764757R04017j247431k451534j672637k84556L97328N54209
36197b067132M22232k23911o17547N59837K590236K929204Q40157j399659j776721
36188A256696q77436r5831L65613P56927R71267J269902J970310J979888j08275
$$ y = [994714, 805628, 354728, -1361607, -3698102, -4613542, -3418706, -1694058, -927311, -809956, -488146, 77891, 727482, 1613535, 2450625, 2686117, 2895851, 4277378, 6169303, 6122811, 3469507, 790693, 407123, 1236984, 915650, -432428, -569160, 1512008, 4351064, 5748740, 4596700, 1541437, -1255736, -1719921, -48323, 1450309, 1255280, 230341, -304619, -563006, -1251490, -1969808, -2015680, -1629387, -1138493, -31285, 1733472, 2637489, 1390058, -1061476, -2734113, -3018669, -2621341, -2067132, -1644900, -1868811, -2486358, -1926521, 663715, 3592919, 4433076, 3033417, 1256696, 379260, 283429, 649042, 1405969, 2377236, 3647138, 5617448, 7597336, 7489061]
36179G489061l004186l499814j101065R53132N11954n78826j00260Q71679L01561
36170A843236j109063j282260k57393K83035n5948k81157j56678l41402p30738
36161b088368m20861P39187J797866J875896R86661q5424l93065J84881N12930
36152C109703m02767j736426j830714o80361K40198N01717R74218J471479O30975
36143B278022j309337k164865j102853J93150N87819J026357J794988J188380
36135B491661j248751k881409j690785M72366P91103l27666n25695O44929J700253
36126e73994J888102J534979O26606r41036k379533k746366j896329M5598K608130
36117a833843L805008J591188k398585l651175j070666R62522o80404k827746
$$ y = [7489061, 4484875, 985061, -116004, 837128, 1349082, 770256, 669996, 1541675, 1843236, 734173, -548087, -805480, -522445, -578393, -859550, -1016228, -1357630, -2088368, -2509229, -1770042, 27824, 1903720, 2890381, 2804957, 2411892, 2596773, 3109703, 2706936, 970510, -860204, -1540565, -1300367, -798650, 175568, 1647047, 2278022, 968685, -1196180, -2299033, -2105883, -1518064, -491707, 1303281, 2491661, 1242910, -1638499, -3329284, -2856918, -2065815, -2393481, -2919176, -2274247, -573994, 1314108, 2849087, 3475693, 2534657, 155124, -2591242, -4487571, -4441973, -1833843, 1971165, 3562353, 1163768, -2487407, -3558073, -2595551, -3275955, -6103701]
36109f103701j346816J901150K243549j32795j038691N71737J684402R71363L60570
36100h89232P20473O47116j6314J98906P97518k92367k187653j504473J654689
36091h71337K894634L70607k132542j260755R79721J179113k94315j255306j682854
36082b073034k338401k049266P7289J834119Q68726j202007j138092Q23793J809458
36073c387415J233957J092341J742909J284383m66701j016990O31628J937001
36065C051113O42001j730401k180168l93227J369627J527775N17629n52554r91670
36056A260125n25642M44219P01585m62628j875381j703274j02151Q13469N8123
36047a391555p62806n6093J205356J155986J22906j36159L08844l02962j811313
$$ y = [-6103701, -7450517, -5549367, -3305818, -3438613, -4477304, -3905567, -2221165, -1249802, -889232, -168759, 478357, 462043, 660949, 1458467, 1166100, -1021553, -2526026, -871337, 2023297, 2393904, 261362, -999393, -19672, 1159441, 865126, -390180, -2073034, -4411435, -6460701, -6383412, -4549293, -3680567, -4882574, -6020666, -5196873, -3387415, -2153458, -1061117, 681792, 1966175, 1499474, 482484, 1114112, 3051113, 3693114, 1962713, -217455, -610682, 758945, 2286720, 2804349, 2251795, 1260125, 734483, 1178702, 1880287, 1417659, -457722, -2160996, -2263147, -1449678, -1391555, -2154361, -2210454, -1005098, 150888, 273794, 137635, 446479, 143517, -1667796]
36038a667796j519452J505552L996852K541451j529951l749825k196993P58788
36030a861374K119155J508599N06002M03490J163897J652928P09441j404058k932056
36021A866024k653667j268124M4403J258368K372505K069535l33258k627405k057832
36012a329451N32735J665631K71376j113894n89349O22728R09153P36919Q96829
36003B602677O11646p55971j868714j195466N67468J504457J015860P981o36180
35994A853758o30943o4091N00416M20546L6891L33667J134306J056653j76586
35985D464617j106919j036167j188989k149533k232043k74890J783638J506833
35977b33453j99512n08452Q37210J291737k40875j619173p94063J090068J335593
$$ y = [-1667796, -3187248, -1681696, 2315156, 4856607, 3326656, -423169, -2620162, -1861374, 257781, 1766380, 2272382, 2675872, 3839769, 5492697, 6202138, 4798080, 1866024, -787643, -2055767, -2011364, -752996, 1619509, 3689044, 3355786, 728381, -1329451, -796716, 868915, 1140291, 26397, -562952, 59776, 968929, 1705848, 2602677, 3214323, 2458352, 589638, -605828, -38360, 1466097, 2481957, 2489938, 1853758, 1222815, 1158724, 1659140, 2079686, 2116577, 2450244, 3584550, 4641203, 4464617, 3357698, 2321531, 1132542, -1016991, -3249034, -3523924, -1740286, -233453, -432965, -941417, -104207, 1187530, 946655, -672518, -1466581, -376513, 959080]
35968I59080n58620k195539j358231J104940K263231R13944p97027n33584P12023
35959E10217M09848r67791m33141K153083K978650K10010k649337k107472q2175
35950B1892k25999j640799r26819J382726J733603N9596j95644J303096R33895
35941B445547j884064k694818M34535K824953N18506k933517j985065J989251
35933a284672L001376j21912k444508r07134J631910J521764n93418j653170m49044
35924a298808J645467K550448J191761j313266k100186J27037K606394J740216
35916E149063j511762k632768k55100J782535M27539k072050k009442K56196J551089
35907F85300P50321n74537j200896j261525r02152j81588K33114N2233K22689
$$ y = [959080, 400460, -1795079, -3153310, -2048370, 214861, 1128805, 331778, -201806, 510217, 920065, -47726, -480867, 1672216, 4650866, 4860876, 2211539, 104067, 21892, -204107, -1844906, -2771725, -1388999, 344604, 404200, 208556, 1511652, 2445547, 561483, -2133335, -1698800, 1126153, 1644659, -1288858, -3273923, -1284672, 1716704, 1594792, -849716, -1756850, -124940, 1396824, 803406, -849764, -1298808, 346659, 2897107, 4088868, 2775602, 675416, 802453, 3408847, 5149063, 3637301, 1004533, 749433, 2531968, 2959507, 887457, -1121985, -865789, 685300, 1435621, 861084, -339812, -1601337, -2503489, -2685077, -2451963, -2399730, -2177041]
35898b177041J182889J554964M93049k99487N85019J127972j036397l771977k843964
35889e184973J328704L848350K626618Q35465Q92596Q18659j039499k152513k47212
35880A726195J943478O28850k758593l648370j204101J238440J796557J771220
35872A493676J818452O22233j743524k758881j213141P80082R83992m8132o45746
35863g10989n65058m30407l39031l45596q27008j216540J270K719809M247033
35854B533483K567925o92055k327576j631248n84889n90123r37868n39828M28552
35845a773627J065715R32136K91709k48645j27444P09975J609197J734215Q17702
35836E010933p08581k081991k530714j624289K55568J923531K213062Q90799j154985
$$ y = [-2177041, -994152, 560812, 1053861, 754374, 1339393, 2467365, 1430968, -2341009, -5184973, -3856269, -7919, 2618699, 3454164, 4346760, 5165419, 4125920, 1973407, 1726195, 3669673, 4298523, 1539930, -2108440, -3312541, -2074101, -277544, 1493676, 3312128, 3934361, 2190837, -568044, -1781185, -1001103, -17111, -65243, -710989, -1276047, -1706454, -2045485, -2391081, -3218089, -4434629, -4433359, -1713550, 2533483, 5101408, 4409353, 2081777, 450529, -134360, -724483, -1662351, -2202179, -1773627, -707912, 224224, 515933, 267288, 139844, 849819, 2459016, 4193231, 5010933, 4302352, 2220361, -310353, -1934642, -1679074, 244457, 2457519, 3348318, 2193333]
35827B193333k479095k063338k20644J508341J780186P10623o18502j513481j835660
35818b538237j273582L41896K014189K171352O95056o77801m92537P38274J479648
35809B458258J019201j68390j250881j685262j430398q38927j37498P80646J604938
35800C51687J301399l66100j656267q59542Q82670Q71899j011600j937708n02792
35791b926354J142694Q47746l16142k84582O13746P81937K86275K51314M89356
35782H85990J15265l83534k4981N19425K6870p59336k57505Q91358O52746q29865
35772H36433j420862p12150m37015q61514j62497J673072J868383m53273j902762
35763a572185K31698L361648L153991j26399k345903j625531k08509k74548j125071
$$ y = [2193333, -285762, -2349100, -2569744, -1061403, 718783, 1429406, 810904, -702577, -2538237, -3811819, -3469923, -1455734, 715618, 1410674, 732873, 240336, 978610, 2458258, 3477459, 3309069, 2058188, 372926, -1057472, -1896399, -2033897, -1253251, 351687, 1653086, 1286986, -369281, -1228823, -346153, 525746, -485854, -2423562, -2926354, -1783660, -935914, -1252056, -1536638, -922892, -140955, 145320, 396634, 885990, 1001255, 617721, 592740, 1112165, 1139035, 379699, 122194, 1013552, 1666298, 836433, -584429, -1296579, -1733594, -2595108, -2757605, -1084533, 783850, 330577, -1572185, -1340487, 2021161, 5175152, 5048753, 2702850, 1077319, 868810, 594262, -530809]
35754e30809j254885o41079Q0363P73438J150655N76368o05082j030298l86098
35745a867427M5571k71707r3514J039282J187384r67646l087499j923712J685287
35736d253981L583718K057129k46699q33171o41445j185569j336247L52433K195126
35727c08706J562988n86963q49052J251109K529873J266464m19539n49235l43699
35718C553240j252020j820713l63429J432926R11029r29470q20120J313581K026247
35709D051271r8245k132333j410222N29738O94111q05427j406649j93591J032586
35700B61239O08875q34125j432586l66126J269762J626152K11846j266343q27233
35691g48539J090476K005935P19833j154555j639062q66264m5698N64420J149883
$$ y = [-530809, -1785694, -2426773, -2346410, -1572972, -422317, 154051, -451031, -1481329, -1867427, -1821856, -2093563, -2187077, -1147795, 39589, -928057, -4015556, -5939268, -4253981, -670263, 1386866, 1140167, 306996, -334449, -1520018, -2856265, -2503832, -308706, 1254282, 667319, -181733, 1069376, 3599249, 4865713, 4446174, 3896939, 3553240, 2301220, 480507, 117078, 1550004, 2461033, 1531563, 711443, 2025024, 4051271, 3953026, 1820693, 410471, 940209, 1634320, 828893, -577756, -771347, 261239, 870114, 35989, -1396597, -1762723, -492961, 1133191, 1345037, 78694, -748539, 341937, 2347872, 3067705, 1913150, 274088, -592176, -637874, -73454, 1076429]
35682A076429J087268M8406o43087J58491J033723j26172k330168k453992j72337
35673b321439J223782j3139j252063J19066K173406J409995j489136k536383n89850
35664c275761J083217J05396j479829p37875J618535K632721J527737J65316k42093
35655A397364l84793p68101o30829L44457J012409N03839l06488k29407L18909
35646A257360J22488p61613j144873o59174j83672k57858l69212j37140M1317
35637b092377R2628P70844K101652K438832N69687j861584j864280Q65929L176690
35628D198021K418593l01809j965173j589513p68382q27426j216839r37637q3573
35619a073738P08322J294639J667518J268675l29425k267424k837614j365010
$$ y = [1076429, 2163697, 2212103, 1569016, 1727507, 2761230, 2635058, 304890, -2149102, -2321439, -1097657, -1110796, -2362859, -2243793, -70387, 1339608, -149528, -2685911, -3275761, -2192544, -2087148, -3566977, -4304852, -2686317, -53596, 1474141, 1639457, 1397364, 1012571, 244470, -386359, -41902, 970507, 1474346, 1167858, 938451, 1257360, 1379848, 618235, -526638, -1185812, -1369484, -1627342, -1996554, -2133694, -2092377, -1999749, -1228905, 872747, 3311579, 3881266, 2019682, 155402, 1021331, 4198021, 6616614, 6314805, 4349632, 2760119, 1991737, 1164311, -52528, -990165, -1073738, -365416, 929223, 2596741, 3865416, 3535991, 1268567, -1569047, -2934057]
35611b934057Q05018J615737N71869o52801k32994J384225J871689J24678k034407
35602E18957k194113n49263P10189O70908M40741O91908P03946L74691P75108
35593B143072J584865N40090k624333m164393j195040L315905M090781R78301
35585D669248j345852q60195o09584k510798l571530j103348K192025K215045
35577i24989j18239p38676R01641J544815L9271r57870J01515J027736j75373
35568F99831j905659j634123K58650J503023J243234L06985o62259j429495j351519
35559b971332j37898J073505R75959P3407j2851J056335J968787J659713M09745
35550D095370q57774j360823p25909N39706J113887M04145m14095j12721M41215
$$ y = [-2934057, -2129039, -513302, 58567, -594234, -827228, 556997, 2428686, 2553364, 518957, -1675156, -2224419, -1514230, -843322, -402581, 289327, 993273, 1367964, 2143072, 3727937, 4268027, 1643694, -2520699, -3715739, -399834, 3690947, 4669248, 3323396, 2463201, 1853617, -657181, -4228711, -5332059, -3140034, -924989, -1043228, -1781904, -880263, 664552, 703823, -254047, -152532, 875204, 699831, -1205828, -2839951, -2581301, -1078278, 164956, 471941, -190318, -1619813, -2971332, -3109230, -2035725, -1059766, -986359, -999210, 57125, 2025912, 3685625, 4095370, 3237596, 1876773, 1150864, 1690570, 2804457, 3208602, 2794507, 2681786, 3123001]
35541C123001m05817k031895k078736k80416P86036k39877j208600k2233J704935
35532f53602J136444j124560j946267o14177L97162j82985n35513N89996J323536
35523a609966j32560k021102j414303J235667K709369J657339j8251m72245j24048
35514a90100M0523J69430M78821K66689o88830j138306k09262Q85442N94993m05901
35504a96501k89998P88524Q29502n79657j263845P0096J361523Q1533k647024
35495a845847l211839n65478K280035K456999Q01704j51508K0810j05412p80136
35486a100672q01648o3105J13607l71100J09799J689838J760749j074916l842561
35477c580009k792105J028373L020727J572601j05189N87014J817256R53774q02313
$$ y = [3123001, 2717184, 685289, -1393447, -1673863, -887827, -1127704, -2336304, -2358537, -653602, 482842, -641718, -2587985, -3202162, -2805000, -2987985, -3523498, -2933502, -1609966, -1742526, -3763628, -5177931, -3942264, -1232895, 424444, 406193, -66052, -190100, -149577, 19853, 498674, 765363, 76533, -1061773, -1271035, -385593, 209400, -196501, -486499, 302025, 1131527, 551870, -711975, -641879, 719644, 801177, -1845847, -5057686, -5623164, -3343129, -886130, -84426, -235934, -215124, -320536, -1100672, -1902320, -1965425, -1851818, -2222918, -2113119, -423281, 1337468, 262552, -3580009, -6372114, -5343741, -2323014, -750413, -855602, -268588, 1548668, 2502442, 1700129]
35468A700129n38185J215649J094115j528200l142544j422135J084856Q10510
35460g25805j384980j652927Q17400K595255J385492n43124j55932J543533J331842
35451C210754r43912k200247j091366J49133l01240j032802k58223J020653R62617
35442d84633R4970J7803L27585l75824j377615p56530J001570J357794j85908
35433c80788j300945o58927L18309M07805M69569J054916P89035j008536k327457
35424b637019j267412Q86605J629329R00144M49100N67031m4494j525902k286314
35415c328932j354368L99252J611318J714423Q25355m88649j291618j089253m79870
35406c482342k17039l8823O10712J253898J044597L42973J96280M85694J42032
$$ y = [1700129, 1161944, 2377593, 3471708, 1943508, -1199036, -2621171, -1536315, -725805, -2110785, -3763712, -2946312, -351057, 1034435, 491311, 335379, 1878912, 3210754, 2266842, 66595, -1024771, -875638, -1176878, -2209680, -2467903, -1447250, -484633, -389663, -371860, -44275, -420099, -1797714, -2554244, -1552674, -194880, -380788, -1681733, -2340660, -2022351, -1614546, -1144977, -90061, 698974, -309562, -2637019, -3904431, -3017826, -1388497, -488353, -39253, 527778, 483284, -1042618, -3328932, -4683300, -4284048, -2672730, -958307, -132952, -621601, -1913219, -3002472, -3482342, -3699381, -3738204, -3127492, -1873594, -828997, -486024, -289744, 195950, 337982]
35397C37982p89067r53177M7278P70108J54561o54441N4237J818347K349778O62898
35387C798504j392057j453247K10857J051996k69866k049981j947134j43791J250802
35378i43917J271988Q17384M88163k57493j327662j328181K65110J778632J452245
35369B216269k03726j334876j155787l71953J06197j5671l31528k7087R98320
35360a19842J313568l13191k366245j942842Q49677K492625J177951n41749p5953
35351D73999J144672O25035p50520o06674N46588N23508l59442j71878N46353
35342A971641l47401k120928j765589P70811K071679O71823r25755p63221k07393
35333f44333o29499p67454N07607J686813J197759J78096L77680J124596O35933
$$ y = [337982, -451085, -1404262, -1356984, -586876, -432315, -1086756, -1032519, 785828, 3135606, 3798504, 2406447, 953200, 1164057, 2216053, 1946187, -103794, -2050928, -2194719, -943917, 328071, 1145455, 1633618, 1376125, 48463, -1279718, -1014608, 764024, 2216269, 2012543, 677667, -478120, -850073, -743876, -759547, -1091075, -1118162, -119842, 1193726, 880535, -1485710, -3428552, -2578875, -86250, 1091701, 549952, 473999, 1618671, 2243706, 1493186, 886512, 1433100, 1956608, 1597166, 1425288, 1971641, 1624240, -496688, -2262277, -1491466, 580213, 1252036, 326281, -436940, -644333, -1273832, -2041286, -1533679, 153134, 1350893, 1528989, 1906669, 3031265, 3667198]
35324C667198r53143j868227j185989L62043J389442Q96600p51300j608160l45378
35315c96914J320530N89476j843110k133928Q35246L198619J618221j918290l365089
35306b095239k204099q04644j46028N45726J097945N70621l78527j45911J006471
35297b553685J291044M55897J21860Q68005J170323j48850k066316k693363j468498
35288e023583M74230J548848J161607J93933j49038N5153j69960p09655l04383
35279b922848J012472J331680j41892j396801n27348J338782J914365J063378
35271A671788J60301n06539j377208j764142p86490O33338J008667P33775R85117
35262G58607J114779j87341j883058j707974P4232J045897O02911M39468R91910
$$ y = [3667198, 2714055, 845828, -340161, 21882, 1411324, 2307924, 1556624, -51536, -396914, 923616, 1513092, -330018, -2463946, -1628700, 1569919, 3188140, 1269850, -2095239, -4299338, -5103982, -5250010, -4704284, -3606339, -3035718, -3414245, -3560156, -2553685, -1262641, -806744, -684884, 183121, 1353444, 1204594, -861722, -3555085, -5023583, -4549353, -3000505, -1838898, -1644965, -1794003, -1738850, -1908810, -2618465, -2922848, -1910376, -578696, -720588, -2117389, -2644737, -1305955, 608410, 1671788, 1832089, 1325550, -51658, -1815800, -2602290, -1968952, -960285, -226510, 758607, 1873386, 1686045, -197013, -1904987, -1830755, -784858, -181947, 257521, 1249431]
35253A249431O85697p41958j396222n78783P4270j69172J36454J362757J472091
35244B094565l11630j581101o85094L35300n98552j731471n23692J625800J460103
35235H4228p48318j781348p29302K11152Q0653M42820J729699J945386L25589
35226A560559q67145L6390J357943R94211j41585l999R25484N31570j267927k324141
35216H01360j557050k92758m1196n81831p02479K27296J663506K185433O73207
35207B375488j998150l107516j208624J564690K013289J75331j028840k86843
35199a501175N58010L809p25567j60575Q11381O83162n9174p0158M46191N07089
35189D92993M28371R95962J435471M71400j140725j415375k15684O34993K29919
$$ y = [1249431, 1935128, 1193170, -203052, -781835, -707565, -876737, -740283, 622474, 2094565, 1782935, 201834, -483260, -147960, -746512, -2477983, -3001675, -1375875, 84228, -664090, -2445438, -3174740, -2963588, -2882935, -2440115, -710416, 1234970, 1560559, 693414, 729804, 2087747, 3081958, 2940373, 2936374, 3861858, 4393428, 3125501, 801360, -755690, -1048448, -1089644, -1671475, -2373954, -2146658, -483152, 1702281, 2375488, 377338, -2730178, -3938802, -2374112, -360823, -185492, -1214332, -1501175, -943165, -939356, -1664923, -1825498, -1014117, -330955, -390129, -460287, -14096, 492993, 921364, 1917326, 3352797, 3824197, 2683472, 1268097, 1052413, 1687406, 1917325]
35180A917325n08947p71313o37115Q7472J585081K425658P10867k594465l917316
35171a702753j700383J396752K177287Q33476k75984o4805P81674J508692J797026
35162D750982J338234K92333l95373j60425L12084J85669l27865o26437p32227
35153D636975q88931r84081j052461j448809j902308j453670j6122J123087J103974
35144h82346O33246N36047M34731j37693n09060N0220R22172R56453O8987q13738
35134A259019q70878J9152J153954J373546M69040l4107J056521K225695J187539
35125G839481j079690j283401Q33361J642755o36064l009500k566585p84717k45338
35116G10302k28592J014814K205552J093021j230750j837372n54266L68943J33082
$$ y = [1917325, 1408378, 637065, -50, 87422, 1672503, 4098161, 4809028, 2214563, -1702753, -3403136, -2006384, 170903, 1004379, 728395, 663590, 1445264, 2953956, 4750982, 6089216, 6381549, 5986176, 5825751, 6137835, 6323504, 5995639, 5369202, 4636975, 3748044, 2763963, 1711502, 262693, -1639615, -3093285, -3109407, -1986320, -882346, -249100, 286947, 721678, 583985, 74925, 125145, 1047317, 2003770, 2072757, 1259019, 388141, 407293, 1561247, 2934793, 3403833, 3369726, 4426247, 6651942, 7839481, 6759791, 5476390, 6309751, 7952506, 7316442, 4306942, 1740357, 955640, 710302, 481710, 1496524, 3702076, 4795097, 3564347, 1726975, 1172709, 1541652, 1674734]
35107A674734k45321l93927m19501M71894K196964K246966o74974l249978j852718
35098b45861J346538J370218j592060k628528l12560J279812k72664k008855j007632
35089d071592J088766J459132L27920n97534q81126n02250R64840K569928K156722
35080B514806j22055j317911j57456J122176R29998Q00908J693170J445003j280404
35071E628235l712333k880041k41138Q73689K87038J26806P15387O68653r9319
35062A366977n20383o07881q93005o10016R58434K281428J393809q20541j767051
35053G81771j047917o95327j703067k654475j996860M6502K005938K482945J190742
35044a589748m73610o06446P16462J377796M79150k11360N58526J145998M620
$$ y = [1674734, 1429413, 1035486, 615985, 1087879, 3284843, 5531809, 4856835, 1606857, -245861, 1100677, 2470895, 878835, -1749693, -2062253, -782441, -1055105, -3063960, -4071592, -2982826, -1523694, -1195774, -1793308, -2674434, -3176684, -2211844, 358084, 2514806, 2392751, 1074840, 917384, 2039560, 2969558, 3770466, 5463636, 6908639, 5628235, 1915902, -964139, -1205277, -331588, -44550, 82256, 797643, 1466296, 1366977, 846594, 238713, -654292, -1264308, -305874, 1975554, 3369363, 2548822, 781771, -266146, -961473, -2664540, -5319015, -7315875, -7269373, -5263435, -2780490, -1589748, -2063358, -2669804, -1953342, -575546, -96396, -307756, 250770, 1396768, 1401388]
35035A401388j116717L2864J891113J169261j608463k498546j55014K195459J720313
35026C031658j91159o26678O32473J473594P14610p07622j392895j220363j288609
35017D25009k317692l284220k294992Q13246L664576L969625K104058Q2478j057422
35008B104666j527490j356449l55212Q97528J427620R48817k86601j884113k683595
34999b714829j227969J706541K788363M46328k195262j456531J313923J789443
34991D50007n90865j989923l86985J654464J472426p3335j034777j280289j149542
34982b928819j0163J826763K258908O02798o82115K05183J168042m31677l140958
34973a132038l451216j194890N80913N30307K84898P78549P48230l21974q40259
$$ y = [1401388, 284671, 317535, 2208648, 3377909, 1769446, -729100, -884114, 1311345, 3031658, 2840499, 2213821, 2846294, 4319888, 5034498, 4326876, 2933981, 1713618, 425009, -1892683, -5176903, -7471895, -6658649, -2994073, 975552, 3079610, 3162088, 2104666, 577176, -779273, -1134485, -236957, 1190663, 2139480, 1852879, -31234, -2714829, -3942798, -2236257, 552106, 998434, -1196828, -2653359, -1339436, 450007, -140858, -2130781, -2517766, -863302, 609124, 535789, -498988, -1779277, -2928819, -2938982, -1112219, 1146689, 1749487, 1067372, 1272555, 2440597, 2008920, -1132038, -4583254, -5778144, -5197231, -4666924, -4382026, -3603477, -2855247, -3177221, -4017480]
34964d017480K8149P50903K06567k70353N50300J286704K62883j303603j027914
34955c533844P75224J650145Q80239P3080j0151l72377j117365p16115J028038
34946a343126J902175O89635o78682k46834Q11313M45373o94518o82525L2729
34937B35540m89932j866435j705574K68088J520898O91413n32109m19247L90945
34928a906413O20217L55162Q5447m29309j107244r62697K72974J377547J449486
34919b44830J049412P23430O8377p84481n80372R02405J796894P06041j111813
34910B525063j559123m57459Q37969J392884J019533j79016j404841j430105k88983
34901D55922M85503J42107k38335J93389O60682M00649j14749n48605j255218
$$ y = [-4017480, -3989331, -3238428, -3031861, -3302214, -2751914, -1465210, -1202327, -2505930, -3533844, -2758620, -1108475, -228236, -155156, -165307, -537684, -1655049, -2371164, -1343126, 559049, 1248684, 570002, 323168, 1134481, 1579854, 885336, 202811, 235540, -254392, -2120827, -3826401, -3558313, -2037415, -1346002, -1878111, -2297358, -1906413, -1286196, -931034, -845587, -1274896, -2382140, -3344837, -3071863, -1694316, -244830, 804582, 1528012, 1596389, 811908, 231536, 1133941, 2930835, 3636876, 2525063, 965940, 508481, 1346450, 2739334, 3758867, 3579851, 2175010, 744905, 455922, 941425, 1083532, 845197, 1038586, 1699268, 2099917, 1985168, 1436563, 181345]
34892A81345j577596j63745J846782J124940k449853m143625j011883L057888
34884c135747K750294q82013k481020m39424J847375J906569P47642l85416j601110
34875a672850k313658j268982Q52087J970917J957778K348064K767889J211312
34867E852557j761782k831664r07189J072760O39227r11237j263717n52343l27228
34858i90616r07430j324783p96697N71429J715584J315408l43168r95064M64130
34849a291207J744066N22132j409446p84527J491178J598637p35846j787754k20391
34840h73158R74112R3886n31410O56994J397229r7164j711160j123255M08982
34831h04944P26414K27971K2016m73867j493707j372844L63673J316051K77844
$$ y = [181345, -1396251, -1559996, 286786, 1411726, -1038127, -5181752, -6193635, -3135747, -385453, -1267466, -3748486, -4187910, -2340535, -433966, 313676, -71740, -1672850, -3986508, -5255490, -4403403, -2432486, -474708, 1873356, 4641245, 5852557, 4090775, 1259111, 351922, 1424682, 2063909, 1152672, -111045, -663388, -990616, -1898046, -3222829, -4019526, -3448097, -1732513, -417105, -760273, -1755337, -1291207, 452859, 974991, -434455, -1218982, 272196, 1870833, 1134987, -652767, -873158, 100954, 194840, -336570, 320424, 1717653, 1620489, -90671, -1213926, -804944, -78530, 149441, 171457, -302410, -1796117, -3168961, -2805288, -1489237, -1211393]
34822a211393k02353J637080L013093J095015j842805k073500n75379p50716k061573
34813b972531j188935J618833K665718J018941l65000k3807J86675n59277l26696
34804E3921J572081K761089J734915K13253k86403j032035k975042l927719j752111
34795c638051J576350K212534j68955k084541j188351R95422J821392R98332J59769
34786F83901J95896M67065K84075j72933n90153j053654j381101r57939M3748
34777b481095L55088m35697p51899O41399K276880K004412M46557j53840J22422
34768B024227o96221k229428j746112Q27797J896232j28000j980345q35186J148768
34759a718268P83844p58315m05727J297603J395363j80578p56058K35403M93253
$$ y = [-1211393, -1413746, 223334, 3236427, 4331442, 2488637, 415137, -160242, -910958, -2972531, -4161466, -2542633, 123085, 1142026, 777026, 753219, 939894, 380617, 53921, 1626002, 4387091, 6122006, 6335259, 6048856, 5016821, 2041779, -1885940, -3638051, -2061701, 150833, -18122, -2102663, -3291014, -2295592, -474200, 524132, 683901, 879797, 1346862, 1630937, 1458004, 867851, -185803, -1566904, -2524843, -2481095, -2126007, -2561704, -3313603, -2672204, -395324, 1609088, 2055645, 1901805, 2024227, 1328006, -901422, -2647534, -1819737, 76495, -51505, -2031850, -2867036, -1718268, -934424, -1692739, -2098466, -800863, 594500, 413922, -342136, -106733, 386520]
34750C86520r61132k193063j476340N15089K057838K090592O52061q77193o27939
34741d33567J203841J958024L70244j105967j92875J277234N50212j148672r64817
34732A513657K16690m39359j882285n90921K654194L239023M19742j328544K6589
34723C828786R53919q51329k262501o19269J276716K33680j545757n35519J629351
34714B108077J000704j611793j868711Q34928K546921J232955o37460q44281n85550
34705B175790j222695j320476N71491K507291J460657j882017l472476j378676
34697b561111J419816J134131j488887k283241K23107K663561J900866m59084
34689E49158j008390R9307J30004j015128o11718J733563K784003P74759j695404
$$ y = [386520, -574612, -2767675, -4244015, -3728926, -1671088, 419504, 1071565, 194372, -433567, 770274, 2728298, 3098542, 1992575, 1799700, 3076934, 3627146, 2478474, 1513657, 1730347, 1290988, -591297, -1182218, 1471976, 4710999, 5130741, 3802197, 3828786, 4782705, 3931376, 1668875, 1049606, 2326322, 2560002, 1014245, 478726, 2108077, 3108781, 1496988, -371723, 463205, 3010126, 4243081, 3605621, 2761340, 2175790, 953095, -367381, 204110, 2711401, 4172058, 2290041, -1182435, -2561111, -1141295, -7164, -1496051, -3779292, -3556185, -892624, 1008242, 549158, -459232, -359925, -229921, -1245049, -1856767, -123204, 2660799, 3435558, 1740154]
34680A740154j742999k43418L87044K3368L5073M85712M83122L5419m14346j143891
34670c54762k152613k237312o94987J230347K072984K063554J978158J556235
34662C461604N49377j80340j84923n18294j702767k246608r51537Q95094J438457
34653E60063P86172q6446j098971j865877q95807J708020K970270J176750r52922
34644B301252l92409J153576K58792k063583j887084R11136K340460O50460j604654
34635A667946k287916k091846j489574L90907K644056K493939p5017j479743j24454
34626c51702J045402k32007j625624m57634J567916J429390j04513k75301O71434
34617A667361K37773j666666k557063j492939j19048L81018N45559P22436M39426
$$ y = [1740154, -2845, -246263, 140781, 164149, 199222, 684934, 1168056, 1203475, 789129, -354762, -2507375, -4744687, -5439674, -4209327, -2136343, -72789, 1905369, 3461604, 4010981, 3830641, 3645718, 3127424, 1424657, -821951, -1773488, -878394, 560063, 1346235, 1259789, 160818, -1705059, -2600866, -892846, 2077424, 3254174, 2301252, 1908843, 3062419, 3321211, 1257628, -629456, 281680, 2622140, 3272600, 1667946, -619970, -2711816, -4201390, -3810483, -1166427, 1327512, 1252495, -227248, -351702, 693700, 461693, -1163931, -1621565, -53649, 1375741, 1271228, 995927, 1667361, 1905134, 238468, -2318595, -3811534, -3930582, -3549564, -3004005, -2281569, -1842143]
34608a842143l5847K34484R10588N93758o44906j016752J40590J228539R16353
34599D84664L6651j49701r2409q91298k004317j642688O03416K774334K704665
34590A823317O08345j195386j139111k34342l88405j457920j356873P08694K678783
34581D7102K316242K48651j098474q70656m55520j001910j833088j639509j69001
34572d456163J633095K500649J791119J77478p17840n3223J111676J191627J96981
34563C375399n24741l34821J23215K31326K113n53999j323897j388203L0285J769055
34553A405732J628417m36372j839015r56000N75109M68719q64358j360716o03444
34544a981928k9289k44141j03664J200938K529226J973971p77584l592395l621514
$$ y = [-1842143, -1877990, -1643506, -732918, -139160, -784066, -1800818, -1660228, -431689, 484664, 521315, 371614, 279205, -612093, -2616410, -4259098, -3655682, -881348, 1823317, 2431662, 1236276, 97165, -137177, -525582, -1983502, -3340375, -2631681, 47102, 2363344, 2611995, 1513521, 642865, 187345, -814565, -2647653, -4287162, -4456163, -2823068, -322419, 1468700, 1646178, 928338, 875115, 1986791, 3178418, 3375399, 2850658, 2515837, 2639052, 2870378, 2872491, 2318492, 994595, -393608, -363323, 1405732, 3034149, 2597777, 758762, -197238, 377871, 846590, -17768, -1378484, -1981928, -2011217, -2255358, -2359022, -1158084, 1371142, 3345113, 2567529, -1024866, -4646380]
$$ [...]
##END NTUPLES=NMR SPECTRUM
##END=
