##TITLE=31Pdec_55-2021
 CDCl3, 24 sc
 9.07.2021
##JCAMPDX= 6.0         $$ Bruker NMR JCAMP-DX V2.0
##DATA TYPE= NMR SPECTRUM
##DATA CLASS= NTUPLES
##ORIGIN= UXNMR, Bruker Analytische Messtechnik GmbH
##OWNER= root
$$ XWIN-NMR		Version 3.5
$$ Fri Jul  9 10:54:56 2021 Russian Standard Time (UT+4h)  she@DPX200
##.OBSERVE FREQUENCY= 81.013821
##.OBSERVE NUCLEUS= ^31P
##.ACQUISITION MODE= SIMULTANEOUS
##.ACQUISITION SCHEME= undefined
##.AVERAGES= 24
##.DIGITISER RES= 16
##SPECTROMETER/DATA SYSTEM= spect
##.PULSE SEQUENCE= zgpg30
##.SOLVENT NAME= DMSO
##.SHIFT REFERENCE= (INTERNAL, DMSO, 0, 248.564)
##AUDIT TRAIL= $$ (NUMBER, WHEN, WHO, WHERE, WHAT)
$$ ##TITLE= Audit trail, XWIN-NMR		Version 3.5
$$ ##JCAMPDX= 5.01
$$ ##ORIGIN= Bruker BioSpin GmbH
$$ ##OWNER= she
$$ F:/spectra/data/she/nmr/P31/1/pdata/1/auditp.txt
$$ ##AUDIT TRAIL=  $$ (NUMBER, WHEN, WHO, WHERE, WHAT)
(   1,<2021-07-09 10:53:22.56 +0400>,<she>,<DPX200>,
      <created by zg, POWCHK disabled, PULCHK disabled
       configuration hash MD5:
       00 E9 B6 7A A2 85 ED C7 34 08 36 98 17 FE 4E 26
       data hash MD5: 32K
       BA 13 EB 9E D8 DE 54 96 43 91 55 DC E8 82 83 D6>)
(   2,<2021-07-09 10:53:26.23 +0400>,<she>,<DPX200>,
      <Start of raw data processing
       efp BC_mod = 2 LB = 1 FT_mod = 6 PKNL = 1 PHC0 = -8916.78 PHC1 = 2872.875 SI = 64K 
       data hash MD5: 64K
       D9 5D 39 28 0D 4C 29 74 8B 96 BE E9 E8 1A 26 D2>)
(   3,<2021-07-09 10:54:14.81 +0400>,<she>,<DPX200>,
      <pk PHC0 = 1032.741 PHC1 = -1780.4 
       data hash MD5: 64K
       6C D9 82 AA A4 AE 70 56 0B 97 6F 3F 34 DC 5A 97>)
$$ ##END=
$$ 
$$ hash MD5
$$ 45 C3 77 BD B2 39 DB 01 37 F3 72 07 B7 EB 82 C6
##$RELAX= 
##$RELAX= 
##$RELAX= 
##$RELAX= 
##$RELAX= 
##$RELAX= 
##$RELAX= 
##$RELAX= 
$$ Bruker specific parameters
$$ --------------------------
##$DU= <F:/spectra>
##$EXPNO= 1
##$NAME= <P31>
##$PROCNO= 1
##$TYPE= <nmr>
##$USER= <she>
##$AMP= (0..31)
100 100 100 100 100 100 100 100 100 100 100 100 100 100 100 100 100 100 
100 100 100 100 100 100 100 100 100 100 100 100 100 100 
##$AQSEQ= 0
##$AQ_mod= 1
##$AUNM= <au_zg>
##$AUTOPOS= <>
##$BF1= 81.014009
##$BF2= 200.13
##$BF3= 200.13
##$BF4= 200.13
##$BF5= 200.13
##$BF6= 200.13
##$BF7= 200.13
##$BF8= 200.13
##$BYTORDA= 1
##$CFDGTYP= 0
##$CFRGTYP= 5
##$CHEMSTR= <none>
##$CNST= (0..31)
1 1 145 1 1 1 1 1 1 1 1 1 1 1 1 1 1 1 1 1 1 1 1 1 1 1 1 1 1 1 1 1 
##$CPDPRG= <waltz16>
##$CPDPRG1= <>
##$CPDPRG2= <waltz16>
##$CPDPRG3= <>
##$CPDPRG4= <mlev>
##$CPDPRG5= <mlev>
##$CPDPRG6= <mlev>
##$CPDPRG7= <mlev>
##$CPDPRG8= <mlev>
##$CPDPRGB= <>
##$CPDPRGT= <>
##$D= (0..31)
0 1 0 0 0 0 0 0 0 0 0 0.03 2e-05 3e-06 0 0 0 0 0 0 0 0 0 0 0 0 0 0 0 0 
0 0 
##$DATE= 1625813602
##$DBL= (0..7)
120 120 120 11 120 120 24 19 
##$DBP= (0..7)
150 150 150 150 150 150 150 150 
##$DBP07= 0
##$DBPNAM0= <>
##$DBPNAM1= <>
##$DBPNAM2= <>
##$DBPNAM3= <>
##$DBPNAM4= <>
##$DBPNAM5= <>
##$DBPNAM6= <>
##$DBPNAM7= <>
##$DBPOAL= (0..7)
0.5 0.5 0.5 0.5 0.5 0.5 0.5 0.5 
##$DBPOFFS= (0..7)
0 0 0 0 0 0 0 0 
$$ [...]
##$SUBNAM2= <"">
##$SUBNAM3= <"">
##$SUBNAM4= <"">
##$SUBNAM5= <"">
##$SUBNAM6= <"">
##$SUBNAM7= <"">
##$SUBNAM8= <"">
##$SUBNAM9= <"">
##$SW= 501.771253377433
##$SWIBOX= (0..15)
0 1 3 0 0 0 0 0 0 0 0 0 0 0 0 0 
##$SW_h= 40650.406504065
##$TD= 32768
##$TD0= 1
##$TE= 0
##$TE2= 300
##$TE3= 300
##$TEG= 300
##$TL= (0..7)
0 120 53 12 22 120 120 120 
##$TP= (0..7)
150 150 150 150 150 150 150 150 
##$TP07= 0
##$TPNAME0= <>
##$TPNAME1= <>
##$TPNAME2= <>
##$TPNAME3= <>
##$TPNAME4= <>
##$TPNAME5= <>
##$TPNAME6= <>
##$TPNAME7= <>
##$TPOAL= (0..7)
0.5 0.5 0.5 0.5 0.5 0.5 0.5 0.5 
##$TPOFFS= (0..7)
0 0 0 0 0 0 0 0 
##$TUNHIN= 0
##$TUNHOUT= 0
##$TUNXOUT= 0
##$USERA1= <user>
##$USERA2= <user>
##$USERA3= <user>
##$USERA4= <user>
##$USERA5= <user>
##$V9= 5
##$VALIST= <valist>
##$VCLIST= <CCCCCCCCCCCCCCC>
##$VD= 0
##$VDLIST= <DDDDDDDDDDDDDDD>
##$VPLIST= <PPPPPPPPPPPPPPP>
##$VTLIST= <TTTTTTTTTTTTTTT>
##$WBST= 1024
##$WBSW= 4
##$XGAIN= (0..3)
0 0 0 0 
##$XL= 0
##$YL= 0
##$YMAX_a= 7660
##$YMIN_a= -7652
##$ZGOPTNS= <>
##$ZL1= 120
##$ZL2= 120
##$ZL3= 120
##$ZL4= 120
##$ABSF1= 0
##$ABSF2= 0
##$ABSG= 0
##$ABSL= 0
##$ALPHA= 0
##$AQORDER= 0
##$ASSFAC= 0
##$ASSFACI= 0
##$ASSFACX= 0
##$ASSWID= 0
##$AUNMP= <proc_1d>
##$AZFE= 0.1
##$AZFW= 0.5
##$BCFW= 0
##$BC_mod= 2
##$BYTORDP= 0
##$COROFFS= 0
##$CY= -3
##$DATMOD= 1
##$DC= 0
##$DFILT= <>
##$DTYPP= 0
##$F1P= 0
##$F2P= 0
##$FCOR= 1
##$FTSIZE= 65536
##$FT_mod= 6
##$GAMMA= 0
##$GB= 0
##$INTBC= 1
##$INTSCL= 5.30512e-09
##$ISEN= 30
##$LB= 1
##$LEV0= 0
##$LPBIN= 0
##$MAXI= 10000
##$MC2= 0
##$MEAN= 0
##$ME_mod= 0
##$MI= 50
##$NCOEF= 0
##$NC_proc= -4
##$NLEV= 6
##$NOISF1= 182.463
##$NOISF2= 159.3651
##$NSP= 0
##$NTH_PI= 0
##$NZP= 0
##$OFFSET= 248.5645
##$PC= 4
##$PHC0= -7884.039
##$PHC1= 1092.475
##$PH_mod= 1
##$PKNL= yes
##$PPARMOD= 0
##$PSCAL= 0
##$PSIGN= 0
##$REVERSE= no
##$SF= 81.014009
##$SI= 65536
##$SIGF1= 159.3651
##$SIGF2= -187.1042
##$SINO= 113.3802
##$SIOLD= 16384
##$SREGLST= <1H.CDCl3>
##$SSB= 0
##$STSI= 65536
##$STSR= 0
##$SW_p= 40650.406504065
##$SYMM= 0
##$S_DEV= 0
##$TDeff= 32768
##$TDoff= 0
##$TI= <>
##$TILT= no
##$TM1= 0
##$TM2= 0
##$TOPLEV= 0
##$USERP1= <user>
##$USERP2= <user>
##$USERP3= <user>
##$USERP4= <user>
##$USERP5= <user>
##$WDW= 1
##$XDIM= 65536
##$YMAX_p= 471493862
##$YMIN_p= -18658453
$$ End of Bruker specific parameters
$$ ---------------------------------
##NTUPLES= NMR SPECTRUM
##VAR_NAME=  FREQUENCY,     SPECTRUM/REAL,   SPECTRUM/IMAG
##SYMBOL=    X,             R,               I
##VAR_TYPE=  INDEPENDENT,   DEPENDENT,       DEPENDENT
##VAR_FORM=  AFFN,          ASDF,            ASDF
##VAR_DIM=   65536,         65536,           65536
##UNITS=     HZ,            ARBITRARY UNITS, ARBITRARY UNITS
##FACTOR=    0.620285442955139, 1,           1
##FIRST=     20137.2065510759, 0,            0
##LAST=      -20513.1999529892, 0,           0
##MIN=       -20513.1999529892, -18658453,   0
##MAX=       20137.2065510759, 471493862,    0
$$ Real data points
##PAGE= N=1
##DATA TABLE= (X++(R..R)), XYDATA
$$ [...]
35525a51830N5216M41387M22510J08137j22909j80722k25088k16790J0488K67893
$$ -151830 -96614 344773 767283 875420 752511 571789 346701 129911 140399 408292
35515D08292J47646k67711l91980k8914K85965J43386j02337P163K49525J60529
$$ 408292 555938 288227 -103753 -132667 153298 296684 194347 201510 451035 611564
35505F11564j46605k28395q3159l8227q9475L145J37069M0533j17760K6183K90788
$$ 611564 464959 236564 153405 115178 25703 28848 165917 206450 88690 114873 405661
35494D05661J85156j81086k20727Q7010J33466k12442l30659M2826L18470Q2988
$$ 405661 590817 409731 189004 276014 409480 197038 -133621 -90795 227675 310663
35484C10663j97752m8628J83722J7809k76024j97214P9429P0168j28733o9186
$$ 310663 112911 64283 248005 265814 -10210 -207424 -127995 -57827 -186560 -255746
35474b55746K06344K75139J00723J3328N9085N117j07051k4072J72568J62556
$$ -255746 -49402 225737 326460 339788 398873 403990 296939 272867 445435 607991
35464F07991k3454o6896L9969K0497j07452o4726R3588K4826k29987k47408K2072
$$ 607991 584537 517641 557610 578107 470655 405929 499517 524343 294356 46948 69020
35453F9020J38828l5313q6787J63554K73070m8792l59847j68888K56285L17389
$$ 69020 207848 172535 85748 249302 522372 473580 113733 -55155 201130 518519
35443E18519K356j97804r8000K1256L257L3369J95380K54927N7992j81253k02906
$$ 518519 520875 323071 225071 246327 249584 282953 478333 733260 791252 609999 407093
35432D07093q3716o4778j40922q3943J52080K98611J37476j79595l31106k36933
$$ 407093 323377 258599 117677 33734 185814 484425 621901 442306 111200 -125733
35422a25733q1475J3188J02514J94580J66919J1263o6062N6433K05461J75856
$$ -125733 -207208 -194020 -91506 103074 269993 281256 215194 271627 477088 652944
35412F52944L0251n4784p4415j07944j00739J3929J02544J5220j14301m3369J62531
$$ 652944 683195 628411 553996 446052 345313 359242 461786 477006 362705 319336 481867
35401D81867J87808n7811k93962k48207K3073K39371J88620q3498k86120j62252
$$ 481867 669675 611864 317902 69695 92768 332139 520759 437261 151141 -11111
35391a1111J58743K51820l3588l30727k84933m4337P1603Q7404J48451Q2233k70867
$$ -11111 147632 399452 365864 35137 -249796 -294133 -222530 -135126 13325 95558 -175309
35380a75309n10685j25299N94329P93009K64192k67937k43847L3354P7706l7216
$$ -175309 -685994 -811293 -216964 576045 840237 572300 328453 361807 439513 402297
35370D02297k4007M9703L141l9754P5787J63209K1899j49237q9575L4035p1019
$$ 402297 378290 427993 431134 391380 467167 630376 652275 503038 413463 447498 376479
35359C76479k48017j15868K44690L33485k1738l92315l41152K7107K69773J65811
$$ 376479 128462 12594 257284 590769 569031 176716 -164436 -137329 132444 298255
35349B98255r7330k28601j84725j47230j89148j35194J23131L49406K66983K4079
$$ 298255 200925 -27676 -212401 -359631 -548779 -683973 -560842 -211436 55547 79626
35339G9626n796J65003J61024r7668k49755j24277k131l8761L9973L50198M80897
$$ 79626 73830 238833 399857 302189 52434 -71843 -73974 -112735 -72762 277436 758333
35328G58333J42302k71732k67175p005N3375n8086k1270Q5545m9485k82993j76316
$$ 758333 900635 628903 361728 354723 408098 350012 328742 414287 364802 81809 -94507
35317i4507K04208L06809k7004l00547j18872K91889M88125L29640l9788l86881
$$ -94507 109701 416510 389506 88959 -29913 261976 750101 1079741 1039953 653072
35307F53072m68462k30834K7953K858j45160l6997K63457L17181M4525j40347
$$ 653072 184610 -46224 -18271 -15413 -160573 -197570 65887 383068 427593 287246
35297B87246k6178Q8835m4786k47399k89100k07896n9940K03157M21935K78370
$$ 287246 261068 349903 305117 57718 -231382 -439278 -499218 -296061 125874 404244
35287D04244j19855k22657J13404L11027j4926l91538k49138J53899K04691n5994
$$ 404244 284389 61732 175136 486163 471237 79699 -169439 -15540 189151 133157
35277A33157j17245O4836P2863j34590j44883J15442K17547O517j09585J08982
$$ 133157 15912 80748 153611 19021 -125862 -10420 207127 213644 104059 213041
35267B13041K94832J04824j92940j74204N8189Q7648j46326l14394k19530R580
$$ 213041 507873 612697 419757 245553 303742 391390 245064 -69330 -288860 -279280
35257b79280J96027K80474K29531M6895j13988p8470Q4715J32627Q748p8885l398
$$ -279280 -83253 197221 426752 473647 359659 281189 365904 498531 507279 428394 424996
35246D24996P6181p906j33055p3502J18902J74920L8059l9587P0187J13157j38163
$$ 424996 501177 493271 360216 286714 405616 580536 618595 579008 649195 762352 624189
35235F24189m18838k79653J96043M10383J01753k39532r2471L03050L17067j07669
$$ 624189 205351 -74302 121741 532124 633877 394345 301874 604924 921991 814322
35225H14322m00067k56221l7825r5471j93980K2869L53988L10578r8374l44063
$$ 814322 414255 158034 120209 24738 -169242 -146373 207615 518193 419819 75756
35215G5756j50364J49817J59610m4835j41925n8181M2778R7480J72131K23141
$$ 75756 -74608 75209 234819 189984 48059 -10122 32656 130136 302267 525408
35205E25408J12440j19761k37588j33622K0167L0690p0384j35189j03521J2751
$$ 525408 637848 518087 280499 146877 167044 197734 127350 -7839 -111360 -98609
35195i8609K01082L65114L13095J0971k69577k67011r8686o7395j74561j40561
$$ -98609 102473 467587 780682 791653 522076 255065 156379 88984 -85577 -226138
35185b26138R0073K21497R5209l5530O9020K21713J09213j92445l26843j79712
$$ -226138 -136065 85432 180641 145111 214131 435844 545057 352612 25769 -153943
35175a53943J7269P4084N5213P8186J21765R7091j9968j49887j39397Q6215L18220
$$ -153943 -136674 -62590 -7377 70809 192574 289665 269697 119810 -19587 66628 384848
35164C84848J98113k59739n05981j36920M51082N25479M0516l21938j65583J25917
$$ 384848 582961 323222 -182759 -319679 131403 656882 697398 375460 209877 335794
35154C35794J01145p8928k8141J92586K22165j0719k38652k68033j26957R1120
$$ 335794 436939 358011 329870 522456 744621 733902 495250 227217 100260 191380
35144A91380K69748K68750J07187R894O9502O2558j55723l19949j52485J29276
$$ 191380 461128 729878 837065 846959 916461 979019 823296 503347 350862 480138
35134D80138J16908j31339j89618N1905K57422J98114Q893j44670k55129k66890
$$ 480138 597046 465707 276089 327994 585416 783530 792423 647753 392624 125734
35124A25734o8163K15511K72472N3087j54879j76350j34679j12421p040J53666
$$ 125734 57571 273082 545554 598641 443762 267412 132733 20312 13272 166938
35114A66938J41942n2819j11973J01675K83834J82814N615L5045J47135N1911
$$ 166938 308880 256061 144088 245763 529597 712411 718026 753071 900206 952117
35104I52117k09513l44094k32808j619K01031K76084J74293J2473K889J03229
$$ 952117 742604 398510 165702 164083 365114 641198 815491 827964 830853 934082
35094I34082J013l50734n17205k11964J85019J55460j75235k66047P682K60595
$$ 934082 935095 584361 67156 -144808 40211 195671 20436 -245611 -237929 22666
35084B2666K46531J00756m3889k00820k60696m3072L00287L62171P5055j66537
$$ 22666 269197 369953 326064 125244 -135452 -178524 121763 483934 558989 392452
35074C92452j06957M0204K8719m1550j6592j5284j69489k99793j70348J05503
$$ 392452 285495 325699 354418 312868 296276 280992 111503 -188290 -358638 -253135
35064b53135K16874J04289j7896k3357N88k0706k5866L0258O8669J3378o9669
$$ -253135 -36261 68028 50132 26775 27363 6657 -19209 11049 79718 93096 23427
35053B3427m9863P8731J56963M5091j78562k74574j27450J01108J77806R2359
$$ 23427 -26436 52295 209258 254349 75787 -198787 -326237 -225129 -47323 45036
35043D5036L2475R7395J76907J41607L4119j048P9464J53626P3781j54034l53924
$$ 45036 77511 174906 351813 493420 527539 526491 605955 759581 833362 679328 325404
35032C25404l61352j94183J288J29891J80294J29087k5182j44273o9810J08283
$$ 325404 -35948 -230131 -228843 -98952 81342 210429 185247 40974 -28836 79447
35022G9447J27942l8342j11401M8289K05387J40506k932m532N5757k907j04350
$$ 79447 207389 169047 57646 105935 311322 451828 448896 444364 500121 497214 392864
35011C92864p6052J6300K2612K5055J54247K53510J11016j11396r7629P7341O2345
$$ 392864 316812 333112 355724 380779 535026 788536 899552 788156 690527 767868 830213
35000H30213j69628k92195j88653r2504j25663j24348K018J25729J81179K29340
$$ 830213 660585 368390 179737 87233 -38430 -162778 -160760 -35031 146148 375488
34990C75488K12594K7330j53965o8344J22660J0917l16261k98230J77994M91862
$$ 375488 588082 615412 461447 393103 515763 526680 210419 -87811 90183 582045
34980E82045K14983k43456l06385n2382Q8120N5043O8796J09790Q9j69921j52928
$$ 582045 797028 553572 247187 194805 282925 337968 406764 516554 516643 346722 193794
34969A93794K4052J22295R0726O0571L2771r6473k56485k51899o8869J11117J77449
$$ 193794 217846 340141 430867 491438 524209 427736 171251 -80648 -149517 -38400 139049
34958A39049J72604J47253J02213L8019n0920j64771k20928j25137K9250L6225
$$ 139049 311653 458906 561119 599138 548218 383447 162519 37382 66632 102857
34948A02857q1503o6420J35165K35148O8493j23401r5361K4456K2960k4161L6105
$$ 102857 21354 -45066 90099 325247 393740 270339 174978 199434 222394 198233 234338
34937B34338J13541P7152L4140R2685R2150r5963k44598j16557J01036J10170
$$ 234338 347879 425031 459171 551856 644006 548043 303445 186888 287924 398094
34927C98094L0992J60162L67373K42866k07662n00359l45747J5516K20420K02676
$$ 398094 429086 589248 956621 1199487 991825 491466 145719 161235 381655 584331
34917E84331J20272J00780J24140L6917k61604n56508m50133O0947M23021K30553
$$ 584331 704603 805383 929523 966440 704836 148328 -301805 -240858 182163 412716
34907D12716j95016l06709j19155j6234l2242Q6043K61607J77810o4064l2366
$$ 412716 217700 -89009 -208164 -224398 -256640 -170597 91010 268820 204756 172390
34897A72390K49184K56231j58403m66445k74991J21443K83044K26050J66481R9317
$$ 172390 421574 677805 519402 52957 -222034 -100591 182453 408503 574984 674301
34887F74301k0089m0208R4798J29024r7211l07683j95077Q5905J73549L6332q7268
$$ 674301 654212 614004 708802 837826 740615 432932 237855 323760 497309 533641 446373
34876D46373j13015j31122j26597j3263J19586Q8482q5570j98133j53006l2198
$$ 446373 333358 202236 75639 62376 181962 270444 184874 -13259 -166265 -198463
34866a98463Q3292J69813J76266O7633o6645r9192l2075M5686J03928J35767O0483
$$ -198463 -115171 54642 230908 298541 231896 132704 100629 146315 250243 386010 446493
34855D46493j51940l14356j98117J17807K80251J06592j76085k37870n9529J03310
$$ 446493 294553 -19803 -217920 -100113 180138 286730 110645 -127225 -186754 -83444
34845h3444J00694O0851J47902K87491K61229L1032j75214j45075N7986J94190
$$ -83444 17250 78101 226003 513494 774723 805755 630541 485466 543452 737642
34835G37642J36213k9967j45613j32380l4567J8506p3090k37097k57781l6862
$$ 737642 873855 843888 698275 565895 531328 549834 476744 239647 -18134 -54996
34825e4996K34011K82467J00734n6420j9262R0924N7102j30217k55734j49118
$$ -54996 179015 461482 562216 505796 486534 577458 634560 504343 248609 99491
34815I9491R7579K33700J55477J2915l8855o3198j62515j98688K9281L63380L88570
$$ 99491 197070 430770 586247 599162 560307 497109 334594 135906 165187 528567 917137
34804I17137L7119k57140j75268N1421O3445q2613j12445k1713N173j8028M4371
$$ 917137 954256 697116 521848 573269 636714 554101 441656 419943 425116 407088 451459
34793D51459J12024N765j76878j70040K0654J31530O8039q948q075m721j9972
$$ 451459 563483 569248 392370 222330 242984 374514 442553 433605 425530 420809 400837
34782D00837N721L3788k736j212J45890K65686J25239j34516j71906n290K6783
$$ 400837 406558 440346 437610 436398 582288 847974 973213 838697 666791 661501 688284
34771F88284j36330j77838K9525K05232J38414k1593j01049j53558k17185j70073
$$ 688284 551954 374116 403641 608873 747287 725694 624645 471087 253902 83829
34761H3829N372J29422J31766J32844J17449r2605m02582m01952K3047M20244
$$ 83829 89201 218623 350389 483233 600682 508077 105495 -296457 -273410 146834
34751A46834L75122M3872j77178j87546j11725j589R7565N9777o7693p337K77658
$$ 146834 521956 565828 388650 201104 89379 87790 185355 245132 177439 170102 447760
34740D47760L78008L9619l49591k90578P2598K03254k970j48875k1714J38964
$$ 447760 825768 865387 515796 225218 297816 501070 498100 349225 327511 466475
34730D66475R9386n2440j45951j61819j18780J7068K01131K82139J94548L6721
$$ 466475 565861 513421 367470 205651 86871 103939 305070 587209 781757 818478
34720H18478q6833j63446j90234j42811o4100n3310j17591j37784l3456J11960
$$ 818478 731645 568199 377965 235154 171054 117744 153 -137631 -171087 -59127
34710e9127J47552M7884l8911L3222J94153K02586l3114k82274k78236q1656M9295
$$ -59127 88425 136309 97398 130620 324773 527359 494245 211971 -66265 -147921 -98626
34699i8626P1984J50996K59430J54632j58775l13889j16810J38691J38577K2465
$$ -98626 -26642 124354 383784 538416 379641 65752 -51058 87633 226210 248675
34689B48675P7873K23540J79746j9631r2365k654O715j29639j88054o8303J9367
$$ 248675 326548 550088 729834 710203 617838 615184 621899 492260 304206 235903 255270
34678B55270q1134j90731p0610K02291L42922K49099R1133L0678K2503m9112j61568
$$ 255270 174136 -16595 -87205 115086 458008 707107 798240 828918 851421 802309 640741
34667F40741j91354j01363L1866J50731K27247J51972j61501m90073m04136J31149
$$ 640741 449387 348024 379890 530621 757868 909840 748339 258266 -145870 -14721
34657a4721N22482K58449l33649m74718M24M49099L46781o9131k66138j31403
$$ -14721 507761 766210 432561 -42157 -41733 407366 754147 685016 418878 287475
34647B87475M4890L4690j27420k50980j52806J41708L25652J59513j25245j05223
$$ 287475 332365 367055 239635 -11345 -164151 -22443 303209 462722 337477 232254
34637B32254J62094K01518p7090j98488M6179J85947j26855m52076k43478K33890
$$ 232254 394348 595866 518776 320288 366467 552414 425559 -26517 -269995 -36105
34627c6105L06150o1970k81690p6703K21151L04726K59136K16935J16715o1050
$$ -36105 270045 208075 -73615 -150318 70833 375559 634695 851630 968345 907295
34617I07295j73690j50907q3500k5306M7395P7792o147q5346P187J57360R7705
$$ 907295 733605 582698 499198 473892 521287 599079 592932 507586 514773 672133 769838
34606G69838j33663j98166K3056K35667J66594p8574k20846j58709L669J14686
$$ 769838 636175 438009 461065 696732 863326 784752 563906 405197 408866 523552
34596E23552P4632q7976j94814j04842P4517J24012M4229L9782J58468J89868
$$ 523552 598184 510208 315394 210552 285069 409081 453310 493092 651560 841428
34586H41428R768j90410j62024N5718K00035J20274p8613k05577j99404j48925
$$ 841428 851196 660786 498762 554480 754515 874789 796176 590599 391195 242270
34576B42270j41578j48503q8960L2568J27562J48204J22642O8256k8016j32632
$$ 242270 100692 -47811 -136771 -104203 23359 171563 294205 362461 334445 201813
34566B01813j69415j09483K5401K07304L40946K56876m8423k77337j93384k341
$$ 201813 32398 -77085 -51684 155620 496566 753442 705019 427682 234298 231957
34556B31957l5057j71218m1184K62578K58110q8791k48013k6305J01815j17608
$$ 231957 196900 25682 -15502 247076 505186 416395 168382 142077 243892 126284
34546A26284k04963J83977N28967K42462l26218m28008o8567J51672P6396O9714
$$ 126284 -78679 105298 634265 876727 550509 122501 53934 205606 282002 351716
34536C51716K02774J52968j03710k04805m7535Q5572P3347O1293K5095j91681
$$ 351716 554490 707458 603748 398943 351408 436980 510327 571620 596715 405034
34526D05034m07042k67005R8288J94316k2754q3813J58941K89176P6274j57813
$$ 405034 -2008 -269013 -170725 23591 837 -82976 75965 365141 441415 283602
34516B83602j41189n3809q5191j05761k2858M902o9918n1735Q3412R7450k5349
$$ 283602 142413 88604 3413 -102348 -125206 -120304 -190222 -241957 -158545 -61095 -86444
34505h6444M311K13569K46898P617j33931n019O9781q8937j61362M0476J65289
$$ -86444 -82133 131436 378334 385951 252020 247001 316782 227845 66483 106959 272248
34494B72248m5817k59827j33322J06419J31717Q4507J74648J77576j08806l35019
$$ 272248 226431 -33396 -166718 -60299 71418 155925 330573 508149 399343 64324
34484F4324j36417J74464R5688k01031j77436J42286K57599O1151p4582j6781
$$ 64324 -72093 102371 198059 -2972 -180408 -38122 219477 280628 206046 189265
34474A89265j0506r6514k9638J59832J28346j38920k13851P0636L16053J88434
$$ 189265 178759 82245 52607 212439 340785 201865 -11986 58650 374703 563137
34464E63137q9214j44290J702Q0475N994j05792j63205j32903J3833K23425L36792
$$ 563137 473923 329633 331335 411810 417804 312012 148807 15904 29737 253162 589954
34453E89954K62452Q4657o1340j18145q6473j0746l518j33965k72708k13610J8670
$$ 589954 852406 937063 875723 757578 671105 660359 656841 522876 250168 36558 55228
34442E5228J59043N9253j08446r2687J17012L06861K96212R8634j30503k47113
$$ 55228 214271 273524 165078 72391 189403 496264 792476 891110 760607 513494
34432E13494k22490j20617j3136L7248l8696k20198l07155j17796K01122K95161
$$ 513494 291004 170387 157251 194499 155803 -64395 -371550 -489346 -288224 6937
34422F937J01368n1264L2446J12661l4075j94573q8765J27963J50481P4107J66581
$$ 6937 108305 57041 89487 202148 168073 -26500 -115265 12698 163179 237286 403867
34411D03867K69253J0352m46896n05382o6138K64810J09478j34067j1344K49658
$$ 403867 673120 683472 236576 -268806 -334944 -70134 39344 -94723 -106067 143591
34401A43591J88333r1481j20775J51835L06695J16960j83276l08652k37712p6091
$$ 143591 331924 240443 119668 271503 578198 695158 511882 203230 -34482 -110573
34391a10573R4647J72987Q3977p8433j44510j08879q6031n9052Q2788K65591K69133
$$ -110573 -15926 157061 241038 162605 18095 -90784 -176815 -235867 -153079 112512 381645
34380C81645Q3742m9734k9175l3043j58529k17774q2442M7582k2792j18325J7598
$$ 381645 465387 415653 386478 353435 194906 -22868 -105310 -57728 -80520 -198845 -181247
34369a81247K39440J82412j42934l30085j78557N2521R9128O0228J22219J99730
$$ -181247 58193 240605 97671 -232414 -410971 -358450 -259322 -199094 -76875 122855
34359A22855J12198o8472j25133m7414j1172m8563M959K02242L38483K14149p8910
$$ 122855 235053 166581 41448 -5966 -17138 -65701 -60742 141500 479983 694132 615222
34348F15222k40486r7146K00622L23315J10763k34225l56595j59411R4412J31892
$$ 615222 374736 277590 478212 801527 912290 678065 321470 162059 256471 388363
34338C88363m476q0571o292J00828J22940O1731k3743p6313n7523Rr1p1294q6140
$$ 388363 383887 303316 297024 397852 520792 582523 558780 482467 424944 424953 424862 353568 267428
34325B67428K2975J14779N2446n0653k1159M0473q3304k78309j77043K33907M60692
$$ 267428 290403 405182 457628 406975 385816 426289 342985 64676 -112367 121540 582232
34314E82232J70982k91836l71550o3360J54811N3709r4772m0665O1822q867j27324
$$ 582232 753214 461378 89828 26468 181279 234988 140216 99551 161373 152506 25182
34303B5182m9447J21671N8102k42632l88045j54960J91491L03816K02751J03427
$$ 25182 -24265 97406 155508 -87124 -475169 -630129 -438638 -134822 67929 171356
34293A71356L7461o2857r8592L8712J83424J28383J9495J10865K35768K8714l62456
$$ 171356 208817 145960 47368 86080 269504 397887 417382 528247 764015 792729 430273
34282D30273l85340Q902K08817q0238l51753j60401J49578Q9053j44266j03392
$$ 430273 44933 53835 262652 182414 -169339 -329740 -180162 -91109 -235375 -338767
34272c38767P5199j6094k23394o8067L52230M47398Q1830k45070k00287R828J28332
$$ -338767 -263568 -279662 -503056 -571123 -218893 228505 310335 65265 -135022 -125194 3138
34261C138J54227R3290q6107j96375j5111K59331K33263k2198q2383Q8811J23894
$$ 3138 157365 250655 164548 -31827 -46938 212393 445656 423458 341075 429886 553780
34250E53780k0391k103J73651Q4549k99591m62684k06000N1253P1842J49553L62757
$$ 553780 533389 531286 704937 789486 489895 27211 -178789 -127536 -55694 93859 456616
34239D56616K77851j87065l93081n959L54001J13219k96755k09745J53635J55207
$$ 456616 734467 547402 154321 148362 502363 615582 318827 109082 262717 417924
34229D17924j45592k04435J5559J04532L2748J17191L02801K21327j05714k83239
$$ 417924 272332 67897 83456 187988 220736 337927 640728 862055 756341 473102
34219D73102j98704p4723K7323J77792J95685r3398l57803j60920K67362L32489
$$ 473102 274398 199675 226998 404790 600475 507077 149274 -11646 255716 588205
34209E88205K8513j33353n3942j03538k69394j10518L28815M32452O5166j38264
$$ 588205 616718 483365 429423 325885 56491 -54027 274788 707240 772406 634142
34199F34142J32521L13514k0896l71358j67121K28631J09439m11202n97525k27353
$$ 634142 766663 1080177 1059281 687923 520802 749433 858872 447670 -149855 -377208
34189c77208J81128K13851K4315q8578p4233L641J28195K36138K16279Q8395n31
$$ -377208 -196080 17771 42086 -46492 -120725 -117084 11111 247249 463528 551923 551392
34178E51392K638O822l2141l5341M0150R5109P181j98461l37453k34630O7696
$$ 551392 554030 560852 528711 493370 533520 628629 635810 437349 99896 -134734 -67038
34167f7038K92880K09996p4753k31635j27209K9707J9832q2904o1174J24789L12313
$$ -67038 225842 435838 361085 129450 2241 31948 51780 -31124 -92298 32491 344804
34156C44804L52549K23487j1742k36627l10744j83649K6962J49262J37578P4945
$$ 344804 697353 920840 909098 672471 361727 178078 205040 354302 491880 566825
34146E66825K1526n0242j58248k33013j94861o6649N7730J34919J73486J23281
$$ 566825 588351 538109 379861 146848 -48013 -114662 -56932 77987 251473 374754
34136C74754q2854l10686k43413J87447N49754L88694j23933l80086j71806Q1884
$$ 374754 291900 -18786 -262199 -74752 475002 863696 739763 359677 187871 269755
34126B69755M1105q3820q733J09369N754j80624j61781k0856k6739j11665l798
$$ 269755 310860 227040 218307 327676 333430 152806 -8975 -29831 -56570 -168235 -172033
34115a72033K35306K79521R0769n0898n1040q7717j81269j28670O5162J23322
$$ -172033 63273 342794 433563 382665 331625 243908 62639 -66031 -869 122453
34105A22453k3421r4003O1195K04985J15261p9653j54192j01493k3765M8916P3895
$$ 122453 99032 5029 66224 271209 386470 306817 152625 51132 27367 76283 150178
34094A50178l8488k22689k36053J0883K87125L32550J51348p8683k19303k17832
$$ 150178 111690 -110999 -347052 -336169 -49044 283506 434854 356171 136868 -80964
34084h0964j07172j3910j3895P339J54367K50665O4209k43342k68108K4505K50473
$$ -80964 -188136 -202046 -215941 -208602 -54235 196430 260639 17297 -250811 -226306 24167
34073B4167K21516J52173J44908j3205l13941l19357J40550N29022L41129r3039
$$ 24167 245683 397856 542764 529559 215618 -103739 36811 565833 906962 813923
34063H13923j09976K41117L00904j27898m67948k65528J51967K16491o7923k36746
$$ 813923 703947 945064 1245968 1118070 650122 384594 536561 753052 685129 448383
34053D48383r0039R6871P6113j6500L6774J33386L2061j79278j53742J36894K74442
$$ 448383 358344 455215 531328 514828 551602 684988 717049 537771 384029 520923 795365
34042G95365L3544k17773r0368J75197J08008j73059j44010K01370K91510o4332
$$ 795365 828909 611136 520768 695965 803973 630914 486904 688274 979784 915452
34032I15452l35211j43621J44477Q9824j12944r0995L706j65642m05507k57833
$$ 915452 580241 436620 581097 670921 557977 466982 470688 305046 -100461 -358294
34022c58294J85216L53361N8562k62749k26128M4966K46239K89717K33287J09314
$$ -358294 -173078 180283 238845 -23904 -250032 -205066 41173 330890 564177 673491
34012F73491l4480j22682j62262k08223k16251j12874J4597J8042m5266R781J61428
$$ 673491 639011 516329 354067 145844 -70407 -183281 -168684 -150642 -195908 -186127 -24699
34001b4699J90416N0186m3762L4201J30824Q7503j2515r075Q4829J40448J10191
$$ -24699 165717 215903 172141 206342 337166 424669 412154 403079 487908 628356 738547
33990G38547L9752m5110j52245k50941k64442j47346M6506J87027J88456J07725
$$ 738547 778299 733189 580944 330003 65561 -81785 -35279 151748 340204 447929
33980D47929O7539Q2266N6890k8620p5449n4290p1385j61385j93600j02368k0137
$$ 447929 515468 597734 654624 626004 550555 496265 424880 263495 69895 -32473 -52610
33969e2610l2327p864J32112J96209L1470j51520p7392J32751J52612j7885r5282
$$ -52610 -84937 -92801 39311 235520 266990 115470 38078 170829 323441 305556 210274
33958B10274r551M5225K4337P7239J65697O8079j70371k23744l3413O2286r3120
$$ 210274 200723 245948 270285 347524 513221 581300 410929 187185 153772 216058 122938
33947A22938j99275k9960J74813J44092L6310J14483K63968K14078J2321r1201
$$ 122938 -76337 -106297 68516 212608 248918 363401 627369 841447 853768 762567
33937G62567n0577K1653J19955K26728J34779k24491m74282k63078J21643J25266
$$ 762567 711990 733643 853598 1080326 1215105 990614 516332 253254 374897 500163
33927E00163j94098k47735J16902L66948J61431j29288q5381J02798M7114j65582
$$ 500163 306065 58330 175232 542180 703611 574323 488942 591740 638854 473272
33917D73272j77233K6151J50255Q4795k8751j03313j39063o8094J09747J66639
$$ 473272 296039 322190 472445 557240 528489 425176 286113 218019 327766 494405
33907D94405l9122k30218p5900K38290K56278j0373j01018J22516K61955O6288
$$ 494405 455283 225065 149165 387455 643733 633360 532342 654858 916813 983101
33897I83101j89309k24451j71185j84950r4005J87485K99805l7600m41383l27642
$$ 983101 793792 569341 398156 213206 119201 306686 606491 568891 127508 -200134
33887b00134K19118N62692M12207R1455p3857j28209j63259r6659N0611M5341
$$ -200134 18984 581676 993883 1085338 1011481 883272 720013 623354 673965 719306
33877G19306j77529l39933k33948k9468M2216M1660J14252J76372R6670m866M6206
$$ 719306 541777 201844 -32104 -61572 -19356 22304 136556 312928 409598 404732 450938
33866D50938J28241J1203j88935j14160K58555M93619K70989j84938m15994k79945
$$ 450938 579179 590382 401447 287287 545842 1039461 1310450 1125512 709518 429573
33856D29573j5160J13099N1203r2082j73029j00731R0773K45461K22487L7527
$$ 429573 414413 527512 578715 486633 313604 212873 303646 549107 771594 809121
33846H09121j55520k05156q2231Q8936J21768k6430j46872j7931K32744K17795
$$ 809121 653601 448445 366214 455150 576918 550488 403616 385685 618429 836224
33836H36224j58007m82712l85967p0979K3458r2157m7403J96195K65918N8724
$$ 836224 678217 195505 -190462 -261441 -237983 -330140 -377543 -181348 84570 143294
33826A43294m2321J53282K71365K8524k13418k8924L11283K40659j85999l92887
$$ 143294 100973 254255 525620 554144 340726 311802 623085 863744 677745 284858
33816B84858j83705O5835Q9386J7936n0224j97089l12139j29475K25230K74512
$$ 284858 101153 166988 256374 274310 224086 26997 -285142 -414617 -189387 85125
33806H5125m3658k03945O7098L35471J79841j43178j73213L3208J07977k0651
$$ 85125 41467 -162478 -95380 240091 419932 276754 103541 136749 244726 224075
33796B24075j50465j84819j26187O8255L09823L25711P5970q6518L6401J49944
$$ 224075 73610 -111209 -237396 -169141 140682 466393 542363 455845 492246 642190
33786F42190L033j61229r5327l8868k23719l27019j2564L70745K95953o1887j55607
$$ 642190 645223 483994 388667 349799 126080 -200939 -213503 157242 453195 391308 235701
33775B35701M390l38j46098o5542J60827J34393m1839P5734L44859J81531l34568
$$ 235701 240091 239753 93655 28113 188940 323333 281494 357228 702087 883618 549050
33764E49050m52492l930K91287M4249k19361q1573P0325j15632k47982M9911L81275
$$ 549050 96558 92628 383915 428164 208803 127230 197555 81923 -166059 -116148 265127
33753B65127K53910p1929r7568N9753J7299j10125n603J56793K9205j88429n6918
$$ 265127 519037 447108 349540 409293 426592 316467 310864 467657 496862 308433 251515
33742B51515K84353L11460k659j74789k3727J31265Q7245J41l6483j39973k85716
$$ 251515 535868 847328 844669 669880 646153 777418 864663 864804 828321 688348 402632
33731D02632k56785m3095R2586L4438l5881J9395J01219Q6623j2683j32735j92151
$$ 402632 145847 102752 195338 229776 193895 213290 314509 401132 388449 255714 63563
33720F3563q6989J34868K01020j8587k12814l8294L04814L27925J0466j79796
$$ 63563 -23426 111442 312462 293875 81061 42767 347581 675506 685972 506176
33710E06176m3560P3952r5300l04189k25282L0428J30586K3465o8503k3250O0153
$$ 506176 462616 536568 441268 137079 -88203 -57775 72811 96276 27773 4523 64676
33699F4676N5148n1441j77328j99300m4489J95305L12494K19481N7909L17L0185
$$ 64676 119824 68383 -108945 -308245 -352734 -157429 155065 374546 432455 432772 462957
33688D62957J7347n8121q7569k7568J3336o2789j71737j33948P9245K82507K96008
$$ 462957 480304 422183 334614 307046 320382 257593 85856 -48092 31153 313660 609668
33677F09668J46167j3577j00430j27267j03357l5111K1124L0891N5856J27282
$$ 609668 755835 742258 641828 514561 411204 376093 397217 428108 483964 611246
33667F11246J24102m6537k26139j92064j6218L0116q8931j33708j3249O4779m0581
$$ 611246 735348 688811 462672 270608 254390 284506 195575 61867 48618 113397 72816
33656G2816j73779j40974L7845K32013L33887K39138m7544k60549j46144Q7657
$$ 72816 -100963 -241937 -204092 27921 361808 600946 553402 292853 146709 234366
33646B34366n293l72787m41580L085M42465M09803J32813J3153l2300k13075k91489
$$ 234366 229073 -143714 -585294 -582209 -139744 270059 402872 416025 383725 170650 -120839
33635a20839K1889M15068L65745j5186j74056j8612K9000j56758k14702k597J37630
$$ -120839 -98950 316118 681863 666677 492621 474009 503009 346251 131549 128952 266582
33624B66582J0426r2809N1591J78147k661k81630k60877M3826K56292J79008p065
$$ 266582 277008 184199 235790 413937 411276 129646 -131231 -87405 168887 347895 340830
33613C40830n0676O4927J50641M9697j78344l12139k26199l7372P9436J30473
$$ 340830 290154 355081 505722 555419 377075 64936 -161263 -198635 -119199 11274
33603A1274K12149K66870J50711p6286j66935m0382R3621M5918r9831j55998j02258
$$ 11274 223423 490293 641004 564718 397783 357401 451022 496940 397109 241111 138853
33592A38853n0946l9747r299M6474M6485l2903q4341j5370R8101J15901N8913
$$ 138853 87907 48160 38861 85335 131820 98917 14576 -794 97307 213208 272121
33581B72121P0470J37454O9303j45481k21841k5617J31111k9673k29782n6473
$$ 272121 342591 480045 549348 403867 182026 156409 287520 257847 28065 -28408
33571b8408K86644K49834j15958j83695J92480L94569Q0000k35175o9405K19753
$$ -28408 258236 508070 392112 208417 400897 795466 875466 640291 570886 790639
33561G90639J05324j96916j68194Q9562R9849j13229j25138R6762J93348R3196
$$ 790639 895963 699047 530853 620415 720264 607035 481897 578659 772007 865203
33551H65203M3788M7870j00378k77861j64121J18953J31408j23273k05138l3886
$$ 865203 908991 956861 856483 578622 414501 533454 664862 541589 336451 302565
33541C02565O19j82427j69937J53464L17307P3259j41567N1444L13757J56196
$$ 302565 303184 120757 -49180 104284 421591 494850 353283 404727 718484 874680
33531H74680k58960m02603j91283j8627j12125k76118k39556L2532L61950N11583
$$ 874680 615720 213117 21834 3207 -108918 -385036 -624592 -592060 -230110 281473
33521B81473L63373N8586j22129q8570j7976n2774j15742j08050p5928n7893L5277
$$ 281473 644846 703432 581303 492733 474757 421983 306241 198191 122263 64370 99647
33510I9647K42436M11153L69273J24737j79621l87860l82757j83683p843l7236
$$ 99647 342083 753236 1122509 1247246 1067625 679765 297008 113325 105482 68246
33500F8246j27919k292K70198L16148M8503j59010n2205J11083J0047k03995j65416
$$ 68246 -59673 -61965 208233 524381 572884 413874 361669 472752 482799 278804 113388
33489A13388J11434K67088J48190j8506k6644J7596q3669k83569l34406j30503
$$ 113388 224822 491910 640100 621594 594950 612546 528877 245308 -89098 -219601
33479b19601J19739J35525o9767j89645k9821K30830L00475J62218K2003k4643
$$ -219601 -99862 35663 -34104 -223749 -253570 -22740 277735 439953 461956 437313
33469D37313m0408k2855R4692K14709J21267j75997l77592k73206P34J75619J60768
$$ 437313 396905 374050 468742 683451 804718 628721 251129 -22077 -21343 154276 315044
33458C15044N1555k9662j6975O3545R2025p117j19281p2237Q6514J24379l5256
$$ 315044 366599 336937 319962 383507 475532 468415 349134 276897 363411 487790 452534
33447D52534j93246j57644J9292J58345J62559M2297j32336k35250j64198J4717
$$ 452534 259288 101644 120936 279281 441840 484137 351801 116551 -47647 -32930
33437c2930J07881L4750p4592p2878J5892O5876K8338k8836k3832M4929J04896
$$ -32930 74951 109701 35109 -37769 -21877 43999 72337 43501 19669 64598 169494
33426A69494R8518M6332p807p2044j40208j02689J09035L09646K26713p9153k30272
$$ 169494 268012 314344 306537 234493 94285 -8404 100631 410277 636990 557837 327565
33415C27565o7286J23370P9300m5762l144J15758P8647o3834q6391K0794P5880
$$ 327565 260279 383649 462949 417187 414043 529801 608448 544614 458223 479017 554897
33404E54897J4715p7593j32914r4166R1016K80773J83490j82653l71365j34211
$$ 554897 569612 492019 359105 264939 355955 636728 820218 637565 266200 131989
33394A31989J67972J32174p0648r0600m0906j84796l03361m0630L47941L09879
$$ 131989 299961 432135 361487 270887 229981 45185 -258176 -298806 49135 359014
33384C59014p4100k11592P282J00992q2575j13132J92717M10369K29287q5068
$$ 359014 284914 73322 80604 181596 99021 -14111 178606 588975 818262 733194
33374G33194k20684k50859k69254j25101J84813L38593J93027L3061O3125Q5600
$$ 733194 512510 261651 -7603 -132704 52109 390702 583729 616790 679915 765515
33364G65515n8616j71634r9450k7428q6536p7500J05104J78259n2028k82084j59312
$$ 765515 706899 535265 435815 408387 321851 244351 349455 527714 475686 193602 34290
33353C4290J55895K59684J10511m734L3459M3990j37235m17183n22263k67250
$$ 34290 190185 449869 560380 555646 589105 633095 495860 78677 -443586 -710836
33343g10836J90937M31625K60151p794n383J26852L5855j79209j46646N1701p97
$$ -710836 -519899 -88274 171877 164083 158700 285552 321407 142198 -4448 47253 46456
33332D6456k30867j23460L00316L67870j17013m45409j26258L22154K62802n1253
$$ 46456 -184411 -307871 -7555 360315 243302 -202107 -328365 -6211 256591 205338
33322B05338l6462J96280J38096j63895k17050M6417K05757Q2286o2868n0070
$$ 205338 168876 365156 503252 339357 122307 168724 374481 456767 393899 343829
33312C43829J356J436K4270P4911M4072p0330j33895p3675N5107J53420J27555
$$ 343829 345185 346621 370891 445802 489874 419544 285649 211974 267081 420501 548056
33301E48056l0654j49171n6981R6538O01k72085k79170Q5651L57327K14057m2574
$$ 548056 517402 368231 311250 407788 408389 136304 -142866 -57215 300112 514169 471595
33290D71595n3167K2496p6875j54136N7259K88715J12478l04076m10928j15577
$$ 471595 418428 440924 364049 209913 267172 555887 668365 364289 -46639 -162216
33280a62216J47581J33319M8002P9253J30123J02496O9345O7297J0318j06146
$$ -162216 -14635 118684 166686 245939 376062 478558 547903 615200 625518 519372
33270E19372j46344m6644Q3520J08003o275j88586k99757k28059k9446J17358
$$ 519372 373028 326384 409904 517907 511632 323046 23289 -204770 -234216 -116858
33260a16858J45468J49162J67645J28984N5692O6134J08204J78j84821j50767
$$ -116858 28610 177772 345417 474401 530093 596227 704431 704609 519788 369021
33250C69021Q3367J19639j43860k61359K6292K97771J26326j95753j53060J22627
$$ 369021 452388 572027 428167 166808 193100 490871 617197 421444 268384 391011
33240C91011J02936k31209l79796j48091J18239J55144J08412J33820J21339j2694
$$ 391011 493947 262738 -117058 -265149 -146910 8234 116646 250466 371805 359111
33230C59111j06844k2518J07925Q0797p5486j43398o534J91642J99589k8390k29686
$$ 359111 252267 229749 337674 418471 342985 199587 193053 384695 584284 555894 326208
33219C26208j52831P8631J31262k4742o1588J70382L70787K27221j40927l84162
$$ 326208 173377 252008 383270 358528 296940 467322 838109 1065330 924403 540241
33209E40241l59150j73665J7608R3007J2031q4249j946J87968J92464n5265k62539
$$ 540241 181091 7426 25034 118041 130072 45823 43877 231845 424309 369044 106505
33198A06505k00790J9523K02403K86968K11158r1775m20271l95514j253L17558
$$ 106505 -94285 -74762 127641 414609 625767 533992 113721 -281793 -283046 34512
33188C4512K64524M1067p2586q9828q7872j0178J04076Q8630Q787J08957K74327
$$ 34512 299036 340103 267517 177689 89817 79639 183715 272345 281132 390089 664416
33177F64416J06254k85490k45439L50301O98411K41962m29799m82345o2943R8185
$$ 664416 770670 485180 239741 590042 1288453 1530415 1100616 618271 555328 653513
33167F53513j27855k60038j08176N7122R7027J32592J56773M4261j17119j34870
$$ 653513 525658 265620 157444 214566 311593 444185 600958 645219 528100 393230
33157C93230n8000n9009j17666j35031j53030j68991j4547K77038L33956K4442
$$ 393230 335230 276221 158555 23524 -129506 -298497 -313044 -36006 297950 322392
33147C22392k16757l9291K51592K22548M94o2363j3349n6385o4196J08669J89464
$$ 322392 105635 66344 317936 540484 540978 478615 465266 408881 344685 453354 642818
33136F42818n8113k97309j38292J51105R3318j59944j14259K02323L39329J87996
$$ 642818 584705 287396 149104 300209 393527 233583 119324 321647 660976 848972
33126H48972R125j15022k54081k53698K1214K68139J46281j23606j20719O8736
$$ 848972 858097 743075 488994 235296 256510 524649 670930 547324 426605 495341
33116D95341Q7668k1487J0098J04840M7485k1203P5390P8041k16537l88473m5435
$$ 495341 583009 561522 571620 676460 723945 702742 778132 856173 639636 251163 205728
33105B05728L71252K44843j57439j83872L4276p1310l28187j24200L30034K45622
$$ 205728 576980 821823 664384 480512 514788 443478 115291 -8909 321125 566747
33095E66747l07560m31295O5819L69965R1841j71544j5532J28985n6194j79470
$$ 566747 259187 -172108 -106289 263676 355517 183973 168441 297426 241232 61762
33085F1762L4007J95310J7895j47786j1429J39697N9006j113J29525J52104r0773
$$ 61762 95769 291079 308974 161188 149759 289456 348462 347349 476874 628978 538205
33074E38205k41548o9775J12304N8800O516J00514L9891k70560l51545N8584M30519
$$ 538205 296657 226882 339186 397986 404502 505016 544907 274347 -77198 -18614 411905
33063D11905K37902j81826j81613J83452L45383J49753m1842m4179p0337k52576
$$ 411905 649807 467981 286368 469820 815203 964956 923114 878935 808598 556022
33053E56022l89902k82096l6146R3318M5652J8275J68614L27706J83272k16605
$$ 556022 166120 -115976 -152122 -58804 -13152 5123 173737 501443 684715 468110
33043D68110m13190j68130J49171J02729j60463j92096O0649K77621K95652J78452
$$ 468110 54920 -113210 35961 138690 -21773 -213869 -153220 124401 420053 598505
33033E98505n5117l33187l74761q4419J54678N9953k4834K37159M30576M0706
$$ 598505 543388 210201 -164560 -248979 -94301 -34348 -59182 177977 608553 649259
33023F49259n16280m38944J33449L47444M9526r4185J28453J95250l6923n0417
$$ 649259 132979 -305965 -172516 174928 224454 130269 258722 453972 417049 366632
33013C66632K47374K32546k68975n37031j48919L09837K56092j1734j8894O2110
$$ 366632 614006 846552 577577 40546 -108373 201464 457556 445822 426928 489038
33003D89038q7997k57155j40901O9630Q8015M4920J16602J12804j02273k33454
$$ 489038 401041 143886 2985 72615 160630 205550 322152 434956 332683 99229
32993I9229m8533J77192J29825l9029o6316k7691n8613k7277J43743K08542M178
$$ 99229 50696 227888 357713 318684 252368 224677 166064 138787 282530 491072 495250
32982D95250k24477k19228q7217j5629M2059J52263K20171K16659K29195J66091
$$ 495250 270773 51545 -35672 -51301 -9242 143021 363192 579851 809046 975137
32972I75137j54541n22173m70142l5788J94755q588j82342J1680K53394J83736
$$ 975137 820596 298423 -171719 -207507 -12752 -21340 -203682 -192002 61392 245128
32962B45128j7051m5441L2321O2089J18286K13242J34051j34779k66932j33133
$$ 245128 228077 182636 214957 277046 395332 608574 742625 607846 340914 207781
32952B07781k0874p6612m0742J92688K85553M3816k09174j86765r5275j89280
$$ 207781 186907 110295 69553 262241 547794 591610 382436 195671 100396 -88884
32942h8884l00912j63098J49131L84123M15187K09250j63975m00237k33204J25668
$$ -88884 -389796 -552894 -403763 -19640 395547 604797 440822 40585 -192619 -66951
32932f6951K59458J99820K48168K62004j19780n91333m39731K18231M50194j3027
$$ -66951 192507 392327 640495 902499 782719 191386 -248345 -30114 420080 407053
32922D07053l42671k7478L17166J01384k48816j43871J59276J51993j6860J9112
$$ 407053 64382 36904 354070 455454 206638 62767 222043 374036 357176 376288
32912C76288Q7315j02373k86994j09682J86546J85069K0205N0295J71815P1660
$$ 376288 463603 361230 74236 -35446 151100 336169 356374 406669 578484 650144
32902F50144j43894j50595N193K7645j11562j93554j20182M4104K10932K46663
$$ 650144 506250 355655 360848 388493 276931 83377 -36805 7299 218231 464894
32892D64894N4572j92538k01079k830J08846Q4477J06773J24629l9869j87036
$$ 464894 519466 326928 125849 123019 231865 316342 423115 547744 507875 320839
32882C20839o603K29729K2763l80827k88403J89299K45154j91140k90438J89708
$$ 320839 314236 543965 566728 185901 -102502 86797 331951 140811 -149627 40081
32872D0081M71836J67401r7788O8964J58612j13250k06915R3396J25896l58652
$$ 40081 511917 679318 581530 650494 809106 695856 488941 582337 708233 349581
32862C49581n52371k2582M05084Q5100k96948j0634M04892K21173j27252L1681
$$ 349581 -202790 -225372 179712 264812 -32136 -42770 362122 583295 456043 487724
32852D87724K73124o7655n30651l26328K08698K49035l9161M9075L49852J78427
$$ 487724 760848 693193 162542 -163786 44912 293947 254786 303861 653713 832140
32842H32140l14986l93178m9862P5890j24493j90896k6723P7280J25714K70363
$$ 832140 517154 123976 74114 150004 25511 -165385 -192108 -114828 10886 281249
32832B81249K73909o0421k89710R301L92572K18213k61493l59896q7284O6578
$$ 281249 555158 494737 205027 214328 606900 825113 563620 203724 116440 183018
32822A83018O1587J30137R7754k27830m24707j03880K73977J30332j86304m2350
$$ 183018 244605 374742 472496 244666 -180041 -283921 -9944 120388 -65916 -108266
32812a08266L10490K32874j14817j47436K0630r6210l10816j35271J84481R3045
$$ -108266 202224 435098 320281 172845 193475 97265 -213551 -348822 -164341 -71296
32802g1296j81693m7545L04560K71749m279L0687K18926M7553k32252m1445L11411
$$ -71296 -252989 -300534 4026 275775 271496 302183 521109 568662 336410 294965 606376
32791F06376J02088m19122m04314O7676J74397j24438j09628K48951K49540j36149
$$ 606376 708464 289342 -114972 -47296 127101 2663 -106965 141986 391526 255377
32781B55377j77556K10722L02505n7173j88319J11411K48560O4326J15766L92815
$$ 255377 77821 288543 591048 533875 345556 456967 705527 769853 885619 1278434
32771A278434K5149j186314k047856j471468R0645J300405J427602P53757Q031
$$ 1278434 1303583 117269 -1930587 -3402055 -3311410 -2011005 -583403 170354 178385
32762A78385k39290L062J72677r1547l66405j09235L81479M13214O7109J3684
$$ 178385 -60905 -57843 114834 23287 -343118 -452353 -70874 342340 409449 423133
32752D23133K88902K50545k16600m52883j59959J31372O378k13522j19699J57137
$$ 423133 712035 962580 745980 293097 133138 264510 270888 57366 -62333 94804
32742I4804K75025J49314j07004l19831k69700O1136L17739K20004j526l0555
$$ 94804 369829 519143 412139 92308 -177392 -116256 201483 421487 419961 389406
32732C89406k3932k23111l56674p5807L24014L11661j6645j72456j06136j11224
$$ 389406 365474 142363 -214311 -290118 33896 345557 328912 156456 50320 -60904
32722f0904j68588p2340O5227P9715J78096M58918M71657k9968m31796j81559
$$ -60904 -229492 -301832 -236605 -156890 21206 480124 951781 921813 490017 308458
32712C08458K01181j7228m80429l71227J51575L09409R1148Q0576K28056K8731
$$ 308458 509639 492411 11982 -359245 -207670 101739 192887 273463 501519 530250
32702E30250l19974j79312K78888K94155j21407k27290J08579K66186L9866j42004
$$ 530250 210276 30964 309852 604007 482600 255310 363889 630075 669941 527937
32692E27937j46947k53952l70299j27192K86977L32332O6808j2499R4336K8218
$$ 527937 380990 127038 -243261 -370453 -83476 248856 315664 303165 397501 425719
32682D25719q9463Q9534L11550J21734k06043j30569J25669L9168j50833M0544
$$ 425719 336256 425790 737340 859074 653031 522462 648131 687299 536466 577010
32672E77010K40013j29954n64747k09538N33404N78896K428j99460P3004J6586
$$ 577010 817023 687069 122322 -87216 446188 1025084 1027512 828052 901056 917642
32662I17642m12266m16803O4892K15291j57197l60405j36722N6651R8497K89916
$$ 917642 505376 88573 153465 368756 211559 -148846 -285568 -228917 -130420 159496
32652A59496M52573J69558k14338o5610L07844J79542j92815p8142K33859j1779
$$ 159496 612069 781627 567289 501679 809523 989065 796250 718108 951967 940188
32642I40188m25409j20749M39960J23512o77909n62162L48565N41360j97220m31439
$$ 940188 514779 394030 833990 957502 279593 -282569 65996 607356 410136 -21303
32632b1303L20674P89573K43423m09981m02350j95080k01657o3862K56290J88742
$$ -21303 299371 1088944 1332367 922386 520036 324956 123299 59437 315727 504469
32622E04469k05595j75476K51796K53052j58684j10963L62382K76800l77243m84096
$$ 504469 298874 123398 375194 628246 469562 358599 720981 997781 620538 136442
32612A36442J41324L96225o0323k49635K17275M88313J84806J1243K10889J28364
$$ 136442 277766 673991 613668 364033 581308 1069621 1254427 1265670 1476559 1604923
32602A604923k97539l18316L6287p8042n28893k72315N47117N87640k74853o28340
$$ 1604923 1307384 989068 1025355 947313 418420 146105 693222 1280862 1006009 377669
32592C77669l5921K87715j74139l85489J22196L99578K9023j36216J61741M3813
$$ 377669 341748 629463 455324 69835 192031 591609 620632 484416 646157 689970
32582F89970n49136m75457L78209O50503l0036l49142K01865M22169k01907n12646
$$ 689970 140834 -334623 43586 694089 664053 314911 516776 938945 737038 224392
32572B24392j515J95116l94925n68440K03070O72281J55964k54046Q5596J85705
$$ 224392 222877 417993 23068 -545372 -342302 329979 485943 231897 317493 503198
32562E03198m08093n45527K29539N84091j37453o04428L2644O00910J90893k20820
$$ 503198 95105 -450422 -220883 363208 225755 -378673 -346029 254881 445774 224954
32552B24954J66478M51124k6452l29954J00602K43007l87316n81276K31008P10844
$$ 224954 391432 842556 816104 486150 586752 829759 442443 -138833 92175 803019
32542H03019Q5068l72586J93444N72854j19981o89185j59465L73509r7440o10873
$$ 803019 888087 515501 708945 1281799 1161818 472633 313168 686677 589237 -21636
32532b1636k14494K45801l5340k40534K32916M27014j63578l73153L52720O92546
$$ -21636 -236130 9671 -25669 -266203 -33287 393727 230149 -143004 209716 902262
32522I02262m5366m96963J45382N37044j88621o97996o7380M16783j62333n30470
$$ 902262 856896 359933 505315 1042359 853738 155742 88362 505145 342812 -187658
32512a87658J88445O45407p9134n90803J12016O61123J3480n22986N3650M54632
$$ -187658 787 646194 567060 -23743 88273 749396 762876 239890 293540 748172
32502G48172k15604n63891K54227O69097k20114o73128L66958J048838O6119p90205
$$ 748172 532568 -31323 222904 892001 671887 -1241 365717 1414555 1480674 690469
32492F90469k6248P52398M6171o78690m0429N03908k77224p63358K51837R27518
$$ 690469 664221 1416619 1462790 784100 743671 1247579 970355 206997 458834 1386352
32482A386352q7405q36702K09927J057503j1452j051710k05125P20179r7825q62398
$$ 1386352 1298947 462245 672172 1729675 1718223 666513 461388 1181567 1083742 221344
32472B21344J77845J058273r6201j217393j91390J017997K01554q05718J39856
$$ 221344 399189 1457462 1361261 143868 -47522 970475 1172029 366311 506167
32463E06167J163256J12882j073692j72958Q99131m0946j001484J54697J229225
$$ 506167 1669423 1782305 708613 535655 1434786 1393840 392356 547053 1776278
32454A776278j8885j228817J8809J308758J06009j128379J88781J476593R1782
$$ 1776278 1757393 528576 547385 1856143 1962152 833773 1022554 2499147 2590929
32445B590929j217967K59187J526867k64916j798204R3642J895492J14255j641565
$$ 2590929 1372962 1632149 3159016 2894100 1095896 1189538 3085030 3199285 1557720
32436A557720K95448K068583k03233k252600K60400K766834L94975k120218M83272
$$ 1557720 1853168 3921751 3718518 1465918 1726318 4493152 4888127 2767909 3251181
32427C251181L162113K48585k693730O47909M204251R49704k429877J883360O341934
$$ 3251181 6413294 6661879 3968149 4616058 8820309 9770013 7340136 9223496 15565430
32418A5565430K233612j374886N884111J3122890P712209L448550J7182260L1653961
$$ 15565430 17799042 16424156 22308267 35431157 43143366 46591916 63774176 95428137
32410I5428137K4141448K1170989O6849721J32127598J22894851Q881118j14121969
$$ 95428137 119569585 140740574 207590295 339717893 462612744 471493862 357371893
32403C57371893j38173371p5302280k0970792j9362325l1101074k0445163m627629
$$ 357371893 219198522 143896242 122925450 103563125 72462051 52016888 47389259
32396D7389259o121400j2452351o717999J315472j701118p189490l463746K309341
$$ 47389259 41267859 28815508 22097509 23412981 21711863 14522373 11058627 13367968
32388A3367968j06575m587571k036080K253813J48677l642250j673332J934503
$$ 13367968 13261393 8673822 6637742 8891555 9040232 5397982 3724650 5659153
32380E659153L83646k706236j164505J760811M74856k018127o26691J742766L20918
$$ 5659153 6042799 3336563 2172058 3932869 4407725 2389598 1762907 3505673 3826591
32371C826591k068499q01441J538622N23098j555697n88285J309563L54395j389173
$$ 3826591 1758092 956651 2495273 3018371 1462674 874389 2183952 2538347 1149174
32362A149174l64628J384574M28198j277182m38824J090862K09815j245836l07251
$$ 1149174 784546 2169120 2597318 1320136 881312 1972174 2181989 936153 628902
32353F28902J171290K59473j238845m32335R75611K05674j071803j76517J178671
$$ 628902 1800192 2059665 820820 388485 1364096 1569770 497967 321450 1500121
32344A500121K91238j146670l54797J111544M41332j034446o07237O10486K00550
$$ 1500121 1791359 644689 289892 1401436 1842768 808322 201085 811571 1012121
32335A012121p13673K5793J052181J82255j042909k29872J119904M20563j025598
$$ 1012121 298448 324241 1376422 1558677 515768 285896 1405800 1826363 800765
32326H00765n60209P88286M83505o16081k03026P97807J36068j168987p16606
$$ 800765 240556 1028842 1512347 896266 693240 1491047 1627115 458128 -258478
32317b58478O19376L98338p24841m33122P36617O06529l70673k25682N24852N7954
$$ -258478 360898 759236 34395 -398727 337890 944419 573746 348064 872916 930870
32307I30870r07859m42609O93908M15968o48371l75653P54762O47457l85717l98635
$$ 930870 23011 -419598 274310 690278 41907 -333746 421016 1068473 682756 284121
32297B84121L63331J49678o78951l94797N58156L69013n62018l85289N82621N03181
$$ 284121 647452 797130 118179 -276618 281538 650551 88533 -296756 285865 789046
32287G89046l91437l23625N00000L33882o10687n18019N31132P16244j02933l00388
$$ 789046 397609 73984 573984 907866 297179 -220840 310292 1026536 923603 623215
32277F23215L45925M45554j55427k30562K13415k6732p85316o88054J96503M32996
$$ 623215 969140 1414694 1259267 1028705 1242120 1215388 430072 -257982 -61479 371517
32267C71517j50290l59715l628K4655j94381J79903P46346M08258l90606l04455
$$ 371517 221227 -138488 -142116 -117461 -311842 -131939 614407 1022665 632059 327604
32257C27604L99106L27215m04800m55529J44103J36827m43682l55208L77172M62182
$$ 327604 726710 1053925 649125 193596 337699 474526 30844 -324364 52808 514990
32247E14990k16609m51204k377J45807j68400r0953L79841L42784j80285k62309
$$ 514990 298381 -152823 -155200 -9393 -177793 -268746 111095 453879 273594 11285
32237A1285J41108K25114q705R3341L00101q0378n81439k38659N03866M48779
$$ 11285 152393 377507 368802 462143 762244 681866 100427 -138232 365634 814413
32227H14413j88827k28822K55181J94726l30720k72659L09056L67801j25264k42615
$$ 814413 625586 396764 651945 846671 515951 243292 552348 920149 794885 552270
32217E52270M2408m6036l80679j97516K30785O0459l47062l0729N98910L92561
$$ 552270 594678 548642 167963 -29553 201232 261691 -85371 -116100 482810 875371
32207H75371l41760l46959K59813L01261j70081q3097M43141L23707k97460l10262
$$ 875371 533611 186652 446465 747726 577645 494548 937689 1261396 963936 653674
32197F53674J28839q9070o85572l60466O13281O34636l45020o80498M3031M31803
$$ 653674 782513 693443 7871 -352595 260686 895322 550302 -130196 -87165 344638
32187C44638l7744k19404L19885M77079j75988n49033j09367K23178n3921j82697
$$ 344638 306894 87490 407375 884454 708466 159433 50066 273244 219323 36626
32177C6626J65087K06885k87090m26087P8592L34385j5011j77922J52448K43440
$$ 36626 201713 408598 121508 -304579 -225987 108398 93387 -84535 67913 311353
32167C11353r4991p9456L95605M00606k23607m46068L6361K32887k13467l36917
$$ 311353 216362 136906 532511 933117 709510 263442 299803 532690 319223 -17694
32157a7694K44782N29638O876m00053j01624J22261k44591m02955J86445O70029
$$ -17694 227088 756726 763602 363549 261925 384186 139595 -263360 -76915 593114
32147E93114K92742l08626l24367p3041j08997j50736J52756L85067J56280j55667
$$ 593114 885856 577230 252863 179822 70825 -79911 72845 457912 614192 458525
32137D58525j66360j14225j62998q824L23090K84136j44743k59627Q8530J66865
$$ 458525 292165 177940 14942 6118 329208 613344 468601 208974 297504 464369
32127D64369k44496l61030J55064M88673P8170m25726l20895O9942J82074J15908
$$ 464369 219873 -141157 13907 502580 580750 155024 -165871 -95929 86145 202053
32117B02053J16317K8309j65721j11540J68105J66523j25533j10251K46123K39923
$$ 202053 318370 346679 180958 69418 237523 404046 278513 168262 414385 654308
32107F54308k28253l40078J72482M81540J27379j98930K5659K40205o7561m05597
$$ 654308 426055 85977 258459 739999 867378 668448 694107 934312 866751 461154
32097D61154k37763O6247Q719j63118o5293J18219J43383J71222K35634L4340
$$ 461154 223391 289638 298357 135239 69946 188165 331548 502770 738404 772744
32087G72744l38365l17206R6533J79176k39755l90262Q0491M46288J68370k27406
$$ 772744 434379 117173 213706 392882 153127 -237135 -156644 289644 458014 230608
32077B30608j76705J3739n2100j05461Q9384J68526n2196r4049K59315M18326
$$ 230608 53903 67642 15542 -89919 -535 167991 115795 21746 281061 699387
32067F99387J0551m00891k76804L6588O0198M451J73484K90293P9775j41952n9920
$$ 699387 709938 309047 32243 68831 129029 133480 306964 597257 677032 535080 475160
32056D75160Q7989N7828M2809J28005J2106l06473l23576P6196L15766J23946
$$ 475160 563149 620977 663786 791791 803897 497424 173848 250044 565810 689756
32046F89756j6814J51426J57613k20474m12569q3258J96428m6602l55389j95256
$$ 689756 672942 824368 981981 761507 348938 265680 462108 415506 60117 -135139
32036a35139J40743J66847L6805P6202J30870l11r0454Q103r265k69921l51654
$$ -135139 5604 172451 209256 285458 416328 416017 325563 333666 324401 54480 -297174
32025b97174j1859L38497L20271J20158j4038j38315j82249Q7840M15546K19416
$$ -297174 -309033 29464 349735 469893 455855 317540 135291 223131 638677 858093
32015H58093l37322m17156O9177K26428k46947m70367M9978M99886J73850l34123
$$ 858093 520771 103615 172792 399220 152273 -318094 -268116 231770 405620 71497
32005G1497k45168J27103J56135L5182J64016K33853j01222l75592q6388L41473
$$ 71497 -173671 -46568 109567 144749 308765 542618 441396 65804 -20584 320889
31995C20889K65658j08796k19400j07175r0026o6454R9151J00174j89312k67191
$$ 320889 586547 477751 258351 151176 61150 -5304 93847 194021 4709 -262482
31985b62482J17170L54204n173l75843j13343L76804L91104Q8542j6285m1796
$$ -262482 -145312 208892 203719 -172124 -285467 91337 482441 570983 554698 512902
31975E12902k69054l37799Q4437M37676J15915l82097k34864K73648K62028k09101
$$ 512902 243848 -93951 -9514 428162 544077 161980 -72884 200764 462792 253691
31965B53691l09791P9847K51681k2771j65666J18929L66168J72231k21583l82047
$$ 253691 -56100 23747 275428 252657 86991 205920 572088 744319 522736 140689
31955A40689k11282J12509L51498L28774R4214j01134j55934k08715k51376o9134
$$ 140689 -70593 41916 393414 722188 816402 715268 559334 350619 99243 30109
31945C0109K45422K49364j09460k98522p4215J05400o1033j62197J15667L45098
$$ 30109 275531 524895 415435 116913 42698 148098 87065 -75132 40535 385633
31935C85633J35069j34537l4545J08795j28296m02773j94556K43948L16911L7728
$$ 385633 520702 386165 351620 460415 332119 -70654 -265210 -21262 295649 333377
31925C33377j73523k26940k15209J7723M67668N97916R8641m35023l22980J42857
$$ 333377 159854 -67086 -282295 -264572 203096 801012 899653 464630 141650 284507
31915B84507K23909r6149k57425r5655R3479J78690K04888P3280j90481k08486
$$ 284507 508416 412267 154842 59187 152666 331356 536244 609524 419043 210557
31905B10557J37401L15000l4836m07255k44892J13172O8498j84177j00013J91417
$$ 210557 347958 662958 628122 220867 -24025 89147 157645 -26532 -126545 64872
31895F4872K05752M4046J05022K19535o666l10274j72969J69273Q1740l16493
$$ 64872 270624 314670 419692 639227 632561 322287 149318 318591 400331 83838
31885H3838l34039Q1529K82419N7310q4502J37370L40279J70151j96651m07933
$$ 83838 -250201 -168672 113747 171057 86555 223925 564204 734355 537704 129771
31875A29771l39609p3719J87386K27517R1561O0990J46092j589l92964m75153
$$ 129771 -209838 -283557 -96171 131346 222907 283897 429989 428400 35436 -439717
31865d39717k6180L44098J47489j64414j5603K89107J77710j37137j07659J29308
$$ -439717 -465897 -121799 25690 -138724 -154327 134780 312490 175353 67694 197002
31855A97002R9102o3995N2383K35689K0596l64310l60927q8506n2796j59042J7522
$$ 197002 296104 232109 284492 520181 540777 176467 -184460 -272966 -325762 -484804 -467282
31844d67282K75980J27770j65934L6160N35754N37359L466l16174j65203k1303
$$ -467282 -191302 -63532 -229466 -193306 342448 879807 883273 567099 401896 380593
31834C80593n3264Q9619L63993K54177k28965m41537j88982Q6j24520j63568O1925
$$ 380593 327329 416948 780941 1035118 806153 364616 175634 175720 51200 -112368 -50443
31823e0443J45011r3409k16638N1979L45322K85710K8097j19200j19919l6948
$$ -50443 94568 1159 -215479 -163500 181822 467532 495629 376429 256510 219562
31813B19562J15519J99789N4470j66500j66258J366M7386k9189j5095M9097k406
$$ 219562 335081 534870 589340 422840 256582 257948 305334 276145 261050 310147 307741
31802C07741k9315J49839K64990j68l30935k14216J68322K47256N1145L6199J23386
$$ 307741 278426 428265 693255 693087 362152 147936 316258 563514 614659 650858 774244
31791G74244j36257n38374m01162K04163M32725K1780l31116j76285O4340N121
$$ 774244 637987 99613 -301549 -97386 335339 357119 26003 -150282 -85942 -80821
31781h0821o7279J21188K80941J32718r4735j22455l7062L9912J71775K68038
$$ -80821 -148100 -26912 254029 386747 292012 169557 132495 172407 344182 612220
31771F12220O8537l22132m19391p7222K82144L11021J16061j00030k62742k34458
$$ 612220 680757 358625 -60766 -137988 144156 455177 571238 471208 208466 -25992
31761b5992O7115L38507K26131n5920m9711J24352K409k88966k06979J56496J74472
$$ -25992 41123 379630 605761 549841 500130 624482 626891 337925 130946 287442 461914
31750D61914j34994r3498L28006L29256k70823n65512n4008M88555L09528j36854
$$ 461914 326920 233422 561428 890684 619861 54349 341 488896 798424 661570
31740F61570j12516J38370k6079m19918l53929J81132N19734L30398o4501k69000
$$ 661570 549054 687424 661345 241427 -112502 68630 588364 918762 854261 585261
31730E85261j91002O0832K65255J90095j22985l47589l16343j99652j14946M5627
$$ 585261 394259 455091 720346 910441 787456 439867 123524 -76128 -191074 -145447
31720a45447K38405J91918p5406j59620N4669J55618o1881j90324P4191L59765
$$ -145447 92958 284876 209470 49850 104519 260137 198256 7932 82123 441888
31710D41888K35689q4338j70525q3523j09224j50050M2267K90051K13504j26558
$$ 441888 677577 593239 422714 339191 229967 79917 122184 412235 625739 499181
31700D99181l09898j84402R705P1182L3090k2238n2830q358R3706J20296J3833
$$ 499181 189283 4881 14586 85768 118858 96620 43790 35432 129138 249434 263267
31689B63267q9563p4395k1932l1674l9964L3467J16433J02592J6476k8836N8773
$$ 263267 173704 99309 77377 45703 5739 39206 155639 258231 274707 245871 304644
31678C04644K77493M43450K83800j67854m39982k17334J25846M3818l07025l13402
$$ 304644 582137 1025587 1309387 1141533 701551 484217 610063 653881 346856 33454
31668C3454O8941K48029N606j74329J8852K36673J57508m777k7625q6057k38439
$$ 33454 102395 350424 356030 181701 200553 437226 594734 589957 562332 476275 237836
31657B37836j27437L27594N24211M2415n72384n40513P49K54811m6311l77764
$$ 237836 110399 437993 962204 1004619 432235 -108278 -107529 147282 100971 -276793
31647b76793k84881O8388K83417K33583O5186m8882n4555k4628l5346k5770R9421
$$ -276793 -561674 -493286 -209869 23714 88900 40018 -14537 -39165 -74511 -100281 -860
31636h60K29249J41099j19513k39917j10265K2544k353p695J39862K31678O0558
$$ -860 228389 369488 249975 10058 -100207 -77663 -80016 -87711 52151 283829 344387
31625C44387k08574k83956j56797k1294M3577R4189J58442K19845K51990J78588
$$ 344387 135813 -148143 -304940 -326234 -282657 -188468 -30026 189819 441809 620397
31615F20397m8450k77048k63431j4099J94429J93424R4246L2329k1704j24205
$$ 620397 571947 294899 31468 17369 211798 405222 499468 531797 510093 385888
31605C85888k35220k86560k27759m2181J41423J04825r7184q4105K49099M19941
$$ 385888 150668 -135892 -363651 -405832 -264409 -159584 -256768 -340873 -91774 328167
31595C28167Q9669k71305p0211L99421M21187O3093j0749K10946Q9222l83250
$$ 328167 417836 146531 76320 475741 896928 960021 949272 1160218 1249440 866190
31585H66190m38399Q8750L58118p8268n28777l62801J5328M6609k2848J89328
$$ 866190 427791 516541 874659 796391 267614 -95187 -79859 -33250 -56098 133230
31575A33230L62524J12620k00902j21165N4278j15267l22654j02869K02772J4685
$$ 133230 495754 608374 407472 286307 340585 225318 -97336 -200205 2567 17252
31565A7252l65002j94623M12567O28677K28540j66124j58451l8859p9081j14233
$$ 17252 -347750 -542373 -129806 498871 727411 561287 402836 363977 284896 170663
31555A70663r536N4818l9146j26751n5005J21407K67137K38259o1217m35511m45417
$$ 170663 161127 215945 176799 50048 -4957 116450 383587 621846 560629 125118 -320299
31544c20299k4505K77654Q6691j55107R4675N13031M02851j33377l56309r2817
$$ -320299 -344804 -67150 19541 -135566 -40891 472140 874991 741614 385305 292488
31534B92488R6000m9404j44264K3029J37134K9695k1321J02001J39948O7496K07189
$$ 292488 388488 339084 194820 217849 354983 384678 363357 465358 605306 672802 879991
31523H79991M89969M23610J62340O63748K091545K926466J718980p72584k334809
$$ 879991 1369960 1793570 1955910 2619658 4711203 7637669 9356649 8584065 6249256
31514F249256k008560r34153m50493n13359m33817j81399j60815l00188k18274
$$ 6249256 4240696 3306543 2856050 2342691 1908874 1727475 1566660 1266472 1048198
31505A048198j4319j12705m29770m19076J8330L32684J88406o3185k2652J59631
$$ 1048198 1033879 921174 491404 72328 90658 423342 611748 548563 525911 685542
31495F85542J48627k8901j55257k07562k38050j65244p71J4383j80923k43167
$$ 685542 834169 805268 650011 442449 204399 39155 38384 52767 -128156 -371323
31485c71323M2787L46369L06475J13339J12167J73270j49k47266k28422n3246
$$ -371323 -328536 17833 324308 437647 549814 723084 722935 475669 247247 194001
31475A94001q310N4818L59407N25326R0587n06737m26718J87682L66054j04317
$$ 194001 185691 240509 599916 1125242 1215829 709092 282374 470056 836110 731793
31465G31793l62951J4154L15640k1867m53988l03749J47655K73326J29311J27189
$$ 731793 368842 382996 698636 676769 222781 -80968 66687 340013 469324 596513
31455E96513K05126N0683k29952l01276j62083j6190J08367J90780M6807k64000
$$ 596513 801639 852322 622370 321094 159011 142821 251188 441968 488775 224775
31445B24775k92740J00796L70164R0332l28635k91996N4009J63475o035p2216
$$ 224775 -67965 32831 402995 493327 164692 -127304 -73295 90180 84145 11929
31435A1929N8605J63236J87435K23461J82398l5142k28809j84989n7004o7526
$$ 11929 70534 233770 421205 644666 827064 791922 563113 378124 321120 253594
31425B53594r8637K1669J23606J0218j32514o3556Q3871J06901J12673J78512
$$ 253594 154957 176626 300232 310450 177936 114380 198251 305152 417825 596337
31415E96337N3107l25162m70911q1985L28423J88026j77119j01625K67007K42611
$$ 596337 649444 324282 -146629 -228614 99809 287835 110716 9091 276098 518709
31405E18709j89934l44739J6351L41607K06251j30019k56580j46538J9158J37613
$$ 518709 328775 -15964 387 341994 548245 418226 161646 15108 34266 171879
31395A71879J55357N7412n9275j04221j02339k4952K32172M95482L41792j99969
$$ 171879 327236 384648 325373 221152 118813 93861 326033 821515 1163307 963338
31385I63338m65322j21831K20877l5646m73265l75493N3120J19011r6285L9582
$$ 963338 498016 376185 597062 561416 88151 -287342 -234222 -115211 -211496 -171914
31375a71914M44721M04728j10186l14334O8831L81118J81934j18978j21968p7440
$$ -171914 272807 677535 567349 253015 321846 702964 884898 765920 643952 566512
31365E66512k51086l79783k02830O0479J55947J90225K52132J57706j07957j93693
$$ 566512 315426 -64357 -267187 -206708 -50761 139464 391596 549302 441345 247652
31355B47652N4661K91710K20859O116j17360j91791k48140j31889J21783J88286
$$ 247652 302313 594023 814882 820998 703638 511847 263707 131818 253601 441887
31345D41887j8782j72091j14635j14545k66552j98010K42887N39454K50000k32692
$$ 441887 423105 251014 136379 21834 -244718 -442728 -199841 339613 589613 356921
31335C56921k35526J83262L71805Q1820k41153j76443J23999K40540M9500j89245
$$ 356921 121395 304657 676462 758282 517129 340686 464685 705225 754725 565480
31325E65480j99064j4378R5964Q997p7183M1222K28690K11036J5923q9962n0614
$$ 565480 366416 352038 448002 456999 379816 421038 649728 860764 876687 786725 736111
31314G36111o2895j69110j73554k5588O6777K322o1783k9254j9759r0679j10093
$$ 736111 673216 504106 330552 304964 371741 374063 312280 283026 263267 172588 62495
31303F2495k8630J6353j5974J8006J32923J29044l4438r9700P0140K27933J21408
$$ 62495 33865 50218 34244 52250 185173 314217 279779 180079 250219 478152 599560
31292E99560j16010j94091q9540o0j0323k5968K6105R7171R6462n484j28632j35466
$$ 599560 483550 289459 199919 199859 189536 163568 189673 286844 383306 377822 249190 113724
31280A13724Q134J60222J80433J11153O3284K4885n2832r6984m7188k8780j51594
$$ 113724 121858 282080 462513 573666 636950 661835 609003 512019 464831 436051 284457
31269B84457k55053j32366R6202J40967p257r8362k7238R3659J95734K74247K29256
$$ 284457 29404 -102962 -6760 134207 126950 28588 1350 95009 290743 564990 794246
31258G94246J3894j55321q2979L2677r6528l11221k38266M9690J42138J876p625
$$ 794246 808140 652819 569840 602517 505989 194768 -43498 6192 148330 150206 142581
31247A42581J86087K46218P6993j5090N0531m7896l68633m69702j42319J78111
$$ 142581 328668 574886 651879 636789 687320 639424 270791 -198911 -341230 -163119
31237a63119J09952o8505M5173K64256J55030k00519l20189o1369K29014K73660
$$ -163119 -53167 -121672 -76499 187757 342787 142268 -177921 -239290 -10276 263384
31227B63384J80026J43511J37149L0036j43467j89924l2884J27154N6410j39658
$$ 263384 443410 586921 724070 754106 610639 420715 387831 514985 571395 431737
31217D31737j17096J58221K70788j5409l14919j78812J89657K65030L0712r6367
$$ 431737 314641 472862 743650 728241 413322 234510 424167 689197 719909 623542
31207F23542m2271j28214l59506l38122J315K08455O4546q0120L9900J71356N8567
$$ 623542 581271 453057 93551 -244571 -243256 -34801 29745 -50375 -10475 160881 219448
31196B19448j10033r7157j4000j76P6275K68872K96737r208l46898l69922j65696
$$ 219448 109415 12258 -1742 -1918 74357 343229 639966 630758 283860 -86062 -251758
31185b51758K451J14066K32067K34525N4248p7635L2217J90002J20756r1285j77510
$$ -251758 -249307 -135241 96826 331351 385599 307964 340181 530183 650939 559654 382144
31174C82144j04855k5790J3992L8253k7787k20963l66988k75289L53K58528L71361
$$ 382144 277289 251499 265491 303744 275957 54994 -311994 -587283 -586930 -328402 42959
31163D2959K93138M5136j83463j47043J05846K33611R1335n3624L4886J88796
$$ 42959 336097 381233 197770 50727 156573 390184 481519 427895 462781 651577
31153F51577J28849j11409k86331k74463j24993N6624J27252J901j63824j12435
$$ 651577 780426 669017 382686 108223 -16770 39854 167106 169007 5183 -107252
31143a07252J17000K12496R1299K8761J56768K20895M1622j55809j30675j3150
$$ -107252 9748 222244 313543 342304 499072 719967 761589 605780 475105 461955
31133D61955k0995q3334l5769O0093O7250K6877K2082m932r5455j46178j05769
$$ 461955 440960 357626 321857 381950 449200 476077 498159 493227 397772 251594 145825
31122A45825o4513j8963J55240L64165K96267n3827k58250r2644J04186L324j82979
$$ 145825 81312 62349 217589 581754 878021 824194 565944 473300 577486 580810 397831
31111C97831j12019J01710J30541p862n6740J7192N2607K5248J4748j2468r4622
$$ 397831 285812 387522 518063 510201 453461 470653 523260 548508 563256 550788 456166
31100D56166j07153K8069J35174M0045j37806j81475q7452K1455R4304Q9175n1179
$$ 456166 349013 377082 512256 552301 414495 233020 145568 167023 261327 350502 299323
31089B99323k06971j50051N5878Q2572q5956o1665K42304L51275J8495k78932
$$ 299323 92352 -57699 -1821 80751 -5205 -66870 175434 526709 545204 266272
31079B66272j07476J84848R2768j45264J3520M06749L85011j10371m44845k64101
$$ 266272 158796 343644 436412 291148 304668 711417 1096428 986057 541212 277111
31069B77111Q8217J99030P8342p5410j47532o5484J37247K02152m6308l23248
$$ 277111 365328 564358 642700 567290 419758 354274 491521 693673 647365 324117
31059C24117k21825J34291K45457J4737j45353l1510O3851n5928j14513J44832
$$ 324117 102292 236583 482040 496777 351424 319914 383765 327837 213324 358156
31049C58156M70152M40399O8879k40106k32579n9394o889j38583k62628k04436
$$ 358156 828308 1268707 1337586 1097480 864901 805507 798618 660035 397407 192971
31039A92971k8624P7450Q2925J17448K04733K12941J19665O8649O7122p6114l55587
$$ 192971 164347 241797 324722 442170 646903 859844 979509 1048158 1115280 1039166 683579
31028F83579m41176j83859P1653o115k05459j27922J58077K47695M2273j58799
$$ 683579 242403 58544 130197 124082 -81377 -209299 -51222 196473 238746 79947
31018G9947j48710k9481M5186M7219N275k2872L8675J38611R8869q0774j36101
$$ 79947 -68763 -98244 -53058 -5839 -564 -23436 15239 153850 252719 171945 35844
31007C5844M2400J78917O5723o3318L9323J50043l5359k94989j90902J89256L46918
$$ 35844 78244 257161 322884 259566 298889 448932 413573 118584 -72318 116938 463856
30996D63856J42815p0533o1469K3473L6109K5316J5317m6325r5641k6626O8651
$$ 463856 606671 536138 474669 498142 534251 559567 574884 528559 432918 406292 474943
30985D74943L9806k7982J2505L9173j14747k62967j44897M9838l9755k62029j49550
$$ 474943 514749 486767 499272 538445 423698 160731 15834 65672 25917 -236112 -385662
30974c85662K41899L44260k76k71403j00789K19498K98791J91289R9077l918j50925
$$ -385662 -143763 200497 200221 -71182 -171971 47527 346318 537607 636684 632766 481841
30963D81841j82161n3219R085q6868r6993R4272J92830p360k11288r0808J41722
$$ 481841 299680 246461 255546 168678 71685 165957 358787 351427 140139 49331 191053
30952A91053P0154k24883k75439M1797L26777K56471L336q4593K5565P5611p1738
$$ 191053 261207 36324 -239115 -197318 129459 385930 389266 304673 330238 405849 334111
30941C34111k31974j51066J41251L45300K59838J2547j45553j53946j26198j20436
$$ 334111 102137 -48929 92322 437622 697460 710007 564454 410508 284310 163874
30931A63874r3470l2204K5939P3153J06479P5512k8751j12293j19065j14130j03565
$$ 163874 70404 38200 64139 137292 243771 319283 290532 178239 59174 -54956 -158521
30920a58521M3725L08675L78453P2421k83707k59342N5006K10564P5214q3428
$$ -158521 -114796 193879 572332 644753 361046 101704 156710 367274 442488 359060
30910C59060j22897j62263j85061O130L33914L96338M8481l41640l98742j70216
$$ 359060 236163 73900 -111161 -105031 228883 625221 673702 332062 -66680 -236896
30900b36896J08558L30426M06223J89361k26071m21981j67229K04413K20447q8954
$$ -236896 -128338 202088 608311 797672 571601 149620 -17609 186804 407251 318297
30890C18297k72325q9918K13217K69471K5193k40370k48620l0455J19696K4361
$$ 318297 45972 -43946 169271 438742 463935 223565 -25055 -55510 64186 88547
30880H8547j29342n6913J89544K85926J18881p4773j13659j24544k36146k83213
$$ 88547 -40795 -97708 91836 377762 496643 421870 308211 183667 -52479 -335692
30870c35692o5661K57033L12718K3464k69180k33200O1955K72903K08672O937
$$ -335692 -401353 -144320 168398 191862 -77318 -310518 -248563 24340 233012 239949
30860B39949j05548r3973o4880l3291P7781K17732K01809l810j85048j79560r2097
$$ 239949 134401 40428 -24452 -57743 20038 237770 439579 435769 250721 71161 -20936
30849b0936p6825q9074k3914O7931R5778J10486J76353K09770J40005O8253O1303
$$ -20936 -97761 -186835 -210749 -142818 -47040 63446 239799 449569 589574 657827 719130
30838G19130k2281k53178l81119j71993J73634K76246J17245j9642k3555r732
$$ 719130 696849 443671 62552 -109441 64193 340439 457684 438042 414487 404755
30828D04755j592N9271O6281r8193k32754n8391K58757K80169r118j56935L0609
$$ 404755 403163 462434 528715 430522 197768 139377 398134 678303 669185 512250 542859
30817E42859J97472L4585k51842k95584p5176J55687K06138N3644j80243k52692
$$ 542859 740331 774916 523074 227490 152314 308001 514139 567783 387540 134848
30807A34848j9216K93092K84002o8539l32283k04830J04229K24207J06376k8411
$$ 134848 115632 408724 692726 624187 291904 87074 191303 415510 521886 493475
30797D93475m0503J5978L2119k8813r7698o8572M3683P9075k6387r6417J0505
$$ 493475 452972 468950 501069 472256 374558 305986 349669 428744 402357 305940 316445
30786C16445J30387N6826o7830L6155K78061K91173J3291k20577j99942q0005
$$ 316445 446832 503658 435828 471983 750044 1041217 1054508 833931 633989 553984
30776E53984l3617j4788K8361J4163q3851j54349j30812m9626P7280K21463K23124
$$ 553984 520367 505579 533940 548103 464252 309903 179091 129465 206745 428208 651332
30765F51332k807k16919j39216R2398J19041o1555j43623p9050j00523j88405
$$ 651332 648525 431606 292390 384788 503829 442274 298651 219601 119078 -69327
30755f9327n8189K44570K86734n3403l34986k14416Q7668K01189R7051m6708j24899
$$ -69327 -127516 117054 403788 350385 15399 -199017 -111349 89840 186891 140183 15284
30744A5284q5060N6277R4644j10917k65239R299M45596L75560k01758m99922j29956
$$ 15284 -69776 -13499 81145 -29772 -295011 -285712 159884 535444 333686 -166236 -296192
30733b96192L18667K57269m2502q1130N959j44153l44377j86727J80545K74668
$$ -296192 22475 279744 237242 156112 162071 17918 -326459 -513186 -332641 -57973
30723e7973O3457p3532p514P1486J20602K49719L47397J94405r6981k00657r6149
$$ -57973 5484 -68048 -75562 -4076 116526 366245 713642 908047 811066 610409 514260
30712E14260n9083j63282j92755n6275P3597P3224K0216q27Q53K7527Q8748J04586
$$ 514260 455177 291895 99140 42865 116462 189686 209902 209075 209928 237455 326203 430789
30700D30789J177j30764j44758n5285R313K284l2767o2204m9297M9223J69096
$$ 430789 431966 301202 156444 101159 110472 112756 79989 17785 -31512 17711 186807
30689A86807J64573M1922j9609K7599J6845r2749r1288Q5614J55287n9293k73008
$$ 186807 351380 393302 373693 401292 418137 325388 234100 319714 475001 415708 142700
30678A42700j53278J53888K57193R1856q1568j08992n6917k430J6451n8455j85831
$$ 142700 -10578 143310 400503 492359 410791 301799 244882 242452 258903 200448 14617
30667A4617j76902K2434J72644Q7991n5020j3379J21192J12908l320j6643P9795
$$ 14617 -162285 -139851 32793 120784 65764 52385 173577 286485 283165 266522 346317
30656C46317J06717N351j25389k03304j75809l551J84179J24846j72042l05096
$$ 346317 453034 458385 332996 129692 -46117 -49668 134511 259357 87315 -217781
30646b17781l6347K95306K48034p3765k23527p2854J31553K25302K40483J62500
$$ -217781 -254128 41178 289212 215447 -8080 -80934 50619 275921 516404 678904
30636F78904m6118k39756k38612j19134o8342n8943L3187J28800R5487N7139J89174
$$ 678904 632786 393030 154418 35284 -33058 -92001 -58814 69986 165473 222612 411786
30625D11786L28645J80101j75610l68567k78929j17372j9193P1091J46482J26477
$$ 411786 740431 920532 744922 376355 97426 -19946 -39139 31952 178434 304911
30615C04911O8141N9246k1999k76134m17523r8934M40367N60823J20990l03880
$$ 304911 373052 432298 410299 134165 -283358 -382292 58075 618898 739888 436008
30605D36008k48554N5646J50264J1867o5676J4898Q3910K5786q5521j35979r6616
$$ 436008 187454 243100 393364 405231 339555 354453 438363 464149 378628 242649 146033
30594A46033r889O4439R4961R1869O2579r352r7145j07084K981J41036J86738
$$ 146033 136144 200583 295544 387413 449992 440640 343495 236411 239392 380428 567166
30583E67166J15723k2241j45372j37754L1052J58672J3831k62332k63161O9653
$$ 567166 682889 660648 515276 377522 408574 567246 581077 318745 55584 125237
30573A25237L02910J67374m7510l6669M461j85716l65366j72821K02996K98408
$$ 125237 428147 595521 548011 511342 515803 330087 -35279 -208100 -5104 293304
30563B93304J22889N3915J26725M0858j83157j81520P2787J61040q0262k82733
$$ 293304 416193 470108 596833 637691 454534 273014 345801 506841 426579 143846
30553A43846j57013Q2226J22426l80q8362j06235j08686q2063k2215J8132M9683
$$ 143846 -13167 69059 191485 191105 102743 -3492 -112178 -194241 -216456 -198324 -148641
30542a48641J28788J93362J32371J2650r791K4553l4077j12607m242K28952L03237
$$ -148641 -19853 173509 305880 318530 308739 333292 299215 186608 182366 411318 714555
30531G14555J69277N0438J2618r9855k55140j98232O6997J86025K714j96219j71963
$$ 714555 883832 934270 946888 847033 591893 393661 460658 646683 649397 453178 281215
30520B81215q9164j51644k24016r0855J63621K94702K30666P0589p8766j18303
$$ 281215 192051 40407 -183609 -274464 -110843 183859 414525 485114 406348 288045
30510B88045j05J23408J6092k53837l01831K6932L57945K68881j28743l58519
$$ 288045 287940 411348 427440 173603 -128228 -101296 256649 525530 396787 38268
30500C8268k17071K4687N3607o5973j7796K84933N00749K80022j87449l27946
$$ 38268 -178803 -154116 -100509 -166482 -184278 100655 601404 881426 693977 366031
30490C66031K7960L51936J59701k82728l86485j07643J12479J01274Q2320J17780
$$ 366031 393991 745927 905628 622900 236415 128772 241251 342525 424845 542625
30480E42625J4034j85452j83891O884M1030j17485j00838J60772K51215J6577
$$ 542625 556659 371207 187316 194200 235230 117745 16907 177679 428894 445471
30470D45471j11495J32119L57439J96068p3950o8311K1039j52560l83955k57273
$$ 445471 333976 466095 823534 1019602 945652 877341 898380 745820 361865 104592
30460A04592Q2099J35812j21287k33033k7672J64958R6571p0630j03717r56J26739
$$ 104592 186691 322503 201216 -31817 -59489 105469 202040 131410 27693 26737 153476
30449A53476J95001J31303m2917j37848l3126Q8208Q466j32153m7120J77456J72732
$$ 153476 348477 479780 436863 299015 265889 354097 362563 230410 183290 360746 533478
30438E33478j11353l01005j68938O1452J10651J9525l0203n198M2415J11945J65748
$$ 533478 422125 121120 -47818 13634 124285 143810 113607 108409 150824 262769 428517
30427D28517Q8277j12836k25742j01691J32580K55465K09090O6096j05936k14307
$$ 428517 516794 403958 178216 76525 209105 464570 673660 739756 633820 419513
30417D19513j37901P7851J68709j0504k24718j62714J01894K22293R3346m5870
$$ 419513 281612 359463 528172 517668 292950 130236 232130 454423 547769 501899
30407E01899k8596L7367N4024R7636J59554M2643k64344m08819j71519J19020
$$ 501899 473303 510670 564694 662330 821884 864527 600183 191364 19845 138865
30397A38865M8523k14593j79270J56571K91612L7509j98285j00472Q8560N1496
$$ 138865 187388 -27205 -206475 -49904 241708 279217 80932 -19540 69020 120516
30387A20516q5825m6662J21709K02271J72778J06899m2229k58066l01866m8988
$$ 120516 34691 -11971 109738 312009 484787 591686 549457 291391 -10475 -59463
30377e9463K36637K59048R2655m8704j61997k61160j61946J50734K78106o798
$$ -59463 177174 436222 528877 480173 318176 57016 -104930 45804 323910 317112
30367C17112k67989n5309K83204J22214l54269l89756J14361M52279K67640K1492
$$ 317112 49123 -6186 277018 399232 44963 -344793 -230432 221847 489487 510979
30357E10979Q6733J52167j05232m08341l83769j68154o7846k1115J69873L90670
$$ 510979 597712 749879 644647 236306 -147463 -315617 -383463 -404578 -234705 155965
30347A55965L99266K22670M0696j15917k72228l13637j40730J29882K98635K78902
$$ 155965 555231 777901 818597 702680 430452 116815 -23915 105967 404602 683504
30337F83504Q4457j75983k66389o2385J69488P4233k16458k43829L0357J64956
$$ 683504 767961 591978 325589 263204 432692 506925 290467 46638 76995 241951
30327B41951O284q7556M1620O0921j59824k22204N3879K08230n2661k56494K9911
$$ 241951 248235 160679 202299 263220 103396 -118808 -64929 143301 90640 -165854 -135943
30316a35943L78076K01065k05451j50972K65746L47507j0510k20348o5843R108
$$ -135943 242133 443198 237747 86775 352521 700028 689518 469170 403327 412435
30306D12435j94086k54673N3061K81715N4611k70050j59167K58908M16686J47005
$$ 412435 218349 -36324 16737 298452 353063 83013 -76154 182754 599440 746445
30296G46445j65131j98913p2191m8405j52906k10192j14148P0200K17828K49820
$$ 746445 581314 382401 310210 261805 108899 -101293 -215441 -145241 72587 322407
30286C22407J41849o7001k44475k50470j16500k7713m0385K1971K33575L27689
$$ 322407 464256 397255 152780 -97690 -214190 -241903 -282288 -260317 -26742 300947
30276C00947P7536k48380k06385J27014K39106k6689k56116j54405M1037M3494
$$ 300947 378483 130103 -76282 50732 289838 263149 7033 -147372 -106335 -62841
30266f2841m1945k7194P969l6479l3492R0811J60306Q9546P5154J97903K16416
$$ -62841 -104786 -131980 -124011 -160490 -193982 -103171 57135 146681 221835 419738 636154
30255F36154K5597r8262j0141N051k01757k78462r966J91061k7712k73900o2376
$$ 636154 661751 563489 553348 558399 356642 78180 68214 259275 231563 -42337 -104713
30244a04713K93206J98884j58582j14797L13521M45187N8372l27496l48556k20087
$$ -104713 188493 387377 228795 113998 427519 872706 931078 603582 255026 34939
30234C4939j46047O20K33956K98344J39265J0641j3023j19269k72433k03605K2315
$$ 34939 -111108 -110488 123468 421812 561077 571718 558695 439426 166993 -36612 -14297
30223a4297K5031j80791j28776K53932M06026L9075l39442k11645J81055L09471
$$ -14297 10734 -170057 -298833 -44901 361125 400200 60758 -150887 30168 339639
30213C39639J49263J8883j5814p8678q6235J02822L00953J88690j75562l92550
$$ 339639 488902 507785 491971 413293 327058 429880 730833 919523 743961 351411
30203C51411k42830Q1536K42546Q7656k32143l74688j40875K38226L13872j4458
$$ 351411 108581 190117 432663 520319 288176 -86512 -227387 10839 324711 310253
30193C10253l58355l53282p2066J89264K85999K35012Q7985l8419j0105J09062
$$ 310253 -48102 -401384 -473450 -284186 1813 236825 324810 286391 276286 385348
30183C85348J00598m5930q3290N4666R0426j19593k76846j00108J87791J82495
$$ 385348 485946 440016 356726 411392 501818 382225 105379 5271 193062 375557
30173C75557q9943k46419j16862R8148J87266J49196O3918j2658j5078Q1408J70181
$$ 375557 285614 39195 -77667 20481 207747 356943 420861 408203 393125 474533 644714
30162F44714J19158m0776j51414j29750m1316n095q5431k15244k00452O7802L69490
$$ 644714 763872 723096 571682 441932 400616 395521 310090 94846 -105606 -37804 331686
30151C31686L30004n7958l24200j29060K33571K25498j81531m75360l03948J08596
$$ 331686 661690 603732 279532 150472 384043 609541 428010 -47350 -351298 -242702
30141b42702L21139K05249j2105p5581O3144K52492K85135R0576j54458j80252
$$ -242702 78437 283686 271581 196000 259144 511636 796771 887347 732889 552637
30131E52637M1229K06464M9038k73140l53029r4246J53630J24658K3549J28013
$$ 552637 593866 800330 849368 576228 223199 128953 282583 407241 430790 558803
30121E58803K51120K7758l80510m08696K3122L17664J20963j35548j037K23624
$$ 558803 809923 837681 457171 48475 71597 389261 510224 374676 373639 597263
30111E97263N0253k86854k00312K21967L32828n920k40779p7152J20742N7747
$$ 597263 647516 360662 160350 382317 715145 709225 468446 391294 512036 569783
30101E69783m7153r293m6477k61513l19885l8173K03124O7531j59842p7154J38912
$$ 569783 522630 513337 466860 205347 -114538 -152711 50413 117944 -41898 -119052 19860
30090A9860P5521j71215j63915J22932K61836M8458k36602k72181n3033K30262
$$ 19860 95381 -75834 -239749 -116817 145019 193477 -43125 -315306 -368339 -138077
30080a38077L89258K98306o662k76116k76794o2476J24800J62114J12230O6329
$$ -138077 251181 549487 542825 266709 -10085 -72561 52239 214353 326583 392912
30070C92912O6958J08833J03022m8262k49172k54033k7769J51491J03503J7195
$$ 392912 459870 568703 671725 623463 374291 120258 92489 243980 347483 364678
30060C64678J00850K08850J02727j13812j48123J5195J18014L9352p2188n8598
$$ 364678 465528 674378 777105 663293 515170 530365 648379 687731 615543 556945
30050E56945O1185J51158P8666j58045l43190k33326Q1983K29017P4064q0987
$$ 556945 618130 769288 847954 689909 346719 113393 195376 424393 498457 417470
30040D17470M582J42810R3464k5276k5533l2542j90383k71561l2255K71662K12899
$$ 417470 422052 564862 658326 633050 607517 574975 384592 113031 80776 352438 565337
30029E65337j23362k75260j15265N7566O9872N1057Q1675Q5952O3554P3196M9792
$$ 565337 441975 166715 51450 109016 178888 229945 311620 397572 461126 534322 584114
30018E84114l8775k0259J32162N7268l91532o40636j92134L74439J13524p13525
$$ 584114 545339 525080 657242 714510 322978 -317658 -509792 -135353 -21829 -735354
30008g35354q54835L9050Q67234P73449K83005J61286J70515j95273n76828l62392
$$ -735354 -1590189 -1551139 -683905 89544 372549 533835 704350 509077 -67751 -430143
29998d30143J43515J96873j20447j26003K12599K69419p3264k28748M1417K64302
$$ -430143 -286628 -89755 -210202 -336205 -123606 145813 72549 -156199 -114782 149520
29988A49520J31788m5515q192K8026r1537j23833N4125J44017k9693j75082n9844
$$ 149520 281308 235793 227601 255627 164090 40257 94382 238399 208706 33624 -26220
29977b6220Q9509N3266K3616J73195K55024M8721j85474j38738J6897o845o1372
$$ -26220 63289 116555 140171 313366 568390 617111 431637 292899 309796 302951 241579
29966B41579J09158K85853J09073k26146k37284J6886L6228k26134k56905J25086
$$ 241579 350737 636590 745663 519517 282233 299119 335347 109213 -147692 -22606
29956b2606M24969K54005j09797k43153j71752j03976n981J64801J70803j21437
$$ -22606 402363 656368 546571 303418 131666 27690 21709 186510 357313 235876
29946B35876l55562j48838K65261L33780m992k83080k21963k4334P6168J14208
$$ 235876 -119686 -268524 -3263 330517 325525 42445 -179518 -203852 -127684 -13476
29936a3476J40260N9810j14664j66886o108J63897J63994Q8832P9262Q1358J2812
$$ -13476 126784 186594 71930 -94956 -101064 62833 226827 315659 394921 476279 489091
29925D89091m8944m0652o5817j58435j12509J73322L74352J28181l55848m83235
$$ 489091 440147 399495 333678 175243 62734 236056 610408 738589 382741 -100494
29915a00494q9855L23402K95527j1117j56686o6729r985r3886j37771l5874O3768
$$ -100494 -190349 133053 428580 417463 260777 194048 184063 90177 -47594 -83468 -19700
29904a9700K6589n7346n1766J6119O4282J22621K19864K26435K8918k03125j74512
$$ -19700 6889 -50457 -102223 -86104 -21822 100799 320663 547098 576016 372891 198379
29893A98379R9932K66406J18298j21811j45985J9150J30664J02276K1593q6728
$$ 198379 298311 564717 683015 561204 415219 434369 565033 667309 688902 602174
29883F02174k41211l08855j30577J50584J90898m8719j93445N283K92543K92950
$$ 602174 360963 52108 -78469 72115 263013 214294 20849 26132 318675 611625
29873F11625N2959q5840k5126J442j37248k50690j37951J03763K28624J66473
$$ 611625 664584 578744 553618 555060 417812 167122 29171 132934 361558 528031
29863E28031M5669l5597j03172j73177j64574k2089J45898J57779j4856k01107
$$ 528031 573700 538103 434931 261754 97180 75091 220989 378768 363912 162805
29853A62805k41437j60464p2119j79R9871J97683K03358J14219K0833l4421q1689
$$ 162805 -78632 -239096 -311215 -311394 -211523 -13840 189518 303737 324570 290149 208460
29842B08460j06015m6567O6616J20120R1500O5549M8609m6342j71710j23700J27939
$$ 208460 102445 55878 122494 242614 334114 399663 448272 401930 230220 106520 234459
29831B34459L01675J76285p9930j67761r0078o8107j34270j06742N4707J52284
$$ 234459 536134 712419 632489 464728 374650 306543 172273 65531 120238 272522
29821B72522N5853j22038k19861k10378j33820j9280O7237N1885j2482J3092J32109
$$ 272522 328375 206337 -13524 -223902 -357722 -377002 -309765 -257880 -270362 -257270 -125161
29810a25161J90274J27341P3000J06104J00149n7201k42194k59386j25226j5624
$$ -125161 65113 192454 265454 371558 471707 414506 172312 -87074 -212300 -227924
29800b27924P629M6591J57824K44842J93845K4539j30550j55554n5570M2859J9879
$$ -227924 -220295 -173704 -15880 228962 422807 447346 316796 161242 105672 148531 168410
29789A68410q4296r6982O0821K42006K44827O5579j14299j61275j07133m5587
$$ 168410 84114 -12868 47953 289959 534786 600365 486066 324791 217658 172071
29779A72071j9801l0450o0143n3562M6622J96815K54586J45128k7250j07347r0426
$$ 172071 152270 121820 61677 8115 54737 251552 506138 651266 624016 516669 426243
29768D26243r9118j64036j48295L7275K33519J88078r0631k80611j31052K02107
$$ 426243 327125 163089 14794 52069 285588 473666 383035 102424 -28628 173479
29758A73479L39816J55295r4552j36916j9170K7416n8847j19438m8529N2285M5447
$$ 173479 513295 668590 574038 437122 417952 445368 386521 267083 218554 270839 316286
29747C16286l6659n2904L8642J33056J28629M4518k8828l9681o310K4395J8398
$$ 316286 279627 226723 265365 398421 527050 571568 542740 503059 496749 521144 539542
29736E39542k2736n6881m2588n645k5225j12067j46670k2087J71941K22626Q0634
$$ 539542 516806 459925 417337 411692 386467 274400 127730 105643 277584 500210 580844
29725E80844n0270M740J29653Q6870j09599j86158p983K00380J49715j26316l36271
$$ 580844 530574 535314 664967 751837 642238 456080 448097 648477 798192 671876 335605
29714C35605l18356j86784r1484j0640J33001K76315K73326J06864p9843j68563
$$ 335605 17249 -169535 -261019 -271659 -138658 137657 410983 517847 438004 269441
29704B69441j79926j69646j10527L6397J89791K04086O5195p1579q1650k1184
$$ 269441 89515 -80131 -190658 -154261 35530 239616 304811 233232 151582 130398
29694A30398q397l5225o752P9561J28562J12639R9562R2535j836j78045k58733
$$ 130398 122001 86776 80024 159585 288147 400786 500348 592883 591047 413002 154269
29683A54269j36665L8375O6962p342N118J19692J64378O9208m2400p5170p6909
$$ 154269 17604 55979 122941 115599 120717 240409 404787 473995 431595 356425 279516
29672B79516q5894n5828o16k5360j22971j24432L4223J70891J18484l4562j08568
$$ 279516 193622 137794 137178 111818 -11153 -135585 -101362 69529 188013 153451 44883
29661D4883p6214J3921J78826L64909L44491J0458l50607l66987q7235J10808
$$ 44883 -31331 -17410 161416 526325 870816 881274 530667 163680 76445 187253
29651A87253O4242l0090p464M6026K4557k5818n0931p2744o5828K4412R4967k7523
$$ 187253 251495 221405 213941 259967 284524 258706 207775 135031 69203 93615 188582 161059
29639A61059k51959k58963K2208K56907J77562m9984j21775k7432L3915l746l8761
$$ 161059 -90900 -349863 -327655 -70748 106814 56830 -64945 -92377 -58462 -62208 -100969
29628a00969p344N1052P2643K4414m0501K4502K55173L95668J82493k03001l16602
$$ -100969 -108313 -57261 15382 39796 -705 23797 278970 674638 857131 654130 337528
29617C37528j18804k4099j75774j96290R1741K53500l1571l36400j34253L23671
$$ 337528 218724 194625 18851 -177439 -85698 167802 136231 -200169 -334422 -10751
29607a0751M16727J38171k7859q317j56642m26788l20215K19114N66312L17738
$$ -10751 405976 544147 516288 507971 351329 -75459 -395674 -176560 389752 707490
29597G07490j53597l24118j97448n4223L5837J15660R7465n8225j69906r5460
$$ 707490 553893 229775 32327 -21896 13941 129601 227066 168841 -1065 -96525
29587i6525N2935J34336J72109J68934K0567k11045k46839k4444J15186p8617
$$ -96525 -43590 90746 262855 431789 452356 241311 -5528 -29972 85214 6597
29577F597l52893l04862O0279L89660M45053K78815P0602l5576k9023n3468j95032
$$ 6597 -346296 -651158 -590879 -201219 243834 522649 593251 557675 528652 475184 280152
29566B80152k49505L6654M73529N42055J15817l12657l10268l8188J16450P9782
$$ 280152 30647 67301 540830 1082885 1198702 886045 575777 537589 654039 733821
29556G33821j2104j21971k12544j29890J16071K27093N2979j34803q4470M1849
$$ 733821 721717 599746 387202 257312 373383 600476 653455 518652 434182 476031
29546D76031K3465j7723O6519Q9289r2219j82294P6376L48461J88776j85794k26057
$$ 476031 499496 481773 548292 637581 545362 363068 439444 787905 976681 790887 564830
29535E64830M3672J15868j10893k25985q8088k6327j60448j71360N7777J64603
$$ 564830 608502 724370 613477 387492 299404 273077 112629 -58731 -954 163649
29525A63649o1493k83454j64394J12506K01991J30261J35060K32968K64472J92484
$$ 163649 102156 -181298 -345692 -233186 -31195 99066 234126 467094 731566 924050
29515I24050R1533k8286j75626k63974k10428p0223L1260L0464m4482q6800J6141
$$ 924050 1015583 987297 811671 547697 337269 267046 298306 328770 284288 197488 213629
29504B13629J97155J93143q1687k84829q7646K51404J94779k26939l94559k7079
$$ 213629 410784 603927 522240 237411 149765 401169 595948 369009 -25550 -52629
29494e2629L94200L57243J3365j70587p8894P6862J57297J37957j8160k36225
$$ -52629 341571 698814 712179 541592 462698 539560 696857 834814 816654 580429
29484E80429k85561j12976J1161p8187j48598K730J40884n613k15427j13205J67622
$$ 580429 294868 181892 193053 114866 -33732 -31002 109882 104269 -111158 -224363 -56741
29473e6741J85329n5724j08153J51488L09751J08770j39053p4925J55669J86662
$$ -56741 128588 72864 -35289 116199 425950 534720 395667 320742 476411 663073
29463F63073J309j06480J535J66326K03143R5721p0721k11671k65402k12816r2930
$$ 663073 664382 557902 559437 725763 928906 1024627 953906 742235 476833 264017 171087
29452A71087L6455J32705J56405R6120K4313L2384P5429K882j90612k86076j35757
$$ 171087 207542 340247 496652 592772 617085 649469 724898 727780 537168 251092 115335
29441A15335Q5408J00521p5269j69289n2691J18577J88740J85714J30952p7665
$$ 115335 200743 301264 225995 56706 4015 122592 311332 497046 627998 550333
29431E50333m03492n13104j71190L31339M74931K01315m1579J5593J12395m0087
$$ 550333 146841 -366263 -537453 -206114 268817 470132 428553 444146 556541 516454
29421E16454k55363j74403J49179L18767J62339q5978j64966q4312n146k1208
$$ 516454 261091 86688 235867 554634 716973 630995 466029 381717 376571 355363
29411C55363j07781j57429o0119J43614K39073J03185q4142p7763O0845O4988
$$ 355363 247582 90153 30034 173648 412721 515906 431764 354001 414846 479834
29401D79834j06073k07499r8955O8984J23278Q6721L9452k4093r0917o5994O3240
$$ 479834 373761 166262 67307 136291 259569 346290 385742 361649 270732 204738 267978
29390B67978J37116J2109k48324m31860l57569j7811L45114L74500Q871l15477
$$ 267978 405094 417203 168879 -262981 -620550 -638361 -293247 81253 90124 -225353
29380b25353j51344L09076M33024L6238l45011k34296J40325K67078Q3760p1330
$$ -225353 -376697 -67621 365403 401641 56630 -177666 -37341 229737 313497 242167
29370B42167k0885J09828J89963J95629J01072o9421j54313o1628L1773o7887
$$ 242167 221282 331110 521073 716702 817774 748353 594040 532412 564185 496298
29360D96298k33475k05450r291J22241J50931K13107K61190J13234j39915j82218
$$ 496298 262823 57373 48082 170323 321254 534361 795551 908785 768870 586652
29350E86652P359Q5334q4654k00632o0050P5674m6299j89443j8374K92622L08088
$$ 586652 594011 679345 594691 394059 334009 409683 363384 173941 155567 448189 756277
29339G56277M2011p6904P7021J47229o5031k56790j50879L1614m1597k47984k23950
$$ 756277 798288 721384 798405 945634 880603 623813 472934 504548 462951 214967 -8983
29328h983L4645J99695J60524J30072J88573J32231j09216k75712j88346m1913
$$ -8983 25662 225357 385881 515953 704526 836757 727541 451829 263483 221570
29318B21570n1698q9858L4698J74942Q3949j12201q7260J13816J08066j89033
$$ 221570 169872 80014 114712 289654 373603 261402 174142 287958 396024 206991
29308B06991l81518j87767J46490K44921J20346L8590P6476R7988M2793k7168
$$ 206991 -174527 -362294 -215804 29117 149463 188053 264529 362517 405310 378142
29298C78142r8078j85523j90498j184K69232L55792J80723n6286j62784j61052
$$ 378142 280064 94541 -95957 -97141 172091 527883 708606 652320 489536 328484
29288C28484j49926j17788o098J40260K10106J75563J11279P9813O9844M2304
$$ 328484 178558 60770 54672 194932 405038 580601 691880 771693 841537 883841
29278H83841k1615j17062k06172k14025j00265M7606O4797r5166k68282k53016
$$ 883841 862226 745164 538992 324967 224702 272308 337105 241939 -26343 -279359
$$ [...]
##END NTUPLES=NMR SPECTRUM
##END=
