##TITLE=31Pdec_54-2021
 CDCl3, 24 sc
 7.07.2021
##JCAMPDX= 6.0         $$ Bruker NMR JCAMP-DX V2.0
##DATA TYPE= NMR SPECTRUM
##DATA CLASS= NTUPLES
##ORIGIN= UXNMR, Bruker Analytische Messtechnik GmbH
##OWNER= root
$$ XWIN-NMR		Version 3.5
$$ Wed Jul  7 10:46:39 2021 Russian Standard Time (UT+4h)  she@DPX200
##.OBSERVE FREQUENCY= 81.013821
##.OBSERVE NUCLEUS= ^31P
##.ACQUISITION MODE= SIMULTANEOUS
##.ACQUISITION SCHEME= undefined
##.AVERAGES= 24
##.DIGITISER RES= 16
##SPECTROMETER/DATA SYSTEM= spect
##.PULSE SEQUENCE= zgpg30
##.SOLVENT NAME= CDCl3
##.SHIFT REFERENCE= (INTERNAL, CDCl3, 0, 248.564)
##AUDIT TRAIL= $$ (NUMBER, WHEN, WHO, WHERE, WHAT)
$$ ##TITLE= Audit trail, XWIN-NMR		Version 3.5
$$ ##JCAMPDX= 5.01
$$ ##ORIGIN= Bruker BioSpin GmbH
$$ ##OWNER= she
$$ F:/spectra/data/she/nmr/P31/1/pdata/1/auditp.txt
$$ ##AUDIT TRAIL=  $$ (NUMBER, WHEN, WHO, WHERE, WHAT)
(   1,<2021-07-07 10:44:04.35 +0400>,<she>,<DPX200>,
      <created by zg, POWCHK disabled, PULCHK disabled
       configuration hash MD5:
       00 E9 B6 7A A2 85 ED C7 34 08 36 98 17 FE 4E 26
       data hash MD5: 32K
       18 7C 7C 65 09 6F F8 E9 D0 DF 51 10 F4 53 44 01>)
(   2,<2021-07-07 10:45:28.21 +0400>,<she>,<DPX200>,
      <Start of raw data processing
       efp BC_mod = 2 LB = 1 FT_mod = 6 PKNL = 1 PHC0 = -7251.997 PHC1 = -258.1141 SI = 64K 
       data hash MD5: 64K
       EF C4 64 F0 5A B0 F8 E3 DE 27 7A F9 CF 7D 97 90>)
(   3,<2021-07-07 10:45:55.68 +0400>,<she>,<DPX200>,
      <pk PHC0 = 46.25134 PHC1 = -28 
       data hash MD5: 64K
       99 92 59 6E 40 58 58 37 63 D2 25 30 04 B8 6B 64>)
(   4,<2021-07-07 10:45:59.39 +0400>,<she>,<DPX200>,
      <abs ABSG = 5 
       data hash MD5: 64K
       C8 D5 4B 90 CB 5B 2E 51 4B C8 6A DE 87 72 61 B7>)
$$ ##END=
$$ 
$$ hash MD5
$$ 2F BE 8A AF 37 90 2B 4B 1F D6 9A 5A A5 14 45 0A
##$RELAX= 
##$RELAX= 
##$RELAX= 
##$RELAX= 
##$RELAX= 
##$RELAX= 
##$RELAX= 
##$RELAX= 
$$ Bruker specific parameters
$$ --------------------------
##$DU= <F:/spectra>
##$EXPNO= 1
##$NAME= <P31>
##$PROCNO= 1
##$TYPE= <nmr>
##$USER= <she>
##$AMP= (0..31)
100 100 100 100 100 100 100 100 100 100 100 100 100 100 100 100 100 100 
100 100 100 100 100 100 100 100 100 100 100 100 100 100 
##$AQSEQ= 0
##$AQ_mod= 1
##$AUNM= <au_zg>
##$AUTOPOS= <>
##$BF1= 81.014009
##$BF2= 200.13
##$BF3= 200.13
##$BF4= 200.13
##$BF5= 200.13
##$BF6= 200.13
##$BF7= 200.13
##$BF8= 200.13
##$BYTORDA= 1
##$CFDGTYP= 0
##$CFRGTYP= 5
##$CHEMSTR= <none>
##$CNST= (0..31)
1 1 145 1 1 1 1 1 1 1 1 1 1 1 1 1 1 1 1 1 1 1 1 1 1 1 1 1 1 1 1 1 
##$CPDPRG= <waltz16>
##$CPDPRG1= <>
##$CPDPRG2= <waltz16>
##$CPDPRG3= <>
##$CPDPRG4= <mlev>
##$CPDPRG5= <mlev>
##$CPDPRG6= <mlev>
##$CPDPRG7= <mlev>
##$CPDPRG8= <mlev>
##$CPDPRGB= <>
##$CPDPRGT= <>
##$D= (0..31)
0 1 0 0 0 0 0 0 0 0 0 0.03 2e-05 3e-06 0 0 0 0 0 0 0 0 0 0 0 0 0 0 0 0 
0 0 
##$DATE= 1625640243
##$DBL= (0..7)
120 120 120 11 120 120 24 19 
##$DBP= (0..7)
150 150 150 150 150 150 150 150 
##$DBP07= 0
##$DBPNAM0= <>
##$DBPNAM1= <>
##$DBPNAM2= <>
$$ [...]
##$SUBNAM3= <"">
##$SUBNAM4= <"">
##$SUBNAM5= <"">
##$SUBNAM6= <"">
##$SUBNAM7= <"">
##$SUBNAM8= <"">
##$SUBNAM9= <"">
##$SW= 501.771253377433
##$SWIBOX= (0..15)
0 1 3 0 0 0 0 0 0 0 0 0 0 0 0 0 
##$SW_h= 40650.406504065
##$TD= 32768
##$TD0= 1
##$TE= 0
##$TE2= 300
##$TE3= 300
##$TEG= 300
##$TL= (0..7)
0 120 53 12 22 120 120 120 
##$TP= (0..7)
150 150 150 150 150 150 150 150 
##$TP07= 0
##$TPNAME0= <>
##$TPNAME1= <>
##$TPNAME2= <>
##$TPNAME3= <>
##$TPNAME4= <>
##$TPNAME5= <>
##$TPNAME6= <>
##$TPNAME7= <>
##$TPOAL= (0..7)
0.5 0.5 0.5 0.5 0.5 0.5 0.5 0.5 
##$TPOFFS= (0..7)
0 0 0 0 0 0 0 0 
##$TUNHIN= 0
##$TUNHOUT= 0
##$TUNXOUT= 0
##$USERA1= <user>
##$USERA2= <user>
##$USERA3= <user>
##$USERA4= <user>
##$USERA5= <user>
##$V9= 5
##$VALIST= <valist>
##$VCLIST= <CCCCCCCCCCCCCCC>
##$VD= 0
##$VDLIST= <DDDDDDDDDDDDDDD>
##$VPLIST= <PPPPPPPPPPPPPPP>
##$VTLIST= <TTTTTTTTTTTTTTT>
##$WBST= 1024
##$WBSW= 4
##$XGAIN= (0..3)
0 0 0 0 
##$XL= 0
##$YL= 0
##$YMAX_a= 7151
##$YMIN_a= -6897
##$ZGOPTNS= <>
##$ZL1= 120
##$ZL2= 120
##$ZL3= 120
##$ZL4= 120
##$ABSF1= 248.5645
##$ABSF2= -253.2056
##$ABSG= 5
##$ABSL= 3
##$ALPHA= 0
##$AQORDER= 0
##$ASSFAC= 0
##$ASSFACI= 0
##$ASSFACX= 0
##$ASSWID= 0
##$AUNMP= <proc_1d>
##$AZFE= 0.1
##$AZFW= 0.5
##$BCFW= 0
##$BC_mod= 2
##$BYTORDP= 0
##$COROFFS= 0
##$CY= -3
##$DATMOD= 1
##$DC= 0
##$DFILT= <>
##$DTYPP= 0
##$F1P= 0
##$F2P= 0
##$FCOR= 1
##$FTSIZE= 65536
##$FT_mod= 6
##$GAMMA= 0
##$GB= 0
##$INTBC= 1
##$INTSCL= 5.30512e-09
##$ISEN= 30
##$LB= 1
##$LEV0= 0
##$LPBIN= 0
##$MAXI= 10000
##$MC2= 0
##$MEAN= 0
##$ME_mod= 0
##$MI= 50
##$NCOEF= 0
##$NC_proc= -4
##$NLEV= 6
##$NOISF1= 182.463
##$NOISF2= 159.3651
##$NSP= 0
##$NTH_PI= 0
##$NZP= 0
##$OFFSET= 248.5645
##$PC= 4
##$PHC0= -7205.746
##$PHC1= -286.1141
##$PH_mod= 1
##$PKNL= yes
##$PPARMOD= 0
##$PSCAL= 0
##$PSIGN= 0
##$REVERSE= no
##$SF= 81.014009
##$SI= 65536
##$SIGF1= 159.3651
##$SIGF2= -187.1042
##$SINO= 113.3802
##$SIOLD= 16384
##$SREGLST= <1H.CDCl3>
##$SSB= 0
##$STSI= 65536
##$STSR= 0
##$SW_p= 40650.406504065
##$SYMM= 0
##$S_DEV= 0
##$TDeff= 32768
##$TDoff= 0
##$TI= <>
##$TILT= no
##$TM1= 0
##$TM2= 0
##$TOPLEV= 0
##$USERP1= <user>
##$USERP2= <user>
##$USERP3= <user>
##$USERP4= <user>
##$USERP5= <user>
##$WDW= 1
##$XDIM= 65536
##$YMAX_p= 443471230
##$YMIN_p= -1921839
$$ End of Bruker specific parameters
$$ ---------------------------------
##NTUPLES= NMR SPECTRUM
##VAR_NAME=  FREQUENCY,     SPECTRUM/REAL,   SPECTRUM/IMAG
##SYMBOL=    X,             R,               I
##VAR_TYPE=  INDEPENDENT,   DEPENDENT,       DEPENDENT
##VAR_FORM=  AFFN,          ASDF,            ASDF
##VAR_DIM=   65536,         65536,           65536
##UNITS=     HZ,            ARBITRARY UNITS, ARBITRARY UNITS
##FACTOR=    0.620285442955139, 1,           1
##FIRST=     20137.2065510759, 0,            0
##LAST=      -20513.1999529892, 0,           0
##MIN=       -20513.1999529892, -1921839,    0
##MAX=       20137.2065510759, 443471230,    0
$$ Real data points
##PAGE= N=1
##DATA TABLE= (X++(R..R)), XYDATA
$$ [...]
##PAGE= N=2
##DATA TABLE= (X++(I..I)), XYDATA
39002A38567K44421K30685J04116o9674j54280j04935l4366j668P4930J79993
38992F07789J30533r1009k06129n8015J06327L0774j22823n4682J64019K11060
38982G17844K7433j25564q5336K7654O1320L7644N0183R9318R1449m2345k37506
38971F22094l22307k12048l8619K6455J9097P5435J41937N0516j37667j65447
38961E9446J0509J48222J15631M8866M9903M9278M4274J31603K23435J03145j48104
38950H36208j93980j5597K6969j54681k01090N367O6183j85698k71170J26725
38940C9236M96986K46760l32157n11156k08462O6886J21320K10951L71206K98460
38930H00030n9242l50994l42095j57110K4875J41783J29015j8219j04827J7863
$$ y = [138567, 382988, 613673, 717789, 648115, 493835, 388900, 354534, 352866, 427796, 607789, 738322, 647313, 441184, 383169, 489496, 520270, 397447, 342765, 506784, 717844, 745277, 619713, 534377, 562031, 623351, 660995, 711178, 810496, 901945, 859600, 622094, 299787, 87739, 49120, 75575, 94672, 170107, 312044, 362560, 224893, 59446, 69955, 218177, 333808, 382674, 432577, 481855, 526129, 657732, 881167, 984312, 836208, 642228, 626631, 653600, 498919, 297829, 303196, 369379, 183681, -87489, 39236, 536222, 782982, 450825, -60331, -268793, -201907, -80587, 130364, 501570, 800030, 740788, 389794, 47699, -109411, -84536, 57247, 186262, 168043, 63216, 81079]
38920H1079J63678R9778l1370M1399K17777J99600J0017j06719j48298k47723
38910B79218k71423m3484J82220M2562k63346k26366J35837L28552K14062J24372
38900E02204J46281P609k51373k24077Q6710J55524j72420l67990r9690K30622
38890A3400K03667K7106L5058Q5565o1806k17510j06695J13597J44670N0697M3678
38879C31427M6854r7527k30209j18060R0431O4883j74821k86386q8816K59726
38869b02498M88281M13076L8407l60978m19136j09644J90012K10197J09471J04460
38859D61648R2828p5747k32206j38947Q6603J42544N420q8097k8325P1211R6980
38848C93912L7226o9298j24819k2884J57355J68269n2079k42499j99937o9240
$$ y = [81079, 244757, 344535, 313165, 354564, 572341, 771941, 781958, 675239, 526941, 279218, 7795, -35689, 146531, 189093, -74253, -300619, -164782, 163770, 377832, 502204, 648485, 656094, 404721, 180644, 267354, 422878, 250458, -117532, -217222, 13400, 217067, 244173, 279231, 364796, 302990, 85480, -21215, 92382, 237052, 287749, 331427, 378281, 280754, 50545, -67515, 22916, 87799, -87022, -373408, -462224, -202498, 285783, 698859, 737266, 376288, -42848, -152492, 37520, 247717, 357188, 461648, 554476, 478729, 246523, 107576, 194179, 336723, 342143, 254046, 225721, 296932, 393912, 431138, 361840, 237021, 214137, 371492, 539761, 487682, 245183, 45246, -23994]
38838b3994m9691n3535Q8204K92468L71266L29458K52439Q6562j88946l62593
38828G41638k72754j16350j50230k49591j26691J47089K42213J19448O0761J56144
38818E51677J64057m6647k72413l07756k08064r8012K1886J40134J35057k4165
38808E5754j47261n7327J58698K69892J83321p423j71665k20242j03005J29268
38798I0010K78699J62289j33685k81069r1888K06983K29886o1431k95322j86756
38788h2284J00813K22347J03162p1370j73587j93796q4317J68899L62320K62021
38778F14208k0798j34404O731J23248L3235j08692j37854j23312j29523l7957
38768H4882J86519L15119J82348j7828j4994J24066J22698p5450k50070k28884
$$ y = [-23994, -73685, -127220, -39016, 253452, 624718, 954176, 1206615, 1293177, 1104231, 741638, 468884, 352534, 202304, -47287, -173978, -26889, 215324, 334772, 395533, 551677, 715734, 669087, 396674, 88918, -119146, -217158, -195272, -55138, 79919, 55754, -91507, -148834, 9864, 279756, 463077, 455654, 283989, 63747, -39258, 90010, 368709, 530998, 397313, 116244, 24356, 231339, 461225, 399794, 104472, -82284, 18529, 240876, 344038, 272668, 99081, -94715, -179032, -10133, 352187, 614208, 593410, 459006, 465737, 588985, 622220, 513528, 375674, 252362, 122839, 84882, 271401, 586520, 768868, 751040, 736046, 860112, 982810, 907360, 657290, 428406]
38758D28406o9181P2478J11344P3982M4204O4554Q2757M1172j9567m5384q9206
38747F95559j87861k04663k9873J37294K0370k50883k60725N2476K78513J63914
38737D14121n2866j07552j01476j76810j78430L5581K47133J91202r075n3844
38727B07984O5340J25928O5383J6843M5092Q6913Q2295K6j58224k60899j31277
38716A45404J46874K37334J9027k08517j67448K5366J34349J53206J24321p0398
38706E39518m10939n24960j63680L35446M65871K45536P9979R3715N8178r0838
38696F27826j31351J4336J19275J6491j68485k44477j96605j20694o5579J690
38686a47573J38522L15354L51412J05400k32634k80207j333J84444J7163k01775
$$ y = [428406, 359225, 431703, 543047, 617029, 661233, 725787, 808544, 849716, 830149, 784765, 695559, 507698, 303035, 273162, 410456, 430826, 179943, -80782, -28306, 250207, 414121, 361255, 253703, 152227, -24583, -203013, -167432, 79701, 270903, 261828, 207984, 273324, 399252, 464635, 481478, 526570, 613483, 695778, 695804, 537580, 276681, 145404, 292278, 529612, 548639, 340122, 172674, 198040, 332389, 485595, 609916, 539518, 128579, -396381, -560061, -224615, 241256, 486792, 566771, 660486, 718664, 627826, 496475, 510811, 630086, 646577, 478092, 233615, 37010, -83684, -149263, -147573, -9051, 306303, 657715, 763115, 530481, 250274, 248941, 433385, 450548, 248773]
38676B48773j08704J29650J15239j14920j70835N1049K42069J80836m173j01834
38666D67150o3910N1909J69716K06112J38053L5835n2690j40756j69407n0767
38656E91245P5167o1673l64233l58722P7657M11654K31528j06801q4831J32707
38646E43698N5054k44483k75403J5573K19362K02579K07723K53516R8563j71208
38636I04974j72131P9258J33540j05568k03254J3321J24858j35059l96902k80011
38626c6974J2224J26321J38583K52086K95791L5427k83357k35501P8957J46139
38616E29696j63587l86201j68457K09447K53556m5508k37708o7566J97668J91903
38606C13243l1798j35641k2512P9961M9436M0175J25163J14492o7512j48783N9200
$$ y = [248773, 140069, 269719, 384958, 270038, 99203, 150252, 392321, 573157, 568984, 467150, 403240, 455149, 624865, 830977, 969030, 1004865, 952175, 811419, 642012, 591245, 666412, 604739, 240506, -118216, -40559, 371095, 602623, 495822, 410991, 543698, 598752, 354269, 78866, 94439, 313801, 516380, 724103, 977619, 1076182, 904974, 732843, 812101, 945641, 840073, 636819, 650140, 774998, 639939, 243037, -36974, -24750, 101571, 240154, 492240, 788031, 823458, 540101, 304600, 383557, 529696, 366109, -20092, -188549, 20898, 274454, 228946, -8762, -76328, 121340, 313243, 281445, 145804, 123292, 203253, 252689, 292864, 418027, 532519, 465007, 316224, 375424]
38595C75424K77334J60637j36243j93165K5400J65915N2494j32031j99642j42404
38585B53719J3517K16719K78846O2611k42918l19256j44884M4195J25968J25493
38575D14010Q52k46042l51781q1368L34253M49931K39396P1661J08745J58333
38565A097990J00742K3130p0900k51992l62150j64811J83434K59773R590j89399
38555F35407j33052o643M6060R6010J09758o1521k93701k69184k2816Q5363P815
38544A93496O3167K55651J74363k24131l80852q605L90534K90905q3181k01242
38534D70105j7452J50037J85454J63283M2714k01604l61555k73860j09269o8780
38524b0927l4269J49719K99129J67551j03493j87747p8766l8635j47184k20112
$$ y = [375424, 652758, 813395, 677152, 483987, 509387, 675302, 727796, 595765, 396123, 253719, 267236, 483955, 762801, 825412, 582494, 263238, 118354, 162549, 288517, 414010, 414862, 168820, -182961, -264329, 69924, 519855, 759251, 830912, 939657, 1097990, 1198732, 1221862, 1150962, 898970, 536820, 372009, 555443, 815216, 824806, 635407, 502355, 495712, 541772, 637782, 747540, 686019, 392318, 123134, 100318, 185681, 193496, 256663, 512314, 686677, 462546, 81694, 73089, 463623, 754528, 671347, 470105, 452653, 602690, 788144, 951427, 994141, 792537, 430982, 157122, 47853, -20927, -55196, 94523, 393652, 561203, 457710, 269963, 191197, 152562, 5378, -214734]
38514b14734j19073J00561K97691L36223J68034m9837p4349P9455J26800l6835
38504F13936j50352k6099J24220N0111j17506j00590P2540J39549o097k31841
38494C67871l51413k29552J27769M42248L51635r4408l79320j72120K22538L13137
38484E98385O7871j78002k42524j97526r7522O8947K21246K31312J00989n3483
38474E19693j34632j03021k542J5106j26228k18079k3749K55151J78695j87565
38464A72829k42570K14885N63892K63455l03381m02421k855L15602K71428J07602
38454I58466K3828n6501j48593j09558M8140J03290m2454k38081l09732k08338
38444B0467K4329K36659K08592o5460k51118p7621K54698L38334J13197j31279
$$ y = [-214734, -333807, -233246, 64445, 400668, 568702, 518865, 444516, 523971, 650771, 613936, 463584, 437485, 561705, 611816, 494310, 393720, 466260, 605809, 599712, 367871, 16458, -213094, -85325, 356923, 708558, 614150, 234830, 62710, 285248, 598385, 666256, 488254, 245730, 48204, -49318, 19629, 240875, 472187, 573176, 519693, 385061, 282040, 279498, 294604, 168376, -49703, -73452, 181699, 360394, 172829, -69741, 145144, 709036, 972491, 669110, 266689, 263834, 579436, 850864, 958466, 982294, 925793, 777200, 667642, 715782, 819072, 776618, 538537, 228805, 20467, 44796, 281455, 490047, 424587, 173469, 95848, 350546, 688880, 802077, 670798]
38434F70798k09029j85492j32742l8201M8773K7055q5663j62279j25959J0365
38424a82374J74628K17549L5230j86125r8699K74613M41509J13943l38696m24302
38414B7276j99308j8234Q2346K64489L91131K04759j18668j49238R9768J80930
38404G65251n9765k65110j57356J02957K62818K88305K12079K2055j79189k12797
38394G79248j13018r0447j60994j34214j1884k6609j96907k31659k3182J39098
38384g0568M6950p8262L2661K53650K90485J40690L3907M9060O4244J5940k9224
38373G49533l9710o9287j33904j69504j28522l6042N3157R6089O8346j9526j10561
38362B60069j39801r5124k5684K5850Q8017K03072K85774J53397j83916l80766
$$ y = [670798, 461769, 276277, 143535, 105334, 154107, 181162, 95499, -66780, -192739, -182374, -7746, 209803, 245033, 58908, -39791, 234822, 676331, 790274, 451578, 27276, -172032, -190266, -107920, 156569, 547700, 752459, 633791, 484553, 584321, 765251, 705486, 440376, 283020, 385977, 648795, 937100, 1149179, 1171234, 992045, 779248, 666230, 575783, 414789, 280575, 268691, 242082, 45175, -186484, -209666, -70568, -23618, -101880, -69219, 184431, 474916, 615606, 649513, 698573, 762817, 778757, 749533, 709823, 640536, 506632, 337128, 208606, 172564, 225721, 321810, 390156, 370630, 260069, 120268, 25144, -540, 25310, 113327, 316399, 602173, 755570, 571654, 190888]
38352A90888j46331K69769L06415j33477m95846l37016Q3626K54556J35961M8112
38342A76657Q0295P3808N9708K18700M23105L00658j59967m96357m13078j59235
38332A04294p4012r5977R642J95294K22865P8652m146Q6784J88831J17986q3030
38321G47183k15776j56666L8482K06229K03285O670k41858l09975r5319K02319
38311C84574K52410J2064j77608o3390J21156R89l16573l52696K968K94031J79071
38300C36996r2147j22409O0333J73039J40629P0099j2849r2693l8528J46547J72204
38289G41221j10251l56339j97927J45481J86277n2255r9876J64151L18325Q8365
38279H27172k43149k88288n4070J86343K46371J04370j39461k73555j47829R3381
$$ y = [190888, 44557, 314326, 620741, 487264, -8582, -345598, -261972, -7416, 128545, 176657, 256952, 330760, 390468, 609168, 1032273, 1332931, 1172964, 676607, 263529, 104294, 30282, -65695, -56053, 139241, 362106, 440758, 436612, 523396, 712227, 830213, 747183, 531407, 374741, 413223, 619452, 822737, 829407, 587549, 277574, 182255, 384574, 636984, 649048, 471440, 408050, 529206, 530195, 213622, -139074, -136106, 157925, 336996, 244849, 122440, 182773, 355812, 496441, 566540, 553691, 460998, 422470, 569017, 741221, 630970, 274631, 76704, 222185, 408462, 356207, 256331, 420482, 738807, 827172, 584023, 295735, 241665, 428008, 674379, 778749, 639288, 365733, 217904, 311285]
38269C11285J56107R215q2727K6868J79851J99616J08236j6081j51604k23239
38259E17527j22130P5078J34913J037j24159j07204m9446l7692P867J12053J31108
38248E38952K0731k6967R4286J73772Q445k31071k32591j6438J08985J3143j11121
38237C40126q4484K1483O2552M6337N8334Q8051O1595j4402n9204m2279m142K7765
38225E01732M3590j2102j76067l23719k49047M4415K88094K86975J56611R2259
38215F52741Q3680M7158M6311J18962P0402k19386m42926k45494J49876K00029
38205D61353j09068k38760J1858K06191N0116j43235p6783K1217q6412j49835
38195e3358O7695K65825J23135p8044O0979K98044J39715k73763l68240o7586
$$ y = [311285, 467392, 476607, 393880, 420748, 600599, 800215, 908451, 892370, 740766, 517527, 395397, 470475, 605388, 606425, 482266, 375062, 325616, 287924, 295791, 407844, 538952, 559683, 532716, 627002, 800774, 809219, 578148, 345557, 329119, 438104, 451247, 340126, 255642, 277125, 339677, 386014, 444348, 532399, 593994, 579592, 520388, 478109, 473967, 501732, 545322, 533220, 357153, 33434, -215613, -171198, 116896, 403871, 560482, 652741, 736421, 783579, 829890, 948852, 1019254, 799868, 356942, 111448, 261324, 461353, 352285, 113525, 125383, 331574, 381690, 238455, 161672, 182889, 96477, -53358, 14337, 280162, 403297, 325253, 386232, 684276, 823991, 550228, 181988, 114402]
38185A14402J61911J34388J37361K73211K45949o1196l32031l14826j47039l4611
38175A77519K5226P1957N1752k8662o8158m0062J3649J09788K19154J63640r5466
38164F00337k42610m1216K14180J20376j49476j15545J91233K83770M4373j24616
38154G80806j8399R5312K2231q0103r2860j10508j22335j95J25369j2349k57618
38143C29351j62422K32736L62669M1906k25412p7740J74590J57591j23o0042j09743
38132F63361k27943j89574R9560K98289J47371r9699j27837m7738o2171m9181
38122D04438J12585J85135j9981k18719r8151J31671J07143n2288P547K13546
38112G72926J94296n7194j76334m7191M5003p6476k15003j46827N4314J54249
$$ y = [114402, 276313, 410701, 548062, 821273, 1067222, 1006026, 673995, 359169, 212130, 177519, 202745, 274702, 326454, 297792, 229634, 189572, 203221, 313009, 532163, 695803, 600337, 357727, 316511, 530691, 651067, 501591, 386046, 577279, 861049, 905422, 780806, 762407, 857719, 879950, 799847, 706987, 596479, 474144, 473949, 599318, 586969, 329351, 166929, 399665, 762334, 804240, 578828, 501088, 675678, 833269, 833146, 773104, 663361, 435418, 245844, 345404, 643693, 791064, 691365, 563528, 515790, 453619, 404438, 517023, 702158, 682177, 463458, 365307, 496978, 604121, 551833, 559380, 772926, 967222, 910028, 733694, 686503, 731506, 655030, 440027, 293200, 347514, 501763]
38102E01763N4257j22494j66654q568J69687J37592o0470j52262l2176J12572
38092D33247J19047L8628n1921j43213j29290J11868L80800K90647j18792l33017
38082E98004j32215O0299j06670l26665j78464J62892K54421J02014K4371M4142
38072E02129m4196j61998m5589K13898K38467k4151k05570q8962J12582J45784
38062F42394O8047P4161J80858K16471M9705k20390l16153j02818J71862J57839
38052I21976q5618j64273J9548J14632n3682j70263j7293R4250j17097l33491
38042B08689j31564K80794L71163R1302j63713k16286j83177n4686K31912M10918
38032H45352J66978k59942l29632l9397R5041p7044j22154J68399L77492J52180
$$ y = [501763, 556020, 433526, 266872, 258304, 427991, 565583, 505113, 352851, 320675, 433247, 552294, 590922, 539001, 395788, 266498, 378366, 759166, 1049813, 931021, 598004, 465789, 526088, 419418, 92753, -85711, 77181, 331602, 433616, 457987, 502129, 457933, 295935, 250346, 464244, 702711, 678560, 472990, 384028, 496610, 642394, 710441, 784602, 965460, 1181931, 1231636, 1011246, 695093, 592275, 764137, 921976, 836358, 672085, 691633, 806265, 752583, 582320, 565027, 659277, 542180, 208689, 77125, 357919, 729082, 820384, 656671, 440385, 257208, 202522, 434434, 845352, 1012330, 752388, 422756, 383359, 478400, 401356, 279202, 447601, 825093, 977273]
38022I77273k24492l03497j20155j2577o7396q6449N7228K85138M27039L26589
38012A258701k5494l74982m12912j81873l7944j10747r4487K34138N67540M38955
38002A260895j02608n00362l63028J04122M02415L18801Q3674m475L2882m6646
37992A185670k81359l90693j69469J93374L58348K56085O9140q4138k11327k70218
37982F55413j85239k2410O1901L2894l3737j14893k01267j80006J3508K04514
37972B30678J90612O4070M3976Q1045k2242j64539m6794K58683L04642l2686l01388
37961F06057j57184J05489M5976k14508k04988J40067L79665K16652j24570k74810
37951E17846j89649o4240K8906J67399L00552K19746q4238k60000l8121K92943
$$ y = [977273, 752781, 449284, 329129, 316552, 249156, 162707, 219935, 505073, 932112, 1258701, 1233207, 858225, 445313, 263440, 225496, 114749, 20262, 254400, 821940, 1260895, 1158287, 657925, 294897, 399019, 801434, 1120235, 1203909, 1199434, 1232316, 1185670, 904311, 513618, 344149, 537523, 895871, 1151956, 1221096, 1136958, 925631, 655413, 470174, 447764, 509665, 542559, 508822, 393929, 192662, 12656, 26164, 230678, 421290, 485360, 529336, 610381, 588139, 423600, 376806, 635489, 940131, 907445, 606057, 448873, 554362, 600338, 385830, 180842, 320909, 700574, 917226, 792656, 517846, 328197, 263957, 292863, 460262, 760814, 980560, 896322, 636322, 598201, 891144]
37941H91144K00552l02371n90361l00978J42269J92702j6197J96K22541J96952
37931F36449j41448l32693j38459J38224K19871K20623K49667J46555j23002k57950
37921F17837j09840L6647j3414O49K51601L63984J3124m02013l14751O2355O7796
37910E73975k80461k90385K18254N44159K01578l16721l21374P1257K54500P2314
37900G27096j21320j22695n5272J2301J32978J93153Q233k63628k21816J72777
37890D61807M66355L19053p5829l30155l29357j87227M947J66541J63755j9092
37880F40798j77003j35462J0984O0997j6741j09817j36568o1992J19945K92124
37870D87265K64353N0517r0305k8293N3330J8524L0121J85571K19284n8361l12059
$$ y = [891144, 1091696, 789325, 198964, -102014, 40255, 232957, 216760, 216956, 439497, 636449, 495001, 162308, 23849, 162073, 381944, 602567, 852234, 998789, 875787, 617837, 507997, 544644, 531230, 531879, 783480, 1147464, 1160588, 758575, 443824, 506179, 573975, 293514, 3129, 221383, 765542, 967120, 650399, 329025, 400282, 654782, 727096, 605776, 483081, 427809, 440110, 573088, 766241, 774474, 510846, 289030, 461807, 928162, 1247215, 1171386, 841231, 511874, 324647, 329594, 496135, 659890, 640798, 463795, 328333, 339317, 400314, 383573, 273756, 137188, 75196, 195141, 487265, 751618, 802135, 711830, 683537, 736867, 755391, 785512, 971083, 1190367, 1132006, 819947]
37859H19947j49365J83997J41033k25364l33600l7383J53743m3531k37037p2230
37849B00210J82893J47943m6663p7206M854l2148j21923n5309R8264J29221P4205
37838E04341R0276J09597n263j12161J3486K42915K42181j4684k41424k84520
37828E44744k16524n2951K27801M04529J80732k97449m85057j43908L22970M18155
37818I03042J58511p1237o9727J2910l3254k13642l56778l10598r7397J09875
37808C1705J73098J19532N3580Q831k8866k4079N6614J37848J10353m639p7108
37797E56869l8995O0599J42988J53191O2818r0506k02663k13977j68439j08984
37787A52901r667J18570J80739J52032J37379J62180P6304j68296l26924j82205
$$ y = [819947, 670582, 854579, 995612, 770248, 436648, 399265, 553008, 509477, 272440, 200210, 383103, 531046, 484383, 407177, 412031, 379883, 257960, 202651, 300915, 430136, 504341, 594617, 704214, 698951, 586790, 600276, 843191, 1085372, 1070688, 829264, 544744, 328220, 275269, 503070, 907599, 1088331, 790882, 305825, 161917, 484887, 903042, 1061553, 990316, 920589, 933499, 900245, 686603, 329825, 19227, -78170, 31705, 204803, 324335, 377915, 386746, 357880, 333801, 390415, 528263, 638616, 633977, 556869, 517874, 578473, 721461, 874652, 937470, 846964, 644301, 430324, 261885, 152901, 143234, 261804, 442543, 594575, 731954, 894134, 970438, 802142, 475218, 293013]
37777B93013R2734J66012L8311j611J36048K20610R5666r5757j67905j38272j02724
37766E36125m5938R0858K55801L07825J61832j13905l21296k92285p8352Q5196
37756E85861O8957j523K0654O7927J5206p1940o3873k6762j01981k07916j44799
37745A39811M3222J08474L780n8658L399Q309j22599j60177P8033L86751M15160
37734H45505J31128j59793k05039n1255Q9700R9524M3666M7096J17434J30506
37724A088472R049j55021k26697k01458j46219m8724J13203K12103R2029j52123
37714E84614k34110o0480J49503J94235J26410N4645o4042k48675l03566o7685
37704A30849K47262K63763k2959k06668n0737J76157J30849p4173p0901J58010
$$ y = [293013, 385747, 551759, 590070, 588459, 724507, 945117, 1040783, 945026, 777121, 638849, 536125, 490187, 581045, 836846, 1144671, 1306503, 1192598, 871302, 579017, 500665, 585861, 654818, 653295, 673949, 741876, 757082, 685142, 621269, 594507, 492526, 284610, 139811, 183033, 291507, 295287, 236629, 240028, 248337, 125738, -34439, 43594, 430345, 845505, 976633, 816840, 611801, 560546, 650246, 749770, 793436, 840532, 957966, 1088472, 1097521, 942500, 715803, 514345, 368126, 319402, 432605, 644708, 736737, 584614, 350504, 290024, 439527, 633762, 760172, 814817, 750775, 502100, 198534, 130849, 378111, 641874, 618915, 412247, 361510, 537667, 668516, 594343, 523442, 681452]
37694F81452K40987J1407k23777j71764j266l3055k04732j87345O6993K49800
37684D28700J74510J4812j0151O7933R4344K6108o3481q4076K0227J99842K80141
37673A148909J54158m1048j15727j22453k16193k99299j43863J52686K25325J1163
37663G53658j37479k3166J13310M5408r4592j35657j56900k07596j02909K05024
37653B59101L85764J90549j35016k27615j19287l2552N8213K64201M09077K43043
37643A295478j15615l32130l24493k42923j27925N7648J89477J34040K9556P6982
37633F40095J70432Q1574j06553j17889M9884J35604L7153r9499j62367j57886
37623D70548q3951K4469L2988o8469n6256J49043K41729P433k36286j10555J75261
$$ y = [681452, 922439, 933846, 710069, 538305, 537039, 503984, 299252, 111907, 178900, 428700, 603210, 618022, 607871, 675804, 770148, 796256, 732775, 648699, 668926, 868768, 1148909, 1303067, 1262019, 1146292, 1023839, 807646, 508347, 364484, 517170, 742495, 753658, 616179, 593013, 706323, 751731, 657139, 521482, 364582, 156986, 54077, 259101, 644865, 835414, 700398, 472783, 353496, 320944, 379157, 643358, 1052435, 1295478, 1179863, 847733, 523240, 280317, 152392, 210040, 399517, 533557, 563113, 640095, 810527, 892101, 785548, 667659, 717543, 853147, 890300, 790801, 628434, 470548, 386597, 411066, 444054, 375585, 319329, 468372, 710101, 717534, 481248, 370693, 545954]
37612E45954J65834o7364r3473Q7526Q1660j24609j16646J60861K47747k9418
37602H58072k29562l5745K31140J71175p0124j04724R2304K25070J19764j32031
37592A125339l25618k89680l8145J57359N3718j83225j62137J43589L31013J73531
37582I85744o8476q9840L4929O3293l6822j13292n8552J13312K75372K40604k0540
37571A325732k47785k07340o3210j17293k69899j69682J29540J78501j17421k89857
37561A51286m8084K62977K31018j3792r3318L7371J45242J23711M0650m6949r2982
37550F97130l2823P5911N9930r2740j77257j07783m7854p7371l1078J57781K65317
37539F89163J52580L8893J36293K74385J86397m7476j56552j16991j18154j95261
$$ y = [545954, 711788, 644424, 550951, 638477, 720137, 595528, 478882, 639743, 887490, 858072, 628510, 592765, 823905, 995080, 924956, 820232, 912536, 1137606, 1257370, 1125339, 799721, 510041, 471896, 629255, 682973, 499748, 337611, 481200, 812213, 985744, 917268, 827428, 862357, 925650, 888828, 775536, 716984, 830296, 1105668, 1346272, 1325732, 1077947, 870607, 807397, 690104, 420205, 250523, 380063, 558564, 441143, 151286, 103202, 366179, 597197, 583405, 490087, 527458, 672700, 796411, 837061, 790112, 697130, 664307, 740218, 800148, 707408, 530151, 422368, 374514, 297143, 266065, 423846, 689163, 841743, 880636, 1016929, 1291314, 1477711, 1430235, 1273683, 1156692, 1038538, 843277]
37529H43277j95087p1868L3038J7549n5455q2369m9341j0913L254L2344J12288
37518E76717J54953P677k74450l64517p1631L15170L68297J18736k4495Q3817
37508H90274J54039p190j81838j19831P1024J15920m4747k27204k35488m1657
37498C73302J70298J63510l3268r2740J35560L24269J54157j35489j32944K3863
37488I50518r8115l86561l07501J30412K98268k2195k86349j22990J07834M5638
37478C08959p6273k589K3721j85338k81565n011K53886J11329r7734Q3532L86387
37467E19304K88494m9375r2728J12251J00811r3591k2609K63547K33541j51850
37457A107795l03131j601K31475L8675j98481p3625J50240M6381k21702j94244
$$ y = [843277, 648190, 576322, 609360, 626909, 571454, 489085, 439744, 428831, 432085, 464429, 576717, 731670, 739347, 464897, 100380, 28749, 343919, 712216, 830952, 806457, 890274, 1044313, 1037123, 855285, 735454, 806478, 922398, 877651, 650447, 414959, 373302, 543600, 707110, 673842, 581102, 716662, 1040931, 1195088, 1059599, 926655, 950518, 852403, 465842, 158341, 288753, 587021, 564826, 278477, 155487, 263321, 308959, 232686, 230097, 253818, 68480, -213085, -218096, 35790, 147119, 49385, 132917, 519304, 807798, 758423, 665695, 777946, 878757, 785166, 762557, 1026104, 1259645, 1107795, 804664, 803063, 1034538, 1073213, 874732, 801107, 951347, 997728, 776026, 581782]
37447E81782J05509K19410j6039k52262j77540P2953J79675P6605m0448l1901
37437G17744K8387J8753l1619L721J42263K45274J89747N366j80277k58048j91079
37426F90232m3795L8039j8380q8770k1239R3290K9546j77061k07451P1436L72655
37415G38502L84702J73220m073p5777j18090j09324N185J02420O732k01762k38732
37404F63003l542K60012K51405l7489l17064l10052l3560K45881L23794K37355
37394A279743J01426p1953k50165k55169j1980K19524J74976K7122J10055K99114
37384A622693J63861k63457m46846k01990J504j49096k81715k3707L05642K18499
37374I45388j15912j68210P4505J43830r8906k68907j11520J39497J81685N2073
$$ y = [581782, 687291, 906701, 890662, 638400, 460860, 533813, 713488, 790093, 749645, 717744, 746131, 764884, 733265, 736986, 879249, 1124523, 1314270, 1319636, 1139359, 881311, 690232, 646437, 684476, 666096, 577326, 556087, 649377, 678923, 501862, 294411, 365847, 738502, 1123204, 1296424, 1292351, 1216574, 1098484, 989160, 994345, 1096765, 1103497, 901735, 663003, 659461, 919473, 1170878, 1133389, 816325, 506273, 472713, 718594, 1042388, 1279743, 1381169, 1309216, 1059051, 803882, 791902, 1011426, 1186402, 1213524, 1323579, 1622693, 1786554, 1523097, 1076251, 874261, 875765, 726669, 444954, 421247, 726889, 945388, 829476, 661266, 735771, 879601, 780695, 511788, 400268, 539765, 721450, 773523]
37364G73523m0342l1570L300J7630K8996M9833M8375j4546r8308q0982N9821J36088
37352H51818L115j54367p4634J03499J9008k48736k10635K00458M01559O6076
37342I57161k97823j31513K91244L38394J1632j75922p8400j4258r7057j06236
37332F97222j5492o1557k28162k01265N3162J66949j4319j46325O1466L82554
37322F94233M23843J68997q2287j38899o3536K109n873m7996l9334L1944N7375
37311A000576m0824j61609j53211l5211N7612R2559J19732R5072n3995k10859
37301G09842j65165M7913J50644M1095l1929J37373L38245J99580k52274n45776
37291F29548l46628J01967K93520J11269p7607Q760J91413J78657K9398o090P2749
$$ y = [773523, 733181, 701611, 704911, 722541, 751537, 801370, 849745, 835199, 736891, 655909, 715730, 851818, 854933, 700566, 625932, 729431, 748439, 499703, 289068, 489526, 891085, 957161, 659338, 527825, 819069, 1157463, 1169095, 993173, 914773, 900515, 803458, 697222, 681730, 620173, 392011, 190746, 243908, 410857, 396538, 250213, 311679, 694233, 1118076, 1287073, 1204786, 1065887, 1002351, 1004460, 998587, 950591, 911257, 943201, 1000576, 959752, 798143, 644932, 609721, 667333, 759892, 879624, 974696, 920701, 709842, 544677, 592590, 743234, 784329, 752400, 889773, 1228018, 1427598, 1175324, 629548, 282920, 384887, 678407, 789676, 712069, 720829, 912242, 1090899, 1120297, 1114207, 1186956]
37280A186956O8781k7411n8420m0165j03947j40420P0190L62588K98403j32748
37270A483807m12866k67640n1717j07501k09003j0115L29271L87952J12765j76386
37260A078567k51539j43863J9291J07419M5987n9500k6108R2383N8587j00203
37250H21021o5499K09363L37099J19954j06606m7786O9366m8119k26710j69275
37240H92808J2196L7949n3185o6582l6072o8804p5897o057l9778k03983j59401
37229B33194K32051N24427L33357k9695q2445O1705L2198o8531O6405K61827J48791
37218A713284j04668p5454J01184l8760l81713l61110M5548K41483M29k24575
37208I15648j29304Q614n6303j17411J9774J76988J73878J16935Q4680o6650l49496
$$ y = [1186956, 1255737, 1228326, 1169906, 1129741, 1025794, 885374, 955564, 1318152, 1616555, 1483807, 1070941, 803301, 751584, 644083, 435080, 424965, 754236, 1142188, 1254953, 1078567, 827028, 683165, 702456, 809875, 855862, 796362, 770254, 862637, 921224, 821021, 755522, 964885, 1301984, 1421938, 1315332, 1267546, 1336912, 1288793, 1062083, 892808, 905004, 942953, 889768, 823186, 787114, 718310, 642413, 636356, 596578, 392595, 233194, 465245, 989672, 1323029, 1293334, 1210889, 1272594, 1304792, 1236261, 1302666, 1564493, 1713284, 1608616, 1533162, 1634346, 1595586, 1213873, 852763, 898311, 1139794, 1140223, 915648, 786344, 794958, 738655, 621244, 641018, 818006, 991884, 1108819, 1193499, 1126849, 777353]
37197G77353m58543j80064K76521N35205M38005R2485k52082l46791j69486J8625
37187G31228L2135K8422J58482K02692l6413k35007K984L87206K92566k12836
37177A351459m12709n9118K88287K06091j7058l4192k5467k31494m19354k67689
37167C78756P5833K34741J43763Q606n9619p6174k2816R8573J83735J63178Q9796
37156A218372l43j34581k45298j88259L599J15573P7220N5564J42850J93866P5551
37145A314114j29784k57788k27566m3492J88555K60792Q8165j05279o1032J16483
37135A143168J19767o9872j80978j06044p841J8645M2338N2645l4693j26679n3061
37124G97395R3030P2701o5943o4286O4958O8509m2807J287J90262K04481M215
$$ y = [777353, 318810, 138746, 415267, 950472, 1388477, 1480962, 1228880, 882089, 712603, 731228, 763363, 791785, 950267, 1152959, 1116546, 881539, 884523, 1271729, 1564295, 1351459, 938750, 879632, 1167919, 1374010, 1356952, 1322760, 1297293, 1065799, 646445, 378756, 454589, 689330, 833093, 841699, 782080, 705906, 683090, 781663, 965398, 1128576, 1218372, 1218029, 1083448, 838150, 649891, 653490, 769063, 846283, 901847, 1044697, 1238563, 1314114, 1184330, 926542, 698976, 655484, 844039, 1104831, 1192996, 1087717, 1026685, 1143168, 1262935, 1193063, 1012085, 906041, 898200, 916845, 959183, 1011828, 977135, 850456, 797395, 890425, 963126, 897183, 832897, 897855, 966364, 923557, 924844, 1115106, 1319587, 1323802]
37113A323802p7691M6178N4423j43476j69170J37866L31686M7880l65872l56591
37103H29035K9743L03188K48209N4206j04320k09850k19308r7732J2122m7898
37093G97395j56449n5462K25478L54218J56106j26339j41800J24342L33981K02852
37083A714322j59767l63077j69891K37506M52099K57662j80944m94359m40597
37074H52954j05527J99411K62611J57791N1601m8549j79851j95871L6285K84849
37064A315704J93342j31276k19805J2582J33565n3248j87420l1470J06863j6348
37054A122489j12425O4550K09073L1611j74129q2426M3901j05064k18312O2731
37044H41999L61205J46098k88685k77767Q8656J81524n0060r6524J17184J73154
$$ y = [1323802, 1246111, 1292289, 1346712, 1203236, 1034066, 1171932, 1503618, 1551498, 1185626, 829035, 858778, 1161966, 1410175, 1464381, 1360061, 1150211, 930903, 833171, 845293, 797395, 640946, 585484, 810962, 1165180, 1321286, 1194947, 1053147, 1177489, 1511470, 1714322, 1554555, 1191478, 1021587, 1259093, 1711192, 1968854, 1787910, 1293551, 852954, 747427, 946838, 1209449, 1367240, 1418841, 1370292, 1190441, 994570, 1030855, 1315704, 1509046, 1377770, 1157965, 1170547, 1304112, 1250864, 1063444, 1031974, 1138837, 1122489, 1010064, 1074614, 1283687, 1315298, 1141169, 1058743, 1102644, 997580, 779268, 841999, 1203204, 1349302, 1060617, 782850, 871506, 1053030, 1002970, 906446, 1023630, 1196784]
37034A196784L3329O9226K30719P9774k99890l09363J37924M31260K51146m2497
37024A778412j54285k18242k71084j18172J17059N0480k13444j46108K52894L70371
37014A447881L0537j96035Q689K11401N0347j94565k04782j11966n5409R7259
37004A083357K91143J99123j27963j92331J06702K57136L1760j38140K438Q3805
36994A597030j30218k78170j10961L8221q0125j74723l9716M3507n5866R366L13431
36983A131776L29231j32982m09471j7780M86038L69648j52713l66659j33664J55951
36973A259375K86025K51455j9143m11258m77286o3809L09319J85782j45636j97766
36963I77058m0761K2726O2650K19032K37751p6639l37859j28939K67735K99507
$$ y = [1196784, 1230113, 1299339, 1530058, 1609832, 1309942, 1000579, 1138503, 1569763, 1820909, 1778412, 1624127, 1405885, 1134801, 1016629, 1133688, 1184168, 970724, 824616, 1077510, 1447881, 1478418, 1282383, 1291072, 1502473, 1552820, 1358255, 1153473, 1041507, 986098, 1083357, 1374500, 1573623, 1445660, 1253329, 1360031, 1617167, 1648927, 1510787, 1513225, 1597030, 1466812, 1188642, 1077681, 1115902, 1035777, 861054, 821338, 864845, 808979, 818345, 1131776, 1461007, 1328025, 918554, 900774, 1386812, 1756460, 1603747, 1237088, 1103424, 1259375, 1545400, 1796855, 1777712, 1366454, 889168, 825359, 1134678, 1320460, 1174824, 977058, 936297, 959023, 1021673, 1240705, 1478456, 1401817, 1063958, 935019, 1202754, 1502261]
36953A502261k078j83229j12617k340P5488J68977J59859l1957j72214n6237J12349
36942A458262O6048q0568r3892k9278k8321l0273j275q2414k18285q7423K88320
36931A160901L92692L4453k65449j33514M1725j18899k50536N8952M27805K92272
36921A640402j21098k13778j2547K3648j31367j52250m4220m0074n4624J07938
36911A002030K57239J47235O124J10846J82628j04197l79600j32722L12669K50611
36901A652863k04851k91316J27911L83330J32513j84276j73584k5066j813j5337
36891A400374N6464J12674P9094L3190j3788j12870j52524p822J27919k8682l32083
36880A161946l51812k3928K66763K68714J26143K6812l9148r8014p2085P1106
$$ y = [1502261, 1500183, 1316954, 1204337, 1201997, 1277485, 1446462, 1606321, 1574364, 1402150, 1345913, 1458262, 1524310, 1443742, 1349850, 1320572, 1292251, 1261978, 1260703, 1178289, 960004, 872581, 1160901, 1553593, 1588046, 1322597, 1189083, 1230808, 1111909, 861373, 920325, 1348130, 1640402, 1519304, 1305526, 1292979, 1316627, 1185260, 1033010, 988790, 948716, 894092, 1002030, 1259269, 1406504, 1412628, 1523474, 1706102, 1601905, 1222305, 1089583, 1402252, 1652863, 1448012, 1156696, 1284607, 1667937, 1800450, 1616174, 1442590, 1417524, 1415711, 1400374, 1456838, 1569512, 1648606, 1681796, 1668008, 1555138, 1402614, 1394792, 1522711, 1494029, 1161946, 810134, 786206, 1052969, 1321683, 1447826, 1474638, 1435490, 1337476, 1265391, 1336497]
36870A336497K31530K67977R4692k21217m07901k44281P1082J14850j16621j75659
36860I50949Q4111K40798L8709j67827o1210J00995K5329p7824K2315Q3659q9732
36849A150272j66016R9792L05477R0864j54550J7450K55240M8225k78792j28154
36839A239808K37476J25738l30715l98280l8052Q2876j77247k28056J50144M49224
36829A112916L42031J11834M853q2361j20324J06145M14312L10821j68476m04937
36819A626814j57501J15068Q2185p515N4948N0113j31768j84157L8710J89596
36809A676493K9477j39983k0229J56047M9104j96319k03664M0734K27517K01351
36799A820528P9203j4645p4946j10653r2856j8731N6001O8841L1003L7114J27037
$$ y = [1336497, 1568027, 1836004, 1930696, 1709479, 1301578, 1057297, 1128379, 1243229, 1126608, 950949, 1035060, 1275858, 1314567, 1146740, 1085530, 1186525, 1211854, 1134030, 1156345, 1240004, 1150272, 984256, 1084048, 1389525, 1480389, 1325839, 1343289, 1598529, 1646754, 1367962, 1239808, 1477284, 1603022, 1272307, 874027, 835975, 918851, 741604, 513548, 663692, 1112916, 1454947, 1566781, 1571634, 1489273, 1368949, 1475094, 1889406, 2200227, 2031751, 1626814, 1469313, 1584381, 1666566, 1659051, 1713999, 1764112, 1632344, 1448187, 1486897, 1676493, 1705970, 1565987, 1545758, 1701805, 1750909, 1554590, 1350926, 1391660, 1619177, 1820528, 1899731, 1885086, 1810140, 1699487, 1606631, 1587900, 1643901, 1712742, 1743745, 1780859, 1907896]
36788A907896J57299l4389l22729l81344j47253O4424K6137j09959j37962j03794
36778I18326q8083J046J89580K93588K37741K07397K73798K21059l0144k13212
36768B011096j67575q5687p4781M9848K74536K40970q8422k16614M9846J93702
36758B186919j08412l53702p9149L00024K15014j00130j40819n9176k27457l75623
36748A257489o1540L95615L52883r3345l29630k25044r6839K1724K59507L51604
36738A832424L0330l20500k12974P8354L4845j18884J08132M05294J48115l57708
36728A627428k85043K57900L85161l1336k05845J27560L20901M3232j96231l8033
36718B005694J78799J46979K6162p5930k65316l62244n4664L50171K00783l65581
$$ y = [1907896, 2065195, 2030806, 1708077, 1326733, 1179480, 1243904, 1270041, 1160082, 1022120, 918326, 830243, 831289, 1020869, 1314457, 1552198, 1759595, 2033393, 2254452, 2224308, 2011096, 1843521, 1757834, 1683053, 1732901, 2007437, 2248407, 2159985, 1943371, 1993217, 2186919, 2078507, 1724805, 1645656, 1945680, 2160694, 2060564, 1919745, 1860569, 1633112, 1257489, 1195949, 1591564, 1944447, 1851102, 1521472, 1296428, 1199589, 1221313, 1480820, 1832424, 1862754, 1542254, 1329280, 1407634, 1442479, 1323595, 1431727, 1837021, 1985136, 1627428, 1342385, 1600285, 1985446, 1954110, 1748265, 1875825, 2196726, 2239958, 2043727, 2005694, 2184493, 2331472, 2357634, 2281704, 2016388, 1654144, 1599480, 1949651, 2150434, 1784853]
36708A784853m98385J075L69149J79420m4973J07847K19371r9927m40869k76415
36698A301146J96753M41449L43280J44254j0882j06019j26618j26500j62747j01977
36688A792139J83069M50096L30908r5518l95142l74058j69822R1251K75820J30004
36678B218747k93527m18519L1367L97643M3367m95664k91520M08823N50115L029
36668B153861l08866q193K44983K2485k57083k38549j31084m9058J93522M25999
36658B048017K11752k30667j86632L01555L89985j36015m79359j92457J63147
36649A889326J13099j5451P3346Q3013j21662j27901J75566K55058q5088k61420
36639A977886N0839L12810R2279j92327o9895J99468K07741Q3618O5265J9424
$$ y = [1784853, 1286468, 1287543, 1656692, 1836112, 1791139, 1898986, 2118357, 2018430, 1577561, 1301146, 1497899, 1939348, 2282628, 2426882, 2416000, 2309981, 2183363, 2056863, 1894116, 1792139, 1975208, 2425304, 2756212, 2660694, 2265552, 1891494, 1721672, 1812923, 2088743, 2218747, 1925220, 1506701, 1538068, 1935711, 1979078, 1483414, 1191894, 1600717, 2150832, 2153861, 1844995, 1836802, 2081785, 2104270, 1847187, 1608638, 1477554, 1428496, 1622018, 2048017, 2259769, 2029102, 1842470, 2144025, 2534010, 2397995, 1918636, 1726179, 1889326, 2002425, 1986974, 2060320, 2143333, 2021671, 1893770, 2069336, 2324394, 2239306, 1977886, 2028725, 2341535, 2433814, 2241487, 2171592, 2371060, 2578801, 2662419, 2727684, 2747108]
36629B747108j43624j80800l9336m7522k43993j90930K11765M36486J97626r9509
36619B647271j13645n1461q0704j699J88076J58197n3800j1844K11567J6032n60019
36608B347971o74610p5456L94533J80583j48932m1680J12287r3489k15861J56248
36598A941594N18017L05619j10073j31430L8010q4241l06676j73933J54394K10993
36588B362274R503j33850j80618k08569q8036J73415K17604o1984k00563R6072
36578A985248M18449L28743L3856q1261o0668o9864j5745J03672J4377k80969
36568B375838l40451l1490J81962M6363p2358N4683R7675r7480j32432J39524
36558B221834K26305j01528l25222j11425Q5907p9749j73713J70913N14679L86046
$$ y = [2747108, 2603484, 2422684, 2383348, 2335826, 2091833, 1900903, 2112668, 2549154, 2746780, 2647271, 2533626, 2482165, 2401461, 2399762, 2587838, 2746035, 2692235, 2680391, 2891958, 2907990, 2347971, 1673361, 1597905, 1992438, 2173021, 2024089, 1982409, 2094696, 2001207, 1785346, 1941594, 2459611, 2765230, 2655157, 2523727, 2561737, 2477496, 2170820, 1996887, 2151281, 2362274, 2371777, 2237927, 2057309, 1848740, 1760704, 1934119, 2151723, 2089739, 1889176, 1985248, 2403697, 2732440, 2766296, 2685035, 2624367, 2554503, 2538758, 2642430, 2656807, 2375838, 2035387, 2003897, 2185859, 2232222, 2159864, 2214547, 2312222, 2214742, 2082310, 2221834, 2448139, 2346611, 2021389, 1909964, 1995871, 1916122, 1742409, 1913322, 2428001, 2814047]
36548B814047P0621j4007k1605j38857q1054K39199K87933j80501n30736k49324
36538B195716J91219J75798o9431o7384L7089n2633j00538J32375K96011R0895
36528B829117j24145k0951P6984q2893q1911L32211N72465J68992l35231k78069
36518C056569L2427j4835k41560j49973J09550J21762K1007R7468J19130j68712
36508B982833m08223k45118j2350p5740j23091J56376L61727J31723r5378J03419
36498B776178K83603k8293l75617j91584J39773L8098j61384Q8009M00864J58616
36488C128263k51519r1141L48200K44200k80918m04804k9470K07286J26304J09423
36478C105824J77484O942k60193j86700R3518O5739k35138l11420p6453J26987
$$ y = [2814047, 2884668, 2870661, 2849056, 2710199, 2629145, 2868344, 3156277, 2975776, 2445040, 2195716, 2386935, 2562733, 2493302, 2425918, 2463007, 2410374, 2309836, 2442211, 2738222, 2829117, 2704972, 2684021, 2761005, 2678112, 2596201, 2928412, 3500877, 3669869, 3334638, 3056569, 3088996, 3074161, 2832601, 2682628, 2792178, 2913940, 2934947, 3032415, 3151545, 2982833, 2574610, 2329492, 2317142, 2241402, 2118311, 2274687, 2636414, 2768137, 2672759, 2776178, 3059781, 3031488, 2655871, 2464287, 2604060, 2642158, 2480774, 2568783, 2969647, 3128263, 2876744, 2785603, 3133803, 3378003, 3097085, 2692281, 2662811, 2870097, 2996401, 3105824, 3283308, 3290250, 3030057, 2843357, 2936875, 3002614, 2767476, 2456056, 2379603, 2506590]
36468B506590K03936K81601K39029l4608j92478O0156L35547J51891k16882k20454
36458C114328K6911O0338o5346j8461O6418j02821k74365o0737K86956K85471
36448C318692N2029j6464o066j67632k56018J9878L02849J45602j56835r8180
36438C137855J19299L2810j62647k5230K24190J04064j96475j78829L0425j7488
36428C067974j96451o8735K72521M26271M08381M01798K00349l20659o35261k89099
36418C267089K53631K97433j5941j34970q2622j62385j98840M7895K16597l2251
36408C455636k59535O675L41115J56308k24533j89607O4602M6881l3876J86107
36398C549773L20546m4627l64783j4761M82608L14043j59138q0268L32821K57649
$$ y = [2506590, 2710526, 2992127, 3231156, 3196548, 3004070, 3064226, 3399773, 3551664, 3334782, 3114328, 3141239, 3201577, 3136231, 3117770, 3184188, 3081367, 2807002, 2746265, 3033221, 3318692, 3370721, 3354257, 3348191, 3180559, 2924541, 2944419, 3247268, 3392870, 3236035, 3137855, 3257154, 3289964, 3127317, 3102087, 3326277, 3430341, 3233866, 3055037, 3085462, 3067974, 2871523, 2802788, 3075309, 3501580, 3909961, 4311759, 4512108, 4191449, 3556188, 3267089, 3520720, 3818153, 3802212, 3667242, 3584620, 3422235, 3223395, 3271290, 3487887, 3455636, 3196101, 3202776, 3543891, 3700199, 3475666, 3286059, 3350661, 3397542, 3363666, 3549773, 3870319, 3825692, 3460909, 3446148, 3928756, 4242799, 4083661, 4003393, 4336214, 4593863]
36388D593863j80102k13232J01810R8366j56512p6369J86605K2084l73055l11284
36378C692174O4512O1712k22116j29966K34951K19237p9474j7967K97155K14059
36368D334277j60881j58919J34855O1829k78600j91782K44828K89296p2330j33346
36358D069227J77475K10850j32696k57030k2170Q8098l3970o497J84300K03915
36348D481502J40638K93217L91380K4628m16401k76207J78997J98360j39981j83855
36338D692278L4875k8228k78897j82450J34876J22405j17171q1237J17645O5586
36328D479682k0192K34851M35335J01541k72982n7358K55519n3592m51313n3303
36318D598188O35154M93394k41824m41862n7455N9087j20173M1967L42740J06180
$$ y = [4593863, 4413761, 4200529, 4302339, 4400705, 4244193, 4167824, 4354429, 4376513, 4003458, 3692174, 3756686, 3818398, 3596282, 3466316, 3701267, 3920504, 3841030, 3823063, 4120218, 4334277, 4173396, 4014477, 4149332, 4211161, 3932561, 3740779, 3985607, 4274903, 4202573, 4069227, 4246702, 4457552, 4324856, 4067826, 4045656, 4133754, 4099784, 4093287, 4277587, 4481502, 4622140, 4915357, 5306737, 5331365, 4914964, 4638757, 4817754, 5016114, 4876133, 4692278, 4727153, 4698925, 4420028, 4237578, 4372454, 4494859, 4377688, 4296451, 4414096, 4479682, 4459490, 4694341, 5129676, 5231217, 4958235, 4900877, 5156396, 5102804, 4651491, 4598188, 5233342, 5726736, 5484912, 5043050, 4985595, 5044682, 4924509, 4966476, 5309216, 5415396]
36308E415396l07229p2347M10667J72031l95163j53250N91065N30342k50454m03252
36298E537806K50006M94978o313k52046J12503K66653p2859j96501Q6235J38205
36288F358667j15345o8162K10181O0976l32641j89198K87809K09345k65278j98386
36278E957968L08598L39256j4212J00401M65541J55720n10648m07056K52941L10848
36268F959357o7301K16871P94048L13206p86691o62431O48053J064394l0993q41337
36258G607176l20083L38647J81203j6073K98901K88450m42249q74687m28280M9702
36248F682707j7442j7215L49591M04777j1530j00963K78077K75226k16132k58370
36238G368726K98006M94864J22154L2733L21173J33346m45943l43091M03575N72342
$$ y = [5415396, 5108167, 5035820, 5446487, 5618518, 5223355, 5070105, 5661170, 6191512, 5941058, 5537806, 5787812, 6282790, 6276477, 6024431, 6136934, 6403587, 6330728, 6134227, 6220462, 6358667, 6243322, 6175160, 6385341, 6446317, 6113676, 5924478, 6212287, 6421632, 6156354, 5957968, 6266566, 6605822, 6591610, 6692011, 7157552, 7313272, 6802624, 6395568, 6648509, 6959357, 6892056, 7108927, 7902975, 8216181, 7429490, 6767059, 7415112, 8479506, 8448513, 7607176, 7287093, 7625740, 7806943, 7790870, 8089771, 8378221, 7935972, 7061285, 6633005, 6682707, 6665265, 6648050, 6997641, 7402418, 7390888, 7289925, 7568002, 7843228, 7627096, 7368726, 7666732, 8161596, 8283750, 8316483, 8637656, 8771002, 8325059, 7981968, 8385543, 8957885]
36228H957885L3566n2774M52629M12382k60517l43724K93567L82980k81751m45696
36218I148547J62152L71767o4930p4030M26038K96726l92495k79088N97208O73633
36208A0865528j85113l74487L88248N54782j85770k75360O23134Q60662q8347
36199A2183277o34829l3776M56873J84794J26731N56706M21122k86224k54681
36190A2719993M98979N10014k25550j73998O25975N40134l39251k29659P57179
36181A4683816O73914l78499k81623Q87337P94998n74850o56380P93314J099292
36172A7041319k22670n07967Q80009J280552r1736o19410O10165J093375r6298
36163A9367339n40754O14300R59700k32735m19003J084911J534418J26361l50713
$$ y = [8957885, 8991451, 8938677, 9391306, 9803688, 9543171, 9199447, 9493014, 9875994, 9594243, 9148547, 9310699, 9682466, 9617536, 9543506, 9969544, 10266270, 9873775, 9594687, 10191895, 10865528, 10680415, 10305928, 10694176, 11248958, 11063188, 10787828, 11410962, 12271624, 12183277, 11548448, 11514672, 11971545, 12156339, 12283070, 12839776, 13260898, 12974674, 12719993, 13218972, 13728986, 13503436, 13329438, 13955413, 14495547, 14156296, 13926637, 14683816, 15357730, 14979231, 14697608, 15584945, 16379943, 15805093, 15148713, 15942027, 17041319, 16818649, 16310682, 17190691, 18471243, 18379507, 17760097, 18370262, 19463637, 19367339, 18826585, 19440885, 20400585, 20167850, 19748847, 20833758, 22368176, 22494537, 22143824]
36154B2143824R52381J251965j95705m62508J122602J419577k04104l40664J639853
36145B7327221J974766r9422n02160J735731K275856p6418p61064J690396K663345
36136C6228251O15322K48064K891526L299473J35163n59522L046669M437752J310777
36127E1653475M85162M462002N876883K068768J250051O342483P943650K631877
36119H2714351J408074Q822928J2480531O827523O032913J6041563J8677302P122999
36111A60128184Q294434L3428180L3853517l9398667j43441787j74058769r8169450
36104b19364358J706716L7477719J7240934L103447J4007923K0809386J0957418
36097a14060815M017426R202395J1744757M726597N77366N256657Q113000L624338
$$ y = [22143824, 23096205, 24348170, 24152465, 23689957, 24812559, 26232136, 26028032, 25687368, 27327221, 29301987, 29202565, 28700405, 30436136, 32711992, 32635574, 31874510, 33564906, 36228251, 36843573, 37091637, 39983163, 43282636, 43417799, 42858277, 45904946, 50342698, 51653475, 52138637, 56600639, 62477522, 64546290, 65796341, 72138824, 80082474, 82714351, 84122425, 92945353, 105425884, 112253407, 118286320, 134327883, 153005185, 160128184, 168422618, 201850798, 235704315, 196305648, 52863861, -121194908, -219364358, -217657642, -180179923, -162938989, -159835542, -145827619, -125018233, -114060815, -110043389, -100840994, -89096237, -84369640, -83792274, -78535617, -70422617, -66798279]
36089f6798279O79420M057415O001325K283697j46750K642451M519252J866408
36081d4895061K3443K087119L215497Q66560k28278K190531L326533P64917r21453
36072c3570192R05995K234105N55135n39265J194218K340140P49833m14389Q33349
36063b5711071J543012n101q15933Q00634J832531M22123o71167M25776J270658
36054b0908538J96239m76361P28407J452601K34845n89818M93243J274426K25409
36045a7369547o23149J87435Q01992m9251n39304M43226R88553K1377m76200N99199
36035a6015669J195312Q0273p02139K81586J168583L95985m87150J4886O43636
36026a3424697J61132k79940K65637N53485j75907m72775M29709R26821J08790
$$ y = [-66798279, -66118859, -62061444, -56060119, -53776422, -53923172, -51280721, -46761469, -44895061, -44871618, -42784499, -39569002, -38702442, -38930720, -36740189, -33413656, -32648739, -33570192, -32664197, -30430092, -29874957, -30414222, -29220004, -26879864, -26130031, -26544420, -25711071, -24168059, -24173160, -24989093, -24188459, -22355928, -21933805, -22604972, -22179196, -20908538, -20712299, -21188660, -20460253, -19007652, -18772807, -19362625, -18869382, -17594956, -17369547, -17992696, -17805261, -17003269, -17052520, -17591824, -17148598, -16160045, -16138668, -16614868, -16015669, -14820357, -14740084, -15442223, -15160637, -13992054, -13596069, -14083219, -14068333, -13424697, -13263565, -13543505, -13277868, -12724383, -12900290, -13373065, -12943356, -12016535, -11907745]
36017a1907745m43956K32530N99393k71872p34548K68728J038237K42638o10065
36008a1586660k0551Q36989N06876j71500m7924J19280m56437p18173J53547Q86701
35998a0497852L36810m29276j49961M65001L76800J29297L97964M80697j23279
35989i013799m49564Q5020M23437r6001l82436K74759P18398R5781m75337r155
35979h828897N20121R9425m28332o1751N01671L37670o111J78919L37775k4509
35969g374019j80642L10382N58072P3888j75204K93797L41708o24911j251398
35960h028327n18157M14365K50653l06103j26408L05816J30628j49580J49149
35951g877964M05997k594l09803J79028O19041J55097m53656k58176J85987N3550
$$ y = [-11907745, -12351701, -12119171, -11519778, -11791650, -12526198, -12257470, -11219233, -10976595, -11586660, -11607211, -10770222, -10263346, -10434846, -10482770, -10363490, -10819927, -11538100, -11384553, -10497852, -10161042, -10590318, -10740279, -10275278, -9898478, -9769181, -9371217, -8890520, -9013799, -9463363, -9378343, -8954906, -9050907, -9433343, -9158584, -8440186, -8344405, -8819742, -8828897, -8308776, -8209351, -8637683, -8699434, -8197763, -7860093, -7866204, -7687285, -7349510, -7374019, -7554661, -7244279, -6686207, -6612319, -6787523, -6493726, -6152018, -6776929, -8028327, -8546484, -8132119, -7881466, -8187569, -8313977, -8008161, -7877533, -8027113, -7877964, -7471967, -7474561, -7784364, -7605336, -6986295, -6831198, -7284854, -7543030, -7357043, -7303493]
35941g303493j67020J70998M60749Q3668k46840J37065M63296m044m44647O396
35931f843872N60677K20407l52804j05466M48630K63279k99329k68924J30982
35922f246420J19513p4911J51842M17698J23809k44356k7969K49991j21942n71522
35912f224267k44536L62881K92126j30988J8848N05896M04066j91436l86521l8405
35902e632336K14206J42000L0656o0683k02167j67373J06928J81887q3631j32574
35892e603087K30947L18487j66924m10981Q3957N00543J46277k75152K5008M75468
35882d675457K63316j73263q9831J30945j48211m58114j28588L26903J38151k48534
35872e062683m5291L37890R6147l73623j86125L68526L72964o4643j64951K4974
$$ y = [-7303493, -7470513, -7299515, -6838766, -6755098, -7001938, -6864873, -6401577, -6405621, -6850268, -6843872, -6283195, -6062788, -6415592, -6521058, -6072428, -5809149, -6108478, -6377402, -6246420, -6126907, -6201818, -6049976, -5632278, -5508469, -5752825, -5780794, -5530803, -5652745, -6224267, -6468803, -6105922, -5813796, -5944784, -5925936, -5420040, -5015974, -5207410, -5593931, -5632336, -5418130, -5276130, -5245474, -5306157, -5508324, -5675697, -5568769, -5386882, -5470513, -5603087, -5372140, -5053653, -5220577, -5631558, -5547601, -5047058, -4900781, -5175933, -5150925, -4675457, -4412141, -4585404, -4675235, -4544290, -4692501, -5150615, -5279203, -4952300, -4814149, -5062683, -5107974, -4770084, -4673937, -5047560, -5233685, -4865159, -4492195, -4556838, -4721789, -4696815]
35862d696815q0168k87192j3104M24586K93584j50010j00808K99441K56941j74764
35852d228309k34861J11650J76094j41355k47722l53J37124L0797n986M7473n7023
35841d412471j95842o2261J80802J73538K8138K8988J9238k02890k99181M5592
35831d696349M17947K97418o7359j51705l2961l1162j2394J86668K15387j33818
35821d008328l45749m9540K23783q310k31177J17551N24762K91624j87025j73096
35811c845505P5260p7432l29428l5985M35491K86027k21788k04158K51051K85461
35801c381006j57457k83790J10466L66947J47556j64008k70245k71225j93420
35792d096182J7187J45690L0035k2277K17946L54405N9804k21709n0312J54571
$$ y = [-4696815, -4776983, -5064175, -5077279, -4652693, -4359109, -4509119, -4609927, -4310486, -4053545, -4228309, -4463170, -4351520, -4175426, -4316781, -4564503, -4564856, -4427732, -4396935, -4402921, -4355448, -4412471, -4608313, -4670574, -4489772, -4316234, -4288096, -4259108, -4239870, -4442760, -4741941, -4696349, -4278402, -3980984, -4048343, -4200048, -4233009, -4264171, -4276565, -4089897, -3874510, -4008328, -4354077, -4403617, -4179834, -4188144, -4419321, -4301770, -3777008, -3485384, -3672409, -3845505, -3770245, -3847677, -4177105, -4213090, -3777599, -3491572, -3713360, -3917518, -3666467, -3381006, -3538463, -3822253, -3711787, -3344840, -3197284, -3361292, -3631537, -3902762, -4096182, -4078995, -3933305, -3903270, -3925547, -3707601, -3353196, -3293392, -3515101, -3565413, -3410842]
35782c410842p1532k53030J53986N86777K67036l47321l05898J66174J38079l07469
35772c384040k92639J83929K75059j21639k24582J60599L63738J35242k1158Q1612
35762b843879N4385j39537p4226K09053J85490j47150k31525J0455P0793j51126
35752c057267k03062N474O9465o7454k9397J80551J50654j23918k22870q8573
35742c386397k7927o838K24524M29271J93086k02956j47841K03375J73639k29026
35732b777090l70234j49560m6070q0197J74346N65482M65633o0162k82046o1152
35722b621050J4505j82406j29602K16044K47960j23525k51295M6791J60701j37814
35712b759691k68930M9783K98045J46294j9118L8394k8560k99728k54885K25436
$$ y = [-3410842, -3482374, -3735404, -3581418, -2994641, -2727605, -3074926, -3380824, -3214650, -3076571, -3384040, -3676679, -3492750, -3217691, -3339330, -3563912, -3403313, -3039575, -2904333, -2925491, -2843879, -2789494, -2929031, -3003257, -2794204, -2608714, -2755864, -2987389, -2976934, -2906141, -3057267, -3260329, -3254855, -3185390, -3252844, -3282241, -3101690, -2951036, -3074954, -3297824, -3386397, -3414324, -3421162, -3196638, -2767367, -2574281, -2777237, -2925078, -2721703, -2548064, -2777090, -3147324, -3296884, -3342954, -3423151, -3248805, -2683323, -2217690, -2277852, -2559898, -2621050, -2606545, -2788951, -2918553, -2702509, -2454549, -2578074, -2829369, -2782578, -2621877, -2759691, -3028621, -2978838, -2680793, -2534499, -2553617, -2515223, -2543783, -2843511, -3098396, -2872960]
35702b872960M44969K5107l98569k12777K11624K39893r585m4796J25243J48861
35692b342990m484r8930r0268r7824j24557j07347n9295J0710J12078J49164M5169
35681b608574m3716L4948R1646q5661k39294j2389L47102L01949o8790k00834
35671b483613j7833J1506j99116j93337J49082L74591K71179J58285J66023j3699
35661a776932m07412n30323j88395J52044J15295o4918p7686j5424k5481n102
35651b824334Q3742P3897k1522L5353K06418J53553j32356k32698m866J77537
35641b485276Q5230k0680P1739J61117N0928j22012j84561j56789o4512Q2921
35631b581895R8624j50509l50955j09089L41906M10195P5370j30325m6928l3455
$$ y = [-2872960, -2427991, -2402884, -2801453, -3014230, -2802606, -2562713, -2572298, -2617094, -2491851, -2342990, -2347474, -2446404, -2536672, -2634496, -2759053, -2866400, -2925695, -2914985, -2802907, -2653743, -2608574, -2652290, -2617342, -2525696, -2611357, -2850651, -2863040, -2515938, -2213989, -2282779, -2483613, -2501446, -2489940, -2689056, -2882393, -2733311, -2358720, -2087541, -1929256, -1763233, -1776932, -2184344, -2714667, -2903062, -2751018, -2635723, -2700641, -2778327, -2793751, -2819232, -2824334, -2740592, -2666695, -2688217, -2652864, -2446446, -2292893, -2425249, -2657947, -2662813, -2485276, -2400046, -2420726, -2348987, -2187870, -2136942, -2258954, -2443515, -2600304, -2664816, -2581895, -2483271, -2633780, -2984735, -3093824, -2751918, -2341723, -2266353, -2396678, -2443606, -2477061]
35621b477061j57839o2962K33012K34876j26648k97494n0457J61854P7428M3238
35611b422053K35390K62332n3469k55698n7738J42617P584j63047p2446J7359
35601b359169j27029k00903L2563K31779J18912L8738K83329M34327N8246m37799
35591a927006l92750L4719J45680j73689l52716r1354K45665K56819K1722j41034
35581b373944j01059L2518J15683J36317J90868K71759J79095j58596l97040j77065
35571b281464K43986K47660k10426m72671j62565K65047K65083r706p5777J14385
35561b076448K32338J53302M6563J2875k6143j24530k19593k16382p2901J28892
35551b162027J98185O3453o6050K2055J86955J37893r6092k37352k10346j44397
$$ y = [-2477061, -2634900, -2697862, -2464850, -2229974, -2356622, -2654116, -2704573, -2542719, -2465291, -2422053, -2186663, -1924331, -1977800, -2233498, -2291236, -2148619, -2141035, -2304082, -2376528, -2359169, -2486198, -2687101, -2654538, -2422759, -2303847, -2265109, -1981780, -1547453, -1489207, -1927006, -2319756, -2285037, -2139357, -2313046, -2665762, -2757116, -2511451, -2254632, -2232910, -2373944, -2475003, -2442485, -2326802, -2190485, -1999617, -1727858, -1548763, -1707359, -2104399, -2281464, -2037478, -1789818, -2000244, -2472915, -2635480, -2370433, -2105350, -2115056, -2190833, -2076448, -1844110, -1690808, -1644245, -1631370, -1657513, -1782043, -2001636, -2218018, -2290919, -2162027, -1963842, -1900389, -1966439, -1944384, -1757429, -1619536, -1715628, -1952980, -2163326, -2307723]
35541b307723l5539J60389K24286k4118k49582l1027L43976K31914k69533m05704
35531b362661j0247K39786K4513j06769J91297L92451O1862l30694k33681M8323
35521b085820j9805k31439r2240K20331J85951j00154j23466J08968J27316j08185
35511b118543j47990J04965K13766j2652j89326j5238K51047K40808J4839j22536
35501a780860q0337O221M6799N5172L2240l1314p7220l8684L6490L3072m9820
35490a848241p5309J5511Q0548J323p2006O8592K77461J80498k19209m27837j46850
35479b165519K72045L33249M9265k31620l51887l34064j28441K14199L69396J63936
35469a809441p3579r548J49579Q6664r392J50235K89656K6244l21094k03380J32980
$$ y = [-2307723, -2343262, -2182873, -1958587, -1982705, -2232287, -2263314, -1919338, -1687424, -1956957, -2362661, -2372908, -2133122, -2108609, -2215378, -2024081, -1631630, -1569768, -1900462, -2134143, -2085820, -2105625, -2337064, -2429304, -2208973, -2023022, -2123176, -2246642, -2137674, -2010358, -2118543, -2266533, -2161568, -1947802, -1960454, -2149780, -2165018, -1913971, -1673163, -1658324, -1780860, -1861197, -1854976, -1808177, -1753005, -1720765, -1752079, -1829299, -1867983, -1831493, -1798421, -1848241, -1923550, -1908039, -1827491, -1826168, -1898174, -1829582, -1552121, -1371623, -1590832, -2018669, -2165519, -1893474, -1560225, -1510960, -1742580, -2094467, -2428531, -2556972, -2342773, -1973377, -1809441, -1883020, -1892568, -1742989, -1656325, -1665717, -1515482, -1225826, -1199582, -1520676, -1724056, -1591076]
35458a591076J8510m06849l59584K15162N10547K19852l8467R5408J67261r0395
35448a259631k10228O8244K30886p5669l71413k00127R7325P4836n8867Q163M7136
35437a649345j63385k75180j5316K02472r198k57276m5828L21085K78890j4617
35427a627698l0749J69262J27594j29827j77501K5264J24455J1651j15594j77742
35417a800885j78201K9159M17964N22330O6041m40140l62008Q3905K13184k4145
35407a472796r9452R6376J34318q9425j59942Q1532K63376J45390m4858j06651
35397a252132j57771k58261k35291o3055K8069j1836O2918K97669L52794M2543
35387a194353l11811l28858q0708R1344N6167m1618m3784P3456K09462J98199
$$ y = [-1591076, -1572566, -1979415, -2338999, -2123837, -1613290, -1393438, -1431905, -1336497, -1169236, -1259631, -1469859, -1401615, -1170729, -1246398, -1617811, -1817938, -1720613, -1645777, -1704644, -1696481, -1649345, -1812730, -2087910, -2103226, -1900754, -1909952, -2167228, -2213056, -1891971, -1613081, -1627698, -1658447, -1489185, -1361591, -1491418, -1668919, -1643655, -1519200, -1507549, -1623143, -1800885, -1979086, -1949927, -1531963, -1009633, -943592, -1383732, -1745740, -1661835, -1448651, -1472796, -1572248, -1475872, -1341554, -1430979, -1590921, -1509389, -1246013, -1100623, -1145481, -1252132, -1409903, -1668164, -1903455, -1966510, -1938441, -1950277, -1887359, -1589690, -1236896, -1194353, -1506164, -1835022, -1915730, -1824386, -1768219, -1809837, -1853621, -1780165, -1570703, -1372504]
35377a372504k1969k48370j98281Q4999K21215M982k78833k40733O3744K20505
35367a765245M9823j51496n2545K35108L29063J28392p0811m3343N6425P831r5062
35356a371860l7332J02510N5844j75356k82110r8986J78015K77299J37910j28102
35346a342168l60917m09210k33608K6951K06894K69222K10490N32k07498q3831
35336a923143L62801N79416J95284l41237l77034k7753J06707l3202n049J95700
35326a267510J06553k62655l46527k3682J69645L0466l20K02394J23768l39503
35316a607371m61133R8829N62600K48480k92251k06320K74974L36887l7430j85546
35306a268281M3718J74686L4406n6082K2599L1770q5851j22078m7510j8638l270
$$ y = [-1372504, -1394473, -1642843, -1841124, -1756125, -1534910, -1529928, -1808761, -2049494, -1985750, -1765245, -1715422, -1866918, -1919463, -1684355, -1355292, -1226900, -1297711, -1341054, -1284629, -1276798, -1371860, -1409192, -1306682, -1250838, -1426194, -1708304, -1807290, -1629275, -1351976, -1214066, -1342168, -1703085, -2112295, -2345903, -2318952, -2112058, -1842836, -1632346, -1631814, -1839312, -1923143, -1560342, -980926, -785642, -1126879, -1503913, -1531666, -1424959, -1458161, -1463210, -1267510, -1160957, -1423612, -1770139, -1793821, -1624176, -1593710, -1594030, -1391636, -1267868, -1607371, -2068504, -1969675, -1407075, -1158595, -1450846, -1657166, -1382192, -1045305, -1082735, -1268281, -1224563, -1049877, -1015471, -1071553, -1048954, -1017184, -1103035, -1225113, -1272623, -1291261, -1294531]
35295a294531J15778J75339l3363k89970k15207R6406K20395P7048l8684j3930
35285a200719j1355p0071p4241n9863j29567j50700M2762K59623J96942l7101
35275a234290q8850N8721J16653J0207p0125n8194m2585k376R7912Q3066j61634
35264a291495l58908k09880Q5938J44714L3368P2127J96667J06069r8229n4923
35254a374552J57956J17134j74192k65309m9503P4379o2869j35188L5646J58162
35244a518336K5131j23854n0504J07174J50531J26993J04549r22j68870j81019
35234a529127K0825J91556J62128N7912l615j04652k55986k64249o3604J14890
35224a673922R8599K3658M2473N6907l8855r7355M9265K75539L23366J59601k7850
$$ y = [-1294531, -1178753, -1003414, -1036777, -1326747, -1541954, -1445548, -1225153, -1148105, -1186789, -1200719, -1212074, -1282145, -1356386, -1416249, -1545816, -1696516, -1653754, -1394131, -1197189, -1234290, -1323140, -1264419, -1147766, -1137559, -1207684, -1265878, -1308463, -1310839, -1212927, -1129861, -1291495, -1650403, -1860283, -1774345, -1629631, -1596263, -1524136, -1327469, -1221400, -1319629, -1374552, -1216596, -1099462, -1273654, -1538963, -1588466, -1514087, -1576956, -1712144, -1676498, -1518336, -1493205, -1617059, -1667563, -1560389, -1409858, -1282865, -1178316, -1179238, -1348108, -1529127, -1508302, -1316746, -1154618, -1096706, -1100321, -1204973, -1460959, -1725208, -1788812, -1673922, -1575323, -1551665, -1509192, -1452285, -1491140, -1588495, -1539230, -1263691, -940325, -780724, -808574]
35213h08574j08054j14198j24929j64790j99478j64492k7690J49433K46822J82559
35203a133391l9142l07834m05101j71658K20762L45702N3611k53307j38543K32876
35193a596025L22813N913k73661j76612Q3321J31008k5470q5417O6810K20627
35183a326693J59662m5043j38015k2386J06952L8166j36624j42404N9378K01177
35173a245830J18416j7881r574O3825M2102j7325K4998J03926M4835j39127k54287
35162a285922j83006R286J62007J29676q3758k44505j16462J78173K65699O0935
35152a107877j05882k5344Q5190J3079q2050j3317O6073k4338j21536k7843Q8078
35141a255767j0552j76891j33181M1253Q5718K6382N1767R9609J004j14489l930
$$ y = [-808574, -916628, -1030826, -1155755, -1320545, -1520023, -1684515, -1712205, -1562772, -1315950, -1133391, -1172533, -1480367, -1885468, -2057126, -1836364, -1490662, -1437051, -1690358, -1828901, -1596025, -1273212, -1267299, -1540960, -1717572, -1634251, -1503243, -1528713, -1614130, -1547320, -1326693, -1167031, -1212074, -1350089, -1372475, -1265523, -1227357, -1363981, -1506385, -1447007, -1245830, -1127414, -1145295, -1154869, -1091044, -1048942, -1066267, -1041269, -937343, -892508, -1031635, -1285922, -1468928, -1459642, -1297635, -1167959, -1251717, -1496222, -1612684, -1434511, -1168812, -1107877, -1213759, -1239103, -1153913, -1140834, -1222884, -1236201, -1170128, -1194466, -1316002, -1343845, -1255767, -1266319, -1443210, -1576391, -1535138, -1449420, -1423038, -1371271, -1271662, -1270658, -1385147, -1389077]
35130a389077K07198J67154j38232l62194k97286n1632K14350L95552L57092O8814
35120h28261k26499k55132n1546J58469K59327K18075o845k70159k36494J20826
35110a118239L33047R7897k26819k03143N942L8287R312J67954K48495j01415
35100g48682n34140m47475j7350O8472k03718j70354L01559N39555K00447j78282
35090a189968r1402K00907K38942N6327q6267j62407k12153j32215N5480J01983
35080a220773m8501j12078L8785J26322m8261k50353j98858J8188J53259J49392
35070a392878R2004N5295J12765K54194K62960j5360l06363k13317J32881K26558
35060g91261O566n7902J94611L20127L5961l09565l42316j96899r9837O4619L59507
$$ y = [-1389077, -1181879, -1014725, -1152957, -1515151, -1812437, -1864069, -1649719, -1254167, -897075, -828261, -1054760, -1309892, -1361438, -1202969, -943642, -725567, -732412, -1002571, -1239065, -1118239, -785192, -687295, -914114, -1117257, -1111315, -1073028, -1063716, -895762, -647267, -748682, -1282822, -1730297, -1747647, -1679175, -1882893, -2053247, -1751688, -1212133, -1011686, -1189968, -1281370, -1080463, -841521, -785194, -871461, -1033868, -1246021, -1378236, -1322756, -1220773, -1269274, -1381352, -1342567, -1216245, -1264506, -1514859, -1713717, -1695529, -1542270, -1392878, -1300874, -1245579, -1132814, -878620, -615660, -631020, -937383, -1150700, -1017819, -791261, -784695, -842597, -647986, -327859, -291898, -601463, -943779, -1140678, -1240515, -1175896, -816389]
35049h16389M33226M1956m19096m06922q837K33936J06367j09937j47796m9871
35039a143363L4097O0092O5640Q2699Q4941m271j70741k15703M19K55974J99115
35028g51101j11391k44768m5331J38217J3937k27495k55085n9937J45288K41667
35018a155999K24095J19496L4692P8849J44233J2843k46900l00399o6291J22392
35008a032989K5560j62915j61396Q144J57739J99989J22478n1718j63442m9493
34998a108043J47231J22633p1783o2606J91257K53949p4176l79217k72544K2546
34988a230753Q6790n7528j25200r1560j19007j61838l9415K08812L56775L03809
34978h69115J33883l1830p8294N3478K12531J26418k05806m26776k90249J1368
$$ y = [-816389, -383163, -341207, -760303, -1167225, -1176062, -942126, -835759, -945696, -1093492, -1143363, -1109266, -1049174, -983534, -900835, -815894, -820165, -990906, -1206609, -1206190, -950216, -751101, -862492, -1107260, -1152591, -1014374, -1000437, -1227932, -1483017, -1542954, -1397666, -1155999, -931904, -812408, -777716, -698867, -554634, -541791, -788691, -1089090, -1155381, -1032989, -1007429, -1170344, -1331740, -1323596, -1165857, -965868, -843390, -895108, -1058550, -1108043, -960812, -838179, -909962, -972568, -781311, -527362, -601538, -980755, -1253299, -1230753, -1143963, -1201491, -1326691, -1418251, -1537258, -1699096, -1738511, -1529699, -1172924, -869115, -735232, -767062, -845356, -791878, -579347, -452929, -658735, -1085511, -1375760, -1364392]
34968a364392J63152J34650P5073K5354m9044j11020j20274j08007p3872K3593
34958a404787J14938P7375j9425Q732J19550J05721M418M2806J48856L905l31338
34947a129249l92840q2075J19178n0135k05530k4949K02747J54987N1662J68479
34937a187725K76368J01604j06468l2806R4185n3736k39410q1608J98150J35359
34927h96087j46124j69136M8031J01737l317P7975K65235J30908k54548l23674
34917a169000M3977L07537J67347o189J04295K40821R7515j56322k31238j70432
34907g71689j27439o7752J5603m8046k52290k68589L3788K75682J31889j21911
34897a200754m9922K21367K15713j02220k68652o1712J72367P7046j99751k76617
$$ y = [-1364392, -1201240, -1066590, -991517, -966163, -1015207, -1126227, -1246501, -1354508, -1428380, -1404787, -1289849, -1212474, -1231899, -1223167, -1103617, -997896, -993478, -950672, -801816, -797911, -1129249, -1522089, -1604164, -1484986, -1535121, -1740651, -1765600, -1562853, -1407866, -1356204, -1187725, -911357, -809753, -916221, -949027, -854842, -908578, -1147988, -1229596, -1031446, -896087, -1042211, -1211347, -1163316, -1061579, -1064896, -986921, -721686, -590778, -845326, -1169000, -1125023, -817486, -650139, -656328, -552033, -311212, -213697, -370019, -601257, -771689, -899128, -966880, -951277, -999323, -1251613, -1520202, -1486414, -1210732, -1078843, -1200754, -1250676, -1029309, -813596, -915816, -1184468, -1246180, -1073813, -996767, -1196518, -1473135]
34887a473135q4998J10045J18800K2648j8072L2220J09223J50644J19941J8911
34877h93773p0591m1172Q1631J25667O742j17832o5953Q0194R1174m3455r8522
34866i45890R927P7910n1811k28275k28325q4139J5787L2172P5999J68410J97252
34855i60983J07734j6445p9138p1525l5013r103k4049p6463j03005l4415J05275
34844a197130J89252J13047o6013j53842m1053J27221J18103m6901r7426O1865
34834i92877J61746j2352k35574j71496Q4897J61911J2484n9138M0212N1035j30276
34823a089428k31872p0534J37679J46269L6725k0358o7684j69088j73724L9726
34813a462289K73541K47946L620j72504j34622M660P8567M2977l136Q6021L01525
$$ y = [-1473135, -1558133, -1448088, -1329288, -1306640, -1324712, -1292492, -1183269, -1032625, -912684, -893773, -964364, -1005536, -923905, -798238, -791496, -909328, -975281, -895087, -803913, -847368, -945890, -935963, -858053, -909864, -1138139, -1366464, -1450603, -1434816, -1402644, -1326645, -1158235, -960983, -853249, -869694, -948832, -1020357, -1055370, -1064473, -1088522, -1164985, -1267990, -1302405, -1197130, -1007878, -894831, -960844, -1114686, -1155739, -1028518, -910415, -957316, -1054742, -992877, -831131, -843483, -1079057, -1250553, -1165656, -1003745, -991261, -1050399, -1010187, -959152, -1089428, -1321300, -1391834, -1254155, -1107886, -1071161, -1091519, -1159203, -1328291, -1502015, -1462289, -1188748, -940802, -937182, -1109686, -1244308, -1239648, -1161081, -1118104, -1121240, -1035219, -733694]
34802g33694L87406J28665k84665m38252k52275n1450l1045j7782J19723K03597
34792i69772Q6077q1258j33584j42241j74346j16955N0404J31757P3231R3613
34782a183074K36437K00433j00210k50238J3957K97738J61416j54397j68084J4409
34772i31613m7813k76668j79108K58328M63749J64223k05372j69496J57932L33716
34762d32122J68711j42810k90378j36884J44160K34528Q1275l611J64749K86206
34752G3824L5082l42884l48911k0534J19790j00401k55992m1776K43327J80100
34742d58375j49311l14583j21409J94717K79012L1762k88808l21472j8706K64978
34732i02195K19697j5591j02466j4265J2115n1526J4802K23070K67009K730k76969
$$ y = [-733694, -346288, -217623, -502288, -940540, -1192815, -1244265, -1275310, -1293092, -1173369, -969772, -883695, -964953, -1098537, -1240778, -1415124, -1532079, -1481675, -1349918, -1276687, -1183074, -946637, -746204, -846414, -1096652, -1082695, -784957, -623541, -777938, -946022, -931613, -979426, -1256094, -1435202, -1176874, -713125, -548902, -754274, -923770, -765838, -432122, -263411, -406221, -696599, -833483, -689323, -454795, -373520, -377131, -212382, 73824, 108906, -233978, -582889, -603423, -483633, -584034, -840026, -881802, -638475, -458375, -607686, -922269, -1043678, -848961, -569949, -538187, -826995, -1148467, -1167173, -902195, -682498, -698089, -800555, -814820, -802705, -854231, -839429, -616359, -349350, -346620, -623589]
34721f23589k44875J1789J58683Q3367k5003j5869O254j16581k85502k11559J48137
34710a114748M00862J88695k56542l65208l1046K53177J68596J0089R9629K25977
34700d20519P2877j83421j93894m8789m6734j08650J2644J53375o418k63620j47149
34689a180298K21972K51944j12412k63074L6182K45265j9426l40588k18576J39828
34679a239183K50072J18405N8953P8166l1592j99950j66189N8355K17010K15764
34669f40189J70014J16687k0304k18271l43241l12306j23874J64817L69898K82980
34659e53789l80r1775J40681L05398O3544k96587k65935R4901K50597J1730k28816
34648e70431j43790Q7512J54838P4184L1894K7171n9999j83697j68548O483J53806
$$ y = [-623589, -868464, -856675, -697992, -614625, -639628, -655497, -649243, -765824, -1051326, -1262885, -1114748, -713886, -525191, -781733, -1146941, -1177987, -924810, -756214, -746125, -646496, -420519, -347642, -531063, -724957, -773746, -820480, -929130, -916486, -763111, -769529, -1033149, -1180298, -958326, -706382, -818794, -1081868, -1045686, -800421, -819847, -1160435, -1379011, -1239183, -989111, -870706, -811753, -733587, -765179, -965129, -1131318, -1072963, -855953, -640189, -470175, -353488, -373792, -592063, -935304, -1247610, -1371484, -1206667, -836769, -553789, -554169, -645944, -505263, -199865, -136321, -432908, -698843, -603942, -353345, -341615, -570431, -714221, -626709, -471871, -397687, -365793, -338622, -398621, -582318, -750866, -744383, -590577]
34637e90577J25335j5058j10067j12741r5844q7336l079J88689L15197J68079
34627b17402j68037l38722j65253R8393J09339j00334k15093j05051M8239Q2321
34617i71600N5747O4835Q6461J00700J71133K77282K43707o150k67475l00166
34607e45526j49085l8985l9939l6169K9411Q6871R4254P0313q995j49800j99158
34596h86808l760K78759K97692M717k45451k02343m0744l327j4546Q9070J92865
34585e33876J01510o7115m4564J28075J60664q343j46459j40369j29984j86096
34575h66557j85877r2331m6643p4157j709J88210K19081n2670l17592j88019K49018
34564a169246N15640L36053o1981k62075j40055M6272J9071j60546k05712m4552
$$ y = [-590577, -465242, -480300, -590367, -703108, -798952, -886288, -889367, -700678, -385481, -217402, -385439, -724161, -889414, -791021, -681682, -782016, -997109, -1102160, -1053921, -971600, -915853, -851018, -764557, -663857, -492724, -215442, 28265, 22115, -245360, -545526, -694611, -733596, -773535, -809704, -780293, -693422, -599168, -528855, -537850, -687650, -886808, -890568, -611809, -314117, -309400, -554851, -757194, -797938, -801265, -815811, -726741, -533876, -432366, -499481, -544045, -415970, -255306, -263649, -410108, -550477, -680461, -866557, -1052434, -1144765, -1191408, -1265565, -1267274, -1079064, -859983, -912653, -1230245, -1418264, -1169246, -653606, -317553, -379534, -641609, -781664, -735392, -716321, -876867, -1082579, -1127131]
34554a127131P8579L2237L7154K33480L07026l5046m34562k87954K88970N27231
34544c80016J28964l00183j90332J94601K80236L6270j58785j76426j73662j69466
34534i08799m3219J31232J29767o2977k13078j46595P7315K56613K03114q0618
34524f57245l10420j90249J65517L41302K26748J54347K82516K79463q1390m28087
34514b17498l18438N5830J72060l2669j63625l8701J12253Q6970m6595j58082
34504e48495j95556j19710N2723J72735J35396M9872L6843n68j68695l08226k06400
34493a100081M9175K02570J87558R7085m6077k07882k02573N0101K77672J93178
34483d99274n4306j02476P2999J76690P2201q9733j59351j19941j0207M8704j04025
$$ y = [-1127131, -1048552, -1016315, -979161, -745681, -438655, -473701, -908263, -1196217, -907247, -380016, -251052, -551235, -741567, -546966, -266730, -230460, -389245, -565671, -739333, -908799, -952018, -820786, -691019, -753996, -967074, -1113669, -1036354, -779741, -576627, -657245, -967665, -1157914, -992397, -651095, -424347, -270000, 12516, 291979, 210589, -217498, -535936, -480106, -308046, -340715, -504340, -543041, -430788, -343818, -390413, -548495, -744051, -863761, -811038, -638303, -502907, -453035, -416192, -416760, -585455, -893681, -1100081, -1050906, -848336, -660778, -563693, -609770, -817652, -1020225, -970124, -692452, -499274, -553580, -656056, -583057, -406367, -334166, -423899, -583250, -703191, -713398, -664694, -768719]
34472g68719l58221k98924J93392N76520L21728k64258m20225p688L60822K58337
34462d07236n1988j61117p9145m8287j29531j89313j09414J07119L12193K85966
34452d70753k1065l57327m31947k35359L8870K55074L49979K57795K7537j39898
34442g27094j43315q0555J7001K30030L90783J40023l92006n03645O1225N71736
34432d35817L49922j87591k42831Q6955J12718k08239k94456l3413R7841l1391
34422g86302m8736J08388Q3153j20392q2734J93964K14811r9224k45104n1703
34412h33879N6078q7020r5471J44215J92096q2451j78299J15199K79584k476k59738
34401g52162r0133J37752K3755j17344R8030L48586J91057j07326n8865J53165
$$ y = [-768719, -1126940, -1425864, -1232472, -655952, -334224, -598482, -1018707, -1026395, -665573, -407236, -459224, -620341, -699486, -747773, -877304, -1066617, -1176031, -1068912, -756719, -470753, -491818, -849145, -1281092, -1516451, -1477581, -1222507, -872528, -614733, -587196, -727094, -870409, -950964, -933963, -703933, -313150, -173127, -565133, -1068778, -1007553, -435817, -85895, -273486, -516317, -429362, -316644, -524883, -819339, -852752, -754911, -786302, -835038, -726650, -643497, -763889, -846623, -652659, -437848, -537072, -782176, -833879, -777801, -864821, -960292, -816077, -623981, -706432, -884731, -769532, -489948, -492424, -752162, -842295, -704543, -680788, -798132, -700102, -351516, -160459, -267785, -326650, -173485]
34391a73485L2518l06542l32651p123K10367J47197N9158M4799p7145k86571k92577
34380i82055l5514J69348J10959k1890L6373K27193K40523p4133m53241m54374
34370a236811j0704L83563K62792j57218k71589L2938K56843R4941j46143j11276
34360i02664R1290J83141J25919L655j50096k11262j2986K95418L21520J4336
34350b41729k38269k26246j56399j43257j2166K12234K18781K8250N7338L17122
34340a84341K71661j75566l58603K2338K85544q9732n18522l04146J54907R5851
34330h00609k71844k13447J81106K02033j74181k79655K8157J83799n834o0579
34320a211054K35770M49392K77690j061r2617q7393r3116j6625J12794R6126l7006
$$ y = [-173485, -140967, -447509, -780160, -787283, -576916, -429719, -370561, -325762, -402907, -689478, -982055, -1017569, -848221, -737262, -759152, -722779, -495586, -255063, -329196, -782437, -1236811, -1247515, -863952, -601160, -758378, -1029967, -997029, -740186, -645245, -791388, -902664, -811374, -628233, -502314, -498659, -648755, -860017, -873003, -577585, -256065, -241729, -479998, -706244, -862643, -1005900, -1018066, -805832, -587051, -558801, -501463, -184341, 87320, -88246, -446849, -424511, -138967, -228699, -747221, -1051367, -896460, -800609, -1072453, -1285900, -1104794, -902761, -1076942, -1356597, -1328440, -1144641, -1150475, -1211054, -975284, -525892, -248202, -249263, -341880, -429273, -522389, -539014, -426220, -330094, -367100]
34309c67100n2597R289j12176l31011k62653Q6315K54749P0403j10755n2312L7725
34298h30123M481J5667J21443P5867j56534k18018M5497K72657J65502n3384p4431
34287f31376P092l1048j13142o3365M7483O7214M1333N7751L8343o9855j19653
34276g69223j2012R9353O6583j4812l2487p2465j81229j72975N3092K38633J17270
34265f80272j49476k06284k6011J25051J30789R9268N6694q8754k65738k39981
34255a244714K2899K49801K24256N2274n4791p5675r6905q6066L6448J70576J20369
34244f81528p9641j52788J7115J91031J43524J9842O6667J65701K382l45388m13381
34233a066464m7845L12530K71352K9742r466J05150L1819k24618k87138q727K92184
$$ y = [-367100, -419697, -410408, -522584, -853595, -1116248, -1029933, -775184, -704781, -815536, -867848, -830123, -825642, -809975, -688532, -612665, -769199, -987217, -941720, -669063, -503561, -556945, -631376, -624284, -655332, -768474, -831839, -784356, -717142, -675809, -618058, -579715, -649570, -769223, -781235, -681882, -615299, -630111, -662598, -735063, -916292, -1089267, -1036175, -797542, -680272, -829748, -1036032, -1062043, -936992, -806203, -706935, -650241, -738995, -1004733, -1244714, -1221815, -972014, -747758, -695484, -750275, -825950, -922855, -1008921, -972473, -801897, -681528, -761169, -913957, -896842, -705811, -562287, -542445, -475778, -310077, -307695, -653083, -1066464, -1114309, -801779, -530427, -500685, -510151, -405001, -373182, -597800, -884938, -893665, -601481]
34222f01481K82633R266k63292l80673l45502k00524O0J67958K15228J19879k9485
34211a025933o3785J02288L12704L06707O3852j48491j46228m6441j727M1618
34201f05436J33900J18810q9986k37672o2930K43425K72709P832j70597p2150
34191d62095P0167J7838j32521j53348j9640R1536L0988j50874k16737J5671L73585
34180e35430M23877L0362l64691k81661J25044K88850M4989j92278j06614Q4189
34170d83363M6830j47807j91197j8992J51984J75079J14028M7895m6434j58120
34160e10097j63319j2583J14442K9744j32370n7408K25726K76659r9143m41172
34150g69521k52462K17767L16334k3325k38148q3660M5896r1885j56218R3504
$$ y = [-601481, -318848, -309582, -572874, -953547, -1299049, -1499573, -1499513, -1331555, -1116327, -996448, -1025933, -1089718, -987430, -674726, -368019, -304167, -452658, -598886, -645327, -647054, -605436, -471536, -352726, -442712, -680384, -743314, -499889, -227180, -219348, -389945, -462095, -391928, -374090, -506611, -659959, -679599, -588063, -557075, -707949, -924686, -909015, -535430, -111553, -81191, -445882, -727543, -602499, -313649, -268660, -460938, -567552, -483363, -436533, -584340, -775537, -794529, -642545, -467466, -353438, -305543, -351977, -510097, -673416, -685999, -571557, -541813, -674183, -731591, -505865, -229206, -328349, -769521, -1021983, -804216, -487882, -511207, -749355, -833015, -787119, -879004, -1035222, -941718]
34140i41718L06361J68348k8353N1512J55104n0827k86953j28472J95108J64971
34130c94919j35057k07636j9964M0725m6215N3984K87617K32557j06250k40758
34120e35916k4767J50096R3657O9357J58902O8853k09673k29145J33948L67922
34110D3234J42240j67277j64017o5982j88065l10945j18410J51089Q2434j85055
34100g80754j96177M5770J22748o6285j59953M9083L01748K84585L3652j86755
34090e52338j95855j4308J76491J66773o2726k64315j89684R1702K64040J35152
34080d45068j72359l81157l23088o3463J73752K23738J42317R6586J12552O5278
34070e70912o3191j02000L5971J66700P5375j63644k75970j46305O5900J64450
$$ y = [-941718, -635357, -467009, -495362, -443850, -288746, -339573, -626526, -754998, -559890, -394919, -529976, -737612, -757576, -716851, -763066, -709082, -421465, -188908, -295158, -535916, -560683, -410587, -316930, -247573, -88671, -19818, -229491, -458636, -324688, 43234, 185474, 18197, -145820, -211802, -399867, -710812, -829222, -678133, -595699, -780754, -976931, -931161, -808413, -874698, -1034651, -985568, -683820, -399235, -365583, -552338, -748193, -762501, -586010, -419237, -481963, -746278, -935962, -844260, -580220, -445068, -617427, -998584, -1321672, -1385135, -1211383, -987645, -845328, -748742, -636190, -570912, -634103, -736103, -700132, -533432, -458057, -621701, -897671, -1043976, -978076, -813626]
34060h13626J38149J05029J26048J52326J33125R1140N1201l2936j82189k67344
34050d99077j35159J27282K29814N1028j92084k41736j02924O5095J88191K58450
34040b51120K33051J18575K4852n834o9795j76046j61700J279O2797j16631k85487
34029f26059j82907M6352J32098J26100K04293K58821J10438p5095m5298M1901
34019i356j11983l26492j72126K45932L55064J2350k72678j55363O8130K8683
34009c37839j62598k13645j15485j6581O9235J65398J70364J6196j72960k32012
33999h29927j34370M3749J94523K11129J10776O9120J47780J24781j43921l81620
33989e87980k73221m205L4392q6901k527K34733K22948m2523j34603N6949J80196
$$ y = [-813626, -675477, -570448, -444400, -292074, -158949, -67809, -16608, -49544, -231733, -499077, -634236, -506954, -277140, -226112, -418196, -659932, -762856, -697761, -509570, -251120, -18069, 100506, 125358, 119524, 49729, -126317, -288017, -286738, -223941, -340572, -626059, -808966, -762614, -630516, -504416, -300123, -41302, 69136, -5959, -51257, -9356, -121339, -447831, -619957, -374025, -18961, -6611, -279289, -434652, -366522, -337839, -500437, -714082, -829567, -846148, -776913, -611515, -441151, -424955, -597915, -829927, -964297, -920548, -726025, -514896, -404120, -335000, -187220, -62439, -206360, -587980, -861201, -865406, -831014, -917915, -920442, -685709, -462761, -505284, -639887, -582938, -402742]
33978d02742R6869N9471J14969l637k61446k82304p1661n2657k18102o6883L74403
33967g13720L90485j65301m22534J02072N95179K43728m01530l50976K01477L07797
33957b13323j13851k66196R2017L20354N9283k57078k40294r7443j00054j45913
33947i62498q5836J6825J14854K31788K25999m7585l28636k09286J82703L05019
33937e56653M9127j20005K5237J41807o248j32945Q211J71900Q4830q2684q5947
33926e03370n8684j90010k77891n2845K89544L37991J05496k0806R2278J70229
33916a08068L6500j09711n0365J07870J30135K520j11510j52593k00399k56020
33906g11641j84655N8545K83308K68840N4050j06094o7256M4246L3891j01268
$$ y = [-402742, -305873, -246402, -131433, -135070, -396516, -678820, -750481, -803138, -1021240, -1088123, -713720, -323235, -488536, -911070, -808998, -213819, 29909, -371621, -722597, -521120, -213323, -327174, -593370, -501353, -180999, -121716, -378794, -619088, -716531, -816585, -962498, -1048334, -1031509, -916655, -684867, -458868, -506453, -835089, -1044375, -861672, -556653, -507526, -627531, -602294, -460487, -466735, -599680, -591469, -419569, -334739, -417423, -503370, -562054, -752064, -1029955, -1082800, -793256, -455265, -349769, -370575, -278297, -108068, -71568, -181279, -231644, -123774, 6361, 8881, -102629, -255222, -455621, -711641, -896296, -837751, -554443, -285603, -231553, -337647, -404903, -360657, -326766, -428034]
33896d28034j87158r5244J10684K37773J57769n1181j82059j46054o8826o3960
33886g16290k4024J84569L98800K99486r9437l75233k30835J14481K33358K8973
33876a86152k15302k28770k8733J65044J78783M3445o5233n3675k4572q9967j65780
33865f70912j15383j2707l0957j21768q3671O4376R3636j8201k1941J60341K65778
33854d91409J11090j22788j94764j18161j0855R8190J54678M8791j41355j62387
33844h28970O499Q1288k9305l7853J84880L07272R4483j35739k8731J88660R0738
33833a06778k21881l07145j06077M9232M2587O7478J55489J10713n9697j04322
33823d80401J7228M8137j03920j95193o3214J13091J27652N5169P0772J50720
$$ y = [-428034, -615192, -710436, -599752, -361979, -204210, -255391, -437450, -583504, -652330, -716290, -740314, -555745, -156945, 142541, 43104, -332129, -562964, -448483, -215125, -186152, -401454, -630224, -658957, -493913, -315130, -271685, -336918, -390593, -415165, -505132, -670912, -786295, -799002, -829959, -951727, -1035398, -971022, -877386, -895587, -917528, -757187, -491409, -380319, -503107, -697871, -816032, -826887, -728697, -574019, -525228, -666583, -828970, -822471, -741183, -770488, -808341, -623461, -316189, -221706, -357445, -386176, -197516, -106778, -328659, -635804, -741881, -692649, -650062, -582584, -427095, -316382, -376079, -480401, -463173, -415036, -518956, -714149, -777363, -664272, -536620, -481451, -410679, -259959]
33813b59959J23059p1673k76268k59086K8209L19168K74173p6430l08959j63161
33803f70927R6082R6167r0967j36345j2567L4130k7680J3295J57176J39971q7078
33792d88743k19599q7026O7007j0137j76885j43096P4956K02787J17064k3266
33782f86938m8259m338m3372j69751k04104k9207K06131K42048M8957j35548j44145
33771i68526q1073r7318j40555p7909P0922J92364K64909L17422K87358R5413
33761a36993j79612l37898k54104K1569K89489L05842N118l41398l72835r8579
33751a099401J13583P2979p879M9269P2953r6532k49414j28332J40143K63209
33741h69422K19916J60634P8748p4028j40092J3227J89841J54923M4354R4095
$$ y = [-259959, -136900, -208573, -484841, -743927, -715718, -396550, -122377, -198807, -507766, -670927, -574845, -478678, -569645, -705990, -718557, -684427, -712107, -698812, -541636, -401665, -488743, -708342, -795368, -728361, -738498, -915383, -1058479, -983523, -780736, -663672, -686938, -735197, -739535, -782907, -952658, -1156762, -1185969, -979838, -737790, -688833, -824381, -968526, -1049599, -1146917, -1287472, -1365381, -1294459, -1102095, -837186, -519764, -232406, -136993, -316605, -654503, -908607, -887038, -597549, -291707, -286589, -627987, -1000822, -1099401, -985818, -912839, -920718, -871449, -798496, -895028, -1144442, -1272774, -1132631, -869422, -649506, -488872, -410124, -484152, -624244, -611017, -421176, -266253, -221899, -127804]
33731a27804J58967l5054l17969k80669L0507J70537L3231k8029J17691J39297
33721a39295j38483l81371k65813N0717K47339K85858K62825J15718k01708m52527
33711f16740l48494L0830K95164K01522r7731k57968j07378J89427L15355J59477
33701b36536o7422j33086p8281o7722p9589J8325J63123J53712K469n7939L8368
33690c44578P4111q2923k38541j51513J06923K31893N8100k46591l53250j23578
33680a069947K12476L00438J02783n2488N3883K16525J48637n8946j02898M0371
33670b09166J10153k739j26337j18966m0061J6683L2159j5461j33364k15812j52562
33659h55473j7616L7376L3675R9354K01669J83685M7699l0715K5002J04758R1757
$$ y = [-127804, 31163, -3891, -321860, -602529, -572022, -401485, -368254, -396283, -278592, -139295, -277778, -659149, -924962, -874245, -626906, -341048, -78223, 37495, -164213, -616740, -965234, -934404, -639240, -437718, -535449, -793417, -900795, -711368, -396013, -236536, -303958, -437044, -515325, -583047, -662636, -644311, -481188, -327476, -325007, -382946, -344578, -270467, -353390, -591931, -743444, -636521, -404628, -346528, -593119, -946369, -1069947, -857471, -557033, -454250, -506738, -452855, -236330, -87693, -146639, -249537, -209166, -99013, -101752, -228089, -347055, -387116, -370433, -338274, -353735, -487099, -702911, -855473, -873089, -835713, -802038, -702684, -501015, -317330, -269631, -300346, -275344, -170586, -78829]
33648g8829l3399k22331l37900k05268J30595L34477J95364m5384n4532Q1235
33638b35972N7103r5260r7343J5315p9229l69681m15418k0709M17987M59151J81182
33627a82874m2509q2399r9594j90223k30600q1890J76707K88570J18210j39479
33617d66081j83699l0873K4757p6645l8722K20549K89576q7916m62794k87275
33607a099123K04877L23536k6381k60288o3125K05041J68121m4963j33469n9349
33597g85123M5703R7142N4047m6211k0113K21048M04201K08797k04261l68654
33587c93424j77651M4980J02969R9269O2431j10014l00434k42029M676J04127
33577h05100R539K89J33485J71917R5727J38272K53375J27934j83375k46192K86
$$ y = [-78829, -112228, -334559, -672459, -877727, -747132, -412655, -217291, -262675, -317207, -235972, -178869, -274129, -371472, -356157, -435386, -805067, -1220485, -1241194, -823207, -364056, -182874, -225383, -307782, -407376, -597599, -828199, -910089, -733382, -444812, -326602, -466081, -649780, -680653, -655896, -732541, -771263, -550714, -261138, -349054, -811848, -1099123, -894246, -570710, -597091, -857379, -920504, -715463, -547342, -592305, -725774, -785123, -739420, -642278, -588231, -634442, -654555, -433507, -29306, 179491, -24770, -393424, -571075, -526095, -423126, -323857, -261426, -371440, -671874, -913903, -909227, -805100, -795561, -795272, -661787, -489870, -394143, -255871, -2496, 125438, -57937, -304129, -303843]
33566c03843J10835o9155j34722J00367K17548o7487l77438k83595O4767L01088
33556d41635L67137L27252J12079k09951l37398k13820j54890k46481j51158J99576
33546g49289L30421K0461k37907l8369K71153K37709N5067R0338J84772N1605
33536B15961j02478m967O8434k12924n21296l61181O4722K00497N0487J6688R2548
33525d93509j2179j55756K5030L27265K17581k03382k84766R7869L46686J46716
33515A1555q8793j226J60695P2626j37881k20271k11795k13601j25738J02013
33505f52416K47654J15206j50440k53599j05431J34056K44629J22452j09475j84046
33495e91410j8153J34400M4904j20022o1405J58991K28284Q6985m2248o5580p9122
$$ y = [-303843, -193008, -262163, -396885, -296518, -78970, -146457, -523895, -807490, -742723, -441635, -74498, 252754, 364833, 154882, -182516, -396336, -551226, -797707, -948865, -749289, -418868, -398407, -636314, -674683, -403530, -165821, -110754, -20416, 164356, 215961, 113483, 108516, 176950, -35974, -557270, -918451, -853729, -653232, -602745, -586057, -493509, -505688, -661444, -636414, -309149, -91568, -294950, -579716, -481847, -135161, 11555, -77238, -78464, 82231, 154857, 16976, -203295, -415090, -628691, -754429, -652416, -404762, -289556, -439996, -693595, -799026, -664970, -420341, -297889, -407364, -591410, -609563, -475163, -430259, -550281, -611686, -452695, -224411, -137426, -179674, -245254, -324376]
33484c24376o1465R4649K47115J13837k30897l65739j27796J50550J42111n5937
33474d17948j62119j06673r318N5777J06632J53059J49357L5991j50269k11140
33464e56651J1319L13815K74223j30549l73123j20905K13025R0741k82155k80588
33454h40848J26569L40913R9174j74734j15791O8262P1616p420M8534J52008J00677
33443a31040m8628q7778O246O8279n660j51077k23475j35290L8532J09504J4093
33432e46294p8643k7197M8328q840q8640j3890R4978j183k08644k07133L0379
33421a006779K05900J81666J17638J00504K0237j14098r8944J12331K83981K27203
33411B9639J2530j91844k61601j14993J63956K58757j0014l30446k85644K043
$$ y = [-324376, -385841, -291192, -44077, 69760, -161137, -526876, -654672, -504122, -362011, -417948, -580067, -686740, -696058, -640281, -533649, -380590, -231233, -195242, -345511, -556651, -545332, -231517, 42706, -87843, -460966, -581871, -368846, -278105, -560260, -840848, -714279, -373366, -274192, -448926, -564717, -496455, -424839, -432259, -383725, -231717, -131040, -179668, -267446, -261200, -192921, -198581, -349658, -573133, -708423, -669891, -560387, -546294, -624937, -652134, -603806, -612646, -701286, -715176, -620198, -621381, -830025, -1037158, -1006779, -800879, -619213, -501575, -401071, -380834, -494932, -593876, -481545, -197564, 29639, 42169, -149675, -411276, -526269, -362313, -103556, -113570, -444016, -729660, -727617]
33401g27617O8238j26299j73794L2429J33409o837o4073R8781J51987n5730j56377
33390h25883P4060K60051P4453j52501N311L07776K38553j27191k58317k2470
33380d26158J77216Q7971q6810j22897q5515q9745p9716J4318J18709J29074M3230
33369c20323o9670j25345m9478J36447K62413J61418j14206l09435k15580J20263
33359e23496M12249L72068K039l55268l57926m3873K40618K53906N2507j74651
33349a21827k65563j22106J74824L17593J02296k26629k67091n4514J5595j47417
33339e94839k07014j8487J38205J15558J63509L66638L37921j33230n82880m98220
33329i12839p9637J27062O3021P8905K38841K66155Q8020p4460j23172j51093
$$ y = [-727617, -659379, -785678, -959472, -927043, -793634, -800471, -864544, -765763, -613776, -669506, -825883, -751823, -491772, -417319, -569820, -564509, -256733, -18180, -145371, -403688, -426158, -248942, -160971, -247781, -370678, -456193, -545938, -625654, -611336, -492627, -363553, -320323, -389993, -515338, -564816, -428369, -165956, -4538, -118744, -428179, -643759, -523496, -111247, 260821, 262860, -92408, -450334, -494207, -253589, 317, 52824, -121827, -387390, -509496, -334672, -17079, 85217, -141412, -408503, -463017, -447422, -594839, -801853, -820340, -682135, -566577, -403068, -36430, 301491, 168261, -414619, -912839, -992476, -865414, -802393, -723488, -484647, -218492, -130472, -204932, -328104, -479197]
33319d79197j33849K8511J95175J19795j14748j87820m9740N0908K8983L7989
33309e03993P9555k2530j99626j32702K02234L90841J68299j90617k75957o4653
33299e49149J59624J94088N5381j03190j03008P8556K02056L6462k72171l71084
33289f72435k28354j35165j51528J567L48501M42324N3477l38654j74125L52305
33279e02087N61016K36690j65566k22130j3480J61398J77528O7654j13789k66560
33269g9326k65958j23402J473J2770k6579n2488r8051j67322j59873k1888J37039
33258h43605J79672J12964L5582q412k5176R733J02757J50190L9529j46003j76784
33247e69553n36J31874R641j89318j29134J49796K45473K7554j02840J56913M45792
$$ y = [-479197, -613046, -584535, -389360, -269565, -384313, -572133, -621873, -570965, -541982, -503993, -424438, -446968, -646594, -779296, -577062, -186221, -17922, -208539, -484496, -549149, -389525, -195437, -140056, -243246, -346254, -267698, -65642, -29180, -301351, -672435, -900789, -1035954, -1187482, -1185915, -837414, -395090, -341613, -680267, -854392, -502087, 58929, 295619, 130053, -92077, -105557, 55841, 233369, 301023, 187234, -79326, -345284, -468686, -467213, -454443, -481022, -533510, -631561, -798883, -958756, -980644, -843605, -663933, -550969, -515387, -523799, -548975, -539242, -436485, -286295, -246766, -392769, -569553, -570089, -438215, -428574, -617892, -747026, -597230, -351757, -324203, -427043, -270130, 175662]
33236A75662K37918k95778m79812j47804J51808Q4479O163J93764K50500j65607
33226A1293n56740k78711L29061L75744j59639l78587P3121M45651J44369l17471
33216c11909k17254K08396K37252j48558l38596j27624Q1050M2143l0118K6534
33206e78684P2615K5227L653K9014j7220q1631J2564J67617Q7627j92406k97091
33195g68715j12311O0862O5767J19900L12087L57981J09479j35239j18796j6772
33185a25757m5766q1633J319J0567j65483k26439L4641K60498P3003k34276j34419
$$ y = [175662, 413580, 117802, -362010, -509814, -358006, -273527, -267364, -73600, 176900, 11293, -545447, -824158, -495097, -119353, -278992, -657579, -584458, -138807, 5562, -311909, -529163, -320767, -83515, -232073, -570669, -698293, -617243, -575100, -605218, -578684, -506069, -480842, -477189, -448175, -465395, -547026, -534462, -366845, -279218, -471624, -768715, -881026, -820164, -754397, -634497, -322410, 35571, 145050, 9811, -108985, -125757, -171523, -253156, -251837, -241270, -406753, -633192, -598551, -338053, -265050, -499326, -633745]
$$ [...]
##END NTUPLES=NMR SPECTRUM
##END=
