##TITLE=31Pdec_53-2021
 CDCl3, 24 sc
 7.07.2021
##JCAMPDX= 6.0         $$ Bruker NMR JCAMP-DX V2.0
##DATA TYPE= NMR SPECTRUM
##DATA CLASS= NTUPLES
##ORIGIN= UXNMR, Bruker Analytische Messtechnik GmbH
##OWNER= root
$$ XWIN-NMR		Version 3.5
$$ Wed Jul  7 10:56:07 2021 Russian Standard Time (UT+4h)  she@DPX200
##.OBSERVE FREQUENCY= 81.013821
##.OBSERVE NUCLEUS= ^31P
##.ACQUISITION MODE= SIMULTANEOUS
##.ACQUISITION SCHEME= undefined
##.AVERAGES= 24
##.DIGITISER RES= 16
##SPECTROMETER/DATA SYSTEM= spect
##.PULSE SEQUENCE= zgpg30
##.SOLVENT NAME= CDCl3
##.SHIFT REFERENCE= (INTERNAL, CDCl3, 0, 248.564)
##AUDIT TRAIL= $$ (NUMBER, WHEN, WHO, WHERE, WHAT)
$$ ##TITLE= Audit trail, XWIN-NMR		Version 3.5
$$ ##JCAMPDX= 5.01
$$ ##ORIGIN= Bruker BioSpin GmbH
$$ ##OWNER= she
$$ F:/spectra/data/she/nmr/P31/1/pdata/1/auditp.txt
$$ ##AUDIT TRAIL=  $$ (NUMBER, WHEN, WHO, WHERE, WHAT)
(   1,<2021-07-07 10:54:41.67 +0400>,<she>,<DPX200>,
      <created by zg, POWCHK disabled, PULCHK disabled
       configuration hash MD5:
       00 E9 B6 7A A2 85 ED C7 34 08 36 98 17 FE 4E 26
       data hash MD5: 32K
       D8 E4 AF B1 BD DE 2F 45 7D 7A EB 5A 4C DC 72 B8>)
(   2,<2021-07-07 10:54:45.00 +0400>,<she>,<DPX200>,
      <Start of raw data processing
       efp BC_mod = 2 LB = 1 FT_mod = 6 PKNL = 1 PHC0 = -7205.746 PHC1 = -286.1141 SI = 64K 
       data hash MD5: 64K
       0F 5F 0F 77 46 88 FB 14 1A 22 F3 23 79 BC 7F A9>)
(   3,<2021-07-07 10:55:21.34 +0400>,<she>,<DPX200>,
      <pk PHC0 = 3.507034 PHC1 = -40.6 
       data hash MD5: 64K
       D2 83 36 27 65 7A EE BB E4 BA 7E 06 8F 27 FE E9>)
(   4,<2021-07-07 10:55:26.85 +0400>,<she>,<DPX200>,
      <abs ABSG = 5 
       data hash MD5: 64K
       AE 94 E9 DD 56 64 CF 76 D3 06 51 80 B1 DA B1 79>)
$$ ##END=
$$ 
$$ hash MD5
$$ A6 99 73 1C DA FB D4 DA FF 8E 33 83 26 3D A9 6D
##$RELAX= 
##$RELAX= 
##$RELAX= 
##$RELAX= 
##$RELAX= 
##$RELAX= 
##$RELAX= 
##$RELAX= 
$$ Bruker specific parameters
$$ --------------------------
##$DU= <F:/spectra>
##$EXPNO= 1
##$NAME= <P31>
##$PROCNO= 1
##$TYPE= <nmr>
##$USER= <she>
##$AMP= (0..31)
100 100 100 100 100 100 100 100 100 100 100 100 100 100 100 100 100 100 
100 100 100 100 100 100 100 100 100 100 100 100 100 100 
##$AQSEQ= 0
##$AQ_mod= 1
##$AUNM= <au_zg>
##$AUTOPOS= <>
##$BF1= 81.014009
##$BF2= 200.13
##$BF3= 200.13
##$BF4= 200.13
##$BF5= 200.13
##$BF6= 200.13
##$BF7= 200.13
##$BF8= 200.13
##$BYTORDA= 1
##$CFDGTYP= 0
##$CFRGTYP= 5
##$CHEMSTR= <none>
##$CNST= (0..31)
1 1 145 1 1 1 1 1 1 1 1 1 1 1 1 1 1 1 1 1 1 1 1 1 1 1 1 1 1 1 1 1 
##$CPDPRG= <waltz16>
##$CPDPRG1= <>
##$CPDPRG2= <waltz16>
##$CPDPRG3= <>
##$CPDPRG4= <mlev>
##$CPDPRG5= <mlev>
##$CPDPRG6= <mlev>
##$CPDPRG7= <mlev>
##$CPDPRG8= <mlev>
##$CPDPRGB= <>
##$CPDPRGT= <>
##$D= (0..31)
0 1 0 0 0 0 0 0 0 0 0 0.03 2e-05 3e-06 0 0 0 0 0 0 0 0 0 0 0 0 0 0 0 0 
0 0 
##$DATE= 1625640881
##$DBL= (0..7)
120 120 120 11 120 120 24 19 
##$DBP= (0..7)
150 150 150 150 150 150 150 150 
##$DBP07= 0
##$DBPNAM0= <>
##$DBPNAM1= <>
##$DBPNAM2= <>
$$ [...]
##$SUBNAM3= <"">
##$SUBNAM4= <"">
##$SUBNAM5= <"">
##$SUBNAM6= <"">
##$SUBNAM7= <"">
##$SUBNAM8= <"">
##$SUBNAM9= <"">
##$SW= 501.771253377433
##$SWIBOX= (0..15)
0 1 3 0 0 0 0 0 0 0 0 0 0 0 0 0 
##$SW_h= 40650.406504065
##$TD= 32768
##$TD0= 1
##$TE= 0
##$TE2= 300
##$TE3= 300
##$TEG= 300
##$TL= (0..7)
0 120 53 12 22 120 120 120 
##$TP= (0..7)
150 150 150 150 150 150 150 150 
##$TP07= 0
##$TPNAME0= <>
##$TPNAME1= <>
##$TPNAME2= <>
##$TPNAME3= <>
##$TPNAME4= <>
##$TPNAME5= <>
##$TPNAME6= <>
##$TPNAME7= <>
##$TPOAL= (0..7)
0.5 0.5 0.5 0.5 0.5 0.5 0.5 0.5 
##$TPOFFS= (0..7)
0 0 0 0 0 0 0 0 
##$TUNHIN= 0
##$TUNHOUT= 0
##$TUNXOUT= 0
##$USERA1= <user>
##$USERA2= <user>
##$USERA3= <user>
##$USERA4= <user>
##$USERA5= <user>
##$V9= 5
##$VALIST= <valist>
##$VCLIST= <CCCCCCCCCCCCCCC>
##$VD= 0
##$VDLIST= <DDDDDDDDDDDDDDD>
##$VPLIST= <PPPPPPPPPPPPPPP>
##$VTLIST= <TTTTTTTTTTTTTTT>
##$WBST= 1024
##$WBSW= 4
##$XGAIN= (0..3)
0 0 0 0 
##$XL= 0
##$YL= 0
##$YMAX_a= 5686
##$YMIN_a= -5586
##$ZGOPTNS= <>
##$ZL1= 120
##$ZL2= 120
##$ZL3= 120
##$ZL4= 120
##$ABSF1= 248.5645
##$ABSF2= -253.2056
##$ABSG= 5
##$ABSL= 3
##$ALPHA= 0
##$AQORDER= 0
##$ASSFAC= 0
##$ASSFACI= 0
##$ASSFACX= 0
##$ASSWID= 0
##$AUNMP= <proc_1d>
##$AZFE= 0.1
##$AZFW= 0.5
##$BCFW= 0
##$BC_mod= 2
##$BYTORDP= 0
##$COROFFS= 0
##$CY= -3
##$DATMOD= 1
##$DC= 0
##$DFILT= <>
##$DTYPP= 0
##$F1P= 0
##$F2P= 0
##$FCOR= 1
##$FTSIZE= 65536
##$FT_mod= 6
##$GAMMA= 0
##$GB= 0
##$INTBC= 1
##$INTSCL= 5.30512e-09
##$ISEN= 30
##$LB= 1
##$LEV0= 0
##$LPBIN= 0
##$MAXI= 10000
##$MC2= 0
##$MEAN= 0
##$ME_mod= 0
##$MI= 50
##$NCOEF= 0
##$NC_proc= -5
##$NLEV= 6
##$NOISF1= 182.463
##$NOISF2= 159.3651
##$NSP= 0
##$NTH_PI= 0
##$NZP= 0
##$OFFSET= 248.5645
##$PC= 4
##$PHC0= -7202.239
##$PHC1= -326.7141
##$PH_mod= 1
##$PKNL= yes
##$PPARMOD= 0
##$PSCAL= 0
##$PSIGN= 0
##$REVERSE= no
##$SF= 81.014009
##$SI= 65536
##$SIGF1= 159.3651
##$SIGF2= -187.1042
##$SINO= 113.3802
##$SIOLD= 16384
##$SREGLST= <1H.CDCl3>
##$SSB= 0
##$STSI= 65536
##$STSR= 0
##$SW_p= 40650.406504065
##$SYMM= 0
##$S_DEV= 0
##$TDeff= 32768
##$TDoff= 0
##$TI= <>
##$TILT= no
##$TM1= 0
##$TM2= 0
##$TOPLEV= 0
##$USERP1= <user>
##$USERP2= <user>
##$USERP3= <user>
##$USERP4= <user>
##$USERP5= <user>
##$WDW= 1
##$XDIM= 65536
##$YMAX_p= 511705031
##$YMIN_p= -9356751
$$ End of Bruker specific parameters
$$ ---------------------------------
##NTUPLES= NMR SPECTRUM
##VAR_NAME=  FREQUENCY,     SPECTRUM/REAL,   SPECTRUM/IMAG
##SYMBOL=    X,             R,               I
##VAR_TYPE=  INDEPENDENT,   DEPENDENT,       DEPENDENT
##VAR_FORM=  AFFN,          ASDF,            ASDF
##VAR_DIM=   65536,         65536,           65536
##UNITS=     HZ,            ARBITRARY UNITS, ARBITRARY UNITS
##FACTOR=    0.620285442955139, 1,           1
##FIRST=     20137.2065510759, 0,            0
##LAST=      -20513.1999529892, 0,           0
##MIN=       -20513.1999529892, -9356751,    0
##MAX=       20137.2065510759, 511705031,    0
$$ Real data points
##PAGE= N=1
##DATA TABLE= (X++(R..R)), XYDATA
$$ [...]
##PAGE= N=2
##DATA TABLE= (X++(I..I)), XYDATA
38046h69291M89232Q95580N24414p8462k02188J55350L18805o9660m83701k90442
38036C89637K57445L78153o1965l90666j71909K53232M34658L92998K53045r3112
38026A641516n48859n96321n2709M15835J59974m31953m74318J02091N35022M21322
38016A171600J37073K1084r1504l08414l36412l8579J94765P272l74947m85490
38006a03552k18075J62499L54837K11618j28711k30988J59013O02577M24032k59776
37996I73474n81322j68222L36347L13172K8467p700J05083K8310j41307j87630
37986F98672k72361m83827l89521K44768P63905M71018k31484m32004j01290P7344
37976C45220M672J91002N72230M64439j58480m53415q1706K31568n8347m54643
$$ plain form
38046 -869291 -380059 515521 1039935 961473 759285 914635 1233440 1163780 680079 389637
38036 389637 647082 1025235 963270 572604 400695 653927 1088585 1481583 1734628 1641516
38026 1641516 1092657 496336 443627 859462 1019436 587483 113165 215256 750278 1171600
38016 1171600 1308673 1329757 1238253 929839 593427 554848 749613 756885 381938 -103552
38006 -103552 -321627 -159128 195709 407327 278616 47628 206641 809218 1233250 973474
37996 973474 392152 223930 560277 873449 901916 894216 999299 1027609 886302 698672
37986 698672 426311 -57516 -447037 -202269 561636 1032654 801170 369166 267876 345220
37976 345220 349892 540894 1113124 1577563 1419083 965668 883962 1115530 1057183 602540
37966F02540l50556J151Q2465j1241M9173J30769r660j33283O8796L34086K17235
37955I81475j69101l64398k56277n4383J70608M15531M63319J78354j45631k02913
37945A016584j66226k66446k26457K51123P29108N31918j65788n43900l67018
37936G92898j78829k42208j96746L1039o7507n41003n60096K74095R86392N16952
37926H14987n83964q34041L9770P79765N12237j21823j82403J64767J78975j61224
37916F07046k45804R2240L87863L42198J29537r9472m06743o79781o15527k31370
37906g19813R0858J95075L00246M47606L62304O1914n169K60889L09745j51005
37896A152650n52805l44431Q4816Q1064j49119K3849M03933J94183n65831q38239
$$ plain form
37966 602540 251984 253135 335600 324359 373532 504301 494641 361358 430154 764240 981475
37955 981475 812374 447976 191699 137316 307924 723455 1186774 1365128 1219497 1016584
37945 1016584 850358 583912 357455 608578 1337686 1869604 1703816 1159916 792898
37936 792898 614069 371861 175115 206154 138647 -402356 -962452 -688357 298035 814987
37926 814987 231023 -603018 -563248 216517 728754 606931 424528 589295 768270 607046
37916 607046 361242 453482 841345 1183543 1313080 1213608 806865 127084 -488443 -719813
37906 -719813 -628955 -433880 -133634 313972 676276 738190 733021 993910 1303655 1152650
37896 1152650 599845 255414 340230 421294 272175 296024 699957 894140 328309 -509930
37886e09930j25169P37429P79194J78648k01789m5138K45931K92674J11532j32277
37876A331105l33112m35998m51783m29544l16386j1645L51690M32207J36982j92732
37866H0784k24011k3466J68742K99979M11995M08218J88903j03234k05031m8035
37856I54844J80883K32605P52l48050m48785j41729K12556J23130k97872l95920
37846G2414P7463N16773K92873l20599n06829j5677N50984N56895N6290l95128
37836H85459l99772n4324K50457K55572O1412o1969m6473p8643k52140l55067
37826B04512j56695K15818L90794K17271o2104j41807j2163J11470J23074J19098
37816A009268J49568Q1762j46130l15711k29629r0060k09198m05641j83804M11396
$$ plain form
37886 -509930 -635099 102330 881524 1060172 858383 813245 1059176 1351850 1463382 1331105
37876 1331105 997993 561995 110212 -319332 -635718 -647363 -295673 136534 273516 80784
37866 80784 -143227 -166693 2049 302028 714023 1122241 1311144 1207910 1002879 954844
37856 954844 1135727 1368332 1369084 1021034 572249 430520 643076 766206 468334 72414
37846 72414 149877 666650 959523 638924 132095 116418 667402 1224297 1280587 885459
37836 885459 485687 431363 681820 937392 998804 936835 890362 811719 559579 204512
37826 204512 47817 263635 654429 871700 809596 667789 655626 767096 890170 1009268
37816 1009268 1158836 1240598 1094468 778757 549128 459068 249870 -155771 -339575 71821
37806G1821O97028L56951n4218k9400O5633k88447p30860n31855J76319N82344
37796C15316M71410L86603N06197L36490k42633n45891j43840L83700L02206k16287
37786A553271m48146j63343K01925K09986j26932m37682l25524K30019P16871
37777A410445N90996j9322m48548l77107j63906k09470m34075n37123l80452j528
37767e70090L85058L99816k9453k92078J71634Q35857O45676l20509p70517j08596
37757C46798O40975M33986k47241l14830K19670M79362J87553j13331r5741j9450
37747A517751j17661k92124m07119l85856j11769L26980M72708L8122n63383o72585
37737a94936k09844L42907N86273M60133R0930k43794k27512R4126K87467J53180
$$ plain form
37806 71821 768849 1125800 1071582 1042182 1107815 819368 88508 -443347 -267028 315316
37796 315316 786726 1173329 1679526 2016016 1773383 1227492 1083652 1467352 1769558 1553271
37786 1553271 1105125 941782 1143707 1353693 1226761 789079 463555 693574 1410445
37777 1410445 2001441 1982119 1533571 1156464 992558 783088 349013 -188110 -568562 -570090
37767 -570090 -185032 214784 185331 -106747 64887 900744 1546420 1225911 455394 346798
37757 346798 987773 1421759 1174518 859688 1079358 1558720 1746273 1632942 1537201 1517751
37747 1517751 1400090 1107966 700847 314991 203222 530202 1002910 1041032 477649 -194936
37737 -194936 -404780 -61873 524400 984533 1075463 831669 604157 698283 985750 1138930
37727A138930k2544q6391l09511o75743n67414K27108Q47411M94332l17712n37492
37717A90974j51584K9601j55165q3521L77727N67229J80842k04780p3451L04527
37707I82399M26081K49404P404k08204l62678l11886J650L55923M05385j0873
37697A534605o48602r04895l64611N45147Q48780K58830l53488j62179M39850
37688A193437M95820j01525o02861n48873j67455K27033N14827N22963J40539
37679A673905l46090n41471m48498k55910P5752M82155M63814j96677p69742m66427
37669c29189L31498O29155L06001M2531J1644k13263n47174m04111J10522K13966
37659A51580j59721j68256M28697P55948K97531k29167j09669K34571R6467l34616
$$ plain form
37727 1138930 1116386 1029995 720484 44741 -522673 -295565 551846 1046178 728466 190974
37717 190974 39390 68991 -86174 -169695 208032 775261 956103 751323 677872 982399
37707 982399 1408480 1657884 1665288 1457084 1094406 782520 784170 1140093 1545478 1534605
37697 1534605 886003 -18892 -383503 161644 1010424 1269254 915766 753587 1193437
37688 1193437 1689257 1587732 984871 435998 268543 495576 1010403 1533366 1673905
37679 1673905 1327815 786344 337846 81936 157688 639843 1103657 906980 137238 -329189
37669 -329189 2309 631464 937465 979996 991640 778377 231203 -172908 -62386 151580
37659 151580 -8141 -176397 252300 1008248 1305779 1076612 966943 1201514 1297981 963365
37649I63365m39735k15866q7428j12863o7994L699p4778j63373J0672L70911N57318
37638G43928L61622r4384m57868l67647J65177O13638N06648N8544k01777k57898
37628A069983m46132o28088l34607K84252N43542L52996L28551N89625M57814
37619B217936k78518p95701m74099J62818L52258J61352K3263q3184l11412m09856
37609E64857j72690Q1829O4380K7745J85120J88747k11572n48467l29472J40048
37599i475K70473P4435p6387j28453j61539J6862M46311O20166J87221l59174
37589H80440l68616j7069R6214m4643l1289J04149j7938l33703l77878n1836K63772
37578A01603L10653J64093n8448k57589k61243n6939Q5540M1708N0277J74641
$$ plain form
37649 963365 523630 307764 220336 107473 39479 43178 -31600 -194973 -184301 186610 743928
37638 743928 1105550 1011166 553298 185651 350828 964466 1471114 1529658 1327881 1069983
37628 1069983 623851 -4237 -338844 -54592 488950 841946 1170497 1760122 2217936
37619 2217936 1939418 1143717 669618 832436 1184694 1346046 1369309 1286125 974713 564857
37609 564857 392167 473996 538376 566121 751241 939988 728416 179949 -149523 -9475
37599 -9475 260998 335433 259046 130593 -30946 -14084 432227 1052393 1239614 880440
37589 880440 511824 494755 590969 546326 515037 619186 601248 267545 -110333 -162169 101603
37578 101603 412256 576349 517901 260312 -931 -57870 27670 69378 119655 294296
37568B94296L1345m83373p33073k16079N79277Q51514N64371J82673j57063m48182
37558D65706l28441K89597N94222p0235r32499p47781K76499P91294L89219j2826
37548G14755P5104M8075l71654m62138J24304N51256J65858l50508r9426N91181
37538I86807P82119L46092j46282m54189o61442n43725J10075P71085O67084p3077
37528A784547n62499m05961n6840P5445J03364J27826k8671k96381k11626L54881
37518H84085Q47522P73020L44670L161k49359n54359o43803k20781L28504K92357
37508A805017l15354o95757l66761K41193M83094K81085n3618l21384m31838k89574
37498C36103k9704k9277l43187m75260q4930M36904N31975K62165M0001p5403
$$ plain form
37568 294296 325641 -157732 -890805 -1106884 -527607 323907 888278 1070951 913888 465706
37558 465706 137265 426862 1021084 950849 18350 -729431 -452932 338362 727581 714755
37548 714755 789859 837934 466280 4142 128446 679702 845560 495052 395626 986807
37538 986807 1768926 2115018 1968736 1514547 853105 309380 419455 1190540 1857624 1784547
37528 1784547 1222048 816087 759247 834692 938056 1065882 1037211 740830 529204 884085
37518 884085 1731607 2504627 2849297 2852458 2603099 2048740 1404937 1184156 1512660 1805017
37508 1805017 1489663 793906 427145 668338 1151432 1432517 1378899 1057515 625677 336103
37498 336103 306399 277122 -66065 -541325 -626255 -189351 342624 604789 644790 569387
37488E69387k31272k55722M5469L32540K07428N667K73128O47912K81107o39890
37478A235754r05372o7674Q45013Q28328J70081l07341m11895l70683k01155M5020
37468H60076L3144k48752k40525K55088N60847K06509j88296P2226N19589K75276
37458B105182m52709p04723l11252k2298j89555l30461q9956K28999K80490J45206
37448F58923J2787p7218p9177K8115M8309j78505m05378k84430R9314M31538O68721
37437I22999Q32257O24845q2972o73067m82563J12023J82650k99368m69177m7197
37427F20430K31796p2309l52059Q286O32473P76385L84899l2497j72046r7164
37417A928194N3290J10414j08370m93206n98296k00265L25055M52392J45231j84218
$$ plain form
37488 569387 338115 82393 127862 460402 667830 673497 946625 1594537 1875644 1235754
37478 1235754 330382 262708 1107721 1936049 2106130 1798789 1386894 1016211 815056 860076
37468 860076 893220 644468 403943 659031 1219878 1426387 1238091 1310317 1829906 2105182
37458 2105182 1652473 947750 636498 614200 424645 94184 4228 233227 513717 658923
37448 658923 671710 594492 515315 543430 591739 413234 7856 -276574 -177260 254278 922999
37437 922999 1755256 2380101 2297129 1624062 1141499 1253522 1436172 1136804 667627 620430
37427 620430 852226 779917 427858 436144 1068617 1845002 2229901 2197404 2025358 1928194
37417 1928194 1981484 2091898 1983528 1490322 892026 691761 1016816 1469208 1614439 1430221
37407A430221k05420J2754J19194j37399n41908n33219P3498O61350N28595r9048
37397A308618l44318M1659L48157L9784m44745m25605O773K21326k4273l64083
37387C63293l87000n7833L45325M86321K65333r540P0009M27187N14491R0434
37377B108020l65804l23369K5004Q1395k57305n08445l75839j22337l9017L2578
37367B54881L49834P10203O37486O9645m98435o35802m38870k32717j06013O228
37357A16440L7232n8439n9860J92725L87003J71873j23476J19423O95420O82255
37347B160596j02468o38097k16948L99789J37645p11344r51511k81285L98704
37338A95081M10068R1237J8501J89793K52274L5403l46432n84758l46118L09837
$$ plain form
37407 1430221 1224801 1237555 1356749 1219350 677442 144223 217721 879071 1407666 1308618
37397 1308618 964300 1005959 1354116 1393900 949155 523550 530323 751649 727376 363293
37387 363293 -23707 -81540 263785 750106 1015439 1005899 1075908 1503095 2017586 2108020
37377 2108020 1742216 1418847 1443851 1525246 1267941 759496 383657 261320 222303 254881
37367 254881 604715 1314918 1952404 2022049 1523614 887812 448942 216225 110212 116440
37357 116440 153672 95233 35373 228098 615101 786974 663498 782921 1478341 2160596
37347 2160596 2058128 1420031 1203083 1602872 1740517 1029173 77662 -203623 195081
37338 195081 605149 696386 714887 904680 1156954 1192357 845925 261167 -84951 224886
37328B24886P82919O09152J12467j05125p8001k31559m54484k69841J37543L6213
37318G64170n51615o47410J82730J003932P98647j00002n74175k67928J70835
37309G79184J70926j30535l39643l44552k34562j1077L72052P54145P59617K03471
37299A979026n22901p21619j94672M47311N18983Q0802k84929k94542j39152R938
37289H78245J90909L69995L88637K21970n788k12123l13753j76105R7215J02639
37279A541841k58164m70362j91743Q8643j55587m85461j75455M64445N20186K6590
37269I04933j14326K48865K81653k40511m39306P8868M14947j02572o96802l77818
37259d2069M62774P13693K05158k76138k53978K6247K15322J72565j53035n83463
$$ plain form
37328 224886 1007805 1616957 1729424 1624299 1546298 1314739 860255 590414 727957 764170
37318 764170 212555 -434855 -252125 751807 1550454 1450452 876277 608349 779184
37309 779184 950110 819575 479932 135380 -99182 -110259 261793 1015938 1775555 1979026
37299 1979026 1456125 734506 539834 987145 1506128 1586930 1302001 1007459 868307 878245
37289 878245 1069154 1439149 1827786 2049756 2043968 1831845 1518092 1341987 1439202 1541841
37279 1541841 1283677 813315 621572 710215 554628 69167 -106288 358157 878343 904933
37269 904933 790607 1039472 1321125 1080614 641308 720176 1135123 1032551 335749 -42069
37259 -42069 420705 1134398 1339556 1063418 809440 835687 1051009 1223574 1070539 487076
37249D87076o65111k34638K39154K98151J24426R7200J46444N4250j7415J38678
37239F68215K82833J31244r4464o4882O2769p746j40169r9253n6366j73542j30159
37228C78480K64014M66725K8394m43961j46657M50142J89156q19022j136305j55725
37218i24759R03438P52657j93708o03927j11757M76857N16219K04320l2860j45618
37208H40862k57888l12420j98972k0311K6020l6065J6086K27990L21885R4344
37198G01531j88818q6253L56261N77480K37153l33794n89517l92750J1688L57582
37188F50563M52969K01446j85245k62414N1294K37646q8939n11698l79285J70441
37178C36778L71795j7264l53294o8041N21519O74214J85222m31026n85985k13448
$$ plain form
37249 487076 -178035 -412673 -173519 124632 249058 346258 492702 546952 529537 668215
37239 668215 951048 1082292 987828 922946 985715 977969 837800 738547 682181 508639 378480
37228 378480 642494 1109219 1137613 693652 546995 997137 1186293 367271 -769034 -924759
37218 -924759 -21321 731336 537628 -66299 -178056 298801 815020 1019340 986480 840862
37208 840862 582974 270554 71582 51271 77291 41226 57312 285302 607187 701531
37198 701531 512713 426460 782721 1360201 1597354 1263560 674043 281293 292981 650563
37188 650563 1103532 1304978 1119733 857319 908613 1146259 1057320 545622 166337 336778
37178 336778 708573 691309 338015 269974 791493 1465707 1650929 1219903 633918 420470
37168D20470K54028L83412J73654m1735r6571j94441m79959o55203l49294K58829
37158c26810N87827M26740J59461J16200J11289j16381l43897j67579K79553L91062
37148A117465n2102n04269l97562N0677J75902j45213l47320p1720K93796K29265
37138C48919j57206l51777j59183J66557L33481K22074j25493m02208j67748N31026
37128B38442R55494N84270n6212r0323M11418N87794J21518m11832n54376m82010
37118A304183l73129r7145K33588K00145j57839k89421j00392j07647l31195p0365
37108B10783P07927Q86959p0774r59710n05150O47411R31441K48712j15221K96916
37098B279294N15575q8521q01942q04357l53181j37690k13468j93882M897J63948
$$ plain form
37168 420470 674498 1057910 1231564 1189829 1093258 898817 418858 -236345 -585639 -326810
37158 -326810 261017 687757 847218 963418 1074707 958326 614429 446850 726403 1117465
37148 1117465 1065363 561094 163532 214209 390111 244898 -102422 -174142 119654 348919
37138 348919 191713 -160064 -319247 -152690 180791 402865 277372 -124836 -292584 238442
37128 238442 1193936 1778206 1721994 1631671 2043089 2630883 2752401 2340569 1786193 1304183
37118 1304183 931054 833909 1067497 1267642 1109803 820382 719990 612343 281148 210783
37108 210783 918710 1805669 1734895 775185 270035 917446 1848887 2097599 1982378 2279294
37098 2279294 2794869 2706348 1904406 1100049 746868 609178 395710 201828 206725 370673
37088C70673K15322K82766M13171M86635L05137k22311q01088q16255n6647P66930
37078I44333P50632l857n14975k93289Q0027k7412l57113k93883J27278L28306
37068G40047R8655j48867n5633J74660J34710j63758l08028r2462J76713J42448
37058F98485o8219q5265P5068P8412n1432J02170N43223O39523P5681n26916m60898
37047A019832N6577L24779K28070J79590K71927K17795j314j24683j74004l68577
37037A629992n52617l84047m2657l2315k87629k47603J24785K30871q3934k08202
37027A46644J45994L82817O0296k79867n0N24786M90541l6432k54289R4452L94268
37016A669160J83786j86761j94888O1729J03502j58084k96071j7039L70976L36625
$$ plain form
37088 370673 585995 868761 1281932 1768567 2073704 1851393 1050305 234050 177403 944333
37078 944333 1694965 1691108 1176133 882844 962871 935459 578346 284463 411741 740047
37068 740047 838702 689835 634202 808862 943572 779814 471786 379324 556037 698485
37058 698485 630266 545001 620069 698481 647049 749219 1292442 1931965 2007646 1480730 1019832
37047 1019832 1076409 1401188 1629258 1808848 2080775 2298570 2297256 2172573 1998569 1629992
37037 1629992 1077375 693328 650671 618356 330727 83124 207909 438780 354846 146644
37027 146644 292638 675455 735751 455884 455834 980620 1471161 1434729 1180440 1274892 1669160
37016 1669160 1852946 1666185 1471297 1533026 1636528 1478444 1182373 1165334 1536310 1872935
37006A872935j37663m72719k46214K20232K95605r2322m00757k66394N9829J99404
36996A031936J80811K29896L09450J94934j22297l84334l74480j10091J92397
36987A148222K28015j51174o21804n38575K80961J071252Q66502k39623j050971
36978I92805p01294K75036O80036J65507n11574o32608l01447M4026L01915N14031
36968H26433M78257R2260k13436Q151M32246L48550k00794m05131L2467L59468
36958A758471n2200o50199m94930K90083O60561J67714m36764l38205K15248M03869
36948A523648R3224o5080J95207J97936n69383j305705p72056P29683J351413
36939A378887J75506j301846j126752M01378J260600N83827m57536o85691l39285
$$ plain form
37006 1872935 1735272 1262553 1016339 1236571 1532176 1439854 1039097 772703 832532 1031936
36996 1031936 1212747 1442643 1752093 1947027 1824730 1440396 1065916 955825 1148222
36987 1148222 1376237 1225063 603259 64684 345645 1416897 2283399 2043776 992805
36978 992805 291511 566547 1246583 1412090 900516 267908 -33539 10487 312402 826433
36968 826433 1304690 1396950 1183514 1191665 1623911 1972461 1771667 1366536 1399003 1758471
36958 1758471 1706271 1056072 561142 851225 1511786 1679500 1242736 904531 1119779 1523648
36948 1523648 1616872 1551792 1746999 1944935 1375552 69847 -702209 27474 1378887
36939 1378887 1554393 252547 -874205 -472827 787773 1371600 914064 228373 -110912
36930a10912l4361L17694P98174Q24026J21720n22080m00399j1748j18261m09537
36920D54316j61892L67693L66777j01674k50645M8171J30570k44086n20108k83474
36910a94352J98615M61943K89470k60674p42169m77009N54129J298555Q53181
36901A981689k24401o72968k78237J19722J24442J46553L07629J49200l70257
36892A283372o23609l49748m7219n7543r4995L1938N1868j02945m4255L07115
36882C53979M31279O3476l17988k43137Q8957K60115K23898J20854l2555j91774
36872G57104k20053j46785r9623N0633M80359Q72214P09625J32419j79955k9359
36862B326579J14272J1617l9654P7101O7764j09219j25304O423j00001l74252
$$ plain form
36930 -110912 -145273 172421 970595 1794621 1916341 1394261 993862 982114 863853 454316
36920 454316 292424 660117 1026894 925220 674575 722746 853316 609230 89122 -194352
36910 -194352 4263 466206 755676 495002 -247167 -724176 -170047 1128508 1981689
36901 1981689 1757288 1084320 806083 925805 1050247 1196800 1504429 1653629 1283372
36892 1283372 659763 310015 262796 205253 110258 142196 194064 91119 46864 353979
36882 353979 785258 848734 530746 287609 376566 636681 860579 981433 948878 757104
36872 757104 537051 390266 290643 341276 821635 1693849 2403474 2535893 2355938 2326579
36862 2326579 2440851 2452468 2412814 2489915 2557679 2448460 2323156 2329579 2229578 1855326
36852A855326k98919Q1690J14773k71462l66351J8206J56062k23675l40464K16618
36842I41804O08841J29432n62767n64329j74093j38109k31788J89758P89809O68858
36832A657416j02745n42085k45574J94912K64065J13844m86j19261k66204l01047
36822F52835k02543j03358l3864N3290R7469N2253K5194N1965o302j14204Q478
36811D81213L41827M21238P3989k23482j24035L0040r3295j74061R8353L21439
36801A153226N1591l47351k96283J6948L5810j95409k57946j76108k11080k07333
36791d33935N3527K40467N3623k4117M94050J013242O64183j52659k75745L57318
36781A989954O76328K84283n5875Q3922J38438k42285n31369l59156j36970j40664
$$ plain form
36852 1855326 1556407 1638097 1752870 1481408 1115057 1133263 1289325 1065650 725186 941804
36842 941804 1550645 1680077 1117310 552981 378888 240779 8991 198749 988558 1657416
36832 1657416 1554671 1012586 767012 961924 1225989 1339833 1339347 1220086 953882 652835
36822 652835 450292 346934 313070 366360 463829 516082 541276 593241 586939 472735 481213
36811 481213 823040 1244278 1318267 1094785 970750 1000790 907495 733434 831787 1153226
36801 1153226 1204817 857466 561183 578131 613941 418532 160586 -15522 -226602 -433935
36791 -433935 -380408 -139941 -86318 -110435 383615 1396857 2061040 1908381 1632636 1989954
36781 1989954 2666282 2950565 2894690 2978612 3117050 2874765 2343396 1984240 1847270 1706606
36771A706606j32L44443K17414n65703j024009m21825M71539M95256j76616m51611
36761E95362k4855L71535K30372j52738l47396k84277m7791K31601K76226l0219
36751H17820k90644p1572L61906L80034k468j41555J37449K07653k86561p10975
36741D01087l46592M55211P04118J54772m33885m49834j71790r8217j14295J50777
36731B51352M99959L89254j04911k64854J25551L13777k59732q95896n10925O66953
36721B10528J184249L08682r21248j075377j75211N33655L56151j16059j18029
36712A87341K00372K48631M7114J19029M84461M95702j28782p24870n73543O2689
36702D18144L60366J30756n6174J31299L41576K09928j21675l62873m34006k57958
$$ plain form
36771 1706606 1706474 2050917 2268331 1702628 678619 256794 728333 1223589 1046973 595362
36761 595362 570507 942042 1172414 1019676 672280 388003 340212 571813 848039 817820
36751 817820 527176 455604 817510 1197544 1195076 1053521 1190970 1398623 1112062 401087
36741 401087 54495 509706 1213824 1368596 934711 484877 313087 214870 100575 251352
36731 251352 751311 1140565 1035654 770800 896351 1210128 950396 54500 -456425 210528
36721 210528 1394777 1703459 782211 -293166 -468377 65278 421429 305370 187341
36712 187341 387713 636344 683458 802487 1286948 1782650 1653868 928998 355455 418144
36702 418144 778510 909266 853092 984391 1325967 1535895 1414220 1051347 617341 359383
36692C59383K60609P85929O76175n7841n05531o9956O23641O43141O2905l72271
36682B406184m54745n10053m92653p5527M58588M16862j37317l65401K7309L87309
36672A660556K87905J43130K33469R4017m88479p56480j09513P47285P49268O0105
36662B621263l11877j31158n5860k86590k61542J68516L53852k3308l92133l21043
36652A360120k15120m14660m41124R9791N92516L19174k71566k63982J54627L7956
36642I57732n66452n57525L35712R51153N11311j66468q6261L46246K16688k42722
36632A699414j52140L65954L77580k12301n07118j65120J38500J9472l4881K03994
36622A733354J31449n12649q91831l06455O03416P68462K11543k31806k49962
$$ plain form
36692 359383 619992 1405921 2082096 2024255 1518724 1448768 2072409 2715550 2778455 2406184
36682 2406184 1951439 1441386 948733 873206 1331794 1748656 1611339 1245938 1273247 1660556
36672 1660556 1948461 2091591 2325060 2419077 1930598 1174118 1064605 1811890 2561158 2621263
36662 2621263 2309386 2178228 2122368 1835778 1574236 1742752 2096604 2073296 1681163 1360120
36652 1360120 1145000 730340 289216 389007 981523 1300697 1029131 765149 919776 957732
36642 957732 391280 -166245 169467 1120620 1631931 1465463 1379202 1725448 1942136 1699414
36632 1699414 1547274 1913228 2290808 2078507 1571389 1406269 1544769 1564241 1529360 1733354
36622 1733354 1864803 1352154 460323 153868 757284 1525746 1737289 1505483 1255521
36613A255521j82775j28911J12764L31492N4877n31814o34427q922O10581N15661
36603A394047p7485m36050k31486K32537M61021K22724k77071n70672l95295K1600
36593C43870K84896L20057K96102K19791j1542k33711j38155K04518L71777K21211
36583A878814P8608J61843K33710N5131j75970j46514N4287O0773k43706n86631
36573A370345o48426l82528l4052Q1479q7609j78246K02948Q46605R77944J99769
36563B348229q22606j033473k90157M59195M18125q4390j87157K68692O08433
36554A684891L49805j63798l18842l0804K79999K69856l5294l76399m74350k33610
36544I51454J02766J66129k9313n2095K64929M52848Q8536m64630n21327q8837
$$ plain form
36613 1255521 1072746 943835 1056599 1388091 1442968 911154 276727 267805 878386 1394047
36603 1394047 1316562 880512 649026 881563 1342584 1565308 1288237 717565 322270 343870
36593 343870 628766 948823 1244925 1464716 1453174 1219463 1081308 1285826 1657603 1878814
36583 1878814 1957422 2119265 2352975 2408106 2232136 2085622 2139909 2200682 1956976 1370345
36573 1370345 721919 339391 305339 386818 299209 120963 323911 1170516 2148460 2348229
36563 2348229 1525623 492150 201993 661188 1079313 994923 807766 1076458 1684891
36554 1684891 2034696 1870898 1552056 1521252 1801251 2071107 2035813 1659414 1185064 951454
36544 951454 1054220 1220349 1191036 1138941 1403870 1856718 1945254 1480624 959297 870460
36534H70460J78702j2034k38612r9831K39210M09424K98849j3067l84093n34695
36524G14313k48294K10643K87029r3333l50278m1617N56851Q80115P33392L08532
36514B957353j31592l63028k74418l0592N6052p7321k09959k18334j77361q6305
36504A444495J23923L06099K37064L8518J0858R3490J4432j01409P2543L11742
36494B551755O9804m95984o03821j09807K33740M9129j03057J68709L81106J18128
36484B259702k16206k00717j27525k99740l99820j97238p1236j79481r98N62216
36474A128957O23711k20193q59589k62982P85483Q66007J03008k93140r7785j00252
36464A673225l72729j40770O08468Q81499K75402m25275n22998k21707O3381K47942
$$ plain form
36534 870460 1049162 1037128 798516 698685 937895 1347319 1646168 1633101 1249008 714313
36524 714313 466019 676662 963691 870358 520080 478463 1035314 1915429 2648821 2957353
36514 2957353 2825761 2462733 2188315 2157723 2213775 2136454 1926495 1708161 1530800 1444495
36504 1444495 1568418 1874517 2111581 2150099 2160957 2254447 2268879 2167470 2240013 2551755
36494 2551755 2621559 2125575 1521754 1411947 1645687 1694816 1591759 1760468 2141574 2259702
36484 2259702 2043496 1842779 1715254 1415514 1015694 818456 747220 567739 566741 1128957
36474 1128957 1752668 1532475 672886 409904 1195387 2061394 2164402 1871262 1773477 1673225
36464 1673225 1300496 1159726 1768194 2649693 2925095 2499820 1976822 1755115 1818496 2066438
36454B066438K27894j36136n24557m38199j8995J79041J42235K55689L89823J42003
36444B285236j93044n0545J73741l35981j121533q69509L05028P05653k91858
36435F07188j126426m66925P94499J123272O19932L42464L51037m0062o61649
36426A543330o59501m1518K76818k5160k66176L450L47841K95165L4117r4993
36416A413373j71801l42258l61587L0082N33782N76477J19718k46132j31562J13184
36406A533276j1526l38069l21311N627N9089k34401k10603L55180O79552K01085
36396A717899l97512k52091K77121L22951O6013K73234O45325J47704j014994
36387A785650j338065l07170P08546N04405l01751n11015j46331L3616K879K79103
$$ plain form
36454 2066438 2294332 2158196 1633639 1195440 1176445 1355486 1497721 1753410 2143233 2285236
36444 2285236 2092192 2041647 2215388 1879407 757874 -111635 193393 899046 607188
36435 607188 -519238 -986163 -191664 931608 1551540 1894004 2245041 2204979 1543330
36426 1543330 883829 842311 1119129 1093969 827793 831243 1179084 1474249 1508366 1413373
36416 1413373 1241572 899314 537727 567809 1101591 1678068 1797786 1551654 1420092 1533276
36406 1533276 1521750 1183681 862370 867997 927086 692685 482082 837262 1516814 1717899
36396 1717899 1320387 1068296 1345417 1668368 1734381 2007615 2652940 2800644 1785650
36387 1785650 447585 140415 848961 1353366 1051615 540600 394269 427885 430764 709867
36377G09867P17059O11181j04767o65921n66184j64172k2776j33143q5397K27440
36367E23187M24491K35536M551K02649N36402K13469o88525r61965k121J022805
36357A510479P38727l55567o67972N1934N56989K58045o1808J06381J87914j64707
36347B160415l50562k7080J97733p7650l43175k48296k25194m07611j52315O11840
36337A138105Q25291J7113o43038j19712P80011P27512o4818m61785k98748k36301
36327A663630l04594j0429M65390M80060J01463p3560l1259j97141m41746l04629
36317A347185J6012m8178l60812l28287k6892l5824l04168k42335J59566L44689
36307E20956K45300K91304M20189J47833l64525m05426L2433J81787j43721k28250
$$ plain form
36377 709867 1426926 2038107 1933340 1267419 701235 537063 514287 381144 295747 523187
36367 523187 947678 1183214 1187765 1390414 1926816 2140285 1451760 489795 487674 1510479
36357 1510479 2249206 1893639 1225667 1277601 1834590 2092635 2030827 2137208 2325122 2160415
36347 2160415 1809853 1782773 1980506 1902856 1559681 1311385 1086191 678580 526265 1138105
36337 1138105 1963396 1980509 1337471 1217759 1997770 2725282 2660464 2198679 1899931 1663630
36327 1663630 1359036 1348607 1813997 2294057 2395520 2321960 2290701 2093560 1651814 1347185
36317 1347185 1363197 1315019 954207 625920 599028 563204 259036 16701 176267 520956
36307 520956 766256 1057560 1477749 1625582 1261057 855631 888064 1069851 926130 697880
36297F97880K16863N00246J93213r8603J49922L84608q6375q00352p38943R1421
36287E09880O08797K16863l73696k23998M73324P04215J39640l71698j01522L91632
36277A973437J01782p71970j007558k24995N20337M04777L4879K49215O49960
36268A929864L58086m12477o92731l16567o642n7805k6988K43092L09370J2892
36258A340094k03577j12499p4544l02372m15265p8281M33760O58626N49281L54955
36248B150178J87955k1340k91961m93684m48945j31053K21099L22555K11943J57396
36238A864143J59308m4648l62161k85184K72137O56952M11285m9491j83124j52872
36228B286345l07459m08979j19656K25515J25077k07380k48851p5256p1875j22684
$$ plain form
36297 697880 914743 1414989 1608202 1509599 1659521 2044129 1957754 1157402 418459 509880
36287 509880 1118677 1335540 961844 737846 1211170 1915385 2055025 1683327 1581805 1973437
36277 1973437 2075219 1303249 295691 70696 591033 995810 1030689 1279904 1929864
36268 1929864 2287950 1875473 1182742 866175 859533 801728 774740 1017832 1327202 1340094
36258 1340094 1136517 1024018 949474 647102 231837 153556 587316 1245942 1795223 2150178
36248 2150178 2338133 2316793 2024832 1531148 1082203 951150 1172249 1494804 1706747 1864143
36238 1864143 2023451 1978803 1616642 1331458 1603595 2260547 2671832 2622341 2439217 2286345
36228 2286345 1978886 1569907 1450251 1675766 1800843 1593463 1344612 1269356 1197481 1074797
36218A074797O2044J78777j85222o12342l74145L31944O32928L00960j10641k80348
36208A018752l21066j52128L30364O10038J26963o12973n89240J50031N87229
36199A147970L74542J57699K15931P7318l01872k78684J93282K74533k88533o04036
36189I68150j45181L11727m55n78964n41810R632L63578L34311K45297K18996
36179A185281J45301L1908q5986k55843l35326o9709L23224K46421l14029n95538
36169B75704j90436L30157L67068J68059K05308L13965R9837k61526k64852J74031
36159A217315O68178Q14761M34105k93607p49901m19707L14997N15608J0950l47528
36149B165171m8858K93507L0514m31413l26907K61931O19672M27432m0828m40804
$$ plain form
36218 1074797 1136841 1315618 1130396 518054 143909 475853 1108781 1409741 1299100 1018752
36208 1018752 697686 545558 875922 1485960 1612923 999950 410710 560741 1147970
36199 1147970 1522512 1680211 1896142 1973460 1671588 1392904 1586186 1860719 1572186 968150
36189 968150 822969 1134696 1134241 555277 13467 23099 386677 720988 966285 1185281
36179 1185281 1330582 1362490 1276504 1020661 685335 615626 938850 1185271 871242 275704
36169 275704 85268 415425 782493 950552 1155860 1469825 1569662 1308136 1043284 1217315
36159 1217315 1885493 2700254 3134359 2840752 2090851 1671144 1986141 2501749 2512699 2165171
36149 2165171 2116313 2409820 2440334 2008921 1682014 1943945 2563617 2991049 2950221 2509417
36139B509417n63859l06281J47177L78746K61056Q7090R744j45246l37437k29622
36129A810785J09303J39881k09147l29728k1589R9805k38950l63555J46488O05417
36119A748710L74745m0039K0995J53987k44288o64181k92469M44139M72706j66370
36109A807935m73060j73024N8476k5146O9713M15637L97970j31173m70923j76503
36099A299902L06837M19857J74866j64738m22721l71559Q2975M80988K66192k77054
36089A795545l22177J85063M01115k0211l56359n1204L64411J94107k92898l72928
36079A524464k8298J39190r3882l18163j83207J53087L30123K31465L3519m8046
36069A740252J8981J14713J83328K75677L21148J11324k90353m19320l4590M01610
$$ plain form
36139 2509417 1945558 1639277 1786454 2165200 2426256 2513346 2523090 2377844 2040407 1810785
36129 1810785 1920088 2059969 1850822 1521094 1499505 1599310 1360360 996805 1143293 1748710
36119 1748710 2123455 2083416 2104411 2258398 2014110 1349929 1057460 1501599 1974305 1807935
36109 1807935 1334875 1161851 1220327 1195181 1264894 1680531 2078501 1947328 1476405 1299902
36099 1299902 1606739 2026596 2201462 2036724 1614003 1242444 1325419 1806407 2072599 1795545
36089 1795545 1473368 1658431 2059546 2039335 1682976 1631772 1996183 2190290 1897392 1524464
36079 1524464 1496166 1635356 1541474 1223311 1040104 1193191 1523314 1754779 1788298 1740252
36069 1740252 1759233 1873946 2057274 2332951 2654099 2765423 2475070 2055750 2021160 2422770
36059B422770L19910j16513l04411j37991k8683j08049j00891L0100K1123p0989
36049A926376Q6393L43368J42177m56514o52763j52765K87056N9387l21110j19417
36039A142188L83340L87290r3107k72539J55508N93198M46409j23852n28577m53203
36029A636655p8091J90687J25376j06267j74170n7238n7460k54341k87210P7193
36019A015134M85263M50491K7500l20639l34738j03027K11578M34193L50502j6361
36009B199896k65210j10889J69562J70523R007N4973K16348J06650j67748q6718
35999B296394L38064M00504k38862r24068q50455j25275M49883L90105o0797l52250
35989A323243j55143L89400P30662M11522k93987n35688L4211O66617M52099l94536
$$ plain form
36059 2422770 2742680 2626167 2321756 2183765 2155082 2047033 1946142 1976242 1997365 1926376
36049 1926376 2012769 2356137 2498314 2041800 1389037 1236272 1523328 1582715 1261605 1142188
36039 1142188 1525528 1912818 1819711 1547172 1702680 2295878 2742287 2618435 2089858 1636655
36029 1636655 1558564 1749251 1874627 1768360 1594190 1536952 1479492 1225151 937941 1015134
36019 1015134 1500397 1950888 1978388 1657749 1323011 1219984 1431562 1865755 2216257 2199896
36009 2199896 1934686 1823797 1993359 2163882 2172889 2227862 2444210 2550860 2383112 2296394
35999 2296394 2634458 3034962 2796100 1872032 1021577 896302 1346185 1736290 1675493 1323243
35989 1323243 1168100 1557500 2288162 2699684 2405697 1870009 1904220 2570837 3022936 2628400
35979B628400p87856k59793M56590N16804M9872k50004j83647j21965k03029r7307
35969A748065L08337N49154K58654j72526j07297L53675M78792K9046l35696n9996
35959C050208M27030L40193l01445p57842o51817l27513j35426j059J67354K43527
35949B053210K64321M72475P24261M67338l23618q22912m90172O4414K9433l30126
35939B108624k18431K54242K40945l33312n35748Q3793P48121O36322K5088k97391
35929B712253j56681N8404J47261K10630K48183J36164r3043k69053k90558j44491
35919B559069J05067K36376M5568k87204l33676l5471J98503J43594M9659Q9174
35909B770659K4705k83687n26787m42863k19185p4885P8272K34699J19778j83761
$$ plain form
35979 2628400 1840544 1580751 2037341 2554145 2604017 2354013 2170366 2048401 1845372 1748065
35969 1748065 2056402 2605556 2864210 2691684 2584387 2938062 3416854 3445900 3110204 3050208
35959 3050208 3477238 3817431 3515986 2758144 2106327 1778814 1643388 1642329 1809683 2053210
35949 2053210 2317531 2790006 3514267 3981605 3657987 2835075 2344903 2409317 2438750 2108624
35939 2108624 1890193 2144435 2385380 2052068 1516320 1600113 2348234 2984556 3009644 2712253
35929 2712253 2555572 2613976 2761237 2971867 3220050 3356214 3263171 2994118 2703560 2559069
35919 2559069 2664136 2900512 2946080 2658876 2325200 2289729 2488232 2631826 2681485 2770659
35909 2770659 2795364 2511677 1984890 1542027 1322842 1247957 1326229 1560928 1680706 1496945
35899A496945o7850O09168J013187N05685k80941l66318J06245K72365K331j16427
35889C174390l633j60522n63699n80323j05639K16226R8656L812J97637L22833
35879B599738J97007J46488K14689n7997o45448p41678k0478O59950N02276l4076
35869B820471p8817K56860K56231j07486k55294j33976k54267o15790n48570J49977
35859A489339P22321M99900j36425l36687M3983L85547K79446L8078J01066L30676
35849C417244K46791j90187m55943k11265K03488K74990J3652k14981l07004l87923
35839B388862l14799J87378Q46995R12938J51691o96197p87283j69189M16122
35830B936518M61298R6753k65414l67926k21138M141J40483J23221l2536k37156
$$ plain form
35899 1496945 1429095 2038263 3051450 3557135 3276194 2909876 3016121 3288486 3290817 3174390
35889 3174390 3170757 3010235 2446536 1866213 1760574 1976800 2075456 2079268 2276905 2599738
35879 2599738 2796745 2943233 3157922 3099925 2454477 1712799 1692321 2352271 2854547 2820471
35869 2820471 2741654 2998514 3254745 3147259 2891965 2757989 2503722 1887932 1339362 1489339
35859 1489339 2211660 2711560 2575135 2238448 2282431 2667978 2947424 2985502 3086568 3417244
35849 3417244 3664035 3473848 3017905 2806640 3010128 3285118 3298770 3083789 2776785 2388862
35839 2388862 2074063 2261441 3108436 4021374 4173065 3476868 2689585 2520396 2936518
35830 2936518 3397816 3494569 3229155 2861229 2640091 2644232 2784715 2907936 2875400 2638244
35820B638244k64552P6964N41477N36093n2814m86788j49908M56296M28160j04632
35810C618540k32744J24035M2243p08644j024227j80091Q67826Q33819l2751m92774
35800B815232j90655J39462O5260n0023O2515J44678J8235j16153j37805j57210
35790B593536j29903R2856K93058J00292k74151k16929K56267M12430j0537l26131
35780B790788m4046K71969n0927o11823n44078P8391L87124J48795P3362N24021
35770C023576Q35959L98625k96711l75093R6431K65287j95027o76898o07197j78072
35760B290880J15977J62522J42261J22261O1991j5280j08420k80826m31792k98886
35750A760688J05289L67528K41575L1595J12353L71226M61440L22386J04363j27743
$$ plain form
35820 2638244 2373692 2450656 2992133 3528226 3475412 2988624 2838716 3295012 3723172 3618540
35810 3618540 3385796 3509831 3552074 2843430 1819203 1639112 2506938 3340757 3308006 2815232
35800 2815232 2624577 2764039 2829299 2779276 2841791 2986469 3004704 2888551 2750746 2593536
35790 2593536 2463633 2556489 2849547 2949839 2675688 2458759 2715026 3127456 3116919 2790788
35780 2790788 2746742 3018711 2967784 2355961 1811883 1890274 2277398 2426193 2499555 3023576
35770 3023576 3859535 4258160 3961449 3586356 3682787 3948074 3753047 3076149 2468952 2290880
35760 2290880 2406857 2569379 2711640 2833901 2895892 2880612 2772192 2491366 2059574 1760688
35750 1760688 1865977 2233505 2475080 2506675 2619028 2990254 3451694 3774080 3878443 3750700
35740C750700k68126r3703L00995L97313L1376k02964R4662L34055j12206o93018
35730C539084m73877K39786L39964j92930k60501L74338N86261j56664p75508
35721C219953l29848M49094M04103k53217n32665k95122r9139L0578M51747Q48381
35711C893865N32016l03283p10835l91275J4680R4548J55621L57300K81672k45030
35701C679279o54009m33121J18521L83739K55287N0487o5572j47197j77679r7121
35691B912614k961j6784l7472J00743K86224K31106p0992k67650j45254M0811
35681C030385l1176j95767l1038L87915M67657L4673k31975K16036Q18353O40423
35671E105486j56352m90934l6051K95120j09094n24927j27953N31108L15268o49721
$$ plain form
35740 3750700 3482574 3388871 3689866 4087179 4118555 3915591 4010253 4344308 4232102 3539084
35730 3539084 3065207 3304993 3644957 3452027 3191526 3565864 4152125 3995461 3219953
35721 3219953 2890105 3339199 3743302 3490085 2957420 2662298 2563159 2593737 3045484 3893865
35711 3893865 4425881 4122598 3411763 3020488 3035168 3129716 3285337 3642637 3924309 3679279
35701 3679279 3025270 2592149 2710670 3094409 3349696 3400183 3334611 3187414 3009735 2912614
35691 2912614 2909653 2892869 2855397 2956140 3242364 3473470 3402478 3134828 2989574 3030385
35681 3030385 2999209 2803442 2772404 3160319 3627976 3662649 3430674 3646710 4465063 5105486
35671 5105486 4949134 4458200 4422149 4717269 4608175 4083248 3955295 4486403 4801671 4151950
35661D151950j046819k86343O70260P20048M4578l91080k13281J20886J96692
35652C966891J06392J7191j67605m53183m55636R8567P56264P60308J36266k20768
35642D544687J69383N69528Q4160q90149j093952j86900P67835P99714K28703
35633D993009o0039Q5788J24979j84459m64744l47173K1624J96366m1516m30403
35623C893432m69250K2034O06079O68469J52998l69054l88962J9007L99863L95672
35613D930288j6618n28317p07342m08858M0950K61142K95041M12295O03861O27561
35603E510003M08860L9627m24825p91212o64898o2119K91956o5681m74162j05056
35593C662493O12223O03056q4465l98448q2481N7932j87459l2786O51602Q30344
$$ plain form
35661 4151950 3105131 2818788 3489048 4209096 4253674 3862594 3649313 3770199 3966891
35652 3966891 4073283 4090474 3922869 3469686 3014050 3112617 3868881 4629189 4765455 4544687
35642 4544687 4714070 5283598 5367758 4477609 3383657 3196757 3964592 4764306 4993009
35633 4993009 4932970 5018758 5143737 4959278 4494534 4147361 4168985 4365351 4323835 3893432
35623 3893432 3424182 3446216 4052295 4720764 4873762 4504708 4115746 4134753 4534616 4930288
35613 4930288 4913670 4385353 3678011 3269153 3310103 3571245 3866286 4278581 4882442 5510003
35603 5510003 5918863 5958490 5533665 4742453 4077555 4015436 4307392 4241711 3767549 3662493
35593 3662493 4274716 4877772 4793307 4394859 4312378 4370310 4182851 4150065 4801667 5632011
35583E632011J25452l26767K37023Q22025L23449o20211p44481j85036K6831k10278
35573E080018j86105J47058K09990L2925J64376M90016L43493k44544n13483k29462
35563E294282K3646j00438k73155k43881k12500k71289j76810J29609L52573L48935
35553D870972L13895L52596L00002O3711j97629k95742j83095M5514J58403j8722
35543E409905k64354j37217L29963N54087K71727m1804K8366J93484P0821j39640
35533F275338j28253p7261j96937j87600J87701M78233J83850l83176n34882j67199
35523E449814K77939M45780K06159l59499o94193j53353Q63955J016657q5502
35514F967757j036082n83699N09232P24511Q9145j81377K06759L70896q7810n23903
$$ plain form
35583 5632011 5757463 5430696 5667719 6489744 6813193 6192982 5448501 5263465 5290296 5080018
35573 5080018 4893913 5040971 5250961 5283886 5448262 5938278 6281771 6037227 5523744 5294282
35563 5294282 5317928 5217490 4944335 4700454 4487954 4216665 4039855 4169464 4522037 4870972
35553 4870972 5184867 5537463 5837465 5901176 5703547 5407805 5224710 5270224 5428627 5409905
35543 5409905 5145551 5008334 5338297 5892384 6164111 6122307 6150673 6344157 6414978 6275338
35533 6275338 6147085 6069824 5872887 5685287 5872988 6351221 6535071 6151895 5617013 5449814
35523 5449814 5727753 6173533 6379692 6020193 5326000 5172647 6036602 7053259 6967757
35514 6967757 5931675 5347976 5857208 6581719 6670864 6489487 6696246 7067142 6979332 6455429
35504F455429l87626J25482N82314O50834J01072p62067j009667k55356N59380
35495F059795M65800m2031N5884N01522K98395l92256m67380J81900N07875J12150
35485G281654k44541r6406R9648J2103q6654q9475k06760k45720J65080O04204
35475G193133K90672m80441n96710Q4272N09876J67858k62540k41699o3480P4168
35465F675109M18496P56711M39839l19959m64628J77767M93164p4454o11470l26115
35455G164460K18162K50819K8084N1714O7640k47285m66059j74220J93366J21376
35445G208057o1126J54436M89057M02741O5075j0718J10626L139k71041k29723
35435G860523K43740P01230O69680J26993m50813m54342J88871P54961N55147
$$ plain form
35504 6455429 6067803 6193285 6775599 7426433 7527505 6765438 5755771 5500415 6059795
35495 6059795 6525595 6483564 6539448 7040970 7339365 6947109 6479729 6661629 7169504 7281654
35485 7281654 7037113 6940707 7040355 7052458 6965804 6876329 6669569 6423849 6588929 7193133
35475 7193133 7483805 7003364 6406654 6490926 7000802 7168660 6906120 6664421 6600941 6675109
35465 6675109 7093605 7850316 8290155 7970196 7505568 7683335 8176499 8102045 7490575 7164460
35455 7164460 7382622 7633441 7661525 7713239 7780879 7533594 7067535 6893315 7086681 7208057
35445 7208057 7146931 7301367 7790424 8193165 8258240 8247522 8358148 8361287 8090246 7860523
35435 7860523 8104263 8805493 9475173 9602166 9151353 8697011 8885882 9640843 10195990
35426A0195990p7014k41261J63586L33989j02966n33911l99757L9529L37471M93897
35416A0209553N51028K76906k76713n28560j77408K61765J97246k12713m14841
35407I886263k68204p5053n6766j33164r8474J29156L47630K43807j08163j94772
35397I672260J67726M07244O3490l53767j15582M95146O17831K19067L7380K38436
35387A1449231K11827k20325m34752o5107M68498P19468P11850N01858K8542m11187
35377A2959903k96439K85247N92127J99637n29049j007852r48682l79255L23351
35368A1198988N64966K30626l5758J97293L94381Q688m25690j58715M00244L70062
35358A2745085l4795L1892M10595K40074l31303k84031M52088Q14646L62768j71359
$$ plain form
35426 10195990 10118976 9877715 10041301 10375290 10272324 9738413 9338656 9378185 9715656 10209553
35416 10209553 10760581 11037487 10760774 10232214 10054806 10316571 10513817 10301104 9886263
35407 9886263 9618059 9543006 9486240 9353076 9254602 9383758 9731388 9975195 9867032 9672260
35397 9672260 9839986 10247230 10310720 9956953 9841371 10336517 10954348 11173415 11210795 11449231
35387 11449231 11661058 11440733 11005981 10940874 11409372 12128840 12840690 13342548 13371090 12959903
35377 12959903 12663464 12948711 13540838 13740475 13211426 12203574 11254892 10875637 11198988
35368 11198988 11763954 11994580 11958822 12156115 12550496 12559184 12133494 11974779 12375023 12745085
35358 12745085 12710290 12742182 13152777 13392851 13061548 12777517 13229605 14044251 14407019 14235660
35348A4235660k56382j94804j83759O0216N21521P69329P37366P01936N69620
35339A6960703J28175k40936j12670R6592j21961k79353J99441O32892J48004
35330A7410887n65378k68142O41901Q02742K40852R4888M14083K74169k44425
35321A8801577k58679N1239j35106l57683M09527J487336J287961Q6353m21931
35312B0950594l1927K5998k77027R7283P56610L90612m33608k1918J091179Q28083
35302B3375879m62431l10655J385380J952802O00084l20513M08937J064106N61653
35293B8255242K22225O83576N64427m35673n12309Q05717J538176Q66217M72833
35284C2460431J044611R92245n0706j55389J090643J492030M03735N2485J202712
$$ plain form
35348 14235660 13979278 13784474 13600715 13660931 14182452 14951781 15689147 16391083 16960703
35339 16960703 17088878 16847942 16735272 16831864 16709903 16430550 16629991 17262883 17410887
35330 17410887 16845509 16577367 17219268 18022010 18262862 18357750 18771833 19046002 18801577
35321 18801577 18542898 18594137 18459031 18101348 18510875 19998211 21286172 21372525 20950594
35312 20950594 20918667 20944665 20667638 20764921 21521531 21912143 21478535 21456617 22547796 23375879
35302 23375879 22913448 22602793 23988173 25940975 26541059 26220546 26629483 27693589 28255242
35293 28255242 28477467 29161043 29725470 29289797 28777488 29583205 31121381 31987598 32460431
35284 32460431 33505042 34497287 34446581 34291192 35381835 36873865 37277600 37330085 38532797
35275C8532797J624355N27831K31538J587053K175865J053017P11263K154536
35267D8598255K735579J263365M26304J584188K088939M83447o68823J34554O71863
35258E7317671R8745J036899L774195M560897K690616K534920N305977O328223
35250H3648143M148679L886772P182866Q274376N322636N106265J0049474J2406132
35242A40025343R245611R708686J7217931K0196600J4227864J4457532K3985389
35235B49064956R165655n8291756j42574054j68184357j10509003k6791081J6890725
35228b31228915J7076523J1432779J6485661J9015391J2554795P926158J0023956
35221a36713652J0601522O378919M527510P416167Q176398M399424K396691M822829
$$ plain form
35275 38532797 40157152 40684983 40916521 42503574 44679439 45732456 46443719 48598255
35267 48598255 51333834 52597199 53023503 54607691 56696630 57180077 56511254 56645808 57317671
35258 57317671 57416416 58453315 62227510 66788407 69479023 72013943 77319920 83648143
35250 83648143 87796822 91683594 98866460 107140836 112463472 117569737 127619211 140025343
35242 140025343 149270954 158979640 176197571 196394171 210622035 225079567 249064956
35235 249064956 258230611 199938855 57364801 -110819556 -221328559 -248119640 -231228915
35228 -231228915 -214152392 -202719613 -186233952 -167218561 -154663766 -146737608 -136713652
35221 -136713652 -126112130 -119733211 -115205701 -107789534 -99613136 -95213712 -92817021 -87994192
35213h7994192O175778L689024J957051L549387M542206K588497J048021K037611
35205f2406617K805041J760782J355089K518061K556847P99902L32768K049123
35197d8229004K749348J166036K66421J488479K126244O95020k55508R08042J905298
35188c7179624R81814R694O69257J453691Q86847J93970N32797Q06016K53570
35179c1391968J56868J104345J492821M81165l59104R1418P02649N64105N25478
35170b6632223R43930O45593n20222q05424M02359J311772Q14124K05591M92996
35161b3141504O33164p5987m15943L53045R02078K75082k91857L53372J200765
35152b0207785R26329M3225l34629k92718k99363o1045N65369Q63088M92916J54220
$$ plain form
35213 -87994192 -81818414 -78129390 -76172339 -72622952 -68080746 -65492249 -64444228 -62406617
35205 -62406617 -59601576 -57840794 -56485705 -53967644 -51410797 -50610895 -50278127 -48229004
35197 -48229004 -45479656 -44313620 -44047199 -42558720 -40432476 -39737456 -39992964 -39084922 -37179624
35188 -37179624 -36197810 -36188116 -35518859 -34065168 -33178321 -32984351 -32451554 -31645538 -31391968
35179 -31391968 -31235100 -30130755 -28637934 -28156769 -28515873 -28424455 -27721806 -27157701 -26632223
35170 -26632223 -25688293 -25042700 -25562922 -26368346 -25965987 -24654215 -23840091 -23634500 -23141504
35161 -23141504 -22508340 -22584327 -23000270 -22647225 -21745147 -21470065 -21761922 -21408550 -20207785
35152 -20207785 -19281456 -19238231 -19572860 -19865578 -20164941 -20225986 -19660617 -18797529 -18304613 -18150393
35142a8150393K36643J98783r1486N9255O58120P29985J08388j68216K06886K68080
35132a5943955k61601l59165K94239O15602J58143o8221M01601N93077N4730k10420
35122a4725970K80203M84442j53713n40434P3447O83068L42827k17295m7095M05203
35112a3415317L66583J23033J69081J83437q2229n8605N06399Q09478L24095k41831
35102a1315876j94097N0248m7342j56146R5647L29800K11386N9432M6813j87347
35092a1107482n97049n16703Q8747L23387j61165n60981l08984J14849K53762
35083a2471619L56981N25560L74641l4851j23458O0331q6812l45549J03644R10850
35073a0730282P81119k19642n23711K67658O26549k28788r70045m97099L03916
$$ plain form
35142 -18150393 -17913750 -17714967 -17806453 -17747198 -17089078 -16359093 -16250705 -16418921 -16212035 -15943955
35132 -15943955 -16205556 -16564721 -16270482 -15654880 -15496737 -15564958 -15163357 -14570280 -14515550 -14725970
35122 -14725970 -14445767 -13961325 -14115038 -14655472 -14582025 -13898957 -13556130 -13773425 -13820520 -13415317
35112 -13415317 -13048734 -12925701 -12756620 -12573183 -12655412 -12714017 -12207618 -11398140 -11074045 -11315876
35102 -11315876 -11509973 -11459725 -11507067 -11663213 -11567566 -11237766 -11026380 -10966948 -10920135 -11107482
35092 -11107482 -11704531 -12221234 -12132487 -11809100 -11970265 -12531246 -12840230 -12725381 -12471619
35083 -12471619 -12114638 -11589078 -11214437 -11249288 -11372746 -11312415 -11399227 -11744776 -11641132 -10730282
35073 -10730282 -9949163 -10168805 -10692516 -10424858 -9798309 -10027097 -10997142 -11494241 -11190325
35064a1190325L43784R0864K65836M14886J00740l168M91777O71539m991m85592
35054i304650M9284N88419J9774q69973p27757J67778O37579N60249N45809M92996
35044g840492j2428n26963l62914J69838L12339R7300J8404O1443p263k1287J08301
35033h003722J4928l24777k83645K65759N28205J86769J4870L32823K47791o11289
35023g632288j083997l97386L64279J01426l86922P4358Q67334P10009q1161k91399
35013g755747M4676N639l45476k06753L24877M90735L36987M35051N55311R3888
35003f020812n75087o14013k09571j53220l40399j02147L59617L20874k1593Q5261
34993g271090M42659K42460l11372k39376M58597P63356L56337k6400l6343j55163
$$ plain form
35064 -11190325 -10846541 -10755677 -10489841 -10074955 -9974215 -9977383 -9485606 -8814067 -8819058 -9304650
35054 -9304650 -9255366 -8666947 -8647173 -9517146 -10244903 -10077125 -9439546 -8879297 -8333488 -7840492
35044 -7840492 -7852920 -8379883 -8742797 -8572959 -8260620 -8163320 -8144916 -8083473 -8090736 -8112023 -8003722
35033 -8003722 -7988794 -8313571 -8597216 -8331457 -7803252 -7616483 -7601613 -7268790 -7020999 -7632288
35023 -7632288 -8716285 -9113671 -8749392 -8647966 -9034888 -8960530 -8093196 -7383187 -7464348 -7755747
35013 -7755747 -7711071 -7705432 -8050908 -8257661 -7932784 -7442049 -7105062 -6670011 -6114700 -6020812
35003 -6020812 -6595899 -7209912 -7419483 -7572703 -7913102 -8015249 -7655632 -7334758 -7356351 -7271090
34993 -7271090 -6828431 -6585971 -6897343 -7136719 -6678122 -5914766 -5558429 -5584829 -5621172 -5776335
34983e776335n17899n52919q3902K87360K00602L5726J42952L41833L69144J99641
34973e353797j21970m27535l49373J45947M50900J69197j58493O8712M23989J76321
34963d976102l77261l87962R5732K97329Q8356M6816K73695K63086p9691k99545
34953e055547k58372k38391k47731p9685O7560j17662l38748j22084K81887L27889
34943e780884J83668L16916M37047m395n55239k78015O19949R50540L20967m56314
34933d245760p26985n97052j96814M47956Q10309L55124l64018l60473R7654j03322
34923d883381q44370q04518J89934O82766L9334m45535J83322Q81332M67034l53335
34913d887417l42927J00140j38734o90007l16167P15161Q13524l28055j099234
$$ plain form
34983 -5776335 -6294234 -6847153 -6931055 -6643695 -6443093 -6407367 -6264415 -5922582 -5553438 -5353797
34973 -5353797 -5475767 -5903302 -6252675 -6106728 -5655828 -5486631 -5645124 -5576412 -5152423 -4976102
34963 -4976102 -5353363 -5741325 -5645593 -5348264 -5259908 -5213092 -4939397 -4676311 -4756002 -5055547
34953 -5055547 -5313919 -5552310 -5800041 -5879726 -5812166 -5929828 -6268576 -6390660 -6108773 -5780884
34943 -5780884 -5597216 -5280300 -4843253 -4847648 -5402887 -5680902 -5060953 -4110413 -3789446 -4245760
34933 -4245760 -4972745 -5569797 -5766611 -5318655 -4508346 -4153222 -4517240 -4877713 -4780059 -4883381
34923 -4883381 -5727751 -6532269 -6342335 -5659569 -5620235 -6065770 -5882448 -5001116 -4534082 -4887417
34913 -4887417 -5230344 -5130204 -5268938 -5958945 -6275112 -5559951 -4746427 -5074482 -6173716
34904f173716m21334O86437P85905P7961k58689O328Q4500k93269m36541N9596
34894e882822N70919M01172j53847k91933J12221M43674L25370M2785n3025k5071
34884d510557o6218j61485k26360k46416j45415J43598L91942K76784m4021o3332
34874d651480K38859K90184j13134m00203j43936K70141L60544K89868L18464
34865c540693J50120m62044r83567p69755q3461L26833L28703L17751L45371J56926
34855d213816j20249j29834L2365L4070J2850K91422N77517L04427l28505n30917
34845d070670j36753J99320R0068j10730o9332L7585N474m9177k3816j53L7129
34834d091055J75072K42100J5916k58404j29409K88493M07300O2544k73800k36768
$$ plain form
34904 -6173716 -6595050 -5908613 -5122708 -5044747 -5303436 -5297108 -5212608 -5505877 -5942418 -5882822
34894 -5882822 -5311903 -4910731 -5064578 -5356511 -5244290 -4800616 -4475246 -4432461 -4485486 -4510557
34884 -4510557 -4576775 -4738260 -4964620 -5211036 -5356451 -5212853 -4820911 -4544127 -4588148 -4651480
34874 -4651480 -4412621 -4122437 -4235571 -4635774 -4779710 -4509569 -4149025 -3859157 -3540693
34865 -3540693 -3390573 -3852617 -4836184 -5605939 -5689400 -5362567 -5033864 -4716113 -4370742 -4213816
34855 -4213816 -4334065 -4463899 -4431534 -4397464 -4384614 -4093192 -3515675 -3211248 -3539753 -4070670
34845 -4070670 -4207423 -4008103 -3918035 -4028765 -4098097 -4060512 -4055038 -4104215 -4128031 -4128184 -4091055
34834 -4091055 -3915983 -3673883 -3657967 -3916371 -4045780 -3757287 -3349987 -3287443 -3561243 -3798011
34824c798011K4317K26590K33385l2691m49084n51209q2344M55710M20754L828
34814c548755j50296p5214l13968p46318o60835n9599K28716l2564q3664M27098
34804e015399P51544L44760j65087p3101K12134l3502n48698n54276o3728K29309
34794d916044J19065O2329K78947M50963L55889J78861J03021O8908L0440P0742
34784c196879J85668K40266J77480M6561j38874l37645l54507o9982K40229J46747
34774c060936l07702n28943j04505N78435P19905R5298o10969o26225o0778K64407
34764c642013n9646m92699l36333L03130P30210O19876L02900J57705J65569J41328
34754b109973M5375p3913k13580l72042m99618n20655l28150J25276N87491N73991
$$ plain form
34824 -3798011 -3773694 -3547104 -3313719 -3346410 -3795494 -4346703 -4429047 -3973337 -3552583 -3548755
34814 -3548755 -3699051 -3774265 -4088233 -4834551 -5495386 -5554985 -5326269 -5358833 -5442497 -5015399
34804 -5015399 -4263855 -3919095 -4084182 -4157283 -3945149 -3978651 -4527349 -5081625 -5145353 -4916044
34794 -4916044 -4796979 -4734650 -4455703 -4004740 -3648851 -3469990 -3366969 -3298061 -3267621 -3196879
34784 -3196879 -3011211 -2770945 -2593465 -2546904 -2685778 -3023423 -3377930 -3447912 -3207683 -3060936
34774 -3060936 -3368638 -3897581 -4002086 -3423651 -2703746 -2608448 -3219417 -3845642 -3906420 -3642013
34764 -3642013 -3701659 -4194358 -4530691 -4227561 -3497351 -2877475 -2574575 -2416870 -2251301 -2109973
34754 -2109973 -2064598 -2138511 -2352091 -2724133 -3223751 -3744406 -4072556 -3947280 -3359789 -2785798
34744b785798l3552o42597n89160j869M03929L28859J88083L45199N44730L50136
34734a892040j83929n67395m73005q9993J03762j16689m25975l16620J99793N25303
34724c236788K79317j56624k22425N469N1741j39621k00648m6632K7290k0958
34714c659879J34687N15150O15169J45874m41749n32637j55918J37861M4903j79239
34704c375778j57579J05208K70309J34654r9141j14058P5520J93837J69621J94075
34694b603332K63867R0359l41617n60960k78887J18870J40007j06764k14481j57675
34684c650613j58165j47167P8735L59367L80916K37182K56038M05987L96712K29440
34674a611568J17116L800k80050n30851m36617j97531k46482m55822l12703J58584
$$ plain form
34744 -2785798 -2819350 -3461947 -4051107 -4052976 -3649047 -3320188 -3132105 -2786906 -2242176 -1892040
34734 -1892040 -2075969 -2643364 -3116369 -3206362 -3102600 -3219289 -3645264 -3961884 -3762091 -3236788
34724 -3236788 -2957471 -3114095 -3336520 -3331051 -3279310 -3418931 -3619579 -3666211 -3638921 -3659879
34714 -3659879 -3525192 -3010042 -2394873 -2248999 -2690748 -3223385 -3379303 -3241442 -3196539 -3375778
34704 -3375778 -3533357 -3428149 -3157840 -3023186 -3122327 -3236385 -3160865 -2967028 -2797407 -2603332
34694 -2603332 -2339465 -2249106 -2590723 -3151683 -3430570 -3311700 -3171693 -3278457 -3492938 -3650613
34684 -3650613 -3808778 -3955945 -3877210 -3517843 -3136927 -2899745 -2643707 -2237720 -1841008 -1611568
34674 -1611568 -1494452 -1490652 -1770702 -2301553 -2738170 -2935701 -3182183 -3638005 -3950708 -3792124
34664c792124L74273J36181j04251l2773J43673K33978L37079M18542K43309q5788
34654b127901j44032O2382O906m33461o32430j85705L65970K95713k59607n46671
34644c598836k34899K77407M82335L06571M4802j6041J34136K69395K27024Q7985
34634b020121j6666j09329j96756j15775J65643L15649P5959k80369l55291k60806
34624b797862l24398l81683l2151N02540N22630p7247n76712m48141K412K31159
34614c379453J59035L4572K9540J79771L81030L49272n1397m38462l15300J73112
34604b878280M13134K39387O8002P6466m6502l59946l94972M2891M04010J62654
34594b273156l87301n43174j23026L81869M51450J11516j09335J90519O66583
$$ plain form
34664 -3792124 -3417851 -3281670 -3385921 -3418694 -3275021 -3041043 -2703964 -2285422 -2042113 -2127901
34654 -2127901 -2271933 -2209551 -2202645 -2636106 -3268536 -3454241 -3088271 -2792558 -3052165 -3598836
34644 -3598836 -3833735 -3556328 -3073993 -2767422 -2722620 -2738661 -2604525 -2335130 -2108106 -2020121
34634 -2020121 -2036787 -2146116 -2342872 -2458647 -2293004 -1977355 -1901396 -2181765 -2537056 -2797862
34624 -2797862 -3122260 -3503943 -3536094 -3033554 -2510924 -2588171 -3164883 -3613024 -3610612 -3379453
34614 -3379453 -3220418 -3185846 -3156306 -2976535 -2595505 -2246233 -2297630 -2736092 -3051392 -2878280
34604 -2878280 -2465146 -2225759 -2157757 -2081291 -2127793 -2487739 -2882711 -2839820 -2435810 -2273156
34594 -2273156 -2660457 -3203631 -3326657 -2944788 -2493338 -2381822 -2491157 -2300638 -1634055
34585a634055N30757l07995q80633m50946L19698K97102m23053p51949l35823
34576c636897J09977J93667L43666O80898O05410m6385n26498l93510j86938k99313
34566c155923k08084M23813Q52162L79975m03603n01315j3256K27499M1918p9375
34556b436189k1583j26998l84469l96185r2468K26681M67376O95708O48584K2762
34546a396781p69791q64578j11559O05927M54516l49671q63324n08922L39509
34537c464674Q00889M60939j56965k42112K55059N95699L30251j05832j49773
34528a676519L3082o2605l79590l73953J08601N52063M44215j01994n21643m31359
34518b409702n071K54034R7379j99868k46403n5906P0844L2794l7138j03744j99243
$$ plain form
34585 -1634055 -1103298 -1411293 -2291926 -2742872 -2423174 -2126072 -2549125 -3301074 -3636897
34576 -3636897 -3526920 -3333253 -2989587 -2308689 -1703279 -1749664 -2276162 -2669672 -2856610 -3155923
34566 -3155923 -3364007 -2940194 -2088032 -1708057 -2111660 -2612975 -2626231 -2398732 -2356814 -2436189
34556 -2436189 -2457772 -2584770 -2969239 -3365424 -3457892 -3231211 -2763835 -2068127 -1419543 -1396781
34546 -1396781 -2166572 -3031150 -3142709 -2536782 -2082266 -2431937 -3295261 -3804183 -3464674
34537 -3464674 -2663785 -2202846 -2359811 -2601923 -2346864 -1751165 -1420914 -1526746 -1676519
34528 -1676519 -1643437 -1706042 -2085632 -2459585 -2350984 -1798921 -1354706 -1456700 -1978343 -2409702
34518 -2409702 -2414773 -2160739 -2063360 -2263228 -2509631 -2565537 -2494693 -2461899 -2499037 -2602781 -2802024
34507b802024j63654J38276M32616L57934P1837l231R3931L0447q1428R8826K98610
34496a527860m1251o09283m88204K71488N40191p5256n50876j60342L64791K12280
34486b064322j18540J43478N67263L01610l71740n18579j10584R7359p4383j37915
34476b286353k971n1025k33032r4218K98559L54923n3033l87594l01070j1526
34466b767340K24522L88760M11901J78054j42330k40890j34540o9096p2593j1161
34456b234713Q7238J60909L00128M04247O7055o67239r34531j79142P88406P67862
34446a439780j00084n79272j72387L39398K60306j14288k32565j05816r966M1651
34436b112803J64311L18969L85790K66090r8097n23176n57867o5412L73764J54130
$$ plain form
34507 -2802024 -2965678 -2827402 -2394786 -2036852 -1965015 -1968246 -1874315 -1843868 -1925296 -1826470 -1527860
34496 -1527860 -1569111 -2178394 -2666598 -2395110 -1854919 -1930175 -2481051 -2641393 -2276602 -2064322
34486 -2064322 -2182862 -2039384 -1472121 -1170511 -1542251 -2060830 -2171414 -2074055 -2148438 -2286353
34476 -2286353 -2289324 -2340349 -2573381 -2667599 -2369040 -2014117 -2067150 -2454744 -2755814 -2767340
34466 -2767340 -2542818 -2154058 -1742157 -1564103 -1706433 -1947323 -2081863 -2150959 -2223552 -2234713
34456 -2234713 -2147475 -1986566 -1686438 -1282191 -1215136 -1882375 -2816906 -2996048 -2207642 -1439780
34446 -1439780 -1539864 -2119136 -2291523 -1952125 -1691819 -1806107 -2038672 -2144488 -2154454 -2112803
34436 -2112803 -1948492 -1629523 -1243733 -977643 -1075740 -1598916 -2156783 -2222195 -1848431 -1694301
34426a694301m69000p67624n85109l04270n46N16446R21182O12376j47418l01769
34416b220033M57998J076954N56747o72736j364611r87495j17146M22788L46081
34407b501453n8692l45971l31394j64014k623K03963M54144M72543R4004l45025
34397b524518m03660j30885J56619M28159P40626P72772K52891l42833l06209
34388a357038J81642K82006j60152m20080j61623O2533j04259j72578K31956N60172
34378a057421J84398n21890o86496j80564L10187K80805q9594l67368l51708j09075
34368b588726J83753L69815M01150L04551R0673j70239k59581o2310J41659j2146
34358a601401l72618l95509N9715M87257M45535J05829j21250j42228r9836k9920
$$ plain form
34426 -1694301 -2163301 -2930925 -3516034 -3820304 -3820850 -3304404 -2383222 -1770846 -1918264 -2220033
34416 -2220033 -1762035 -685081 -128334 -801070 -2165681 -3153176 -3270322 -2847534 -2501453
34407 -2501453 -2560145 -2906116 -3237510 -3401524 -3404147 -3200184 -2746040 -2273497 -2179493 -2524518
34397 -2524518 -2928178 -3059063 -2902444 -2474285 -1733659 -960887 -707996 -1050829 -1357038
34388 -1357038 -1175396 -893390 -1053542 -1473622 -1635245 -1572712 -1676971 -1849549 -1617593 -1057421
34378 -1057421 -873023 -1394913 -2081409 -2261973 -1951786 -1670981 -1760575 -2127943 -2479651 -2588726
34368 -2588726 -2404973 -2035158 -1634008 -1329457 -1238784 -1409023 -1668604 -1730914 -1589255 -1601401
34358 -1601401 -1974019 -2369528 -2309813 -1822556 -1377021 -1271192 -1392442 -1534670 -1634506 -1664426
34348a664426J03808K05579J24344j38120m14554n04669l19452p101J35649M2529
34338b436413K2366K73377M62278J94319k75675l46009k483J75654j5585j08665
34328b056836J61460L50386N3002l78903l57741O2100L29908K23071O6359J71926
34318a375268M07060L97344J7665l91761l58170J10815M02474K9411o51067q28424
34308b239921l03097K90505L83570J29037j0000R3499K46476K79390J27974j87920
34298a190487m74489m66532j55493J99447M42985O01966N52401N8587o70942r38820
34288b041377m20776K92203M25251J6284k77647j76214l0879q8104n1316L63667
34278a988908Q11292O69101r3803p87013q21911l59966M1443J53579J34130P9092
$$ plain form
34348 -1664426 -1560618 -1355039 -1230695 -1368815 -1783369 -2288038 -2607490 -2614591 -2478942 -2436413
34338 -2436413 -2414047 -2140670 -1678392 -1484073 -1759748 -2105757 -2108240 -1932586 -1948171 -2056836
34328 -2056836 -1895376 -1544990 -1491988 -1870891 -2228632 -2166532 -1836624 -1613553 -1547194 -1375268
34318 -1375268 -968208 -570864 -553199 -944960 -1303130 -1192315 -789841 -760430 -1411497 -2239921
34308 -2239921 -2543018 -2252513 -1868943 -1739906 -1749906 -1656407 -1409931 -1130541 -1002567 -1190487
34298 -1190487 -1664976 -2131508 -2287001 -2087554 -1644569 -1042603 -490202 -431615 -1102557 -2041377
34288 -2041377 -2462153 -2169950 -1744699 -1728415 -2006062 -2182276 -2213155 -2301259 -2352575 -1988908
34278 -1988908 -1177616 -508515 -602318 -1389331 -2211242 -2571208 -2529765 -2376186 -2242056 -2162964
34268b162964k0878L7723M70716R10478O27508l75757j071397o56220L61370Q49496
34258a029925M74663j30688l67306k40235l7391N1198r3m8002P2953K22576P0503
34247i61747k64899j96734L65491O52803J83445l76304k35373K53377K55302j53749
34237d78388k97566j54341j64083j62648K41283N39181k2049q55928o72898L26392
34227a701045O13431j14684m24970K58634N15624n73285j589639r37149N72319
34218c380764J029297L27842p9873K67843M08639o4880l12985J75025O68841L65345
34208e95670m63042r71548p81287j61827M01280N95952M97079M20377M02200Q7343
34198e69143n71982r30507m86505K74366N06821J65104j44362j72218j22855J0935
$$ plain form
34268 -2162964 -2183842 -2146119 -1675403 -764925 -137417 -513174 -1584571 -2240791 -1879421 -1029925
34258 -1029925 -555262 -685950 -1053256 -1293491 -1330882 -1279684 -1279777 -1327779 -1254826 -1032250 -961747
34247 -961747 -1226646 -1423380 -1057889 -405086 -221641 -597945 -833318 -579941 -324639 -478388
34237 -478388 -775954 -930295 -1094378 -1257026 -1015743 -476562 -498611 -1354539 -2027437 -1701045
34227 -1701045 -1087614 -1202298 -1627268 -1368634 -853010 -1426295 -3015934 -3953083 -3380764
34218 -3380764 -2351467 -2023625 -2103498 -1835655 -1427016 -1491896 -1804881 -1629856 -961015 -595670
34208 -595670 -1058712 -2030260 -2811547 -2973374 -2572094 -1976142 -1479063 -1058686 -656486 -569143
34198 -569143 -1141125 -2071632 -2558137 -2283771 -1776950 -1611846 -1756208 -1928426 -2051281 -2040346
34188b040346L50225N15338L8685o32046n26370L17612P21192J04671o11537m22687
34178b185263K82132M63631N9821r6712K62126M54905M8555m07335k72214J52595
34168a237759J02431m25179o20361p7569N74547N72081O2792k30284q8870M8204
34158a319967q5964k18558j05877N3429L335j56496j83737l8182J75336L63706
34148a512975M06340K00929j44903l89348m49096l67243p7005M11521O99452M25391
34138g96937m7421l8796L39327K95245k69264m52723J60197O60873J72667p41334
34128g18166r14927k75019K39150J35410j48278j03798K45643N78328N65809L4477
34118c61371p06857r20511l14322M06953M10756j35566m28045k34336j0744O402
$$ plain form
34188 -2040346 -1690121 -1174783 -1136098 -1768144 -2294514 -1976902 -1255710 -1151039 -1762576 -2185263
34178 -2185263 -1903131 -1439500 -1379679 -1476391 -1214265 -759360 -710805 -1118140 -1390354 -1237759
34168 -1237759 -1135328 -1560507 -2180868 -2258437 -1683890 -1111809 -1049017 -1279301 -1368171 -1319967
34158 -1319967 -1405931 -1624489 -1730366 -1676937 -1673602 -1830098 -2013835 -2052017 -1876681 -1512975
34148 -1512975 -1106635 -905706 -1050609 -1439957 -1889053 -2256296 -2333301 -1921780 -1222328 -796937
34138 -796937 -844358 -883154 -543827 -248582 -517846 -970569 -810372 -149499 23168 -718166
34128 -718166 -1633093 -1908112 -1668962 -1533552 -1681830 -1785628 -1539985 -961657 -395848 -361371
34118 -361371 -1068228 -1988739 -2303061 -1896108 -1485352 -1620918 -2048963 -2283299 -2294043 -2287641
34108b287641M9257J93854K06284O8859M2070J36690P6127j65278l01259k38401
34098b219438j48429m3770K02133M22936L07525J2035M7567M54136O40319K25063
34088i9923m35353p63848o15330k30020J26182K94308K52832J48513J19543Q2301
34078a120795r5926k81631k22850L6171J91597J04682p9830j87970j40356Q0748
34068a716160L36821L42576K4999l05871l87948l33889k46627Q6479O75126R35493
34058e89001M36937l11055n21986k86680k71820n03737l82041J63697N01845L83548
34048a380293K66700L47030J90312l13959n11913k7734M86668K80069l71900o36584
34038a671604l32012J2372R1382J64410M49858P03271N91451J91609j32780k61038
$$ plain form
34108 -2287641 -2238384 -2044530 -1838246 -1769387 -1727317 -1590627 -1514500 -1679778 -1981037 -2219438
34098 -2219438 -2367867 -2411637 -2209504 -1786568 -1479043 -1467008 -1419441 -965305 -324986 -99923
34088 -99923 -535276 -1299124 -1914454 -2144474 -2018292 -1723984 -1471152 -1322639 -1203096 -1120795
34078 -1120795 -1216721 -1498352 -1721202 -1685031 -1493434 -1388752 -1468582 -1656552 -1796908 -1716160
34068 -1716160 -1379339 -1036763 -1011764 -1317635 -1705583 -2039472 -2286099 -2199620 -1524494 -589001
34058 -589001 -152064 -463119 -985105 -1271785 -1543605 -2047342 -2429383 -2265686 -1763841 -1380293
34048 -1380293 -1113593 -766563 -576251 -890210 -1402123 -1429857 -943189 -663120 -1035020 -1671604
34038 -1671604 -2003616 -1991244 -1899862 -1735452 -1285594 -582323 9128 200737 67957 -193081
34028a93081m41250p56938p47173j1971Q86898Q28558k99314j169718p23738L59843
34018b267884P25356L05037J28135M92052O08468J14989l10483j71526J01206
34009b74650P9748M4090K16764J71332l51322p75632n27578N6248L07490J84418
33999h69092K0026j72076m50806m58604N4439N29451K18969o16250q80462r0240
33989b714645R45687J115266L09993n23859n31912P9577L91643L0434l42403q3396
33979a323615L77521K23934l36619l36546L21331O27881J31395l10065O78M50545
33969a73560K51866j95932j01377K62699M7675o44703q72941l37975K63763L69533
33959a130952J74583O6041J40998L43472N01823K73325l88368q51010n28253J71088
$$ plain form
34028 -193081 -634331 -1391269 -2138442 -2150413 -1263515 -434957 -734271 -1903989 -2627727 -2267884
34018 -2267884 -1542528 -1237491 -1109356 -617304 -8836 106153 -204330 -375856 -274650
34009 -274650 -194902 -150812 65952 237284 -114038 -889670 -1417248 -1361000 -1053510 -869092
33999 -869092 -849066 -1021142 -1471948 -1930552 -1876113 -1346662 -1127693 -1743943 -2624405 -2714645
33989 -2714645 -1768958 -653692 -343699 -867558 -1399470 -1319893 -928250 -897816 -1240219 -1323615
33979 -1323615 -946094 -722160 -1058779 -1395325 -1073994 -446113 -314718 -624783 -624105 -173560
33969 -173560 78306 -117626 -219003 43696 91371 -553332 -1426273 -1764248 -1500485 -1130952
33959 -1130952 -956369 -890328 -749330 -405858 95965 369290 -19078 -870088 -1398341 -1227253
33949a227253L55379m752r3646L71613O96360L71881j61303l16253k26759l07203
33939e41936m73809l62821r256J92355N2198k53544m77526m81684k18505K22810
33929b351718N84210O24863L53842J7698j27229k4602J52244J84301M1222j24000
33919f69169k13190k69242k94113j97210q651J10876J88193M45912Q10621P92716
33909F96743J69343n57546p71119n12146k35223r5045M1329J28701L7471n7605
33899a155097Q2666K64969J28410k15357l38276j84719o2065m2916N1427J45706
33889a325252q319k71655k37924P9873K62902J89237J31222J54304N2207r7761
33879a071166J4157K68804K09402j15531j46965J92258K83099j53323n67894m75048
$$ plain form
33949 -1227253 -871874 -876626 -970272 -598659 97701 469582 308279 -7974 -234733 -541936
33939 -541936 -1015745 -1378566 -1387822 -1195467 -1143269 -1396813 -1874339 -2356023 -2574528 -2351718
33929 -2351718 -1767508 -1142645 -788803 -771105 -898334 -922936 -770692 -586391 -545169 -669169
33919 -669169 -882359 -1151601 -1445714 -1642924 -1651575 -1540699 -1352506 -906594 -95973 696743
33909 696743 866086 308540 -462579 -974725 -1209948 -1304993 -1263664 -1134963 -1097492 -1155097
33899 -1155097 -1072431 -807462 -679052 -894409 -1232685 -1417404 -1479469 -1522385 -1470958 -1325252
33889 -1325252 -1333571 -1605226 -1843150 -1763277 -1500375 -1311138 -1179916 -1025612 -973405 -1071166
33879 -1071166 -1057009 -788205 -578803 -694334 -841299 -649041 -365942 -519265 -1087159 -1562207
33869a562207j26377Q3459K10778L51522K71563j07913m12941l92263k47391j05592
33859b037362J66523L52492n0917p57974o78867L95862J139637N91714l02381
33850a181273j97518N07216M65049l15867n90278k6775L84249J21388j75688n3301
33840a062798Q9467L8885J87216M80339K05940o06817q18733M5011Q16308M17619
33830b07563m52340m90904J67439L59164j75462n75915l74296k0161J30843L00157
33820a339038N75258N84530J56571l39181n24867l76610J4198M81169N61273r1767
33810b98464r56099j019154j43133O47632N81604J40036J42991M79288M60658
33801C5359J8378k61068j39740j6692j70155l37490k09695J31539M38459N73942
$$ plain form
33869 -1562207 -1688584 -1605125 -1394347 -1042825 -771262 -879175 -1292116 -1684379 -1931770 -2037362
33859 -2037362 -1870839 -1518347 -1569264 -2327238 -3006105 -2610243 -1470606 -878892 -1181273
33850 -1181273 -1378791 -871575 -406526 -722393 -1312671 -1339446 -955197 -833809 -1009497 -1062798
33840 -1062798 -973331 -934446 -747230 -266891 -60951 -667768 -1486501 -1441490 -625182 -207563
33830 -207563 -659903 -1150807 -983368 -624204 -799666 -1375581 -1749877 -1770038 -1639195 -1339038
33820 -1339038 -763780 -179250 -22679 -361860 -886727 -1263337 -1249139 -767970 -206697 -298464
33810 -298464 -1254563 -2273717 -2416850 -1769218 -1187614 -1047578 -904587 -425299 35359
33801 35359 53737 -207331 -347071 -363763 -533918 -871408 -1081103 -949564 -511105 62837
33791F2837M39557K0997l60843k72644J65813K94295j35788n16878l19660K4544
33781e97770j67108o09454m21011L87256P79928K71496l20105k00210J66915o8932
33771g78995o62742o58542M2876N30405L05822p6625j7470K80547L41673J66917
33761e26134K7142l2006p7429l8913Q4914Q8812p7721j37446M6113J75466M295
33750d62907k29038k03021l9369n8188k60057l93556l15493j1525M61678Q00594
33740g10882N93470n0186m28847j92414J10061q0864l94451j56217M40857O05022
33730b64451J80926j96707j29861J04678J71058P4234j07523l26981l96559k18921
33720a110107r3614k62541l65032r869L82538J69995l11224j90491M04644M87904
$$ plain form
33791 62837 502394 523391 162548 -110096 55717 350012 214224 -302654 -622314 -597770
33781 -597770 -764878 -1374332 -1795343 -1408087 -628159 -356663 -676768 -876978 -710063 -778995
33771 -778995 -1441737 -2100279 -2057403 -1526998 -1221176 -1297801 -1315271 -1034724 -693051 -526134
33761 -526134 -498992 -530998 -608427 -647340 -562426 -473614 -551335 -688781 -642668 -467202 -462907
33750 -462907 -691945 -894966 -934335 -992523 -1252580 -1646136 -1961629 -1973154 -1511476 -710882
33740 -710882 -117412 -167598 -596445 -788859 -678798 -759662 -1154113 -1310330 -869473 -264451
33730 -264451 -83525 -280232 -410093 -305415 -134357 -60123 -167646 -494627 -891186 -1110107
33720 -1110107 -1203721 -1466262 -1831294 -1841163 -1458625 -1288630 -1599854 -1790345 -1385701 -897797
33710h97797l8659j50539M38237O22378j88095q67162l11236P38489Q49159M7311
33700B42086m95659l69254j89979k60183k15291M9674J64993L0242r1576j93701
33690a328648m33838n19652m5343O19045O68825J08671k34720k1222J82049k5792
33680a030625k53272q4121K60264L86341K71274L9688k76228n08430l96860p2994
33670a664963J0650j87836j88463J96996N22352M28776J46423r503j03656k30915
33660a080139k15887M524J68026J66599K58316M89291M34933q3281n31344l96022
33650g84984M2927J83152k1581j83919j83727j88069j71424M0247L41775M33184
33640d92419K82849J14791j0748k22687m62124m46515r0422K93423L35341M9820
$$ plain form
33710 -897797 -936456 -1086995 -648758 -26380 -214475 -1081637 -1392873 -654384 194775 242086
33700 242086 -253573 -622827 -812806 -1072989 -1288280 -1238606 -1073613 -1043371 -1134947 -1328648
33690 -1328648 -1762486 -2282138 -2327481 -1708436 -1039611 -930940 -1165660 -1186882 -1004833 -1030625
33680 -1030625 -1283897 -1368018 -1107754 -721413 -450139 -410451 -686679 -1195109 -1591969 -1664963
33670 -1664963 -1654313 -1842149 -2030612 -1833616 -1311264 -882488 -736065 -745568 -849224 -1080139
33660 -1080139 -1296026 -1291502 -1123476 -956877 -698561 -209270 225663 142382 -388962 -784984
33650 -784984 -742057 -558905 -580486 -764405 -948132 -1136201 -1307625 -1267378 -925603 -492419
33640 -492419 -209570 -94779 -105527 -328214 -790338 -1236853 -1327275 -1033852 -698511 -648691
33630f48691j44915J09847O02195O60459M21p12013n95499K07375O38404K06648
33620C24231l31443j57808L96205M51340p9864n08583m73518k65924j22815P4520
33610f93659L02111K36745j74949m86210l58033k7926Q7871l7375j35955q4013
33600a371393K3994R9069J18701N2224o6391n6725J92122M35538K64037l07126
33590f15950o77484l56398L09933M87679k9717m94718k40850L63874M56336r5244
33580h92539n86650n15763j16863K10633M11932N07947L50620l0576k44154l8790
33570i44203L06835L75131J19991k34718n02921n32704k35605J58315K39984L1701
33560a218194J7132L07803L38217j87386o25048k96900L99238N47420P4850k61402
$$ plain form
33630 -648691 -793606 -683759 -81564 578895 579316 -132697 -728196 -520821 117583 324231
33620 324231 -7212 -165020 231185 682525 602661 94078 -379440 -645364 -768179 -693659
33610 -693659 -391548 -154803 -329752 -815962 -1173995 -1201921 -1114050 -1151425 -1287380 -1371393
33600 -1371393 -1347399 -1248330 -1129629 -1077405 -1143796 -1200521 -1008399 -572861 -308824 -615950
33590 -615950 -1293434 -1649832 -1339899 -852220 -881937 -1376655 -1617505 -1253631 -797295 -892539
33580 -892539 -1479189 -1994952 -2111815 -1901182 -1489250 -981303 -630683 -661259 -905413 -944203
33570 -944203 -637368 -262237 -142246 -376964 -879885 -1412589 -1648194 -1489879 -1249895 -1218194
33560 -1218194 -1201062 -893259 -555042 -742428 -1367476 -1664376 -1265138 -717718 -642868 -904270
33550i04270r7622J60117J87744J64166J86815Q62m09917n79834k50181J96791
33540a345329L30698K51598K18027J32196j42126k96337J7203M71395L72468k85295
33530b75502o64193k34881M08120L48008l36213o74567j99462M36057M85233J32771
33520e74629r875O7139l3900k15703m8209K72233Q7886m79248m65958L81556R88272
33509c0436N08598l75374n38328o2819J72787p486j03833j12643m66516q87580
33499a903630n10029O37455J337380P96058k90687p77556m97551r8058M1626J11302
33489a153690L13290N09055M34091M6438l62371m11460p1261K49151K26274L7977
33479a82506k0359o5180l24617n53693l40740J45657L65350K87037L56889N96401
$$ plain form
33550 -904270 -1001892 -841775 -654031 -489865 -303050 -302188 -712105 -1291939 -1542120 -1345329
33540 -1345329 -1014631 -763033 -545006 -412810 -554936 -851273 -834070 -362675 9793 -275502
33530 -275502 -939695 -1174576 -766456 -418448 -754661 -1429228 -1628690 -1192633 -707400 -574629
33520 -574629 -584504 -517365 -551265 -766968 -815177 -542944 -455058 -934306 -1400264 -1018708 -30436
33509 -30436 478162 102788 -435540 -498359 -325572 -333058 -436891 -549534 -1016050 -1903630
33499 -1903630 -2413659 -1776204 -438824 357234 66547 -711009 -1208560 -1306618 -1264992 -1153690
33489 -1153690 -840400 -331345 102746 149184 -213187 -624647 -695908 -446757 -220483 -182506
33479 -182506 -202865 -268045 -592662 -1146355 -1487095 -1341438 -976088 -689051 -332162 264239
33469B64239N09929J1529l45649k97309k48063m00387k96418K77167O50396K10454
33459C35888n46692o49614k6984M67382K82265k18223m19770k40536o0706j32293
33449a209283k74674j57315K06857M19526K42603m1725p5469J2367r6013k60792
33439a233918j06583K34208K68604P169m5433J82759K00597j06275k45966p7285
33429i22123j06470m52538m38642K37442Q08270O01370R1974O549J36050l7742
33419g5860k15170J38877N87586K69878o15296j013011n97872q4678M3711Q1243
33409a480592K45946K53500N284j13773P8650K53541J92371R6190P4906m5328
33399d39305k07096n9194L52036M71296J13685j61433P3023M22226L04829j70709
$$ plain form
33469 264239 774168 785697 440048 142739 -105324 -505711 -802129 -524962 125434 335888
33459 335888 -210804 -860418 -887402 -420020 -137755 -355978 -775748 -1016284 -1076990 -1209283
33449 -1209283 -1483957 -1641272 -1434415 -1014889 -772286 -814011 -889480 -877113 -973126 -1233918
33439 -1233918 -1340501 -1106293 -837689 -830520 -875953 -693194 -492597 -598872 -844838 -922123
33429 -922123 -1028593 -1481131 -1919773 -1682331 -874061 -272691 -180717 -174168 -38118 -75860
33419 -75860 -291030 -152153 435433 705311 90015 -922996 -1520868 -1605546 -1561835 -1480592
33409 -1480592 -1234646 -981146 -975862 -1089635 -1010985 -757444 -565073 -468883 -393977 -439305
33399 -439305 -646401 -705595 -353559 117737 231422 69989 143012 565238 870067 699358
33389F99358m47789l35142j31978j11645k26195k46304j2800L61391N08953K24554
33379B82403j71921k08206M7536J10374j05445j66886N4588Q7530k91442n28224
33369h89693j20185M93301M89582j54154o53788n00539J432L12466L07230K01067
33359e13281J52641J42307R3154m0158k48860m44141m64679j89114K84665O02707
33349f24759M56233j3646l01188j64105O4384K0931j14281J2838K36281J15759
33339c11553k43995k91073K6445J34502j59187k78313J26304M96700K45885k58694
33329e12979k82555J13891K64574J8320j17910P9581K15176L5281j05060J55888
33319a35793N60428N77939J45961k66232k70165M049J34262n2084l01493l28748
$$ plain form
33389 699358 251569 -83573 -215551 -327196 -553391 -799695 -812495 -451104 57849 282403
33379 282403 110482 -97724 -50188 60186 -45259 -212145 -157557 -70027 -361469 -889693
33369 -889693 -1009878 -516577 -26995 -181149 -834937 -1335476 -1334044 -1021578 -714348 -513281
33359 -513281 -360640 -218333 -125179 -165337 -414197 -858338 -1323017 -1512131 -1227466 -624759
33349 -624759 -168526 -182172 -483360 -647465 -583081 -562150 -676431 -663593 -427312 -311553
33339 -311553 -555548 -846621 -820176 -685674 -844861 -1123174 -996870 -500170 -254285 -512979
33329 -512979 -795534 -681643 -417069 -398749 -516659 -437078 -221902 -186621 -291681 -135793
33319 -135793 424635 1002574 1148535 882303 612138 616187 750449 698365 396872 68124
33309F8124k12607j91434k04488j4221K50378J81560j68499k39689O4837M1970
33299d24069o41595j114153m75085O88380J022243L94364m1098K08267K82776
33290i9970l46475p72000q9682R98978J101770R5447q75794j026767n67161P1309
33280a510345O38870P62349K24160l75105j75842N62541O19051l53598j164064
33271g71983p93104J65743N43621L01954K45646N51003O15462J60895m25159p71370
33261a77292p91614m01956K78369O15616J93556l12656K1772P78728O56711l95955
33251D65279r08678j84877N66998K18681m96248l65089K49527K06417l52778l80607
33241i81375Q7168M7847m71053k91075P68135J296045M87615n30678m79130J77716
$$ plain form
33309 68124 -144483 -335917 -540405 -554626 -304248 -122688 -291187 -530876 -466039 -424069
33299 -424069 -1065664 -2179817 -2654902 -1966522 -944279 -549915 -591013 -382746 -99970
33290 -99970 -446445 -1218445 -1308127 -309149 792621 888068 12274 -1014493 -1581654 -1510345
33280 -1510345 -871475 -109126 115034 -260071 -435913 126628 745679 392081 -771983
33271 -771983 -1565087 -1399344 -855723 -553769 -308123 242880 858342 1019237 594078 -177292
33261 -177292 -968906 -1370862 -1092493 -476877 -283321 -595977 -574205 204523 861234 465279
33251 465279 -443399 -628276 -61278 157403 -338845 -703934 -454407 -247990 -600768 -981375
33241 -981375 -894207 -846360 -1317413 -1608488 -840353 455692 943307 412629 -66501 111215
33231A11215K28769k84238l30693L18890P77268M33100k86301o52963m85511j23229
33221b93693K6877j62159m03366k66165K58164O58797N45880J12175k26976l04874
33211e5340j23520K48244M51577O0148o27794o51423K46977R76133N37179m76113
33201E86068p39597j37235K37336j47978n98638m24773J32967N15348O12978N63944
33191F00420L80207J20277j5880j5653q2165j88759n4466K89874L91394L2048
33181A457297m32720n89669m34662j62000J20687L03576K71534J35045J22120
33172G91208J68347J1364k63201k54106Q6760L33371K63511J22348N1123j56998
33162A153727m79184m38438J60945P60268P26367J44120m14739n82184l65386
$$ plain form
33231 111215 339984 55746 -274947 43943 821211 1254311 968010 315047 -170464 -293693
33221 -293693 -266816 -428975 -832341 -1098506 -840342 -181545 364335 476510 249534 -55340
33211 -55340 -178860 69384 520961 581109 -46685 -698108 -451131 525002 1062181 586068
33201 586068 -153529 -290764 -53428 -201406 -800044 -1224817 -1091850 -576502 36476 600420
33191 600420 980627 1100904 1085024 1069371 987206 798447 743981 1033855 1425249 1457297
33181 1457297 1024577 434908 246 -161754 -41067 262509 534043 669088 791208
33172 791208 959555 970919 707718 453612 540372 873743 1137254 1259602 1310725 1153727
33162 1153727 674543 236105 397050 1157318 1883685 2027805 1613066 1030882 665496
33153F65496K7348K58297Q1039k92624l71751n4848K89016M62818O06429O50450
33143B321670L19592j64826k11340P8047o7245o39142n68489M82166J255848P82139
33133C588420l9276K5736M96503K20853m05604j26821P98714R41016K47447J55241
33123E902229R98195J423065Q54147L37023N6508j688168n414909q266606p107784
33114a2906300k769492R36768J866421J180836O73930O36181O98152R19303J238743
33105g525458J118646M92016J15203L70102O05189K73827j30043J7881L78317
33096d284320K84913r8333j37290J29136J07086k46463l01001J85492O13903M18073
33086c328804j27585l18452N7557N28674N57823J26108l01115k91026J06519M39901
$$ plain form
33153 665496 692844 951141 1032180 739556 367805 312957 601973 1064791 1671220 2321670
33143 2321670 2641262 2476436 2265096 2343143 2275898 1636756 1068267 1550433 2806281 3588420
33133 3588420 3549144 3574880 4071383 4292236 3886632 3759811 4558525 5499541 5746988 5902229
33123 5902229 6900424 8323489 9177636 9514659 9571167 7882999 2468090 -5798516 -12906300
33114 -12906300 -15675792 -14739024 -12872603 -11691767 -11017837 -10381656 -9683504 -8764201 -7525458
33105 -7525458 -6406812 -5914796 -5799593 -5429491 -4824302 -4550475 -4680518 -4662637 -4284320
33096 -4284320 -3999407 -4097740 -4235030 -4105894 -3998808 -4245271 -4546272 -4360780 -3746877 -3328804
33086 -3328804 -3456389 -3774841 -3717284 -3188610 -2630787 -2504679 -2805794 -3096820 -2990301 -2550400
33076b550400L77713M6915k12512k81369k74638k30315n3735K13102L32181K02185
33066b430873M8810J06164K57458K25924L8934m72J58808J52324k30372n97866
33056b271161m48992L9413J99224j26831l08656R3608N84077M58446p7388j94753
33046b053013K58855N04447N7664m95866m05999R7903K21927j23857k32962K09763
33036a961138N89788L26119k09616k69655J21693K50660j31533m19003j28701
33027a831386L22969K80960j12968j67128K38878M62219J15189l60414m20652
33018a472333j86235p3524r0318Q43J36729J13988N8183J66303J89690j75817
33008a332491n42891k64256M04434M65856k97829q80539n43821J28511K94408
$$ plain form
33076 -2550400 -2172687 -2125772 -2338284 -2619653 -2894291 -3124606 -3178341 -2965239 -2633058 -2430873
33066 -2430873 -2382063 -2275899 -2018441 -1792517 -1753583 -1754055 -1595247 -1442923 -1673295 -2271161
33056 -2271161 -2720153 -2680740 -2481516 -2608347 -2917003 -2823395 -2239318 -1780872 -1858260 -2053013
33046 -2053013 -1794158 -1289711 -1232047 -1727913 -2133912 -2036009 -1814082 -1937939 -2170901 -1961138
33036 -1961138 -1371350 -1045231 -1254847 -1524502 -1402809 -1152149 -1283682 -1702685 -1831386
33027 -1831386 -1508417 -1227457 -1340425 -1507553 -1268675 -806456 -691267 -1051681 -1472333
33018 -1472333 -1658568 -1732092 -1822410 -1821567 -1684838 -1570850 -1512667 -1346364 -1156674 -1332491
33008 -1332491 -1875382 -2139638 -1735204 -1269348 -1567177 -2447716 -2991537 -2863026 -2568618
32999b568618J63850L80391P22987M83865j98548m76326j68892K9406k10551l80063
32989b222499j12935K52580L95122M75174N27606J98519m57410o93697j63416
32980a800956L99201K48711k43580k83929O7606J85726L8353J00463L31154K10019
32970g47232k41433l97743q5261J56826N6045K1515K76914L55378q2948n63927
32960a251866m72669M5358L86540L46673J67971k165j80638k31701K2379L90524
32950g79594M11710n8521o11157p18581k87272K57690M00991P0559k84186k37203
32940a835564P9337J93363l5109k76071k46069k131L04434N68831N76491J67317
32930e05171l36011l73321J4312J63240j49112k83861J84899O48836L80371k77044
$$ plain form
32999 -2568618 -2404768 -2024377 -1301390 -817525 -1016073 -1492399 -1661291 -1631885 -1842436 -2222499
32989 -2222499 -2335434 -2082854 -1687732 -1212558 -684952 -486433 -943843 -1637540 -1800956
32980 -1800956 -1401755 -1153044 -1396624 -1680553 -1612947 -1427221 -1388868 -1288405 -957251 -747232
32970 -747232 -988665 -1386408 -1471669 -1314843 -1258798 -1237283 -960369 -604991 -687939 -1251866
32960 -1251866 -1724535 -1679177 -1292637 -945964 -777993 -780158 -960796 -1192497 -1170118 -779594
32950 -779594 -367884 -426405 -1037562 -1756143 -2043415 -1785725 -1384734 -1314175 -1598361 -1835564
32940 -1835564 -1756227 -1562864 -1597973 -1874044 -2120113 -2122244 -1817810 -1248979 -672488 -505171
32930 -505171 -841182 -1214503 -1200191 -1036951 -1186063 -1469924 -1285025 -636189 -255818 -532862
32920e32862m52311j15500q91l24820n02188j97082J89408K93560L15575M46686
32910h80425L90650r1599n74877m04181M01198J035314P52055k73526j004286
32901f49677o06817N10124J040097L62136o46337q08038k11835J26049j37523
32892a021821l36280m2601L00540K50192M3436J8485L6583q5745j43487J6260
32882i64438J20047m1135k11877j76644j93023m61425o03775j97026N08173R00841
32872a320282P76840L73542o8867l65028l06163M4486K51158Q4518j19952n7713
32862g07461J0827k01316l87646j79228J10598m089k56939m1160M61256M73109
32852g22049p4068l41418J25599P12287O66327O6652n06815p45145o62931l02373
$$ plain form
32920 -532862 -985173 -1100673 -1101564 -1426384 -1928572 -2125654 -1936246 -1642686 -1327111 -880425
32910 -880425 -489775 -581374 -1156251 -1560432 -1159234 -123920 628135 354609 -649677
32901 -649677 -1256494 -746370 293727 655863 9526 -798512 -1010347 -884298 -1021821
32892 -1021821 -1358101 -1400702 -1100162 -849970 -806534 -788049 -751466 -837211 -980698 -964438
32882 -964438 -844391 -885526 -1097403 -1274047 -1467070 -1928495 -2532270 -2729296 -2221123 -1320282
32872 -1320282 -543442 -169900 -238767 -603795 -909958 -865472 -614314 -529796 -649748 -707461
32862 -707461 -696634 -897950 -1285596 -1464824 -1354226 -1358315 -1615254 -1656414 -1195158 -722049
32852 -722049 -796117 -1137535 -1011936 -299649 366678 433330 -73485 -818630 -1481561 -1783934
32842a783934J91382M62214K87199q9120k11730N8659M08410M08710l9684n44518
32832h52412n84615j34698K46431J30989k20655l06556j07149N8679J48103L24971
32822a296912M48189K33245j56616k85947j60686j39077j90227K7588L48102K02945
32812i69396l14535m02678J21425L88031j07688n54161p0713Q07913Q60904j9965
32802b60863p40560n65747J04887N46334N37659K26583k28929o28956p27162m78400
32792b215154r3603K08078L28113K37968L9331j4769J72084L18802J56083r5145
32782i58212k2890K80131K81549j84512o22579n55491j44650J00171j6845k55466
32772b098794l35998k18901k4797J45528K72937L84931M96465N58068M58852J36280
$$ plain form
32842 -1783934 -1592552 -1130338 -843139 -932259 -1143989 -1085330 -676920 -268210 -307894 -852412
32832 -852412 -1437027 -1571725 -1325294 -1194305 -1414960 -1721516 -1828665 -1769986 -1621883 -1296912
32822 -1296912 -848723 -615478 -772094 -1058041 -1218727 -1357804 -1548031 -1520443 -1172341 -969396
32812 -969396 -1283931 -1686609 -1565184 -1177153 -1284841 -1839002 -1909715 -1101802 -240898 -260863
32802 -260863 -1001423 -1567170 -1462283 -915949 -378290 -151707 -380636 -1009592 -1736754 -2215154
32792 -2215154 -2308757 -2100679 -1772566 -1534598 -1495267 -1510036 -1337952 -1019150 -863067 -958212
32782 -958212 -981102 -700971 -419422 -603934 -1226513 -1782004 -1926654 -1826483 -1843328 -2098794
32772 -2098794 -2434792 -2653693 -2678490 -2532962 -2260025 -1875094 -1378629 -820561 -361709 -225429
32762b25429k71329m48109k13052J99273L60533J92265K9562M2636k4591k77846
32752f36087k99853J32318L95522j26039q29939n71218M91415R22307J67530n69255
32742i23299k54625L77408J76118m91079m95186N8420J35456k46075J3592J026346
32732f22924J401451L55706r70796j126535k96146K87285J76911l5298P5162K53855
32722e01329K05386J4688j59077l04477l72534k47837j1003O4384r5424j95499
32712a602722L0828L79143L60123j27494n43238l67249J33318K28009j79039l54793
32702b043114J05749N65078L29118k10665k09672K42867L23809j06266l14703
32693a317799K0853L57758L36153K96325L90176J42584n59104r09746l22485N62033
$$ plain form
32762 -225429 -496758 -944867 -1157919 -958646 -598113 -405848 -376286 -333650 -358241 -636087
32752 -636087 -935940 -803622 -408100 -534139 -1364078 -1935296 -1443881 -521574 -354044 -923299
32742 -923299 -1177924 -800516 -624398 -1115477 -1610663 -1552243 -1416787 -1662862 -1649270 -622924
32732 -622924 778527 1134233 163437 -963098 -1259244 -971959 -795048 -830346 -755184 -501329
32722 -501329 -295943 -281255 -440332 -744809 -1117343 -1365180 -1376183 -1311799 -1407223 -1602722
32712 -1602722 -1571894 -1192751 -832628 -960122 -1503360 -1870609 -1737291 -1509282 -1688321 -2043114
32702 -2043114 -1937365 -1372287 -1043169 -1253834 -1463506 -1220639 -896830 -1003096 -1317799
32693 -1317799 -1296946 -939188 -603035 -306710 83466 226050 -333054 -1242800 -1565285 -1003252
32683a003252P37340J78039l62304m45894j85835K04211M63047K60765k91790
32674d45673n16861j14195K69797O1652k36461Q2812N92921L47113m81070p52880
32664a192845j24649M72452K94785k53714m33434j37552K88985N54803M63186
32655f7983m101m52352m42002j69053j85529m25698k67787L30333O25334K96917
32645g61921k927K41522N38825K28892m23067o31301j90757L88871N72717K19422
32635A80276m04274p37422m04946K00079K80710k20263m70387l6685M29538K92449
32625h90925m1258J03639N08939M95231L7827l74505o09910q03318p35624j54162
32615b464066N35806P17812M80246L04259J32299l49097p64776m44910L44313
$$ plain form
32683 -1003252 -265912 -87873 -450177 -896071 -1081906 -877695 -414648 -153883 -445673
32674 -445673 -962534 -1076729 -806932 -745280 -981741 -898929 -306008 41105 -439965 -1192845
32664 -1192845 -1317494 -845042 -550257 -803971 -1237405 -1374957 -1085972 -531169 -67983
32655 -67983 -72084 -524436 -966438 -1135491 -1321020 -1746718 -2014505 -1684172 -1058838 -761921
32645 -761921 -764848 -523326 15499 244391 -178676 -809977 -1000734 -611863 -39146 180276
32635 180276 -223998 -961420 -1366366 -1166287 -885577 -1105840 -1576227 -1612912 -1183374 -890925
32625 -890925 -932183 -828544 -319605 175626 213453 -161052 -770962 -1574280 -2309904 -2464066
32615 -2464066 -1928260 -1210448 -730202 -425943 -293644 -642741 -1407517 -1852427 -1508114
32606a508114O48931L16338J31937L57933L03986l31553q14996n68869m2940J49816
32596a357531J02970Q2971l1536k07089R079N85921O83865n4465p20698m61396
32586a367909K27946M51982L50161M75188M85252j86408q89581n11239N69431
32577c95177Q45608J5994o11454k95490J22934q9439l41233j5311L15187J7722
32567d30659l11944J21054Q09350P36408R1670j05324K62346L52460j03030m68878
32557I53453m56807n09751p35588n91590J1637L45725Q7737p6882L08358N63429
32547a00279K9486o46895m17691M84615Q73399L85613j52798j42031M5278l2040
32537C26657j45508M183J56429k2620l21643l44748j13955J23407L38426N35828
$$ plain form
32606 -1508114 -859183 -542845 -410908 -52975 251011 -80542 -895538 -1464407 -1507347 -1357531
32596 -1357531 -1254561 -1171590 -1203126 -1410215 -1401136 -815215 -131350 -185815 -906513 -1367909
32586 -1367909 -1139963 -687981 -337820 137368 622620 436212 -453369 -964608 -395177
32577 -395177 450431 466425 -145029 -440519 -317585 -407024 -748257 -763568 -448381 -430659
32567 -430659 -742603 -621549 187801 924209 1015879 910555 1172901 1525361 1422331 953453
32557 953453 496646 -13105 -748693 -1340283 -1328646 -982921 -895184 -972066 -663708 -100279
32547 -100279 -70793 -717688 -1135379 -650764 222635 608248 455450 313419 358697 326657
32537 326657 181149 185332 341761 319141 -2502 -347250 -461205 -337798 628 536456
32527E36456M73800P2676j99774N4807L72172o3001j139647j753756j202022n5880
32517b904169O51340O31300L56981K41327K67547K70709J60104j21221n41779
32508i87861q48313p16241j13810N85659Q87149N58519j65384o96600n66056P0655
32498a992283N28522L64922q5452j83167J44310L67886J87455l6448J03290L66806
32488b34159J96955l87700o92417k57728M91269P77383M25249o7125l02670l98675
32478d49618n48334o01077l63643k1307J08046O7374J32213K97858K96066Q4626
32468i97796r1458j44264k26350l08161j24326L13627N89228M64197J77866k9292
32458c76729k19818l46949j07015M06170N03099p0603m88726j5866O75539L91817
$$ plain form
32527 536456 1010256 1082932 883158 937965 1310137 1247136 107489 -1646267 -2848289 -2904169
32517 -2904169 -2252829 -1621529 -1264548 -1023221 -755674 -484965 -324861 -446082 -987861
32508 -987861 -1836174 -2552415 -2666225 -2080566 -1193417 -634898 -800282 -1496882 -2062938 -1992283
32498 -1992283 -1463761 -1098839 -1184291 -1367458 -1223148 -855262 -667807 -704255 -600965 -234159
32488 -234159 -37204 -424904 -1117321 -1375049 -883780 -106397 318852 251727 -50943 -449618
32478 -449618 -997952 -1599029 -1962672 -1983979 -1875933 -1808559 -1676346 -1378488 -1082422 -997796
32468 -997796 -1089254 -1233518 -1459868 -1768029 -1892355 -1578728 -989500 -525303 -347437 -376729
32458 -376729 -596547 -943496 -1050511 -644341 -141242 -211845 -700571 -716437 -40898 350919
32448C50919o58774j047192k81568M71487K28400m02311l63335K28863N10981
32439i62530K79836K9584m220M9268K41150N94001O06235j20028r30328p97763
32429a014795Q0542M41227j32305n86223j20593N51767M19132k43497m68983j64374
32419a238102j2116j47536l9712L71077M65528M7337k67394q9824J10321j30963
$$ plain form
32448 350919 -307855 -1355047 -1636615 -1165128 -936728 -1339039 -1702374 -1473511 -962530
32439 -962530 -682694 -653110 -657330 -608062 -366912 227089 833324 713296 -217032 -1014795
32429 -1014795 -934253 -493026 -625331 -1211554 -1332147 -780380 -361248 -604745 -1073728 -1238102
32419 -1238102 -1250218 -1397754 -1437466 -1066389 -600861 -553524 -820918 -910742 -800421 -931384
$$ [...]
##END NTUPLES=NMR SPECTRUM
##END=
