##TITLE=31Pdec_52-2022
 CDCl3, 24 sc
 29.7.2022
##JCAMPDX= 6.0         $$ Bruker NMR JCAMP-DX V2.0
##DATA TYPE= NMR SPECTRUM
##DATA CLASS= NTUPLES
##ORIGIN= UXNMR, Bruker Analytische Messtechnik GmbH
##OWNER= root
$$ XWIN-NMR		Version 3.5
$$ Fri Jul 29 10:15:01 2022 Russian Standard Time (UT+4h)  she@DPX200
##.OBSERVE FREQUENCY= 81.013821
##.OBSERVE NUCLEUS= ^31P
##.ACQUISITION MODE= SIMULTANEOUS
##.ACQUISITION SCHEME= undefined
##.AVERAGES= 24
##.DIGITISER RES= 16
##SPECTROMETER/DATA SYSTEM= spect
##.PULSE SEQUENCE= zgpg30
##.SOLVENT NAME= CD2Cl2
##.SHIFT REFERENCE= (INTERNAL, CD2Cl2, 0, 248.564)
##AUDIT TRAIL= $$ (NUMBER, WHEN, WHO, WHERE, WHAT)
$$ ##TITLE= Audit trail, XWIN-NMR		Version 3.5
$$ ##JCAMPDX= 5.01
$$ ##ORIGIN= Bruker BioSpin GmbH
$$ ##OWNER= she
$$ F:/spectra/data/she/nmr/P31/1/pdata/1/auditp.txt
$$ ##AUDIT TRAIL=  $$ (NUMBER, WHEN, WHO, WHERE, WHAT)
(   1,<2022-07-29 10:13:50.23 +0400>,<she>,<DPX200>,
      <created by zg, POWCHK disabled, PULCHK disabled
       configuration hash MD5:
       00 E9 B6 7A A2 85 ED C7 34 08 36 98 17 FE 4E 26
       data hash MD5: 32K
       5C CE 42 54 E5 1B 57 3C 1A 3B 8C E6 26 B2 EF 9F>)
(   2,<2022-07-29 10:13:53.04 +0400>,<she>,<DPX200>,
      <Start of raw data processing
       efp BC_mod = 2 LB = 1 FT_mod = 6 PKNL = 1 PHC0 = -10375.95 PHC1 = 319.4567 SI = 64K 
       data hash MD5: 64K
       D6 FB B2 AB A7 36 C3 74 7D 79 E1 A3 8B F8 24 62>)
(   3,<2022-07-29 10:14:06.40 +0400>,<she>,<DPX200>,
      <pk PHC0 = 12.39281 PHC1 = 0 
       data hash MD5: 64K
       D8 EA ED F5 8D F9 2A B8 F3 75 B9 1E 7D 30 46 41>)
(   4,<2022-07-29 10:14:09.09 +0400>,<she>,<DPX200>,
      <abs ABSG = 5 
       data hash MD5: 64K
       08 37 AC DA 6B B7 4B BC 0E 1E 9F 2E 88 6C 73 E7>)
$$ ##END=
$$ 
$$ hash MD5
$$ 97 24 FD 87 61 7E 33 ED 62 1B 37 B9 43 88 D2 6F
##$RELAX= 
##$RELAX= 
##$RELAX= 
##$RELAX= 
##$RELAX= 
##$RELAX= 
##$RELAX= 
##$RELAX= 
$$ Bruker specific parameters
$$ --------------------------
##$DU= <F:/spectra>
##$EXPNO= 1
##$NAME= <P31>
##$PROCNO= 1
##$TYPE= <nmr>
##$USER= <she>
##$AMP= (0..31)
100 100 100 100 100 100 100 100 100 100 100 100 100 100 100 100 100 100 
100 100 100 100 100 100 100 100 100 100 100 100 100 100 
##$AQSEQ= 0
##$AQ_mod= 1
##$AUNM= <au_zg>
##$AUTOPOS= <>
##$BF1= 81.014009
##$BF2= 200.13
##$BF3= 200.13
##$BF4= 200.13
##$BF5= 200.13
##$BF6= 200.13
##$BF7= 200.13
##$BF8= 200.13
##$BYTORDA= 1
##$CFDGTYP= 0
##$CFRGTYP= 5
##$CHEMSTR= <none>
##$CNST= (0..31)
1 1 145 1 1 1 1 1 1 1 1 1 1 1 1 1 1 1 1 1 1 1 1 1 1 1 1 1 1 1 1 1 
##$CPDPRG= <waltz16>
##$CPDPRG1= <>
##$CPDPRG2= <waltz16>
##$CPDPRG3= <>
##$CPDPRG4= <mlev>
##$CPDPRG5= <mlev>
##$CPDPRG6= <mlev>
##$CPDPRG7= <mlev>
##$CPDPRG8= <mlev>
##$CPDPRGB= <>
##$CPDPRGT= <>
##$D= (0..31)
0 1 0 0 0 0 0 0 0 0 0 0.03 2e-05 3e-06 0 0 0 0 0 0 0 0 0 0 0 0 0 0 0 0 
0 0 
##$DATE= 1659075229
##$DBL= (0..7)
120 120 120 11 120 120 24 19 
##$DBP= (0..7)
150 150 150 150 150 150 150 150 
##$DBP07= 0
##$DBPNAM0= <>
##$DBPNAM1= <>
##$DBPNAM2= <>
$$ [...]
##$SUBNAM3= <"">
##$SUBNAM4= <"">
##$SUBNAM5= <"">
##$SUBNAM6= <"">
##$SUBNAM7= <"">
##$SUBNAM8= <"">
##$SUBNAM9= <"">
##$SW= 501.771253377433
##$SWIBOX= (0..15)
0 1 3 0 0 0 0 0 0 0 0 0 0 0 0 0 
##$SW_h= 40650.406504065
##$TD= 32768
##$TD0= 1
##$TE= 0
##$TE2= 300
##$TE3= 300
##$TEG= 300
##$TL= (0..7)
0 120 53 12 22 120 120 120 
##$TP= (0..7)
150 150 150 150 150 150 150 150 
##$TP07= 0
##$TPNAME0= <>
##$TPNAME1= <>
##$TPNAME2= <>
##$TPNAME3= <>
##$TPNAME4= <>
##$TPNAME5= <>
##$TPNAME6= <>
##$TPNAME7= <>
##$TPOAL= (0..7)
0.5 0.5 0.5 0.5 0.5 0.5 0.5 0.5 
##$TPOFFS= (0..7)
0 0 0 0 0 0 0 0 
##$TUNHIN= 0
##$TUNHOUT= 0
##$TUNXOUT= 0
##$USERA1= <user>
##$USERA2= <user>
##$USERA3= <user>
##$USERA4= <user>
##$USERA5= <user>
##$V9= 5
##$VALIST= <valist>
##$VCLIST= <CCCCCCCCCCCCCCC>
##$VD= 0
##$VDLIST= <DDDDDDDDDDDDDDD>
##$VPLIST= <PPPPPPPPPPPPPPP>
##$VTLIST= <TTTTTTTTTTTTTTT>
##$WBST= 1024
##$WBSW= 4
##$XGAIN= (0..3)
0 0 0 0 
##$XL= 0
##$YL= 0
##$YMAX_a= 3543
##$YMIN_a= -3638
##$ZGOPTNS= <>
##$ZL1= 120
##$ZL2= 120
##$ZL3= 120
##$ZL4= 120
##$ABSF1= 248.5645
##$ABSF2= -253.2056
##$ABSG= 5
##$ABSL= 3
##$ALPHA= 0
##$AQORDER= 0
##$ASSFAC= 0
##$ASSFACI= 0
##$ASSFACX= 0
##$ASSWID= 0
##$AUNMP= <proc_1d>
##$AZFE= 0.1
##$AZFW= 0.5
##$BCFW= 0
##$BC_mod= 2
##$BYTORDP= 0
##$COROFFS= 0
##$CY= -3
##$DATMOD= 1
##$DC= 0
##$DFILT= <>
##$DTYPP= 0
##$F1P= 0
##$F2P= 0
##$FCOR= 1
##$FTSIZE= 65536
##$FT_mod= 6
##$GAMMA= 0
##$GB= 0
##$INTBC= 1
##$INTSCL= 5.30512e-09
##$ISEN= 30
##$LB= 1
##$LEV0= 0
##$LPBIN= 0
##$MAXI= 10000
##$MC2= 0
##$MEAN= 0
##$ME_mod= 0
##$MI= 50
##$NCOEF= 0
##$NC_proc= -5
##$NLEV= 6
##$NOISF1= 182.463
##$NOISF2= 159.3651
##$NSP= 0
##$NTH_PI= 0
##$NZP= 0
##$OFFSET= 248.5645
##$PC= 4
##$PHC0= -10363.56
##$PHC1= 319.4567
##$PH_mod= 1
##$PKNL= yes
##$PPARMOD= 0
##$PSCAL= 0
##$PSIGN= 0
##$REVERSE= no
##$SF= 81.014009
##$SI= 65536
##$SIGF1= 159.3651
##$SIGF2= -187.1042
##$SINO= 113.3802
##$SIOLD= 16384
##$SREGLST= <1H.CDCl3>
##$SSB= 0
##$STSI= 65536
##$STSR= 0
##$SW_p= 40650.406504065
##$SYMM= 0
##$S_DEV= 0
##$TDeff= 32768
##$TDoff= 0
##$TI= <>
##$TILT= no
##$TM1= 0
##$TM2= 0
##$TOPLEV= 0
##$USERP1= <user>
##$USERP2= <user>
##$USERP3= <user>
##$USERP4= <user>
##$USERP5= <user>
##$WDW= 1
##$XDIM= 65536
##$YMAX_p= 418756207
##$YMIN_p= -13834978
$$ End of Bruker specific parameters
$$ ---------------------------------
##NTUPLES= NMR SPECTRUM
##VAR_NAME=  FREQUENCY,     SPECTRUM/REAL,   SPECTRUM/IMAG
##SYMBOL=    X,             R,               I
##VAR_TYPE=  INDEPENDENT,   DEPENDENT,       DEPENDENT
##VAR_FORM=  AFFN,          ASDF,            ASDF
##VAR_DIM=   65536,         65536,           65536
##UNITS=     HZ,            ARBITRARY UNITS, ARBITRARY UNITS
##FACTOR=    0.620285442955139, 1,           1
##FIRST=     20137.2065510759, 0,            0
##LAST=      -20513.1999529892, 0,           0
##MIN=       -20513.1999529892, -13834978,   0
##MAX=       20137.2065510759, 418756207,    0
$$ Real data points
##PAGE= N=1
##DATA TABLE= (X++(R..R)), XYDATA
$$ [...]
39925d98682l4270M04222K84039m4621j68466j05771r5815j90788k30875o4680
39915g45707K92647N92682M83574o6232n41330m12222J27740L56507j0862m83760
39905d06963n17860j30328L47775O79628O94355L04570k11545l67905j32703J1266
39895B70290j33615j80418N7504J39564j82706l79793k2542L52739P9218m19825
39885d19584k35615M74922O40809k0151n44928k50090K71575J97706k64925l54689
39875e04970K4183K88314J47648o5327j3320K06686L26696K53644L9425k38236
39865D64743m37449l82009q4297J69640J24198r2463r5837K34586N47585M71427
39855I20124J14737j14575q5504k9639q4544j26115j18071k15454l57094j95739
$$ plain form
39925 -498682 -532952 -128730 155309 110688 -57778 -163549 -259364 -450152 -681027 -745707
39915 -745707 -453060 139622 623196 556964 15634 -396588 -268848 87659 76797 -406963
39905 -406963 -924823 -1055151 -707376 -27748 666607 971177 759632 391727 259024 270290
39895 270290 136675 -43743 13761 153325 -29381 -409174 -431716 -78977 241 -419584
39885 -419584 -655199 -180277 460532 440381 -104547 -354637 -83062 114644 -150281 -504970
39875 -504970 -480787 -192473 -44825 -110152 -123472 83214 409910 663554 702979 464743
39865 464743 27294 -354715 -439012 -269372 -145174 -237637 -333474 -98888 448697 920124
39855 920124 1034861 920286 834782 805143 720599 594484 476413 260959 -96135 -291874
39845b91874K75497M63526j2029o05682n29915O8587L01686j14018m24451J0041
39835h58632P35477Q32222J73272m52252l86213J42462M02247N2412n18487o85994
39825e63486k82341K79815N26368M08530J88645j358k49393n31810n72103j94809
39815i91942L36189N59450L68505J08363O8815J13647k589j55672m7049J88400
39805E46117M3295n44973r10977n38223J72861M80231L29181K30630L34291L08086
39795D50519O8248q7547j21797l09682n28860k68887M01299O69764J87794l20886
39785A39965j86442J94018J37320j90226k34188j03244k11163k67318K94341J050547
39775F23610R10403j65124q58471l25921N87797N99405k24388p13941k87382L98135
$$ plain form
39845 -291874 -16377 447149 435120 -170562 -700477 -631890 -330204 -444222 -868673 -858632
39835 -858632 -123155 709067 882339 430087 43874 186336 588583 640995 122508 -563486
39825 -563486 -845827 -566012 -39644 368886 557531 556173 306780 -225030 -797133 -991942
39815 -991942 -655753 -96303 272202 380565 449380 563027 560438 404766 357717 546117
39805 546117 589412 44439 -866538 -1404761 -1231900 -751669 -422488 -191858 142433 450519
39795 450519 518767 431220 309423 -259 -529119 -798006 -396707 273057 460851 139965
39785 139965 -46477 147541 284861 94635 -139553 -242797 -453960 -721278 -426937 623610
39775 623610 1534013 1368889 510418 184497 772294 1371699 1147311 433370 145988 544123
39765E44123M79830n8057n84437o69228m08796r0194J27433J92398J10774K7309
39755c28845J14684K35749R301n33349p18889j32793N69083M51811k70475m78462
39745a082185J50112O78987M26482r8124k81729l91030p03299o39647J87116Q77573
39735h75744M59784m01790l17807N81253Q52891J11046m22945j1421M95936K55012
39725G26215k22578j63755J07627r9147n54045n73451k23371p9131j56006M143
39715a233499M09582O18459N22735L76610J62050k99045o54221k93141N50000
39706A59530Q05359N2628p21004m26787N84661J020505M14763m10786o65071n38415
39696B75383n04186m05644R8724O41195N31804j01497l84927J6610M68253M25260
$$ plain form
39765 544123 1023953 965896 381459 -287769 -696565 -786759 -659326 -466928 -356154 -328845
39755 -328845 -214161 21588 30889 -502460 -1221349 -1354142 -785059 -333248 -603723 -1082185
39745 -1082185 -932073 -253086 173396 75272 -206457 -597487 -1300786 -1940433 -1753317 -875744
39735 -875744 -415960 -817750 -1135557 -554304 298587 409633 -13312 -24733 471203 726215
39725 726215 503637 339882 447509 348362 -205683 -779134 -1002505 -1081636 -1237642 -1233499
39715 -1233499 -823917 -205458 317277 693887 855937 556892 -97329 -390470 159530
39706 159530 964889 1017517 296513 -130274 454387 1474892 1889655 1478869 813798 275383
39696 275383 -228803 -634447 -535723 105472 637276 535779 150852 167462 635715 1060975
39686A060975J49198J0162j62152m96996n46952l0191M51049K20779l66836m56712
39676a67676n229K84143J13869j67181l29916m37836l53247J00494N47192M47548
39666C2161J9280o7128J78109J61854j35023j55677O1759j18100o05259n17147
39656a145171K31351N71217N0663l35883J51690P16834M39319j43876p2117L38669
39646H02696J79422l43047l12700J95215K58595k17273l57367J00933L73535K1359
39636G01368l65641k59307L255k6261j50920l7515J41633P8582j12684j33937
39626a61427M0598K50587L79654K92552r7131n08015m45898Q7881M42433J56951
39616D38185m02111n65012k20477J97016L58465L09558J99359P7376k9182o3210
$$ plain form
39686 1060975 1210173 1220335 1058183 561187 14235 -15956 435093 655872 289036 -167676
39676 -167676 -172905 111238 225107 57926 -271990 -709826 -1063073 -962579 -415387 32161
39666 32161 51441 -15687 162422 324276 189253 33576 95335 -22765 -628024 -1145171
39656 -1145171 -913820 -342603 -291940 -627823 -476133 240701 680020 536144 464027 802696
39646 802696 982118 639071 326371 521586 780181 562908 205541 306474 680009 701368
39636 701368 335727 76420 79675 53414 -97506 -135021 6612 85194 -27490 -161427
39626 -161427 -120829 129758 509412 801964 704833 196818 -249080 -161199 281234 438185
39616 438185 36074 -528938 -749415 -552399 -193934 115624 314983 392359 363177 299967
39606B99967k1170J9740k033n0000l3967M5752L4939j78451m02934k96982J12036
39595d73103L39504J11467j61025L7608M85850M82635j11025o40462n67834j11927
39585f08312K22115L06525K94053K15205L4917j02601k9495J45820J62798k3655
39575F17370k07677k25003j13714m889J9926l2986r7817j16733r1458m0377N4265
39564b39093J76870K22067J36921M1095L2451k1725k44874m07768j92675K31169
39554b65562L39674L2535j96233l4012K01900J68656M6507P7208L9393k53900
39544A56166l51412K06279R05893P65647k01954q95165o62926r9880N4169K58
39534a22925K59996O12451M52713j37288m80215l33474j01335l4558Q9344L66413
$$ plain form
39606 299967 278797 298537 296504 246504 212537 258289 293228 114777 -288157 -585139 -473103
39595 -473103 -133599 -22132 -183157 -145549 340301 822936 711911 71449 -496385 -608312
39585 -608312 -386197 -79672 214381 429586 464503 361902 332407 478227 641025 617370
39575 617370 409693 184690 70976 66087 86013 53027 -44790 -161523 -252981 -293358 -239093
39564 -239093 -62223 159844 296765 337860 370311 348586 103712 -304056 -496731 -265562
39554 -265562 74112 106647 -89586 -123598 78302 246958 293465 370673 410066 156166
39544 156166 -195246 11033 916926 1682573 1480619 585454 -77472 -177352 -123183 -122925
39534 -122925 137071 749522 1202235 1064947 584732 251258 149923 115365 204709 571122
39524E71122M60664J40239l29637n57166m43065r0396L34080N26557K48458k43442
39514F17414l94161j32060L9955p5308k7714L64275M41666k79403j065478q41028
39504a351842J69862O64541J30222m84279k49909M53493O69933K60797j21273
39495A41545j23046o5369k64503n25162m71934q2772K91001L24162L2521k76030
39485a019587l11163m1810L48961O51649P10627M54908K2333k46762j63575L9320
39475D44901N2436N233K47426O30577N22576k55178r75144q77812j85663K21698
39465a68950n492l14737j09147M40474O72002L12784j95450k80815L5430K03163
39455E89262o6648l57602j46312L58821M37581q0551n10865l03693J50450J33080
$$ plain form
39524 571122 1031786 1172025 842388 285222 -157843 -248239 85841 612398 860856 617414
39514 617414 223253 91193 131148 55840 28126 392401 834067 554664 -510814 -1351842
39504 -1351842 -1181980 -517439 -387217 -871496 -1121405 -667912 2021 262818 141545
39495 141545 18499 -46870 -311373 -836535 -1308469 -1391241 -1100240 -776078 -743557 -1019587
39485 -1019587 -1330750 -1372560 -1023599 -371950 338677 793585 815918 569156 405581 444901
39475 444901 497337 502570 749996 1380573 1903149 1647971 672827 -204985 -390648 -168950
39465 -168950 -174442 -489179 -598326 -157852 514150 826934 631484 350669 386099 589262
39455 589262 522614 165012 18700 377521 815102 734551 223686 -80007 70443 203523
39445B03523l45545o42823m34333L782L74591O22674N98256J06751n24115n65959
39435f03198P4076N29877J86498l39483j48167M44834L45787m95136q37578n2666
39425h95156P93174M83216n33028q59602j98445M52382M80483L66304N28761N63084
39415A181173J25677l11988k58818o9883k78798o01266m29308M5510Q8617l52296
39405h61380n39817j00452M75742O38593M30669J40797j18538k52112j07897J80854
39395a13541K20524l7435j52688R0862K88003O2745l10366l53022j03250P2238
39385c35930J03887J47234R4385k53791n96339l46444M31686Q82748M70896k38720
39375C59612l65930N0357K11574j59138m03321j2253N07965L74200k70230n63258
$$ plain form
39445 203523 -142022 -784845 -1219178 -1215396 -840805 -218131 380125 486876 -37239 -603198
39435 -603198 -529122 755 187253 -152230 -300397 144437 490224 -4912 -842490 -895156
39425 -895156 -101982 381234 -151794 -1011396 -1209841 -757459 -276976 89328 618089 1181173
39415 1181173 1306850 994862 736044 666161 387363 -213903 -643211 -597701 -509084 -861380
39405 -861380 -1401197 -1501649 -1025907 -387314 43355 184152 65614 -186498 -294395 -113541
39395 -113541 106983 69548 -83140 7722 295725 358470 48104 -304918 -408168 -335930
39385 -335930 -232043 -84809 9576 -244215 -840554 -1186998 -755312 127436 598332 359612
39375 359612 -6318 44039 255613 96475 -306846 -319099 188866 563066 292836 -270422
39365b70422k07135J55562k9739m43830m44667M4493N55216O82014L71957j36951
39355B76498m23583k00928K62908L56183n0073l95631k87738m9931n5123q2373
39345f49791J32775K62652r138k39014R6696N71140M09389j52182j86216L33050
39335E69361M19095k74980q32346n33773N2706P5318k88579k75758K07581N19814
39325c61561K61446k55793m79835k29508J61130K16046r1268k30368J44758N57767
39315c07186L10992m28291p99316m66178O1500L69220O02232Q30613P62247L62930
39305A298763K1201j55948m38268o52120k14067O67641Q86581J00519n64638k41184
39295G08480K93365k8978p48696o85594Q0109M12072k1883m18385k79333J7407
$$ plain form
39365 -270422 -477557 -321995 -351734 -795564 -1240231 -1195738 -640522 41492 413449 276498
39355 276498 -147085 -348013 -85105 271078 221005 -174626 -462364 -512295 -567418 -649791
39345 -649791 -517016 -254364 -263502 -502516 -405820 165320 574709 422527 236311 569361
39335 569361 988456 713476 -118870 -652643 -599937 -524619 -813198 -1088956 -881375 -361561
39325 -361561 -100115 -355908 -835743 -1065251 -904121 -688075 -779343 -1009711 -864953 -307186
39315 -307186 3806 -424485 -1223801 -1689979 -1628479 -1259259 -657027 173586 935833 1298763
39305 1298763 1319964 1164016 725748 73628 -140439 527202 1413783 1514302 949664 708480
39295 708480 1001845 972867 224171 -461423 -381314 30758 8875 -409510 -688843 -671436
39285f71436J43244K38360K70972m0457m66120l33996L70091P91320M26033j66923
39275E61088k52167R7895L20172J83963j20579l92080n56685n78590m58498k23559
39265a419040J18730M71734N83960L45453L7922k0208O3064J3274p1109O7349
39255A91129K34930L553m77247n36993J3101N41568N03027J46717q864M2592l3970
39244F19543k51993k77205Q47K40832R8003k90733m47280j69847J78105J67647
39234a32081n9550j6156L04638L48423q0571l93388j14490L11945K06593k40210
39224A35153k66087K58738O64896N05224P4380j89666k54393k76281k75202k04400
39214A72362o7311J01789J74821l7294m20889m60294Q4638O41122N03620j31674
$$ plain form
39285 -671436 -528192 -289832 -18860 -59317 -525437 -859433 -489342 301978 728011 561088
39275 561088 308921 406816 726988 910951 790372 398292 -158393 -736983 -1195481 -1419040
39265 -1419040 -1300310 -828576 -244616 100837 138759 118551 181615 194889 123780 191129
39255 191129 426059 429612 -47635 -584628 -571527 -29959 473068 619785 610921 653513 619543
39244 619543 367550 90345 91192 332024 430027 139294 -307986 -477833 -299728 -132081
39234 -132081 -191631 -207787 96851 445274 364703 -28685 -143175 168770 375363 135153
39224 135153 -130934 127804 792700 1297924 1372304 1182638 928245 651964 376762 172362
39214 172362 105051 206840 381661 344367 -76522 -536816 -452178 188944 692564 560890
39204E60890m39273j69885J07292o154j96394o0177L02850N48487N15169K29137
39194A391942j66684m07783l48340j88809j53489j04256J15158K16977o6063l29277
39184d0624n7789L88495K56236k74341l05321K16583L40429k29588n35592M4542
39174a96970P31867O06677j6691l15399k59512k82584l05235l5781K44540J15058
39164B85970j48390l9280K21853P7182l01646k53687K23885M66060K34056j7817
39154G48186r640p90j69324k91401j94429K131J90104L45987L04313m4776l84558
39143D95803l44625j53693k81098n24724k56894M02379N82834N9662k99131O6075
39133b53412M58055O9722o59767p18243n9305M82113N48777N59649O80600M61584
$$ plain form
39204 560890 121617 -48268 59024 52870 -143524 -203701 99149 647636 1162805 1391942
39194 1391942 1225258 817475 469135 280326 126837 22581 137739 354716 288653 -40624
39184 -40624 -98413 290082 546318 271977 -33344 183239 523668 294080 -241512 -196970
39174 -196970 534897 1141574 1124883 809484 549972 267388 -37847 -73628 170912 285970
39164 285970 137580 98300 320153 397335 95689 -157998 65887 531947 766003 748186
39154 748186 738546 737756 568432 277031 82602 84733 274837 620824 925137 880361 495803
39143 495803 151178 -2515 -283613 -808337 -1065231 -662852 -80018 -20356 -319487 -253412
39133 -253412 204643 274365 -385402 -1103645 -1162950 -680837 -132060 427589 1108189 1569773
39123A569773k41294p79892n93372j0593K96196K30250J40308R9060j05088l96271
39113B09077m09906j01255J35522Q4186Q521J31043K09120l3203l40922k28825
39103c36642K69527N83109L68429o7174k36112q9207K6085j35626m45676n71552
39093f34839l17656J63903M71488L40402n7671l10449k55371j08767q4900j06464
39083i00324J847K29149M31559N08017L92842O4322k78524k83062O0078K21504
39073D47408j92453p44549o41392J36676P41920O13901J45106q7814j60941l59419
39063a01557m14962M5276N77190L69448l89666n70669J81483P49314J78181q05439
39053a81401q25298J31422Q15932O15120K02849J84740J97614j89929n82106m28086
$$ plain form
39123 1569773 1328479 548587 -44785 -55378 240818 471068 611376 710436 605348 209077
39113 209077 -200829 -302084 -166562 -82376 -73855 57188 266308 233105 -107817 -336642
39103 -336642 -67115 515994 884423 817249 581137 491930 518015 382389 -63287 -634839
39093 -634839 -952495 -788592 -317104 23298 -34373 -344822 -600193 -708960 -793860 -900324
39083 -900324 -898477 -669328 -237769 270248 663090 727412 448888 165826 225904 447408
39073 447408 254955 -489594 -1130986 -994310 -252390 361511 506617 418803 257862 -101557
39063 -101557 -516519 -471243 105947 475395 85729 -484940 -303457 445857 624038 -181401
39053 -181401 -1006699 -875277 -59345 555775 758624 943364 1140978 951049 368943 -59143
39043e9143K5754J52363r1465k68575k39911k08230j65753R7979M99699O83095
39033D25813N20417J95424j40475m03810l92897k5670L21813K10099j71499k35313
39023C03902P5144J80986j70762m55060k03005K26349J87366k63301m60157j10412
39013f88950L14553K70095j39520l62984j55831J45790J41888o7680n5401K72125
39003c25915M90633K54332j92091l47779j24398J36688K25541K71660L53662K72168
38993A014501q8131m25697l42219Q8170L43608J04570l26960m16732q8213K20991
38983H3888J94145K1110j4908k7607k50707m82588l01433K08531M67307K20266
38973A18004j51860k89376k95146k89169p8324L50915N14265J03930m08661l83556
$$ plain form
39043 -59143 -33389 118974 27509 -241066 -480977 -689207 -854960 -756981 -257282 425813
39033 425813 946230 1141654 1001179 597369 204472 178802 500615 710714 539215 303902
39023 303902 379046 560032 389270 -65790 -268795 -42446 144920 -118381 -578538 -688950
39013 -688950 -374397 -104302 -243822 -606806 -762637 -616847 -474959 -542639 -598040 -325915
39003 -325915 164718 419050 226959 -120820 -245218 -108530 117011 388671 742333 1014501
38993 1014501 926370 500673 158454 246624 590232 694802 367842 -48890 -137103 83888
38983 83888 278033 299143 284235 256628 5921 -476667 -778100 -569569 -102262 118004
38973 118004 -33856 -323232 -618378 -907547 -985871 -634956 -120691 -16761 -425422 -808978
38963h08978P3767L58550K84100J65803J33028m1777m13409o48942m44487J17192
38953a225153O35627O77437J68402l56673k39621L55923M93653j74793p36926
38944d02124l46968M01504L70000l08641m69890J78936O25522K01143m63054n48083
38934g61655j88476L9398N1839J02292J99258J96530J22108N1210n1141j36759
38924c75396o7305N7954j3443j71438l1156L36733L78140k4334k62132L0781L61720
38913B20124J88726k16010k57131N8707K50281J27547p0653j24037l2788R0234
38903B35000R1998p6265j84324n977J86104p9985n86437n31773K06206P02872
38893d2581L69581r7985J09881N20095J62046p17319q99245n6031P53742O52870
$$ plain form
38963 -808978 -735211 -376661 -92561 73242 206270 164493 -248916 -897858 -1342345 -1225153
38953 -1225153 -589526 87911 256313 -100360 -339981 15942 509595 334802 -402124
38944 -402124 -749092 -347588 22412 -286229 -756119 -577183 48339 249482 -213572 -761655
38934 -761655 -950131 -910733 -858894 -756602 -557344 -360814 -238706 -187496 -238637 -375396
38924 -375396 -442701 -384747 -398190 -569628 -600784 -264051 114089 89755 -172377 -141596 220124
38913 220124 408850 192840 -64291 -5584 244697 372244 301591 177554 144766 235000
38903 235000 326998 250733 66409 60432 246536 166551 -419886 -951659 -745453 -42581
38893 -42581 327000 229015 338896 858991 1021037 303718 -595527 -651558 102184 755054
38883G55054N4677j87830J2541J44212l3872l17980m73279l99405p2482L33234
38873a85130M29233N8127l59089k79060J94549L82857k5215m78565l06475L03053
38863b65715N22307M2563m85403l63481K22981N39244K75028k29977n46478n08412
38853g97343j27506L91056O04040K55086k64569l21200R5701L80321K05339j09339
38843C11586k19535k10316k29152j59316O8193K34725J74895L8548R055O5099
38833H3782J55589K63427K10446j63001n36198l70606K10661M33139K2635l38202
38823b8328j18482J91794o0591n51456m76351J82721O85926O38812L27062M0143
38813H31250k37624m46065l91557j67146j03860j99573p7188L59959O74786M76852
$$ plain form
38883 755054 809731 621901 634442 778654 744782 426802 -46477 -445882 -518364 -185130
38873 -185130 244103 302230 -56859 -335919 -141370 241487 216272 -262293 -568768 -265715
38863 -265715 256592 299155 -186248 -549729 -326748 212496 487524 257547 -288931 -797343
38853 -797343 -924849 -533793 70247 325333 60764 -260436 -164735 215586 420925 311586
38843 311586 92051 -118265 -347417 -506733 -438540 -203815 -28920 9628 18683 83782
38833 83782 239371 502798 713244 550243 14045 -356561 -145900 287239 309874 -28328
38823 -28328 -146810 44984 -15607 -567063 -1043414 -860693 -174767 464045 791107 831250
38813 831250 593626 147561 -243996 -411142 -515002 -714575 -791763 -431804 242982 719834
38803G19834r2680o08179p80766n14266J11225P20501Q17944L39809j76572k16534
38793C20316R5025K58350J24727R816J12565K06881O3171j39064j03289P9373
38783A027871P1932j49045k69227j87397j69446l25026l54043n8690K72032L08515
38773A67476J77531J47845J29706p9919l11345k59491j6194J05635J02795J49806
38763C13845J20391j96955n30157l84132J49203M32112J89386j58549j68094Q8598
38753a44352K74507K09010m1253k27675j18709J48637J39362j86502k55303K10123
38743G845N71034K23100l39469k77810K00403K35391k02216l66355j12870k5623
38733h6570j96028q7158L09214L77630O7398k2572J18776j30944o49786n33940
$$ plain form
38803 719834 627154 18975 -761791 -1276057 -1164832 -444331 373613 713422 536850 320316
38793 320316 415341 673691 798418 808234 920799 1127680 1190851 1051787 948498 1027871
38783 1027871 1099803 950758 681531 494134 324688 -338 -354381 -413071 -141039 167476
38773 167476 345007 492852 622558 542639 231294 -28197 -44391 61244 164039 313845
38763 313845 434236 237281 -292876 -677008 -527805 -95693 93693 -64856 -232950 -144352
38753 -144352 130155 339165 297912 70237 -48472 100165 239527 53025 -202278 7845
38743 7845 578879 801979 462510 184700 385103 620494 418278 51923 -60947 -86570
38733 -86570 -282598 -369756 -60542 317088 384486 361914 480690 349746 -300040 -833980
38723h33980K43852N78491R0944k28449J72289M61189N9589k66685O9921K76738
38713F23899l32594r12262m51473M83141P08157K58978k5594L431k9551m3669
38703B82463J34005O6700n05669q41388k81186N14895N60454J01398k720J96255
38693B25207O8470l06231l99706k64410j80660J09609O91582P55428j38991q76374
38683c16076l28042O88525O42885k01770l83262J50372Q4243p54820j001032r5966
38673a514943Q11532P49038J53188k19756k64740m3205M36097O81402J50399o25648
38663C13364n77113J74243M70089O6027r3408K52723J84729n61226q71707r2744
38653g35023Q18175Q12320K37456l6759L1948J4189j09631j67254k41307l44830
$$ plain form
38723 -833980 -590128 -11637 79307 -149142 23147 484336 543925 277240 347161 623899
38713 623899 291305 -620957 -1072430 -589289 118868 377846 352252 355683 326132 282463
38703 282463 416468 483168 -22501 -863889 -1145075 -630180 -69726 31672 28952 225207
38693 225207 293677 -12554 -412260 -676670 -857330 -747721 -56139 699289 560298 -316076
38683 -316076 -644118 44407 687292 485522 102260 252632 336875 -417945 -1418977 -1514943
38673 -1514943 -703411 45627 198815 -20941 -285681 -328886 107211 788613 939012 313364
38663 313364 -263749 -89506 380583 446610 353202 605925 790654 229428 -642279 -735023
38653 -735023 83152 895472 1132928 1096169 1128117 1142306 1032675 865421 624114 279284
38643B79284k52978k3834l9264k92499l57365j95588j61220j48367K66211P65358
38633a60262N29024l11430o74874k18687K33955K19935K34331M47156K61723l40236
38623B20635m61471Q2973K53845l71471p24755r9500N73670L63274j10383M2051
38613b31132L76806J05696l82150l34109m9839j56378l06450P0563M95020K68042
38603a43931j39515Q0306N09670K45560l54299k39417L92407L56729m32012p37886
38593d62388l1703O94865N29216j24837l99485j57899J46058J70900j14599m84934
38583b34806n30997q6305L89630L03584k18521m62369j04136M24676N90231L60226
38573D31213Q2386L2629J25547J530m52686p24887k75164M80028N22286k13804
$$ plain form
38643 279284 26306 2472 -36792 -329291 -686656 -882244 -1043464 -1191831 -925620 -160262
38633 -160262 368762 57332 -617542 -836229 -602274 -382339 -148008 299148 560871 220635
38623 220635 -240836 -157863 95982 -275489 -1000244 -1099744 -526074 -162800 -273183 -231132
38613 -231132 145674 251370 -130780 -464889 -514728 -671106 -977556 -906993 -411973 -143931
38603 -143931 -283446 -203140 306530 552090 197791 -41626 350781 707510 275498 -462388
38593 -462388 -494091 200774 729990 605153 205668 47769 193827 364727 250128 -234806
38583 -234806 -765803 -852108 -462478 -158894 -377415 -839784 -943920 -519244 70987 431213
38573 431213 513599 546228 671775 673305 220619 -504268 -779432 -299404 222882 9078
38563I078n60904J05427P97013M46248l88973m65291J80128M78171J25302j79904
38553E46295j11213n4243r3042J25087M05531O9110p47362r69517j76994O67093
38543c39255N96311q2712m68940l26285m2961J34259K04192J19762o2911l1016
38533b99556L11490M90564Q6925m98472m76923J81959O20661K68810l61689m32411
38523a08642J5844J87240j99213m31998Q5295Q01227P10719j92649q81019o92659
38513g05855p3256K37869J26329q1409j92315j80570l1631J48587J82397J51279
38503d18575K97262M88376L07122j72888l34203l792J95057j29585m58943k44925
38493d75094J74659J90115q8376j51303K0131P1286m5109j18248j08850j5958
$$ plain form
38563 9078 -551826 -446399 350614 796862 407889 -57402 122726 600897 726199 546295
38553 546295 435082 380839 287797 412884 818415 887525 140163 -829354 -1006348 -339255
38543 -339255 257056 174344 -294596 -620881 -663842 -529583 -325391 -205629 -268540 -299556
38533 -299556 11934 502498 589423 90951 -385972 -204013 416648 685458 323769 -108642
38523 -108642 -92798 94442 -104771 -536769 -451474 349753 1060472 867823 -13196 -705855
38513 -705855 -779111 -541242 -414913 -496322 -688637 -869207 -900838 -752251 -569854 -418575
38503 -418575 -121313 367063 674185 501297 167094 163302 358359 228774 -230169 -475094
38493 -475094 -300435 -110320 -198696 -349999 -329868 -258582 -303691 -421939 -530789 -546747
38483e46747K96987O45939M22297m41209r88651n03907L10773L53574j85955k70926
38473i07825K00498L27971j55785m64125j59641J88149J12738j2348J63034K56692
38463d50642q8081m42580k47960K72857M88400L00282J35753K07887K87679J39613
38453F03208j78643m24284l59046P9251O02283O92218J42026n76267p35482k06676
38443c61412L17700J40347n09593o92285j0023P51017O36968j13742m01311J02129
38433a40205M88598O4295n62935m61914J83500M34164N3429k52697J0065M79272
38423B95572N70064K01131k82276n24841l73678L3266L09371J72669k12634m14843
38413b26199k16361K20426N55109N03088N3951l82752k91340K81386O36412K62028
$$ plain form
38483 -546747 -249760 396179 818476 377267 -611384 -1115291 -804518 -450944 -636899 -907825
38473 -907825 -707327 -379356 -535141 -999266 -1158907 -970758 -858020 -870368 -707334 -450642
38463 -450642 -538723 -981303 -1229263 -956406 -468006 -167724 -31971 175916 463595 603208
38453 603208 424565 281 -358765 -279514 322769 1014987 1157013 580746 -154736 -361412
38443 -361412 -43712 96635 -412958 -1105243 -1115266 -364249 272719 158977 -242334 -140205
38433 -140205 348393 412688 -150247 -612161 -428661 5503 58932 -193765 -183700 295572
38423 295572 865636 1066767 784491 259650 -114028 -80762 228609 401278 188644 -226199
38413 -226199 -442560 -222134 332975 836063 890014 507262 215922 497308 1133720 1395748
38403A395748m88667q46262n28874P9819M53934L74745L0719j61925j9285J18193
38393D08145j09122l76601j08237L99073K01110o91291j000136o6220R88169Q74524
38383E19414J2609l26698k5099M3819k88802l45989R495J75354K2178Q1027L82699
38372B60007K80672l02538n56873j16458K81616l781m94375l85762K54504P02495
38362h0493N93340J94841r9590j61153j17673j52995k60465k40976q0305r1171
38352d96640l70087m40630N3409O29587O28538L05619L84880O98806L55017o40858
38342A107641j075244k81590P81337Q66424J00838m41426k98575M5500J10088
38333I14993m5670k00690l02216l00114m6482M26639P12372L64456m99826j101821
$$ plain form
38403 1395748 907081 60819 -468055 -388236 65698 440443 471162 309237 289952 408145
38393 408145 299023 -77578 -185815 213258 414368 -276923 -1277059 -1343279 -355110 519414
38383 519414 532023 205325 180226 224045 -64757 -410746 -401251 -225897 -203719 -122692 260007
38372 260007 540679 238141 -318732 -435190 -153574 -157355 -651730 -1037492 -782988 -80493
38362 -80493 512847 707688 608098 446945 329272 176277 -84188 -325164 -405469 -496640
38352 -496640 -866727 -1307357 -1253948 -624361 4177 309796 694676 1393482 1748499 1107641
38342 1107641 32397 -249193 532144 1398568 1499406 1057980 759405 804905 914993
38333 914993 869323 668633 366417 66303 19821 446460 1158832 1523288 1023462 -78359
38323g8359p85257J07670N34659Q6108m49744k12815N17078Q13294M30042q9576
38313H73100l94373n93698o22233k03041M25512N39729l5895n73141m29337J47441
38303h65936N09949M38003J56836q5402j52559j2673J72308J60336m4284j87300
38293H9278j21445P0975K81521M18106L12260q4369m76438n25005k75097J6133
38283b94081K66624M26005K67498j78171l40358R9010M96693J32172n33184m68846
38273a26638K65699O12724K35503q2545O5181Q3172l25253m46529J77163Q06573
38263A265050O40357M4200k12177k22603m99637q06632m67627L96644Q75904N15143
38253A528622j57670m41261k74468r0355j79630l71493k96071P3468K91908O3423
$$ plain form
38323 -78359 -863616 -755946 -221287 -135179 -584923 -797738 -280660 532634 962676 873100
38313 873100 478727 -114971 -737204 -940245 -514733 24996 -10899 -584040 -1013377 -865936
38303 -865936 -355987 82016 238852 153450 891 -11782 160526 320862 276578 89278
38293 89278 -32167 38808 320329 738435 1050695 966326 489888 -35117 -310214 -294081
38283 -294081 -27457 398548 666046 487875 147517 246527 743220 875392 342208 -126638
38273 -126638 139061 751785 987288 904743 969924 1053096 727843 281314 458477 1265050
38263 1265050 1905407 1949607 1737430 1514827 1015190 208558 -259069 137575 1013479 1528622
38253 1528622 1370952 929691 655223 564868 385238 13745 -282326 -208858 83050 146473
38243A46473k17467p395M55573M34643j02087l71432n0225K09073p3497l93286
38233C0373j88629J68378N8276k93614k47901J20706J76847j93704m36988k21188
38223a027444J71610L72351L35713J80732J0883p5245o2275o8817j37677j31641
38213d31810j1767L9736j6652O7131L28611L50342r3219n29874m21877K2731K17665
38202d78983J01278O3890J75098J51624J3849R2083L32529K58303j98659m30832
38192H0180m0883M82146L99560k54345p38357n87733j12474J55223J69813K80693
38182a66177N89739P40777M38043r1360l83405l31674k14863k11408k17029j56716
38172d073j34017j64177o9239J92441L52141J93219j06512k07055m6855J43829
$$ plain form
38243 146473 -70994 -78389 377184 811827 709740 338308 288083 497156 423659 30373
38233 30373 -158256 10122 68398 -225216 -473117 -352411 -175564 -369268 -806256 -1027444
38223 -1027444 -855834 -483483 -147770 32962 43845 -31400 -93675 -162492 -300169 -431810
38213 -431810 -443577 -403841 -420493 -353362 -24751 325591 232372 -297502 -719379 -696648 -478983
38202 -478983 -377705 -313815 -138717 12907 26756 118839 451368 709671 511012 80180
38192 80180 39297 521443 921003 666658 -71699 -659432 -771906 -616683 -446870 -166177
38182 -166177 423562 1164339 1602382 1511022 1127617 795943 581080 369672 152643 -4073
38172 -4073 -138090 -302267 -371506 -179065 173076 366295 259783 52728 5873 149702
38162A49702J82798J12670O3286O2244J8997j17600k22486j16807J41590K56534
38152E30928Q6432j62521k90409l86323n09723m06713N1558M28161K53275j90181
38142e95516k19215K13869M96082L46813J33270J01304R575k52330l57340j56148
38132b79636O770q1361j39408J33K0606k23482k79207J47850N52338L75229n7802
38121D2030n6116L02403L31730j19608m53779k82527P5572K09065J59084J21117
38111C28971O0470q1042j28624N3067K40158J18237k32690m18757k82867q8920
38101d31997p1094p2711J38746L93686L18327l1096j46024J93484N35479L68004
38091A194804j81974n67746n23032k41629l2032o0353k67761l38429j121M56652
$$ plain form
38162 149702 332500 445170 508456 570700 589697 472097 249611 132804 274394 530928
38152 530928 617360 454839 164430 -221893 -731616 -1138329 -1086771 -658610 -405335 -595516
38142 -595516 -814731 -600862 -104780 242033 375303 476607 486182 233852 -123488 -279636
38132 -279636 -272866 -354227 -493635 -493502 -472896 -696378 -975585 -827735 -275397 99832 42030
38121 42030 -14086 288317 620047 500439 46660 -235867 -160295 48770 207854 328971
38111 328971 389441 308399 179775 232842 473000 591237 358547 -60210 -343077 -431997
38101 -431997 -503091 -575802 -437056 -43370 274957 243861 97837 291321 826800 1194804
38091 1194804 1012830 445084 -77948 -319577 -351609 -411962 -679723 -1018152 -1019273 -562621
38081e62621L90108k04162m44513J78769Q77764O44106k20417n82028j82175J77137
38071G1968N5662r4815O5027K31877J84173J51834J85375j9305l92595m18050
38061B1151q3514l6539m20182m67399K14226Q23600N30069k57423n57051k04159
38051d37221K03275L43365L81524L78163J83055j47006l36478k77048j07038J3770
38041A98361L043j19102j79120m6206Q0203p6396l22522j93901K44663L98899
38031a2078Q0707k14557j76627j13863k11101j01394L71202O56722L23844k01563
38021D01292k91543j0352J88350J90388J15273p6649l46286l52721L4816L87372
38011B39940L22476N0463q8650j55245k52805j74110J12148J65761k01888m53876
$$ plain form
38081 -562621 -172513 -376675 -821188 -642419 235345 879451 659034 77006 -105169 71968
38071 71968 127630 32815 97842 329719 513892 665726 851101 831796 439201 21151
38061 21151 -62363 -98902 -519084 -986483 -772257 51343 581412 323989 -233062 -437221
38051 -437221 -233946 109419 490943 869106 1052161 905155 568677 291629 184591 198361
38041 198361 201404 82302 -96818 -143024 -62821 -139217 -461739 -655640 -410977 -12078
38031 -12078 68629 -145928 -322555 -436418 -647519 -748913 -377711 279011 602855 401292
38021 401292 109749 99397 287747 478135 593408 516759 170473 -182248 -147432 239940
38011 239940 562416 612879 524229 368984 116179 -57931 54217 219978 18090 -435786
38001d35786j54355K74090K54218p975J3104K32976K33751P3503O9299J02818
37991F55643j16278l63481j96571K54006M34578J55564k85132n56549m52757O6458
37981d04519N87136M63971k22941n43956r7298K54439j98688o87321j65488Q33925
37971a80740R20016M7094m64803m5817M14955J84171k84016l46660j31241l369
37961A09590O2562J18262j9004k61603j71030K59592M31163J10307j43603L4627
37951E30863J31982l29305q18179n17069L52306P43465K35643m48067m93362J878
37941f09845L58266K66953O812j44371k58185l88430k61669K76710P42746N00182
37931D89169k40912n27205L4536O77615N58393j00864m80758l38581p4822O7225
$$ plain form
38001 -435786 -590141 -316051 -61833 -69808 -56704 176272 410023 483526 552825 655643
37991 655643 539365 175884 -20687 233319 667897 823461 538329 -18220 -470977 -404519
37981 -404519 182617 646588 423647 -120309 -217607 36832 -161856 -849177 -1014665 -180740
37971 -180740 739276 786370 321567 275750 690705 874876 590860 244200 112959 109590
37961 109590 172152 290414 271410 9807 -161223 98369 529532 639839 496236 530863
37951 530863 662845 333540 -484639 -1001708 -649402 94063 329706 -118361 -611723 -609845
37941 -609845 -251579 15374 22186 -122185 -380370 -768800 -1030469 -753759 -11013 489169
37931 489169 248257 -278948 -244412 433203 991596 890732 409974 71393 -3429 63796
37921F3796J62720J20089k46373o53431n25653J28741N87688L75943j10270k08204
37911c04954J38191M21407K79776j26979l89764k97995N371K18267J78725j0294
37901A11751j08502J7610K22190J66516k74102o96101n61547O975K82847L8138
37891g94225k9117M90485P86425P7520p96673m16371Q41977J123971k5491q65326
37881C93175k00970P73047M98868n20212p91809k60644j7303k53785j80696L07256
37871b53073M33615j366k98494j29357M359k18380m23277k68295P3541L27365
37861g53362M01355K28174j09099j91195J93110N04788J46643n13542n98843l8459
37851g30430M14301L84052K26724J86225M7114k64622m61449l93249j82961J28084
$$ plain form
37921 63796 226516 346605 100232 -553199 -1078852 -950111 -362423 13520 -96750 -304954
37911 -304954 -166763 254644 534420 407441 17677 -280318 -274947 -56680 122045 111751
37901 111751 3249 20859 243049 409565 135463 -560638 -1122185 -1115210 -832363 -794225
37891 -794225 -823342 -332857 453568 531088 -265585 -681956 160021 1283992 1258501 393175
37881 393175 192205 965252 1464120 943908 152099 -108545 -125848 -379633 -560329 -253073
37871 -253073 180542 179176 -119318 -248675 -244316 -462696 -885973 -1154268 -1080727 -753362
37861 -753362 -352007 -123833 -232932 -424127 -231017 273771 420414 -93128 -691971 -730430
37851 -730430 -316129 67923 294647 480872 527986 263364 -198085 -591334 -774295 -646211
37841f46211N01861O01008K12435k03780j16318J45221p7709n12194k84471N12077
37831A31919P40953l0758p94008n87006J72099M49857L6737m13283l75789N4353
37821f14926M55767M92263J43371k85845m61994l41545q9621J62739K79030R3196
37811a67565k56545k71322K12402N94406K99124l19532m70189n0674L78055N07669
37801D55829M60415K41362k28840o34297n48634j48297K8759m9332L2146K99083
37791i1806L41567Q1016j01622j8984J32310J92377J23537j56771m86250l19311
37781c03937M43824Q88997K36900p90928q32177R3346O25286J45295m21234j85492
37771a00120M28758N22220K9439l86326k79358J54522L65137K3851n32026o05953
$$ plain form
37841 -646211 -144350 456658 669093 465313 348995 494216 416507 -95687 -380158 131919
37831 131919 872872 842114 48106 -538900 -366801 83056 119793 -293490 -669279 -614926
37821 -614926 -159159 333104 476475 190630 -271364 -612909 -702530 -539791 -260761 -167565
37811 -167565 -424110 -695432 -483030 111376 410500 90968 -379221 -429895 -51840 455829
37801 455829 916244 1157606 928766 294469 -254165 -402462 -373703 -423035 -390889 -91806
37791 -91806 249761 330777 229155 210171 342481 534858 658395 501624 15374 -303937
37781 -303937 139887 1028884 1265784 474856 -357321 -263975 361311 506606 85372 -100120
37771 -100120 328638 850858 880297 493971 214613 369135 734272 758123 226097 -379856
37761c79856j14441K00331o6556k67534J66764O23536L22689k56079j96175J92832
37751B25511j9176n52991l31039M90932O33707j23351n88498k09901K00939J55525
37741a18342K18683N33701K81111o55441j035841j90070P64722O30412j31943
37732B96992l96708q6233J57115J81092K15923K00796M1346k5029N5898r2702
37722E48490m97908n58659o9572K87057K8906l65370l47213j19637J072J91604
37712i01230M97237M60467j3088k68572J3082K20991p7887l54883j20059K04950
37702c38992J36214k9578N1907O5185k15457l38389m4520J72905N6150J32281
37692c52294N64407N83638q9853m72710J4072L56751l21462j057096n89380M36741
$$ plain form
37761 -379856 -494297 -293966 -360522 -628056 -461292 162244 484933 228854 32679 225511
37751 225511 206335 -346656 -677695 -186763 446944 323593 -264905 -474806 -273867 -118342
37741 -118342 100341 634042 915153 259712 -776129 -966199 -201477 428935 296992
37732 296992 -99716 -185949 -28834 152258 368181 568977 610323 585294 641192 548490
37722 548490 50582 -508077 -577649 -290592 -261686 -627056 -974269 -1093906 -1092834 -901230
37712 -901230 -403993 56474 43386 -225186 -212104 8887 -69000 -423883 -543942 -338992
37702 -338992 -202778 -232356 -180449 -115264 -330721 -669110 -713630 -540725 -484575 -352294
37692 -352294 212113 795751 705898 233188 247260 604011 282549 -774547 -1363927 -927186
37682i27186N31238j64441k92654L21009N30275l8330m65570j95610K44553L49342
37672a07374K46111Q1725j52230j72244K37764N46625J72890l70992j79255M54826
37662G57846M68584j13300k37796K33269K32746n41830r38476k57225N50816M38351
37652E92985j45482k01473J88044K41017j24424l20856j84162r3158j32505L9949
37642a40065M43214N66386J25761m29077m68331j9444K60256m8729n43478m97253
37632g50760J56797O75178M39440k76195p06892n17306k5693L08195K99514M3927
37622c53795k09417k27842j4064K08688L03367L31462L04290J24289j09975j02059
37612B54944J62192L09726J48932p5386j97020l83922o01438m18751K20415O23281
$$ plain form
37682 -927186 -395948 -560389 -853043 -532034 -1759 -40089 -505659 -701269 -456716 -107374
37672 -107374 138737 220462 68232 -104012 133752 680377 853267 482275 303020 757846
37662 757846 1226430 1113130 875334 1108603 1341349 799519 -138957 -396182 154634 592985
37652 592985 447503 246030 434074 675091 550667 229811 45649 -47509 -180014 -140065
37642 -140065 303149 869535 995296 566219 97888 78444 338700 289971 -253507 -750760
37632 -750760 -593963 81215 520655 244460 -462432 -979738 -1005431 -697236 -397722 -353795
37622 -353795 -563212 -791054 -805118 -596430 -293063 38399 342689 466978 357003 254944
37612 254944 417136 726862 875794 800408 603388 219466 -381972 -800723 -580308 42973
37602D2973K98542k45797k73900R6081K62843J41037L5162q2418l42997l78614
37592d47088J45556O61635L56924m38102n84083J15802N94963J92237m18758m30477
37582b51391r0314k6218j26828R2831M71315L90882j85120o02751m66516j01624
37572h95734N9269N4084J12549J71472J9601k55307l23166r0562J78690K65786
37562g03318K38610J99512R5121m4045J2130K85279L60012m2158n03276m12179
37552e14312J36004M88933L87265J63190K1251j95489m21454k62868K63839N29621
37542E95980J82748l04936l55679n3221J95992K91576K90350O0805m12203p03515
37532b12103m32110J44284M52511L51256J71478J49895J79635P0268j91624m21884
$$ plain form
37602 42973 341515 95718 -178182 -82101 180742 321779 356941 274523 -68474 -447088
37592 -447088 -301532 360103 717027 278925 -305158 -189356 405607 597844 179086 -251391
37582 -251391 -341705 -367923 -494751 -401920 69395 460277 275157 -327594 -794110 -895734
37572 -895734 -836465 -782381 -669832 -498360 -478759 -734066 -1057232 -1147794 -969104 -703318
37562 -703318 -464708 -265196 -170075 -214120 -201990 83289 443301 401143 -102133 -514312
37552 -514312 -378308 110625 497890 661080 682331 486842 65388 -197480 66359 595980
37542 595980 778728 473792 118113 64892 260884 552460 842810 903615 491412 -212103
37532 -212103 -644213 -499929 -47418 303838 475316 625211 804846 875114 683490 261606
37522B61606l91852r4522J64819J48258O7892K44412M83592L02218k36820n18659
37512D30944l04984m2229o2732j20178J7317J46066J27925K02060M24779M01584
37502A220552L116k51405k7007J89020j13189n36146l70792K15627L67444j79508
37492E17712p01737m89890K47324P10504M87440m2893k70188j21584l4463j94936
37482A07289k39627N0022K53751J210l04235j32630J99902N9624l16660j80951
37472e02305L54796M49989L0032p1143L51591M37392k30968q26052n56561K02897
37462c60332O39832N57490K15539j29147j49811L00561O13922K8656r73230j010338
37452b66858J08898R17449M59196l79401m54387j6504J50722R8785J72473Q8211
$$ plain form
37522 261606 -130246 -224768 -59949 88309 156201 400613 884205 1186423 949603 430944
37512 430944 125960 83731 20999 -99179 -81862 64204 192129 394189 818968 1220552
37502 1220552 1223668 972263 945256 1134276 1021087 484941 114149 329776 697220 517712
37492 517712 -184025 -673915 -426591 283913 771353 728460 458272 336688 302225 107289
37482 107289 -132338 -82316 171435 172645 -131590 -264220 -64318 -4694 -321354 -502305
37472 -502305 -147509 302480 332512 261369 612960 1050352 819384 -6668 -563229 -360332
37462 -360332 279500 836990 1052529 923382 773571 1074132 1688054 1716710 743480 -266858
37452 -266858 -157960 759489 1218685 839284 384897 368393 519115 617900 790373 878584
37442H78584l69165n82849q5845M70094L34797j03090j02608J36912L786l62678
37432B17938m51937l35690k99094j18705L76337O40550K31341l08542k76915R6907
37422b27810K43378K43292L25676J15228o11084j104699o46042K35193N68299
37413h58569L87555L54288N10937M48043K04621L7791j92227n36808m90993J03869
37403c1493M26927q0317o23633k82923M57832N79656J71663m3629j12139m50290
37393A1654o86570k68405L24575L17576N4531L16667P66122N17136j83007l23569
37383H46710J44743L82443J88010O9394L4457l25697p42020n71247k5812J33576
37373A34557p7746n5985J54212M8615k01190o7365J77942p6840m77969k27174
$$ plain form
37442 878584 509419 -73430 -159275 310819 645616 542526 439918 576830 580616 217938
37432 217938 -233999 -569689 -868783 -987488 -611151 29399 260740 -47802 -324717 -227810
37422 -227810 15568 258860 584536 699764 88680 -1016019 -1662061 -1426868 -858569
37413 -858569 -471014 -116726 394211 842254 1046875 1084666 892439 355631 -135362 -31493
37403 -31493 395434 315117 -308516 -591439 -133607 446049 617712 574083 461944 11654
37393 11654 -674916 -943321 -618746 -301170 -246639 70028 836150 1353286 1170279 846710
37383 846710 991453 1373896 1561906 1631300 1665757 1340060 598040 26793 981 134557
37373 134557 56811 826 155038 203653 2463 -64902 113040 36200 -441769 -668943
37363f68943L73714L32326k76435m17975J29651N27631L82703J59282P5587j41610
37353D75931l84319k36084J04168Q4507j39545j7080K63905J42453j09931J57886
37343C41891O11830M04731k43231l80817j5043M7629j50221J44458O96574M44133
37333A901934n26424q58830q8062O35312L95721l03212o42596n41315k02828K82247
37323E1947N49606J85045m45990n42442j11506J13656l8950m5877K13118L20874
37313B49481K16280J52148n0526n77182p69083m346R07143O88940l16289o26409
37303a29843J6331M71836K90062J59866K21102k11355j002953j082137l12757
37294a579848K23812J52025K69013P20361N53580l43664o87216N7765O81868K74148
$$ plain form
37363 -668943 -295229 37097 -239338 -657313 -527662 -31 382672 541954 617541 475931
37353 475931 91612 -144472 -40304 44203 -95342 -112422 151483 293936 184005 341891
37343 341891 953721 1358452 1115221 734404 719361 766990 616769 761227 1457801 1901934
37333 1901934 1375510 516680 428618 1063930 1459651 1156439 513843 -27472 -230300 51947
37323 51947 601553 786598 340608 -201834 -313340 -199684 -238634 -284511 -71393 249481
37313 249481 465761 617909 567383 -9799 -778882 -783228 123915 812855 496566 -129843
37303 -129843 -113512 358324 648386 808252 1029354 817999 -184954 -1267091 -1579848
37294 -1579848 -1356036 -1204011 -934998 -214637 338943 -4721 -691937 -634172 47696 321844
37284C21844l27676j50039K81063O6988m65802m65765J3746L29252L34082K85380
37274B23073J96093k6893k20591k17234q1657J17614L18086K28086l01569p37391
37264e02383m50475K39343M50445P7029j79852l6267R6794K6650J4118J14139
37254a50459J52811K46011N01980M84879j09758o38390l92538J69611K03212n8740
37244D08619J00530M01087J22802l92417l30817J6830j25021l76869O8511O43437
37234E36692K60747n31521l50925M66550L75079n66094p71662J1202L51807j80369
37224c98494l81711J72532L95691j22914l75936M5030K33042j61530k76825K03900
37214f67215M78605K49143J22996J09412l97824r42317l70926Q85535J070995
$$ plain form
37284 321844 -5832 -155871 125192 192180 -273622 -739387 -725641 -396389 -62307 223073
37274 223073 419166 392273 171682 -45552 -127209 -9595 308491 536577 235008 -502383
37264 -502383 -952858 -713515 -263070 -186041 -365893 -402160 -305366 -278716 -264598 -150459
37254 -150459 2352 248363 750343 1235222 1125464 487074 94536 264147 467359 408619
37244 408619 509149 910236 1033038 640621 309804 326634 201613 -175256 -106745 536692
37234 536692 797439 265918 -85007 381543 756622 190528 -581134 -569932 -218125 -398494
37224 -398494 -780205 -607673 -211982 -334896 -710832 -665802 -432760 -594290 -871115 -667215
37214 -667215 -188610 60533 183529 292941 -104883 -1047200 -1418126 -532591 538404
37205E38404l5099p41263l06252J23899p2982L323O95559R53394L31198k30935
37195A259246k55042l49392n27056l0010P63975N30778m89966n73014M53420P90418
37185A573357j47706p73766k67477J79645j07749j46615M12209M43280k75385
37176H89793m17226K76436L74542m00797n04610L58671M61535o10866r54610J03279
37166d23853O47152k10091o25712L76573R04413k25199j110459k23103P85380
37157a04899J87766p28304k59795O11524L60289k17514R2150L84921l77219r57263
37147a008344m8359J075790P11292l07109l16893K35349N0554m58911k51992K10215
37137a08408J05577j3793L85605M07274l74612n53475N58015J150920p1029j307226
$$ plain form
37205 538404 503305 -237958 -544210 -420311 -493293 -489970 205589 1158983 1490181 1259246
37195 1259246 1004204 654812 127756 97746 861721 1392499 902533 329519 782939 1573357
37185 1573357 1425651 651885 384408 564053 456304 309689 721898 1165178 889793
37176 889793 472567 749003 1123545 722748 218138 576809 1038344 427478 -527132 -423853
37166 -423853 223299 13208 -612504 -235931 668482 443283 -667176 -890279 -104899
37157 -104899 82867 -645437 -905232 -293708 66581 -150933 -58783 326138 -51081 -1008344
37147 -1008344 -1056703 19087 730379 423270 106377 341726 392280 -66631 -318623 -108408
37137 -108408 -2831 -16624 368981 776255 401643 -151832 406183 1557103 1486074 178848
37127A78848o00364P53004N03772p19426q03587J77863N81598K28699J04717J00017
37117E05141m41762q94286l52715M81183M55944k3269l852J80382j29021l85071
37107f07326K9486M60547L13785K32880N48769L35604n77472p10483M35783J115996
37097A577569L47863k83342L44459P06844l81894j280709m63520O03018J44950
37088A315238p57852m10027L59047M8709o17114l38246K09495O741j51284M63326
37078A28033O39226l83586r67484N7707J019291L71417n09626o8833N34905l1431
37068G89619n32099K51934Q90800P9707o95920q4278M22996m26685r13452K80545
37058F3167J142460r568j162273k75052R45155M32771l64341L94574J277468O93896
$$ plain form
37127 178848 -421516 331488 835260 115834 -687753 -509890 71708 300407 405124 505141
37117 505141 63379 -830907 -1183622 -702439 -246495 -269764 -273616 -93234 -222255 -607326
37107 -607326 -577840 -117293 196492 429372 978141 1313745 736273 25790 461573 1577569
37097 1577569 1925432 1642090 1986549 2693393 2311499 1030790 567270 1170288 1315238
37088 1315238 557386 147359 506406 555115 -61999 -400245 -190750 -184009 -335293 128033
37078 128033 767259 383673 -583811 -526104 493187 864604 354978 286145 821050 789619
37068 789619 257520 509454 1400254 1479961 784041 699763 1122759 696074 -217378 63167
37058 63167 1205627 1196059 33786 -241266 703889 1136660 772319 1166893 2444361 3138257
37048C138257K32167J146710J169603j189241k941750j482806O49981L28733p37537
37039C14117J54447J350605L70965r78080j94221Q93610j38364j307247j97692
37030B68140R92431k24907j378814K52690J970729O13362j227166j54711J420241
37021B531995J54636j454460q7812J459308k86555k081068J22583K877042J272454
37012D508123j709797p94858J562518K19859k387384j017687J901833R32063j656257
37003A558413m66107K132034O94884k189787r00665J783446J65688k427923J25770
36994D75753L808878J387286l090865j372122K937694J211546k941872n09145
36986A907153M466079K060676l398058q64651N194370K585709l905506n09497
$$ plain form
37048 3138257 3370424 4517134 5686737 4497496 1555746 72940 722921 1051654 314117
37039 314117 468564 1819169 2190134 1212054 1017833 1911443 1773079 465832 268140
37030 268140 1260571 1035664 -343150 -90460 1880269 2493631 1266465 1111754 2531995
37021 2531995 2686631 1232171 1144359 2603667 2317112 236044 358627 3235669 4508123
37012 4508123 2798326 2003468 3565986 3785845 1398461 380774 2282607 3214670 1558413
37003 1558413 1092306 3224340 3919224 1729437 828772 2612218 2777906 349983 475753
36994 475753 4284631 5671917 2581052 1208930 4146624 5358170 2416298 1907153
36986 1907153 6373232 8433908 5035850 4171199 9365569 11951278 8045772 7536275
36978G536275P889711N964902r45162M308583J4712956Q987052m622026J959771
36970D5792062K1825663K0903384R712060M2290371J14427996J31230841L2573830
36963D18756207j01675470j43383671q0491283j3671891o604503k2310192j3456635
36956C7162562M490951M21272j3598196j1359839M1915n4369o828114m171110
36948F105072L164835J280604n251470l595945K596423J776019l199487k190015
36940F86036K288244J264547k780609j639262K247221J183413k522964j594126
36932h67500J862473R85141k280138j405234J875123J372380j424583p90914J840158
36923A166906J118622j449534o64294J983524J313553j411130j120807J276565
$$ plain form
36978 7536275 15425986 21390888 20445726 24754309 39467265 48454317 43832291 45792062
36970 45792062 67617725 88521109 98233169 140523540 254951536 386182377 418756207
36963 418756207 317080737 173697066 93205783 79533892 72929389 50619197 37162562
36956 37162562 41653513 42074785 28476589 17116750 17158665 17104296 10276182 6105072
36948 6105072 9269907 10550511 5299041 1703096 4299519 6075538 2876051 686036
36940 686036 2974280 4238827 1458218 -181044 2066177 3249590 726626 -867500
36932 -867500 994973 1980114 -300024 -1705258 169865 1542245 117662 -673252 1166906
36923 1166906 2285528 835994 171700 2155224 3468777 2057647 936840 2213405
36915B213405J069102j066010r36825O97777N3034j756719r05155J358150R63798
36906A690557j155592j043528O64146M20476j062745m73534J281679Q48336r05110
36897B64685o69926P71431L17969j098345m03085J288923O81907j158232o86938
36888f91611J325182J233440o61725r29984N73226J032807K56010K62271N43381
36879B942997p10644j999990p03499J500138J031631j135130j179441O65102Q56408
36870A267572p67310j033983L92591P12466m17863n51074M41855K73435q43965
36861e26276m04399J283554J314457l99207r42949J81538L97193q34277j071151
36852a001517L42809J125212L74692j77661J26202o0102p63641l68414Q59658
$$ plain form
36915 2213405 3282507 2216497 1279672 1977449 2030483 273764 -631391 726759 1690557
36906 1690557 534965 -508563 155583 576059 -486686 -960220 321459 1169795 264685
36897 264685 -405241 366190 684159 -414186 -817271 471652 1153559 -4673 -691611
36888 -691611 633571 1867011 1205286 275302 848528 1881335 2137345 2399616 2942997
36879 2942997 2232353 232363 -471136 1029002 2060633 925503 -253938 411164 1267572
36870 1267572 500262 -533721 -141130 571336 153473 -397601 44254 317689 -526276
36861 -526276 -930675 352879 1667336 1268129 325180 506718 903911 69634 -1001517
36852 -1001517 -658708 466504 841196 663535 789737 729635 -34006 -402420 457238
36843D57238P61384o98001j161183j11225L67739m05472o45828K99064Q30909
36834c05375L04531K3370L75635J67996o14063n14370M24780M98191m18300n67957
36824f25562L24381N39999l12921o21963L6751J56687o08332o78661L89408J020422
36814c79791N60939K62387N80327L22835o86794q85153J53716P60292Q6739n18700
36804B56797q8111L79757L966m60100k72585L0876m212J20761N55192N59317n7512
36793A024146m94344m36808m50088n84693k04783N22674O11278j0543l36283l8960
36783c98404J60858j8195r4405M384q0859j46505J33764J92008m32916p55131
36773a435401J27921R92150K55662r93862m64564J348592J684846m918j226561
$$ plain form
36843 457238 1218622 520621 -640562 -751787 -384048 -789520 -1435348 -1136284 -305375
36834 -305375 -844 22526 398161 566157 -47906 -562276 -137496 360695 -57605 -625562
36824 -625562 -301181 238818 -74103 -696066 -659315 -502628 -1110960 -1789621 -1400213 -379791
36814 -379791 181148 443535 1023862 1346697 659903 -225250 -71534 688758 775497 256797
36804 256797 168686 548443 552409 92309 -180276 -149400 -153612 -32851 522341 1081658 1024146
36793 1024146 529802 92994 -357094 -941787 -1146570 -623896 -12618 -23161 -359444 -398404
36783 -398404 -237546 -255741 -350146 -345762 -426621 -573126 -439362 -247354 -680270 -1435401
36773 -1435401 -1307480 -315330 -59668 -1053530 -1518094 -169502 1515344 1510426 283865
36764B83865n34553N33731M56922n1916M2295K80270M5998j57010R6494K27540
36754A223636j52956m76774l37411j33016j30081q8971o1776l35020n40884j30828
36744a164081M01812J90896l97106l86714J691o5967j79293N33292J273098N97462
36734H05090p65228p32843O08148J059751N0102n52098J42082O57177M8511m83066
36724H37626L39N17288J44408m28389m89928n38043q23884n30421M91961R60128
36714A41085K53723m17736o4089M99180K77777k13594j14647K49528J81047j54566
36704F37708l15561m07765n06428k52052K99991M45274J1460k73365m3297J95212
36694b08823J80215K86157M51241N6019p26661q48073j06175M26077J65816j63362
$$ plain form
36764 283865 -250688 283043 739965 688049 730344 1010614 1056612 899602 996096 1223636
36754 1223636 1070680 593906 256495 123479 -6602 -95573 -157349 -492369 -1033253 -1164081
36744 -1164081 -762269 -571373 -968479 -1355193 -1353502 -1419469 -1598762 -1065470 207628 805090
36734 805090 39862 -692981 -84833 974918 1025020 472922 615004 1272181 1320692 837626
36724 837626 837965 1355253 1499661 1071272 581344 43301 -780583 -1311004 -819043 141085
36714 141085 394808 -22928 -87017 412163 689940 476346 361699 611227 792274 637708
36704 637708 322147 -85618 -592046 -844098 -544107 -98833 -87373 -360738 -404035 -208823
36694 -208823 -28608 257549 708790 764809 38148 -809925 -916100 -490023 -324207 -487569
36684d87569L0020L07613K43694P8361q6051m61894o76591j04245O91383M41285
36674b3994o34381q72787J83154J025987O49141q6469k79413l40566o31377n15891
36664a526596K00844N15018k4117l32698L39155J019685O64464j45930l55414
36655C54411q8363O999l208J39986J03926k90899m58787o8725K57474O5711j16578
36644i8053J21935K25030k37638o58304m42300K441J48638K36247M69309L54928
36634A22233k79744n98242p495P89055Q76852M24364N1340k39246o14950o93205
36624a69038j84399L78897L71167m931j80659o3052J22327K74064K79734K3336
36614H47446j99830L1789M11302K05380m58077o52147j82361J25300p3784j45631
$$ plain form
36684 -487569 -457549 -149936 93758 172119 86068 -375826 -1052417 -1156662 -465279 -23994
36674 -23994 -658375 -1531162 -1348008 -322021 327120 240651 -38762 -379328 -1010705 -1526596
36664 -1526596 -1325752 -810734 -834851 -1167549 -828394 191291 855755 709825 354411
36655 354411 266048 273047 269839 409825 513751 222852 -235935 -304660 -47186 18525 -98053
36644 -98053 23882 248912 11274 -647030 -1089330 -1086889 -938251 -702004 -232695 122233
36634 122233 -157511 -755753 -763248 25807 902659 1327023 1378363 1139117 524167 -169038
36624 -169038 -353437 25460 396627 391696 211037 147985 270312 544376 824110 847446
36614 847446 647616 679405 1090707 1296087 838010 185863 3502 128802 55018 -90613
36604i0613J48520J51080l08063m11616J22084L80350j32747n52057j65395L85170
36594d73287L36748O3095J28286J81700j82136m51980j24284K72239P7837l47732
36584e19514l21935J2905J19621J4259n600j003q8016n9108J56205K54171J75827
36573b62188K50147M15223J74807l58349l92607J94810N31135K02828j06583P2321
36563G21544K26669l0032k52474j58750j68368l78263k21142K89202K94959l03589
36553A9756m11197L60982Q56673L30686k74307p4076K21967k20679p31870l92827
36543c14892K51319K07078k07940o5286N00895O64350L06179j08223m16288n52983
36533B64209k13781L82828L04372o03456j072308k80558P46890P66219K06242
$$ plain form
36604 -90613 57907 208987 -99076 -510692 -388608 -8258 -141005 -693062 -858457 -473287
36594 -473287 -136539 -73444 54842 236542 54406 -397574 -521858 -249619 -171782 -519514
36584 -519514 -841449 -828544 -708923 -694664 -700264 -701267 -789283 -848391 -692186 -438015 -262188
36573 -262188 -12041 403182 577989 219640 -172967 21843 552978 755806 649223 721544
36563 721544 948213 918181 665707 506957 338589 -39674 -260816 28386 323345 19756
36553 19756 -391441 -30459 826214 1156900 882593 808517 1030484 809805 77935 -314892
36543 -314892 -63573 143505 -64435 -129721 371174 1035524 1341703 1233480 817192 264209
36533 264209 50428 433256 737628 134172 -938136 -1218694 -471804 294415 500657
36524E00657J15999L16419Q5428k69397r1017J82399j66949n84179j21146P14644
36514F82858O37990k84743p73007l59888J89870L52926L83569M17155K28990r0513
36504A385207j82889r7046j39265k48148k15863j87697k75612j56671K69784M30574
36494E82374m462m51290l90476k01957k42757o5448N17989O74063k6636n30710
36484a39310L1581O93184J94467q20832q76297r9097K44487j655K1838L26299
36474d25335J86247k17968r8451K60558o3718p36810n67251L19887O10489R8033
36464f34319p8502L70294M10781k49538n29402M6009M90958J59338k05755L0385
36454a89751L14067J20309q0578J03618J58448k57032n04748q5015M30063L98207
$$ plain form
36524 500657 616656 933075 1018503 749106 658089 840488 673539 89360 -31786 682858
36514 682858 1320848 1036105 263098 -96790 93080 446006 829575 1246730 1475720 1385207
36504 1385207 1202318 1105272 966007 717859 501996 314299 38687 -117984 151800 582374
36494 582374 577912 126622 -263854 -465811 -708568 -774016 -256027 418036 391400 -139310
36484 -139310 -107729 585455 779922 -40910 -917207 -1016304 -771817 -773472 -751634 -425335
36474 -425335 -239088 -457056 -555507 -294949 -358667 -1095477 -1662728 -1342841 -732352 -634319
36464 -634319 -712821 -342527 68254 -181284 -710686 -664677 -173719 -14381 -220136 -189751
36454 -189751 124316 244625 164047 267665 426113 169081 -335667 -420682 9381 407588
36444D07588J31923J30501J56118j09063k81214J0684L23635J32078k63195l51358
36434B87697l34787n92126p59630k91757M36888N75785J66379P6023N09569N57243
36424F31284l61440j356457j107384K61763J174949O33934m65483o11491K20259
36415i80066O54139K4070o75327l65197N26468Q30494L50783j17841j34240k8654
36405H4629p0056o5552J02888J93266L1745k09121k83891j48621N4298J13164
36395a97251l7436j30243J06187L73375J01193n23392n87069J25602O18452J99002
36385D8420m11596l33615J1616j75804m81063k319Q56442Q65315K5861l97913
36375E344M8123L94814m276m81613l17126J49471K78075J13904K6092M4423M8980
$$ plain form
36444 407588 539511 670012 826130 717067 435853 446537 770172 902250 639055 287697
36434 287697 -47090 -639216 -1398846 -1690603 -1253715 -677930 -511551 -435528 74041 631284
36424 631284 269844 -1086613 -2193997 -1932234 -757285 -123351 -588834 -1200325 -980066
36415 -980066 -325927 -301857 -977184 -1342381 -815913 14581 365364 247523 113283 84629
36405 84629 14573 -50979 51909 245175 276920 67799 -216092 -364713 -310415 -197251
36395 -197251 -234687 -364930 -258743 114632 215825 -307567 -894636 -769034 -150582 48420
36385 48420 -363176 -696791 -685175 -860979 -1342042 -1344361 -487919 377396 403257 5344
36375 5344 53467 448281 444005 -37608 -354734 -205263 72812 186716 212808 257231 306211
36364C06211P5404Q4853o5981k24009o6340K53692K36077q7380j51821J17751
36354D78457J24277k97518m77564m1943L80725J66589k95749k95377M4810O0754
36344a52539l29628n34878k19194K84120N20730M24434J90690j5971p7201J29408
36334B19971N66966Q66639N55404l65179j181418j110751k34880N12818M32713
36325B62283j68083m96002k67713J16273J96538m9576k61500r7222L24499M22255
36315a8248j18703p09865m91680L87755Q40362L64498k99264l93023j72470j59184
36305g69822j81516R3274L57214K15350k7803M7063J44573j41682m31468j94534
36295h89351K00431Q0558k97088j79575L19100M06647j464j82777J35506M28471
$$ plain form
36364 306211 381615 466468 400487 176478 110138 363830 599907 512527 360706 478457
36354 478457 602734 305216 -172348 -214291 166434 333023 37274 -258103 -213293 -152539
36344 -152539 -482167 -1017045 -1236239 -952119 -431389 -6955 183735 167764 90563 219971
36334 219971 786937 1653576 2208980 1843801 662383 -448368 -683248 -170430 262283
36325 262283 94200 -401802 -669515 -553242 -356704 -406280 -667780 -765002 -440503 -18248
36315 -18248 -136951 -846816 -1338496 -950741 -110379 254119 -45145 -438168 -610638 -769822
36305 -769822 -951338 -858064 -500850 -285500 -313303 -266240 -121667 -263349 -694817 -889351
36295 -889351 -688920 -608362 -905450 -1085025 -765925 -359278 -360742 -543519 -408013 20458
36285B0458L29769N3828j74663l24455k24130K04587M75899J04613m83905m61035
36275d79034J14458M29202K50584J50536L79652M91067K21059j22152l00458m09150
36265G25764m03496j04142K59693K28110j40062l72305l66789l59136k66794J07454
36255f91703L90299R0581m00139k73224L27549N04339J43779M9529M20043M59617
36245A020670j54553o08725k71186L36026M51015J13976k38184m69864n32001
36236c52826k24197L31417N49958J62869l38144l85075l6603K59738K25308q2521
36226A09924l28479j46278L26984M15275r9474l86860K35271R90953O53045m66975
36216A303386q89719k45253K87555N556l38843n9660L17710J36626k70164k95937
$$ plain form
36285 20458 350227 404055 229392 -95063 -319193 -114606 361293 465906 -17999 -479034
36275 -479034 -364576 64626 315210 465746 845398 1336465 1557524 1435372 1134914 725764
36265 725764 322268 218126 477819 705929 565867 193562 -173227 -532363 -799157 -691703
36255 -691703 -301404 -210823 -610962 -884186 -556637 -52298 91481 141010 561053 1020670
36245 1020670 866117 257392 -13794 322232 773247 887223 649039 179175 -352826
36236 -352826 -577023 -245606 304352 467221 129077 -255998 -292601 -32863 192445 109924
36226 109924 -218555 -364833 -37849 377426 277952 -108908 126363 1117316 1770361 1303386
36216 1303386 413667 168414 455969 461525 122682 63022 380732 517358 247194 -48743
36206d8743k8121J69207K94286L60591J14341l93158o05954k66387J97570L86111
36196A79743L64354J91749j99421m76875j47912M69395M73366j93344n76611k42914
36186a58470J35045P4656n714J69196J49842k26573l75682q3055O0709r8088J45930
36175b12204Q67533R47325j06855j064662p67259J45726M46432J69988J9267q0141
36165C65150m70194o40028k9703O89218N13603k27723m37525l7477J30907j31427
36155b75199k18862M4799J96937J00813R4226K12351J44585r4589k08328j98480
36145b01747k40512k15873P256J69474J02825J44202M26502L80901k73077p37722
36135d37771k94984M20024L98399j11581j68631K09093K74031M529l2299O7806
$$ plain form
36206 -48743 -76864 92343 386629 747220 861561 468403 -137551 -403938 -206368 179743
36196 179743 544097 735846 536425 59550 -88362 381033 854399 661055 84444 -158470
36186 -158470 -23425 51231 45517 214713 364555 137982 -237700 -320755 -260046 -358134 -212204
36175 -212204 655329 1602654 1495799 431137 -336122 -190396 256036 426024 445291 365150
36165 365150 -105044 -745072 -774775 -85557 428046 200323 -237202 -274679 -143772 -275199
36155 -275199 -494061 -449262 -252325 -151512 -57286 155065 299650 205061 -3267 -201747
36145 -201747 -442259 -658132 -650876 -481402 -378577 -234375 192127 573028 299951 -437771
36135 -437771 -732755 -312731 85668 -25913 -194544 14549 288580 293109 260810 328616
36125C28616j74318l88984J08787P74245M41502n74073p04732L39894J010282
36116A161219L63566n73821o23360j63784r1865l00878k42478o5317j56331k47823
36106i40872P0709M87559M47193O0305j64830j02265O8750K92466M47644J97640
36096H64299m24662p63421m33730K5930l864k44142q9922L02429L33120M9561
36086c84402L5101L42095L93345k1040m15076m09139j98884m4861J01989K35666
36076c65206J23214j91753k23874K13867N40722J87412m74524n93787q0416K93321
36066e71024R6967j50032J04413N35515N21774K06394K22294N25825L59824m70296
36056A381654j088290p46600Q4561M08364N5146l07049k66450q1563m1663m7013
$$ plain form
36125 328616 154298 -234686 -125899 648346 1089848 515775 -188957 150937 1161219
36116 1161219 1524785 950964 327604 163820 71955 -228923 -471401 -536718 -693049 -940872
36106 -940872 -870163 -382604 64589 124894 -39936 -142201 -73451 219015 666659 864299
36096 864299 439637 -323784 -757514 -731584 -735448 -979590 -1069512 -767083 -433963 -384402
36086 -384402 -349301 -7206 386139 365099 -49977 -459116 -658000 -702861 -600872 -365206
36076 -365206 -241992 -433745 -657619 -443752 96970 284382 -190142 -783929 -864345 -571024
36066 -571024 -474057 -624089 -519676 15839 537613 744007 966301 1492126 1851950 1381654
36056 1381654 293364 -453236 -368675 39689 94835 -212214 -478664 -560227 -601890 -648903
36046f48903L3892P2726m2501j69002j35794K1381J80076K83361K78064J04935
36036b1765j47283k58397j52250n560J2826l2981P06P5847L3890r9067m4574L56621
36024b81987P83430O94036M7281n00448l92178N9624J31280k25551l53384J9663
36014a8234L48563J91744j09908j15816l0523j70889k33070J54100N59243L10015
36004H85225l22669m44908L9198L08690Q789k59172j09779l3763l78764n82272
35994h89425j44323L79515K27234k87243l11674R7094J28121l22260m58446J0870
35984a570537L51897Q6391j71372K05051P21304N36010j69865n09810k73979n8062
35974h52972j13447k3930L36052M19376n8053n40284m67845j01010K3879k9878
$$ plain form
36046 -648903 -615011 -542285 -584786 -753788 -889582 -868201 -688125 -404764 -126700 -21765
36036 -21765 -169048 -427445 -579695 -585255 -572429 -605410 -604704 -528857 -494967 -594034 -638608 -281987
36024 -281987 501443 1195479 1242760 742312 350134 409758 541038 315487 -37897 -18234
36014 -18234 330329 522073 412165 296349 265826 94937 -138133 15967 575210 885225
36004 885225 562556 117648 156846 465536 474325 215153 105374 71611 -307153 -889425
35994 -889425 -1033748 -654233 -426999 -714242 -1025916 -928822 -800701 -1122961 -1581407 -1570537
35984 -1570537 -1218640 -1132249 -1303621 -1098570 -377266 158744 -11121 -520931 -794910 -852972
35974 -852972 -966419 -990349 -654297 -234921 -292974 -833258 -1301103 -1402113 -1378234 -1408112
35964a408112J27287M19832M37618J65602j4951M1070J41682K21679L82603M83342
35954I97652K13817l43184o82133n39458k11122o6391p7033q235J69263K54966
35944b91858J04423j66088k55210q792L18094L24605M6705m2864K23018L77878
35934F29911N3884l87249m21227j71695q1212j11340N2162K54861R1173k84097
35924c74829l36042o3439N0207m4880O2389L20867J73333l89515o24638j92088
35914a418635L06425L19897J13820J06050J46823k2128j88117q4046R4100P0970
35904e54841k2838K8000J14764R6226J05818K22853K35057M5816r2080l9381k8400
35893A10994j83387k61235j52950j28145k72438k26727J61190M69330L65590J10130
$$ plain form
35964 -1408112 -1280825 -860993 -423375 -257773 -272724 -231654 -89972 131707 514310 997652
35954 997652 1211469 868285 186152 -353306 -564428 -630819 -707852 -716087 -546824 -291858
35944 -291858 -187435 -353523 -608733 -617525 -299431 25174 71879 29015 252033 629911
35934 629911 683795 296546 -124681 -296376 -377588 -488928 -436766 -181905 -90732 -374829
35924 -374829 -710871 -774310 -724103 -768983 -706594 -385727 -212394 -601909 -1226547 -1418635
35914 -1418635 -1112210 -792313 -678493 -572443 -425620 -447748 -635865 -719911 -625811 -554841
35904 -554841 -577679 -549679 -434915 -338689 -232871 -10018 225039 270855 178775 139394 110994
35893 110994 -72393 -333628 -486578 -614723 -887161 -1113888 -952698 -483368 -117778 -7648
35883g648J8032l5409j89362k49139j61126k24697m08232j49529O25609J020208
35873B38707M14818m52246m90944J76185N64809L63070J50912K59203L36160J07113
35863A667787j76262k19120j08599q5950j89332k21145K6287M42949N35420P994
35853A680029o27871n81331J6095J80843m05131q07883k76942N55057O35948J0366
35843C79180m37062l00860M7071J70004l9513m08005n06685k6717N84648N10436
35833b7503j08353j60146O25931J000608J64554p68066m88158L72900L36992m83544
35823D65215p38702j54951K44745N7081l7135K25675K66054p0750k04865j1646
35813D0721l8706l05186j49898M42385O07897N7565m10750k59067L6872O665r4931
$$ plain form
35883 -7648 10384 -25025 -214387 -463526 -624652 -849349 -1257581 -1407110 -781501 238707
35873 238707 653525 201279 -289665 -113480 451329 814399 965311 1224514 1560674 1667787
35863 1667787 1491525 1272405 1163806 1077856 888524 667379 693666 1136615 1672035 1680029
35853 1680029 1052158 470827 486922 667765 262634 -545249 -822191 -267134 368814 379180
35843 379180 -57882 -358742 -311671 -141667 -181180 -589185 -1095870 -1122587 -537939 -27503
35833 -27503 -135856 -296002 329929 1330537 1495091 727025 238867 611767 948759 465215
35823 465215 -273487 -428438 -183693 -126612 -163747 61928 327982 257232 52367 40721
35813 40721 2015 -303171 -453069 -10684 597213 654778 244028 -15039 21833 28498 -66433
35802f6433l0967m6287j52905P3574N56651N64728n7489n00514l11157p1268k09641
35791b51708k15880K46653M78872j02411q09856o66524J13742N89174N16036L71509
35781B69607L34393J53674j70771l46057l15431k52436j77330m8912j2980j18169
35771f84412o0060L45399P27266O51602K57662l5805j47495k08560j57186M6559
35761G34970J14794j40164l66115j95615Q7592P270k52275j54309K00429J83784
35751B20361k50194l79828J20472N64061K59462m19069n87129j57794J25964o8231
35741e71925j44466L71505Q89854N33594m41429q28484j39820P00360O82260L8643
35731A090092l16501j32343J18745J73334J73702R3032k45667n85332m19064J35891
$$ plain form
35802 -66433 -97400 -143687 -296592 -223018 333633 898361 840872 340358 29201 -42067 -251708
35791 -251708 -467588 -220935 257937 155526 -654330 -1320854 -1207112 -617938 -101902 269607
35781 269607 604000 757674 586903 240846 -74585 -327021 -504351 -553263 -566243 -684412
35771 -684412 -744472 -399073 328193 979795 1237457 1201652 1054157 845597 688411 734970
35761 734970 849764 709600 343485 147870 235462 242732 -9543 -163852 36577 220361
35751 220361 -29833 -409661 -289189 274872 534334 115265 -471864 -629658 -503694 -571925
35741 -571925 -716391 -344886 544968 1078562 637133 -191351 -331171 369189 1051449 1090092
35731 1090092 773591 641248 759993 933327 1107029 1200061 954394 369062 -50002 85889
35721H5889L40908r1762n54766m46343K3600K61300J02052j61039k80529k62895
35711i83585k03273j19997O2616L71983O05470M82544J11498j0131K65259L82441
35701I64825r0044o71783o14515j7246M00198L89798K82510K03163Q610j19136
35691G36380J06952L38966q121o51528p28996k32429o4548m84555o45227o0725
35681a693831N65946N28912J49316p670o0635k65843l22961L6459M07139L54648
35671c08520J41823J76050K81136J42650n5146n2138m5962j95758j40721L26358
35661B69772O35883K27699m74788o22909j42104L17501L45822O0665k94272m60849
35651a37580j65983M40957O70523J60633m89280n21399p8567J66296O5168k6918
$$ plain form
35721 85889 426797 335035 -219731 -666074 -642474 -381174 -279122 -440161 -720690 -983585
35711 -983585 -1186858 -1306855 -1244239 -872256 -266786 215758 327256 317125 582384 964825
35701 964825 874781 202998 -411517 -428763 -28565 361233 643743 846906 855516 736380
35691 736380 843332 1182298 1174177 522649 -206347 -438776 -503324 -987879 -1633106 -1693831
35681 -1693831 -1127885 -598973 -449657 -457327 -517962 -783805 -1106766 -1070307 -663168 -308520
35671 -308520 -166697 9353 290489 433139 377993 325855 279893 84135 -56586 269772
35661 269772 905655 1133354 658566 35657 -106447 211054 556876 617541 323269 -137580
35651 -137580 -303563 137394 807917 968550 479270 -42129 -120696 45600 110768 83850
35641H3850j9220p6381n1990L16584P54866O90850J15100l98987n04161l74770
35631E35741k45141j57808j29639j32945R60K72782L04863j17396n36127l88715
35621e93425J25895L37447R7274j46657j66448j84396k76699j81469J63162M01379
35611d23937K60685q7862k94759j94391J30526M17790M03341J43338K8220K41928
35601F24879M21274J66398l39710n96452m62312j78142P3359K20101J31657j59183
35591i8131k76410J417K91704J52443j71440j31754J97674K44389j14972m07137
35581c12217l59162k03639j29545k1381J54636K39027K54159L91631N40058L36635
35571H90202j85908m91325k50713K36643M72671K74387j95696n63181m19437K26041
$$ plain form
35641 83850 64630 -11751 -63741 252843 1007709 1698559 1813659 1414672 910511 535741
35631 535741 290600 132792 3153 -129792 -128832 143950 448813 331417 -204710 -593425
35621 -593425 -467530 -130083 -32809 -179466 -345914 -530310 -807009 -988478 -825316 -423937
35611 -423937 -163252 -251114 -545873 -740264 -609738 -191948 211393 354731 382951 624879
35601 624879 1046153 1212551 872841 276389 -185923 -364065 -290706 -70605 61052 -98131
35591 -98131 -374541 -373124 -81420 71023 -100417 -232171 -34497 209892 94920 -312217
35581 -312217 -671379 -875018 -1004563 -1025944 -871308 -632281 -378122 13509 553567 890202
35571 890202 704294 212969 -37744 198899 671570 945957 750261 187080 -232357 -6316
35561f316P17199M58483k09525m34451j17861M11l55743m91473M9547N84289K95437
35550D89997m43201n85144M1192N53662L51606j43003k73104n6592N4275p2421
35540h2733j60369l0057J75794K60809K03550P6593n2848p3692J14443L70356
35530H01846L27752j41758o18867n72966n1913L75590L70007J63038O3001o98
35520G15032k07283m19787l49264M580L37623L87645J38611k06354l45202j41772
35510h6171J31955N6756l21177m63849j10712L07289L18171Q8274L9316J31208
35500I1060N2922j21841p3485R5831l1601m07280m68070k0887L87807K64058j22904
35489c54390j85939J28327L39217J60271j38303j42740J65908M28875L86398J75524
$$ plain form
35561 -6316 710883 1169366 959841 525390 407529 407940 52197 -439276 -389729 194560 489997
35550 489997 46796 -538348 -497156 56506 408112 265109 -7995 -64587 -10312 -82733
35540 -82733 -243102 -273159 -97365 163444 366994 443587 390739 317047 431490 801846
35530 801846 1129598 987840 368973 -203993 -255906 119684 489691 652729 715730 715032
35520 715032 507749 87962 -261302 -256722 80901 468546 607157 400803 55601 -86171
35510 -86171 45784 102540 -218637 -682486 -793198 -485909 -167738 -79464 -40148 91060
35500 91060 143982 22141 -51344 44487 12886 -394394 -862464 -883351 -495544 -231486 -354390
35489 -354390 -540329 -412002 -72785 87486 -50817 -193557 -27649 401226 787624 963148
35479I63148P7283Q6019n8455m06409o26662m41366k8631K08334J34974n1100
35469a42865j41300r8939R678R3846R3659O6903J30946K28452J11911k88239o39550
35458e75498n56690q5179L41782L83013J12199r3115N5531M02108M40519n0420
35448C74250n72190m63759J53276M87125K16416p5149J26889M63617L55130l4117
35438A031488j14800J38645J88210j72676n22007m62130j14568J50973J69702
35429B92837N0125l1262k8128n5901j84762k53573r9296Q6413m489k16660r8638
35418e43334K80777L24083p9862k68659P6431L03179j16371n98112l67927K30783
35408g59012L13125r1047j97339J55742L46886J38456l242J42758J88120p4301
$$ plain form
35479 963148 1040431 1126450 1067995 661586 34924 -406442 -435073 -226739 -91765 -142865
35469 -142865 -284165 -383104 -373426 -279580 -185921 -119018 11928 240380 352291 64052 -575498
35458 -575498 -1132188 -1217367 -875585 -492572 -380373 -473488 -417957 -15849 424670 374250
35448 374250 -197940 -661699 -508423 -21298 195118 119969 246858 710475 1065605 1031488
35438 1031488 916688 1055333 1243543 1070867 548860 86730 -27838 123135 292837
35429 292837 342962 311700 283572 227671 42909 -210664 -309960 -223547 -228036 -444696 -543334
35418 -543334 -262557 61526 -18336 -286995 -210564 92615 -23756 -621868 -989795 -759012
35408 -759012 -445887 -536934 -734273 -578531 -231645 -93189 -96431 46327 234447 160146
35398A60146k94931k24784q2706l6225Q5493L33060M25693K21164m6305j57316
35388C83289j44696o6837O3114J09747k6778j46670n8372J6212j51890k38685
35378b61566J18136M96490K29933l93576m63995M3407J89437l30560o45546j68947
35368a186787M60225M82981J51268O5161J48622L6754j21969k052K11714J48838
35358C94755r6018k11573k19940k67501k32170j7873J48269J63470L32459P11827
35348G05705P09530j7820p59614o19821J60831N64698K49094j86277k73950j96855
35338C35521j83271j25024K5663O9668k8300j3401J96781L24681J70966j00304
35328F72980k53967k62600j76706P930K29836L27153K28181L0268j38425k05367
$$ plain form
35398 160146 -134785 -359569 -442275 -478500 -393007 -59947 365746 586910 540605 383289
35388 383289 238593 171756 234870 344617 317839 171169 112797 129009 -22881 -261566
35378 -261566 -143430 353060 582993 189417 -274578 -231171 -41734 -372294 -1017840 -1186787
35368 -1186787 -726562 -243581 -92313 -27152 121470 158224 36255 34203 245917 394755
35358 394755 298737 87164 -132776 -400277 -632447 -650320 -502051 -338581 -6122 705705
35348 705705 1415235 1397415 637801 17980 178811 743509 992603 806326 532376 335521
35338 335521 152250 27226 52889 122557 94257 80856 277637 602318 773284 672980
35328 672980 419013 156413 -20293 -12363 217473 544626 772807 803075 664650 459283
35318D59283j53007q6636j91240m19439l92901P8393N44667M15396j60526m13875
35308c19885j9314M63069M13273l4785l31875l09280k10128j44066L600J63891
35298c25500O6956k38386k65670K21772P03965M99266k58732p10792m00339J58242
35288e49218K85167Q1034J07951L96420L93731r0827n05872l76376j5275n498
35278b78763k86969k69578K35060O90904N69632M2816k96009j93993N1501P6250
35268C40851j27570l27196l73336k74371r4663N8616N6259p2533r3675R4064K24594
35257e88960O6909j00812J24093M98819L57123l26567p73512n36251r1295P8254
35247a292199K30862O12467P16161J42953m34246k11314L18640Q2649p17372q28403
$$ plain form
35318 459283 306276 219640 28400 -391039 -783940 -705547 -160880 254516 93990 -319885
35308 -319885 -339199 123870 537143 502358 170483 -138797 -348925 -492991 -489391 -325500
35298 -325500 -258544 -496930 -762600 -540828 163137 662403 403671 -307121 -707460 -549218
35288 -549218 -264051 -183017 -75066 321354 715085 624258 118386 -257990 -273265 -278763
35278 -278763 -565732 -835310 -600250 90654 660286 703102 407093 213100 264601 340851
35268 340851 213281 -113915 -487251 -761622 -856285 -797669 -741410 -813943 -907618 -813554 -588960
35257 -588960 -522051 -622863 -498770 49 357172 30605 -742907 -1279158 -1370453 -1292199
35247 -1292199 -1061337 -448870 267291 410244 -24002 -235316 83324 165973 -551399 -1379802
35237a379802l914N91835L12639m0431K27830N36395K26353k03289o3505K33424
35227D37535l6345n25483l94320K12779M41355J70333L4446J65411M4712l80252
35217A70171n11633j89415J6296j49082j96199J47109L93210J79045m7847J94309
35207E964N49620L82522j95587n15140l33109k4136J03867J30086J49967P1784
35197C25838r7279j38241K7902J44825j5939k73578k50492J02489M10923L38693
35187E75141j8901k91829k68573m3782J92879L38698L42909J65700j39698m03384
35177D49160m76219l42429q6723J63159K76488K40206K23976L41172L74317L1665
35167A194772m86064n73197p1670L67620J42225m13968n04447k8067L41137K09625
$$ plain form
35237 -1379802 -1383716 -791881 -479242 -519673 -291843 244552 470905 267616 204111 437535
35227 437535 401190 -124293 -518613 -305834 135521 305854 340300 505711 550423 170171
35217 170171 -341462 -530877 -514581 -663663 -859862 -712753 -319543 -140498 -188345 5964
35207 5964 555584 938106 742519 227379 -105730 -129866 -25999 104087 254054 325838
35197 325838 228559 90318 118220 263045 247106 -26472 -276964 -174475 236448 575141
35187 575141 556240 264411 -4162 -47944 144935 483633 826542 992242 852544 449160
35177 449160 -27059 -369488 -456211 -293052 -16564 223642 447618 788790 1163107 1194772
35167 1194772 708708 135511 63841 431461 573686 159718 -344729 -372796 -31659 177966
35157A77966l2532N4487K89123K79270P3010l6697n9204j81697k86940j13470
35147A63316J64809O1964m22855o44757k01291M35100N36444Q7390k79333j62863
35137b62076K05086M05233L09596O9370r5427m3558J40996J67523q2400k94495
35127E19848j48239J29690R4760j18778M6868N51905O27357k7125o37205m78485
35117E60596K5125M6139l03192k69109J78456K82013j79167m63393o1662M81037
35107B96843M16395j14051l90665j69425J19663Q4434j72309l19703k14478L8609
35097d24687K73527L87401L12152m16m32782o17602k71930L36756N94190L56604
35087E13213J65535L79552N61410K07696l39329l87074k3278L0201m06731p40890
$$ plain form
35157 177966 145434 199921 489044 768314 841324 804627 745423 563726 276786 163316
35147 163316 328125 390089 -32766 -677523 -878814 -443714 92730 180120 -99213 -262076
35137 -262076 -56990 348243 657839 727209 631782 588224 729220 896743 814343 519848
35127 519848 371609 501299 596059 477281 524149 1076054 1703411 1676286 1039081 560596
35117 560596 585721 631860 328668 59559 238015 520028 340861 -122532 -184194 296843
35107 296843 713238 599187 208522 39097 158760 243194 70885 -248818 -463296 -424687
35097 -424687 -151160 236241 548393 547977 115195 -502407 -774337 -437581 156609 513213
35087 513213 678748 1058300 1619710 1827406 1488077 1101003 1077725 1107926 701195 -39695
35077c9695n92955k49759J051K38907M04001J72550l39889m56809N5804N02979
35067c03815K75566k25613k74116N5397J46269q1419j08517K31615M33477J21030
35057B69874l37493l29368J41360M27948P4194n68613p38589j93269N16390P49797
35047A2231M57920J6303k73490k49508J61682O52189N59219k70676r72377o83635
35037e90142J95713N53957J84356q1298J68472L57539M5199l36156k91380l9895
35027A66365q514j51400k01112j03958J04015L74771M16876m0998o11598n53674
35017f09227J21070N98107M87975K39116J08458k54491q01195p55873P9167O99077
35007h7816L40330l51737m22807m2436O1893j31406j80371p9278l3101J14636
$$ plain form
35077 -39695 -632650 -882409 -881358 -642451 -238450 -65900 -405789 -862598 -806794 -303815
35067 -303815 -28249 -253862 -527978 -472581 -326312 -407731 -516248 -284633 148844 269874
35057 269874 -67619 -396987 -255627 172321 246515 -322098 -1060687 -1253956 -737566 12231
35047 12231 470151 486454 212964 -36544 125138 777327 1336546 1065870 93493 -590142
35037 -590142 -394429 159528 343884 262586 431058 788597 833796 497640 206260 166365
35027 166365 157851 6451 -194661 -298619 -194604 180167 597043 556045 -55553 -609227
35017 -609227 -488157 109950 597925 837041 945499 691008 -110187 -866060 -786893 -87816
35007 -87816 252514 -99223 -522030 -564466 -502573 -633979 -814350 -893628 -926729 -812093
34997h12093M34336M94199J46096J0677L79772M90098j51823o68732k40797L07761
34987C89494j51326r34546n62180O36194R16589k3586o12485o8899M56670L5130
34977H1055m94055r7005P02373P68137J05969m00067l85937k15729j77872k15496
34967c28627k41380k24628j33134m5356p1290o4313J98392M97244L54083j66769
34957b25778m17269r0562L69830M69337K35131q7038l70825m54003j70083K54846
34947d86414L13819q0405m37656l72844k9780K59853L18578R9449k30832k19352
34937h65584L50963R27411P63703j0777n32834m03329p5500j8304j65295k77752
34927c07298k46958J7426M44614O01886K18427k48805k35311J977j13525l58360
$$ plain form
34997 -812093 -377757 116442 262538 273215 652987 1143085 991262 322530 81733 389494
34987 389494 238168 -696378 -1258558 -622364 294225 270639 -341846 -410745 45925 81055
34977 81055 -413000 -510005 192368 960505 1066474 666407 280470 64741 -113131 -328627
34967 -328627 -570007 -794635 -927769 -973125 -1044415 -1108728 -910336 -413092 -59009 -225778
34957 -225778 -643047 -733609 -363779 105558 340689 253651 -117174 -571177 -741260 -486414
34947 -486414 -172595 -253000 -690656 -1063500 -1093280 -833427 -514849 -415400 -646232 -865584
34937 -865584 -514621 412790 1176493 1165716 632882 229553 154053 135749 -29546 -307298
34927 -307298 -554256 -536830 -92216 509670 728097 479292 243981 245958 132433 -225927
34917b25927j14701L57717K60651k58453k81532K22032L26355j31367k63732J45365
34907C6408K02866l31413m51360K26143N77699j12129q24092m98555K63239M05274
34897e05920J39775J72238K65185n6430k86759J63906O42457K49937n11484n31551
34887b58646L9502J84126j67996k06984J57349K11854j54091k80254M0783L28649
34877a05708L78739M12617L50940m4881m24316k51938J80720J55622k29795k61056
34867A60944J20660L10979J60566L8479n8292l75667n78478j97469L12293J79342
34857G3357k51938n5814N13305L41306n18291q07277j97427K42531K1712o3472
34847g02008L35402M28519k0608p3533M91718M60159n82016j086361l2129J089799
$$ plain form
34917 -225927 -340628 17089 277740 19287 -262245 -40213 286142 154775 -108957 36408
34907 36408 239274 -92139 -543499 -317356 260343 148214 -675878 -1174433 -911194 -505920
34897 -505920 -366145 -193907 71278 14848 -271911 -108005 534452 784389 272905 -258646
34887 -258646 -219144 -35018 -203014 -409998 -252649 -40795 -194886 -475140 -434357 -105708
34877 -105708 273031 685648 1036588 991707 567391 315453 496173 651795 422000 160944
34867 160944 281604 592583 753149 791628 733336 357669 -220809 -418278 -105985 73357
34857 73357 -178581 -234395 278910 620216 101925 -705352 -902779 -660248 -638536 -702008
34847 -702008 -366606 61913 41305 -32228 459490 919649 337633 -748728 -780857 308942
34837C08942N47621p73353q37959K30015N56897k93133q08645j86621N70618N64490
34827a21128K46639K08574J90692o1070j53624J01724K14456k5872o5971L41811
34817H76231N02858q9837p89197p37939j42240J97138J21445O1206J17388L8418
34807A55471q6277P1446L31271J38891m49574o49005r3590N25309M27103j21934
34797B49111k51961J78191M13087J8754m44511l32605P6450R7626k09036j89051
34787c93945K07690K57389l05006p25965l79671K38008L25299K2265K5421L32690
34777c95825L11493j09613k73883O9548L44994J48686j11184O507K19766Q2056
34767B92545k15883k06442L9602P4622j41791k08822K0118K30136J84051L5445
$$ plain form
34837 308942 856563 83210 -754749 -524734 32163 -260970 -1069615 -1256236 -685618 -121128
34827 -121128 125511 334085 524777 463707 310083 411807 626263 600391 534420 876231
34817 876231 1379089 1289252 500055 -237884 -380124 -182986 -61541 -335 117053 155471
34807 155471 69194 140640 471911 610802 161228 -487777 -581367 -56058 371045 249111
34797 249111 -2850 175341 588428 607182 162671 -169934 -93484 4142 -204894 -393945
34787 -393945 -186255 71134 -233872 -959837 -1339508 -1101500 -776201 -753936 -728515 -395825
34777 -395825 -84332 -193945 -467828 -398280 -53286 95400 -15784 -9277 210489 292545
34767 292545 76662 -129780 -90178 -15556 -157347 -366169 -346051 -115915 68136 103581
34757A03581j4235k2076r9155j58863p7021M5045j0306k36029l42607j17263K47760
34746f81169L30647R727l34519k74038J27294M19520L35877K5430k39567l16427
34736e97225j54665J86130M26906K93721n4844j49648J20743L25953J53864j41968
34726D08967k25433k08929l11744l31541M0102N84043P60127M61297Q5906j05132
34716A157663k42097m33041n26280l89733j16036J19554J71691n9332m41024n37013
34706a295648r2304M95562O22903L29815J90239L63569L64683p4336n11048m56405
34696f2970n0220K64172L52426L34088K25953k4913l51771o27030p23652m62091
34686a126008J65121O83368N55524K7554o1698M48802O73241J5533q32351q77090
$$ plain form
34757 103581 89346 67270 -31885 -190748 -267769 -222724 -233030 -469059 -811666 -928929 -681169
34746 -681169 -350522 -340795 -675314 -949352 -822058 -402538 -66661 -41231 -280798 -597225
34736 -597225 -751890 -565760 -138854 154867 100023 -49625 71118 397071 550935 408967
34726 408967 183534 -25395 -337139 -668680 -628578 -44535 715592 1176889 1262795 1157663
34716 1157663 915566 482525 -43755 -433488 -549524 -429970 -258279 -317611 -758635 -1295648
34706 -1295648 -1387952 -892390 -269487 60328 250567 614136 978819 904483 393435 -62970
34696 -62970 -113190 150982 503408 837496 1063449 1038536 686765 59735 -663917 -1126008
34686 -1126008 -960887 -277519 278005 305559 243861 692663 1365904 1381437 549086 -328004
34676c28004k26887K59562K79424K02739J89986O4406q4117J2295J74279k74l40481
34665B02928k96256R9459K57621M7086m9844J02530M7244l26797m62278j06542
34655d84849J95845M3285j27174J48690M89037K70666l50470o91290n15250j59643
34645a181153R3730K36600K59621J17287r7320k41923k73069j26982K70524O66362
34635b76323N48179j16473o05759l32969L42594O53840M33671P2387j99867l80760
34625A38520l04553J41077N48374M08129p4106k35508J3128J22218r3802j63324
34615E00153J25240K68092j00848n39237m83995j08356P4307P3311K43516M81094
34605E33277L00134k93176o46999l69640J16934K17593j8039q0832K24293N76252
$$ plain form
34676 -328004 -554891 -295329 -15905 186834 376820 441226 357109 369404 543683 543409 202928
34665 202928 -93328 6131 263752 310838 260994 363524 410768 83971 -378307 -484849
34655 -484849 -289004 -245719 -372893 -224203 264834 535500 185030 -506260 -1021510 -1181153
34645 -1181153 -1087423 -850823 -591202 -473915 -571235 -813158 -1086227 -1213209 -942685 -276323
34635 -276323 271856 155383 -450376 -783345 -440751 213089 646760 719147 519280 138520
34625 138520 -166033 -24956 523418 931547 857441 621933 635061 757279 663477 500153
34615 500153 625393 893485 792637 253400 -230595 -338951 -264644 -191333 52183 533277
34605 533277 833411 540235 -106764 -476404 -359470 -141877 -159916 -240748 -16455 559797
34595E59797O23129L26964j58002o20009p63862m06010J54364K88849j86774o73501
34585h55055n49781k5435K08463K5536j2976L76779P09873M81892n8668k94104
34575F524r9651J11142O0359p8682l5916J81349L34842K31154p1958k89244k09131
34564A40788J5793M9625j31748j98625q956J59308J13934R8276L00051L78269
34554I16715k8698n76658n83493l4451L64003J78164k42169l81179k02595L4293
34544e56068K00649K82614K47067J62029J93934K85339J19685l60021o94631m86733
34534f06136O050K25065Q5511j7976J03888J99149P7345p2750m1272N8059K6601
34523D3534r3113j69412k26263k58281m0505M77951P66028K48336p32409j095479
$$ plain form
34595 559797 1182926 1509890 1351888 731879 -31983 -437993 -283629 5220 -181554 -855055
34585 -855055 -1404836 -1430271 -1221808 -1196272 -1209248 -832469 -122596 359296 300628 6524
34575 6524 -93127 18015 78374 -308 -36224 145125 479967 711121 639163 349919 140788
34564 140788 156581 206206 74458 -124167 -133123 26185 140119 238395 538446 916715
34554 916715 888017 311359 -272134 -306585 57418 235582 -6587 -387766 -590361 -556068
34544 -556068 -355419 -72805 174262 336291 530225 815564 935249 575228 -119403 -606136
34534 -606136 -600086 -375021 -289510 -307486 -203598 -4449 72896 146 -41126 16933 43534
34523 43534 -49579 -218991 -445254 -703535 -744040 -266089 499939 748275 15866 -1079613
34513a079613m05349M83605N92193J41847P5636N59114P78172K57555m13173m86958
34503E03029p7805J88556J13480j5778n6864j49916k82457k11920P8188K27515
34493C16028Q89l17678k94380J8113J29940j46698l32286M8007O27115N47512
34483E96562k83728q83073m90508L57447O50517L63125K57482M74434L55590k53765
34473A144083n97808k85658J6428k27265m32670P4554P53670N92760k73095p44614
34463B0385l80971J58085K87276J79451J18421m00k25097k63176J1901K59085
34453A64960J76291p5770j86719r2844J06993K97229K88248k9499l79787l45927
34443g6825j5423P5850k20285l99756j25475K03495R1285k63378k97236N9056
$$ plain form
34513 -1079613 -1484962 -1001357 -409164 -267317 -191681 367433 1145605 1403160 989987 503029
34503 503029 425224 613780 727260 711482 654618 504702 222245 10325 88513 316028
34493 316028 316917 -761 -295141 -277028 -147088 -293786 -626072 -578065 49050 596562
34483 596562 312834 -570239 -1060747 -703300 -52783 310342 567824 1042258 1397848 1144083
34473 1144083 546275 260617 277045 49780 -382890 -308336 445334 1038094 764999 20385
34463 20385 -360586 -202501 84775 264226 382647 382247 157150 -106026 -94125 164960
34453 164960 341251 265481 78762 -14082 92911 390140 678388 648889 269102 -76825
34443 -76825 -92248 -16398 -236683 -636439 -761914 -558419 -467134 -730512 -1027748 -968692
34433i68692L40037K44117n0497k38148k07831M40K74149M10510K48007r5395
34423d3303k70203q5787K32307K88951R523k43652j35791J69686K33921J7357
34413A73009k5310L03592M92269L2140o92519q08398j75974M12156L66877K8449
34403A06291l3931R3968k8003l59373m16769m0546L79643M86018L48716J62610
34393F98624q8215m18867n51867k03346L83376N56526N8995n61844o12878j36339
34383h75835K30057J82307P1976K20676M03029K77225o4502l09832l71329k85110
34373e21338J016L56811L50440j16191m12952l1552M97369L09777l85375n37112
34363d89107J08710O00289K76023k70593k22884K43084M24931K04950p58l3018
$$ plain form
34433 -968692 -628655 -384538 -435035 -673183 -881014 -880574 -606425 -195915 52092 -43303
34423 -43303 -313506 -399293 -166986 121965 131488 -112164 -247955 -78269 155652 173009
34413 173009 147699 451291 943560 975700 283181 -525217 -701191 -289035 77842 106291
34403 106291 72360 166328 138325 -221048 -637817 -678363 -298720 187298 536014 698624
34393 698624 610409 191542 -360325 -563671 -180295 376231 435226 -126618 -739496 -875835
34383 -875835 -645778 -463471 -391495 -170819 232210 509435 444933 135101 -236228 -521338
34373 -521338 -520322 -163511 186929 70738 -342214 -373766 123603 433380 48005 -489107
34363 -489107 -380397 219892 495915 225322 2438 245522 670453 875403 874645 841627
34353H41627p8092j87613k55663l11629l90017k94341Q7140M27033L48788l714
34343A83519j92498r7417R5545K92833M30033K48417l20741p33627m17416L13581
34333a97771N83074J94056j53716r504J96497j4433l63640l40753n0451M6786
34323a09855o4468o243K80419M24546K18791j28668l70036m54213l52700n0782
34313f13209K06556P2539l42023m66955o0626L82863L34723o131p8214J76545
34303c93932L26406J97866O7912J10357J60431J11960Q2604P0206j00173l47907
34293B85730l27217k8639J00782j19117k66288k5328K76747K51192P8349P3156
34283B99367P5864j60513l83064k65483o3176j68950l43586j37656K04999J12193
$$ plain form
34353 841627 763535 575922 320259 8630 -381387 -675728 -588588 -161555 187233 183519
34343 183519 -8979 -106396 -10851 281982 712015 960432 639691 -93936 -511352 -197771
34333 -197771 385303 579359 425643 416139 612636 598203 234563 -106190 -156641 -109855
34323 -109855 -174323 -180566 99853 524399 743190 614522 244486 -209727 -562427 -613209
34313 -613209 -406653 -334114 -676137 -1143092 -1203718 -820855 -486132 -492263 -570477 -393932
34303 -393932 -67526 130340 198252 308609 469040 581000 663604 733810 633637 285730
34293 285730 -41487 -70126 30656 -88461 -354749 -380077 -103330 147862 226211 299367
34283 299367 375231 214718 -168346 -433829 -497005 -665955 -1009541 -1147197 -942198 -830005
34273h30005k40965j46674M03638O54625L31353J1531O3812J19709r5561k46621
34263B4842q3074Q8465J4472q9259o4342p3837m9562L47154Q76358P23460j61202
34252A553475o64733j32922N21475K20301n74335o53645J7898L95091P9545k49791
34242E12359j29393M1646j32285l79175k95251L3923K53296K18127N8437k1506
34232A60178N1088J08170l5737j97012k1764L14926J95087l74366n27166R8960
34222b27636N74717O8789p32203o66813N3406L20058L2007P7537N70292O29258
34212F99412O5101j96593K29669M86161P57n29551m04305n8932j16460k80998
34202a05739q8521R2441j88556m20884P1266P97358O90745k37865r01488p17561
$$ plain form
34273 -830005 -1070970 -1217644 -814006 -159381 171972 183503 247315 367024 271463 24842
34263 24842 -58232 30233 44705 -44554 -108896 -182733 -232295 114859 991217 1714677 1553475
34252 1553475 888742 755820 1277295 1497596 923261 269616 287514 682605 762150 512359
34242 512359 382966 424612 292327 -86848 -382099 -348176 -94880 123247 181684 160178
34232 160178 211266 319436 283699 86687 64923 379849 574936 200570 -326596 -227636
34222 -227636 347081 415870 -316333 -983146 -929740 -609682 -577675 -500138 70154 699412
34212 699412 764513 567920 797589 1283750 1284507 754956 350651 291719 175259 -105739
34202 -105739 -194260 -101819 -290375 -711259 -639993 157365 848110 610245 -291243 -1008804
34192a008804k22358j6786M6215L30159O82615O36271R0655m81977n14412l023
34182d61445M03484J87356k70009j75454M20088N64871j33300p87217n30181J85446
34172e96361L78577O4628L7785M62188O84190L67945q6497l08647l61175l03362
34162C39271p0872J14790r5585m98118m87682l1703J90735j60275n51803m04559
34152a655801J07527M33931L81796J52145j0545L6235K35411K56429j26354n41735
34142g30961l90646K31028N67489L04409j9115M6098J90328K2523k18933j60807
34132a58587J8205l4208j91473j38869K4979K4487n1476K4529J16944k7421k65275
34121f58165k83626j20623J692J13923L00986L51513J12042r9437K9073K23518
$$ plain form
34192 -1008804 -1231162 -1247948 -1201733 -871574 -188959 447312 537967 55990 -458422 -461445
34182 -461445 -57961 129395 -140614 -316068 104020 668891 535591 -251626 -781807 -596361
34172 -596361 -217784 -153156 -115371 346817 1031007 1398952 1312455 1003808 642633 339271
34162 339271 268399 383189 287604 -210514 -698196 -729899 -539164 -699439 -1251242 -1655801
34152 -1655801 -1548274 -1114343 -732547 -580402 -590947 -554712 -319301 -62872 -189226 -730961
34142 -730961 -1121607 -890579 -323090 -18681 -37796 8302 198630 221153 2220 -158587
34132 -158587 -140382 -174590 -366063 -504932 -479953 -455466 -506942 -482413 -365469 -392890 -658165
34121 -658165 -941791 -1062414 -1060722 -946799 -645813 -294300 -182258 -281695 -252622 -29104
34111b9104J03870j00763M663J71322n2764l69009j53101L52298L05887l03715
34101g0416n71053j31710L56795M18098L78868M55355K85961j65410k88668K2998
34091F90818l9505p49785j053918j96658Q20790O30039l64811o08937K27444Q92710
34081B48187N34917k18882l97983P5451O02994O61792J07491p27281j134421p22724
34071i70459J1500L02122J44524R5624K50549K06555n7264j18562O3553R0727
34061A8869p6131r3013k2171k29040m53126l9529P41001P79049j01790o79329
34051a55210k38067K68145j55729q36101n33032N10034R35590L12635m27586m92236
34041h11557q8557K78360M61269M41316J50875k49385m08544k49136l7639K8967
$$ plain form
34111 -29104 74766 -25997 -21334 149988 97224 -271785 -424886 -72588 233299 -70416
34101 -70416 -641469 -773179 -416384 1714 380582 835937 1121898 956488 667820 690818
34091 690818 651313 -98472 -1152390 -1349048 -528258 101781 -263030 -871967 -644523 248187
34081 248187 783104 564222 166239 241690 844684 1506476 1613967 886686 -247735 -970459
34071 -970459 -958959 -656837 -512313 -416689 -166140 40415 -16849 -135411 -71858 18869
34061 18869 -57262 -150275 -172446 -401486 -854612 -894141 -153140 625909 524119 -155210
34051 -155210 -393277 -125132 -280861 -1116962 -1649994 -1139960 -204370 108265 -319321 -811557
34041 -811557 -900114 -621754 -160485 280831 431706 182321 -226223 -475359 -512998 -484031
34031d84031j5732r2895j06836P9206L82269M33636J24530q7923J28256L31091
34021F91571m9464p04047q05504k32042L09651L53587J57892P0037P9284J25901
34011c134K60645L46529J29200k56597l38432J0208L82865M20230J52405k42216
34001H61703n39889l85020K96055Q17264L94788o28896j021438l39026M66358
33992g8101M90057P6550j2359J28944p0744n14324n75910j69233J40008N8497
33982e26615q1862L7374K88619M26047M12603K97053J01766p5401j28390j60177
$$ plain form
34031 -484031 -499763 -592658 -699494 -620288 -238019 195617 320147 232224 360480 691571
34021 691571 642107 -61940 -867444 -1099486 -789835 -436248 -278356 -208319 -129035 -3134
34011 -3134 257511 604040 733240 476643 138211 148419 531284 951514 1103919 861703
34001 861703 321814 -63206 232849 1050113 1444901 816005 -205433 -544459 -78101
33992 -78101 411956 488506 476147 605091 534347 20023 -555887 -725120 -585112 -526615
33982 -526615 -608477 -571103 -282484 143563 556166 853219 954985 879584 751194 591017
$$ [...]
##END NTUPLES=NMR SPECTRUM
##END=
