##TITLE=31Pdec_52-2021
 DMSO-d6, 124 sc
 6.07.2021
##JCAMPDX= 6.0         $$ Bruker NMR JCAMP-DX V2.0
##DATA TYPE= NMR SPECTRUM
##DATA CLASS= NTUPLES
##ORIGIN= UXNMR, Bruker Analytische Messtechnik GmbH
##OWNER= root
$$ XWIN-NMR		Version 3.5
$$ Tue Jul  6 10:30:18 2021 Russian Standard Time (UT+4h)  she@DPX200
##.OBSERVE FREQUENCY= 81.013821
##.OBSERVE NUCLEUS= ^31P
##.ACQUISITION MODE= SIMULTANEOUS
##.ACQUISITION SCHEME= undefined
##.AVERAGES= 124
##.DIGITISER RES= 16
##SPECTROMETER/DATA SYSTEM= spect
##.PULSE SEQUENCE= zgpg30
##.SOLVENT NAME= DMSO
##.SHIFT REFERENCE= (INTERNAL, DMSO, 0, 248.564)
##AUDIT TRAIL= $$ (NUMBER, WHEN, WHO, WHERE, WHAT)
$$ ##TITLE= Audit trail, XWIN-NMR		Version 3.5
$$ ##JCAMPDX= 5.01
$$ ##ORIGIN= Bruker BioSpin GmbH
$$ ##OWNER= she
$$ F:/spectra/data/she/nmr/P31/1/pdata/1/auditp.txt
$$ ##AUDIT TRAIL=  $$ (NUMBER, WHEN, WHO, WHERE, WHAT)
(   1,<2021-07-06 10:28:53.54 +0400>,<she>,<DPX200>,
      <continue with go, POWCHK disabled, PULCHK disabled
       configuration hash MD5:
       00 E9 B6 7A A2 85 ED C7 34 08 36 98 17 FE 4E 26
       data hash MD5: 32K
       83 8F 9E 2E 63 BE 15 0D B7 AD 4F 97 35 73 E5 B6>)
(   2,<2021-07-06 10:29:20.37 +0400>,<she>,<DPX200>,
      <Start of raw data processing
       efp BC_mod = 2 LB = 1 FT_mod = 6 PKNL = 1 PHC0 = -6975.511 PHC1 = -751.114 SI = 64K 
       data hash MD5: 64K
       ED 68 16 29 F2 D5 86 40 34 08 69 12 7E AF A8 23>)
(   3,<2021-07-06 10:29:37.54 +0400>,<she>,<DPX200>,
      <pk PHC0 = -52.49126 PHC1 = 0.7999997 
       data hash MD5: 64K
       46 AB 6C 0A DB 5C 60 C0 C9 49 AA BD AD 57 DB FB>)
(   4,<2021-07-06 10:29:40.82 +0400>,<she>,<DPX200>,
      <abs ABSG = 5 
       data hash MD5: 64K
       CB DA E5 EC BF D7 A3 EE 03 DC CA 28 C2 D7 7F 19>)
$$ ##END=
$$ 
$$ hash MD5
$$ 2F BB BB F6 2D 68 23 06 A8 C2 D8 7E 38 29 88 B8
##$RELAX= 
##$RELAX= 
##$RELAX= 
##$RELAX= 
##$RELAX= 
##$RELAX= 
##$RELAX= 
##$RELAX= 
$$ Bruker specific parameters
$$ --------------------------
##$DU= <F:/spectra>
##$EXPNO= 1
##$NAME= <P31>
##$PROCNO= 1
##$TYPE= <nmr>
##$USER= <she>
##$AMP= (0..31)
100 100 100 100 100 100 100 100 100 100 100 100 100 100 100 100 100 100 
100 100 100 100 100 100 100 100 100 100 100 100 100 100 
##$AQSEQ= 0
##$AQ_mod= 1
##$AUNM= <au_zg>
##$AUTOPOS= <>
##$BF1= 81.014009
##$BF2= 200.13
##$BF3= 200.13
##$BF4= 200.13
##$BF5= 200.13
##$BF6= 200.13
##$BF7= 200.13
##$BF8= 200.13
##$BYTORDA= 1
##$CFDGTYP= 0
##$CFRGTYP= 5
##$CHEMSTR= <none>
##$CNST= (0..31)
1 1 145 1 1 1 1 1 1 1 1 1 1 1 1 1 1 1 1 1 1 1 1 1 1 1 1 1 1 1 1 1 
##$CPDPRG= <waltz16>
##$CPDPRG1= <>
##$CPDPRG2= <waltz16>
##$CPDPRG3= <>
##$CPDPRG4= <mlev>
##$CPDPRG5= <mlev>
##$CPDPRG6= <mlev>
##$CPDPRG7= <mlev>
##$CPDPRG8= <mlev>
##$CPDPRGB= <>
##$CPDPRGT= <>
##$D= (0..31)
0 1 0 0 0 0 0 0 0 0 0 0.03 2e-05 3e-06 0 0 0 0 0 0 0 0 0 0 0 0 0 0 0 0 
0 0 
##$DATE= 1625552766
##$DBL= (0..7)
120 120 120 11 120 120 24 19 
##$DBP= (0..7)
150 150 150 150 150 150 150 150 
##$DBP07= 0
##$DBPNAM0= <>
##$DBPNAM1= <>
$$ [...]
##$SUBNAM3= <"">
##$SUBNAM4= <"">
##$SUBNAM5= <"">
##$SUBNAM6= <"">
##$SUBNAM7= <"">
##$SUBNAM8= <"">
##$SUBNAM9= <"">
##$SW= 501.771253377433
##$SWIBOX= (0..15)
0 1 3 0 0 0 0 0 0 0 0 0 0 0 0 0 
##$SW_h= 40650.406504065
##$TD= 32768
##$TD0= 1
##$TE= 0
##$TE2= 300
##$TE3= 300
##$TEG= 300
##$TL= (0..7)
0 120 53 12 22 120 120 120 
##$TP= (0..7)
150 150 150 150 150 150 150 150 
##$TP07= 0
##$TPNAME0= <>
##$TPNAME1= <>
##$TPNAME2= <>
##$TPNAME3= <>
##$TPNAME4= <>
##$TPNAME5= <>
##$TPNAME6= <>
##$TPNAME7= <>
##$TPOAL= (0..7)
0.5 0.5 0.5 0.5 0.5 0.5 0.5 0.5 
##$TPOFFS= (0..7)
0 0 0 0 0 0 0 0 
##$TUNHIN= 0
##$TUNHOUT= 0
##$TUNXOUT= 0
##$USERA1= <user>
##$USERA2= <user>
##$USERA3= <user>
##$USERA4= <user>
##$USERA5= <user>
##$V9= 5
##$VALIST= <valist>
##$VCLIST= <CCCCCCCCCCCCCCC>
##$VD= 0
##$VDLIST= <DDDDDDDDDDDDDDD>
##$VPLIST= <PPPPPPPPPPPPPPP>
##$VTLIST= <TTTTTTTTTTTTTTT>
##$WBST= 1024
##$WBSW= 4
##$XGAIN= (0..3)
0 0 0 0 
##$XL= 0
##$YL= 0
##$YMAX_a= 9086
##$YMIN_a= -2200
##$ZGOPTNS= <>
##$ZL1= 120
##$ZL2= 120
##$ZL3= 120
##$ZL4= 120
##$ABSF1= 248.5645
##$ABSF2= -253.2056
##$ABSG= 5
##$ABSL= 3
##$ALPHA= 0
##$AQORDER= 0
##$ASSFAC= 0
##$ASSFACI= 0
##$ASSFACX= 0
##$ASSWID= 0
##$AUNMP= <proc_1d>
##$AZFE= 0.1
##$AZFW= 0.5
##$BCFW= 0
##$BC_mod= 2
##$BYTORDP= 0
##$COROFFS= 0
##$CY= -3
##$DATMOD= 1
##$DC= 0
##$DFILT= <>
##$DTYPP= 0
##$F1P= 0
##$F2P= 0
##$FCOR= 1
##$FTSIZE= 65536
##$FT_mod= 6
##$GAMMA= 0
##$GB= 0
##$INTBC= 1
##$INTSCL= 5.30512e-09
##$ISEN= 30
##$LB= 1
##$LEV0= 0
##$LPBIN= 0
##$MAXI= 10000
##$MC2= 0
##$MEAN= 0
##$ME_mod= 0
##$MI= 50
##$NCOEF= 0
##$NC_proc= -8
##$NLEV= 6
##$NOISF1= 182.463
##$NOISF2= 159.3651
##$NSP= 0
##$NTH_PI= 0
##$NZP= 0
##$OFFSET= 248.5645
##$PC= 4
##$PHC0= -7028.002
##$PHC1= -750.314
##$PH_mod= 1
##$PKNL= yes
##$PPARMOD= 0
##$PSCAL= 0
##$PSIGN= 0
##$REVERSE= no
##$SF= 81.014009
##$SI= 65536
##$SIGF1= 159.3651
##$SIGF2= -187.1042
##$SINO= 113.3802
##$SIOLD= 16384
##$SREGLST= <1H.CDCl3>
##$SSB= 0
##$STSI= 65536
##$STSR= 0
##$SW_p= 40650.406504065
##$SYMM= 0
##$S_DEV= 0
##$TDeff= 32768
##$TDoff= 0
##$TI= <>
##$TILT= no
##$TM1= 0
##$TM2= 0
##$TOPLEV= 0
##$USERP1= <user>
##$USERP2= <user>
##$USERP3= <user>
##$USERP4= <user>
##$USERP5= <user>
##$WDW= 1
##$XDIM= 65536
##$YMAX_p= 331544124
##$YMIN_p= -48907043
$$ End of Bruker specific parameters
$$ ---------------------------------
##NTUPLES= NMR SPECTRUM
##VAR_NAME=  FREQUENCY,     SPECTRUM/REAL,   SPECTRUM/IMAG
##SYMBOL=    X,             R,               I
##VAR_TYPE=  INDEPENDENT,   DEPENDENT,       DEPENDENT
##VAR_FORM=  AFFN,          ASDF,            ASDF
##VAR_DIM=   65536,         65536,           65536
##UNITS=     HZ,            ARBITRARY UNITS, ARBITRARY UNITS
##FACTOR=    0.620285442955139, 1,           1
##FIRST=     20137.2065510759, 0,            0
##LAST=      -20513.1999529892, 0,           0
##MIN=       -20513.1999529892, -48907043,   0
##MAX=       20137.2065510759, 331544124,    0
$$ Real data points
##PAGE= N=1
##DATA TABLE= (X++(R..R)), XYDATA
$$ [...]
##PAGE= N=2
##DATA TABLE= (X++(I..I)), XYDATA
14933 13757376 18340431 20282129 19983911 17252135 13613706 12038561 12613011 12090588
14925 12090588 8568514 3401770 -910870 -1478812 3579782 9788937 6954009 -7222301
14917 -7222301 -18861497 -13733043 2257839 11108482 8966356 9014240 17361552 22885664
14909 22885664 16332722 4145147 -4682302 -12079045 -21677476 -27608259 -23344988 -13222210
14901 -13222210 -5306521 -50941 5454879 9756911 12230025 17783432 26864144 29050592
14893 29050592 17623656 2976442 -999512 2290084 -1165983 -12545990 -18341368 -11328933
14885 -11328933 444973 7578582 10127616 10822308 7714146 -758475 -10000004 -13869150
14877 -13869150 -11524524 -6530395 -1947709 1490743 4201613 6042458 5303335 472240
14869 472240 -6184649 -9631390 -8712199 -8511164 -13223461 -20066924 -23498033 -21859370 -16437693
14860 -16437693 -8220954 79448 3103242 -735478 -5144112 -3136810 4452249 11234084
14852 11234084 12291023 6087072 -4985845 -12643285 -8760268 1996359 4441549 -6158510
14844 -6158510 -16013880 -14242546 -9758012 -13271162 -14851822 648382 23626674 28879850
14836 28879850 13346650 927122 5843595 14108630 10252818 1711676 2751657 9864117
14828 9864117 9431707 326871 -6055079 -3021477 5758100 13749542 15698014 8587570
14820 8587570 -3892942 -12493455 -14198346 -16361248 -22656353 -23865610 -12403392 2368935
14812 2368935 6097590 1038637 1837564 12520997 21720595 21142036 15970250 13918206
14804 13918206 14118116 11052274 2651995 -8396776 -16388610 -15245495 -5218146 3657680
14796 3657680 1805828 -6688196 -9038332 -1823962 4986300 3455081 -2236585 -4249731
14788 -4249731 -1113701 4829888 12531333 20184425 24298944 24828480 25402941 25569335 20148078
14779 20148078 9936218 4470676 8412438 13324611 10113486 2148039 -2159211 -2781348
14771 -2781348 -4599679 -6674525 -5709242 -5369670 -10644083 -16548592 -14589138 -7872823
14763 -7872823 -6763100 -10809025 -9114301 488941 6967263 3600196 -3697167 -9139047
14755 -9139047 -14004460 -16016098 -7159214 10059974 18983882 11622487 1388050 1556606
14747 1556606 5115133 633999 -5285187 -124392 10245673 10186051 418664 -5728185
14739 -5728185 -7098604 -12725209 -18041173 -9062253 7830950 7472892 -15080870 -32793415
14731 -32793415 -25834688 -8753557 -2897426 -3928232 2473005 10660219 5561411 -8334935
14723 -8334935 -13398480 -7960577 -5766022 -9762501 -9078880 -2026303 -642123 -9122525
14715 -9122525 -16646408 -16524308 -15707505 -19396038 -21369651 -16620459 -10542084 -8438079
14707 -8438079 -7360971 -4959687 -5246308 -8706248 -7779043 -5501 5060808 1272795
14699 1272795 -1740387 7127002 21385181 24603767 12880452 -1955551 -9530970 -10711130
14691 -10711130 -10491296 -10619169 -11051466 -11767466 -11125391 -7412733 -3136790 -3096483 -7062958
14682 -7062958 -8867665 -4690953 1244939 1737288 -4570928 -11593655 -12384871 -5984255
14674 -5984255 2157591 5614166 2437082 -3935007 -7587640 -3942100 6664098 17416164
14666 17416164 19451539 10848817 -271101 -4353445 -191322 6876213 13217036 17949048
14658 17949048 18422609 12208672 3257149 -1277447 -869929 -941200 -1866497 2299014 11807231
14649 11807231 17868183 16225796 14485898 18639905 21268462 13496152 1908288 509971
14641 509971 8557888 10310034 -1194192 -12839614 -10218703 1754870 6382767 -1295174
14633 -1295174 -8579310 -3115620 11469111 22008115 22580159 18697259 16687521 15998299
14625 15998299 13885731 11702249 12049573 13565349 13485917 12345610 10807055 5131428
14617 5131428 -6965375 -18328316 -19336917 -12472701 -9907128 -15079852 -17769847 -11820387
14609 -11820387 -6352974 -11063363 -19604900 -18693847 -8233271 -759958 -2914653 -7979037
14601 -7979037 -7356522 -1176344 4149813 3299642 -3726512 -10591634 -9112136 598009
14593 598009 7048635 763889 -11732782 -15388722 -6816374 2319907 2936271 -267042
14585 -267042 1067804 6213730 8858992 7561769 6030473 6150598 6828959 8426590 12918632
14576 12918632 19050879 21249999 15574793 5605388 371887 5250281 15564192 21369573
14568 21369573 18886468 14022479 13048655 14115706 12049261 7619207 5527203 5024441
14560 5024441 53559 -10479179 -19183978 -19282284 -12502309 -5897205 -4676232 -9433706
14552 -9433706 -16367578 -18960580 -13322736 -2775107 6395518 12852432 18412263 19839535
14544 19839535 11475952 -2553368 -8991448 -3019685 4196330 2194140 -3473553 -1881212
14536 -1881212 4764344 5314694 -1538167 -5401210 -774702 6011109 8288191 7417118
14528 7417118 6521559 4597492 962950 -1657430 -2627523 -5430951 -10061945 -10064223 -2452263
14519 -2452263 5500555 5934239 2111386 3171876 10372701 16198210 15813511 12069054
14511 12069054 8750545 5179452 -764278 -8695143 -16424580 -21658277 -22582873 -19712846
14503 -19712846 -16888361 -17029021 -17432780 -13417858 -6257991 -2454779 -4471039 -7394366
14495 -7394366 -6493266 -3268465 -1664225 -2505169 -4160250 -4850218 -2182398 5057225 12092272
14486 12092272 10553098 -181120 -9216189 -7231967 1144767 4642201 1173984 -1742725
14478 -1742725 -81102 2533697 3923252 7219258 12870494 14883425 9484349 1397150
14470 1397150 -3075024 -3999631 -4290269 -3485718 -756179 398381 -2592300 -4549062 1132067
14461 1132067 10683039 13031980 5721269 -656280 2342578 8732473 7479846 -757469
14453 -757469 -4681312 1152043 9414973 11618684 9103733 7573541 6556151 1926203
14445 1926203 -3888466 -3293916 3815559 7198366 106166 -10775085 -15046677 -12972410
14437 -12972410 -12593066 -15640014 -15122316 -7062024 3167634 8353735 7490502 4269957
14429 4269957 2622485 5505056 12718145 17804452 13171124 1790979 -2321361 9058757
14421 9058757 25565075 29094079 15316843 -2213695 -9045728 -4905452 -420634 -3531227
14413 -3531227 -12380642 -19957468 -22554785 -22018479 -20542077 -16978185 -11400635 -10023572
14405 -10023572 -18473943 -30214657 -30514690 -15901845 -1386372 -1305211 -9952036 -11065727
14397 -11065727 -1822048 5018531 2078385 -2690002 -864196 3133700 1180357 -4213424
14389 -4213424 -4306489 1254823 3933866 -54624 -3978460 -753897 7189786 11941038
14381 11941038 10390006 6475334 4847639 6205629 8947928 11930254 13900154 12711615
14373 12711615 7994872 3535352 3696292 7358091 8839201 5910542 3208242 5239305
14365 5239305 9431576 10075654 6803371 4293551 4639246 5403651 5696935 8607702 15020008
14356 15020008 19371890 15744101 6363192 290086 3603960 13132180 20315912 19875385
14348 19875385 13876722 7821225 4209157 1530386 -890684 -436986 4160545 8455647
14340 8455647 6729907 31866 -4286564 -1218066 7301990 16328992 22026686 21410235
14332 21410235 13472914 3007292 -1511077 2645670 8914068 10637369 9518509 10378074
14324 10378074 11851848 9173133 3886789 2910315 7650854 11436063 9977639 8028023
14316 8028023 11888885 20010304 25424586 24523553 19302905 12915774 7064370 3130987
14308 3130987 2602130 5650185 10066506 11326888 4886544 -8117705 -17587732 -12721630
14300 -12721630 3649218 14780817 9022051 -6022960 -14684427 -13396379 -10459251 -9335220
14292 -9335220 -4773219 3517595 6373241 45375 -4925566 1978624 15261221 20502973
14284 20502973 12745926 -371217 -10328835 -14630061 -14333178 -12078753 -11317110 -11831079
14276 -11831079 -8479067 -2855 5080021 -705733 -10665825 -11289234 -827175 9520139
14268 9520139 12030181 9408745 5319841 -240404 -3907538 959412 12669684 19887784
14260 19887784 16944313 11135618 9921045 10797010 9771943 9428075 10699244 6696993
14252 6696993 -5216384 -13615142 -6727018 9943703 20618047 18968527 10499592 503560
14244 503560 -8631689 -12138723 -7238102 -279545 1919613 4324473 14010288 21951589
14236 21951589 11980575 -11574819 -24310814 -15490387 -3197788 -5586531 -13423721 -6900391
14228 -6900391 11650235 20939128 12581500 1499636 2268275 10038836 11598489 5055237
14220 5055237 -315729 1259408 5892314 7558184 5539868 3042310 2355876 3723100
14212 3723100 6964126 11627092 15891728 17260504 14722651 9471010 4172461 2619016
14204 2619016 7876983 17077177 19670400 7301514 -13270621 -23876197 -15272581 2097041
14196 2097041 12207974 11923829 8752395 6486650 3133873 -66432 1452386 6671044
14188 6671044 9478989 8888451 9900167 13102322 12648753 6894554 2076120 2042529 2665512
14179 2665512 430288 -1388323 115665 1397072 -1167433 -5010923 -6510723 -6623817
14171 -6623817 -6669931 -4369703 1004357 5295780 6128898 6853086 8840069 6679938 -2605025
14162 -2605025 -12003423 -13442238 -8833727 -5269067 -4870188 -6563883 -11377815 -17241345
14154 -17241345 -15036127 -401501 15879600 20624781 16493212 15069373 16741547 13069192
14146 13069192 6402322 8588392 18316224 18790677 4528364 -7126118 -1579767 11107019
14138 11107019 13114554 5252907 735378 1498544 -1448074 -7952921 -6737469 5312540
14130 5312540 16561947 16976050 9636893 2366217 -1772690 -1598764 4540726 12854516
14122 12854516 14622666 8737156 5808200 12958566 22113191 21826529 14149657 9445987
14114 9445987 9217345 6210431 -126973 -1272014 5148322 9513960 4718090 -3095687
14106 -3095687 -5129349 -3515305 -5841681 -11339770 -12007611 -5608557 1005859 1985020
14098 1985020 -780858 -2262259 -529387 2978188 5582028 4866187 1064004 -2147957
14090 -2147957 -2232311 -1959712 -5052696 -9475978 -10670969 -10008149 -12622184 -17009844 -15738356
14081 -15738356 -8554928 -4954013 -8708125 -9588043 974570 13859299 13410234 221828
14073 221828 -9944280 -9142056 -6223057 -10111974 -16069308 -14921755 -6866120 1565499
14065 1565499 7352065 9607397 4351567 -9314620 -21428235 -20595259 -10343585 -5195105
14057 -5195105 -9671443 -13009512 -8215878 -3595282 -7061752 -9982400 659790 20429235
14049 20429235 31630378 26774131 14587250 3515780 -6397049 -13304082 -10539498 -25454
14041 -25454 4886608 -1211496 -5463007 3595259 17052482 19720580 14214487 14797220
14033 14797220 22853415 26242618 21196760 16763037 15922778 10294932 -1244456 -5749766
14025 -5749766 3245515 13010471 10490452 1661321 -770790 1129874 -3367313 -12301631
14017 -12301631 -12390605 -896074 8635872 5533968 -4346044 -8630916 -3939953 3268883
14009 3268883 5491812 -472907 -12659488 -24350820 -27945872 -21575970 -10646411 -1596185
14001 -1596185 3758136 6547553 6475900 2068243 -5729860 -13111243 -17349405 -19415479
13993 -19415479 -21224646 -21672098 -18227004 -12072587 -7387849 -4230181 2297510 12076338
13985 12076338 15809295 8434692 839275 6487647 19537434 21216088 8799450 981836
13977 981836 8102466 14710806 4660018 -11293077 -11403350 2685399 8476428 -3087020
13969 -3087020 -16338338 -16614177 -8938880 -4239268 -2188387 2476475 7905250 10305136
13961 10305136 13384699 21678570 29117096 24758547 8353197 -8466237 -16490411 -17226297
13953 -17226297 -16019567 -13701352 -8618082 -2813006 -1207299 -4855075 -8547294 -6948604
13945 -6948604 -1373342 2045530 245996 -3740453 -5712099 -4550665 -723402 4954087
13937 4954087 9099684 7436897 1874319 167636 3813050 2943011 -8958413 -21200483
13929 -21200483 -17784804 -294915 13212502 12208550 4534807 990586 987398 -1277179
13921 -1277179 -6295744 -11372505 -15528875 -16337765 -9183003 4139116 13158994 11794930
13913 11794930 6922964 6754507 7868242 2909612 -5289682 -8666546 -8816516 -14398542
13905 -14398542 -24975774 -29912820 -24683585 -16754488 -12215673 -7509690 387466 5367140
13897 5367140 1328544 -6990519 -10280331 -7215202 -3552978 -2455157 -3004232 -5437188
13889 -5437188 -10108863 -12932671 -9708385 -4389010 -5087428 -11504435 -14700359 -10981115
13881 -10981115 -6979710 -7228132 -5954103 2014101 10076750 8840081 961304 -3125220
13873 -3125220 -981483 1241580 2393872 8278596 18335466 22219849 14474749 2984596
13865 2984596 -2726687 -2921890 -1401714 3007119 10328408 12815965 5161108 -4063843
13857 -4063843 -2565466 7260724 11743748 6549483 1948337 6109824 14355539 18899446
13849 18899446 19638406 19375045 15660938 4967946 -8384183 -14244612 -7947070 3636087
13841 3636087 8590910 2501082 -6026951 -4832679 5970977 12596328 5979512 -4371228
13833 -4371228 -3137630 8475267 14682672 8608796 899174 1552831 5541595 3588145
13825 3588145 -2905188 -7165580 -9849747 -15535620 -20531333 -15791107 -2160434 6945308
13817 6945308 1269039 -13807174 -23718245 -20148771 -7635258 2771394 4060460 -1740743
13809 -1740743 -7524691 -8995919 -7514783 -5419236 -1547651 6043875 14421887 16538304
13801 16538304 9204890 -1237459 -3750768 5616555 18091994 20968385 11877996 618026
13793 618026 -4164230 -4730231 -7081535 -9821141 -7527696 -1966908 -992378 -6555903 -12183390
13784 -12183390 -13506998 -13286200 -13690628 -11462376 -4892647 569302 -1390165 -9563587
13776 -9563587 -16300383 -14421018 -2537140 12479362 18969903 12438623 3169481 3857373
13768 3857373 10461372 6815463 -9977294 -22624479 -18320427 -6919875 -4409647 -9838238
13760 -9838238 -11834301 -9216178 -9513967 -11711514 -6631790 5600895 12448685 5832557
13752 5832557 -8571732 -21279924 -28769719 -30747137 -26585208 -18532466 -12094888 -9833131
13744 -9833131 -9338089 -8695875 -8763571 -9091396 -7333158 -4133650 -3257346 -5434915 -7060839
13735 -7060839 -6248655 -5411525 -6647285 -8819548 -9908905 -8543549 -3906659 1624975
13727 1624975 1921921 -4745684 -9664717 -4316465 4843341 3339557 -9201589 -16842208
13719 -16842208 -11220198 -4293430 -8905593 -18308692 -17429057 -6791996 -720380 -4623443
13711 -4623443 -8527752 -4826176 213352 -2162624 -9935302 -15553023 -17767940 -19943855
13703 -19943855 -20296729 -13190772 -484767 6984834 3299996 -3181299 -459214 10548985
13695 10548985 17510181 14113112 7937066 8262769 13358287 15363380 12352955 8404238
13687 8404238 5105825 1008592 -1967513 86547 4963695 5670640 1379520 -1002252
13679 -1002252 1152906 1327307 -3879050 -6010525 3294296 17351948 21635428 13527262
13671 13527262 4553302 2639199 2481279 -2940793 -10549619 -13654985 -13808908 -17411703
13663 -17411703 -23334686 -23203201 -14849786 -7267051 -8349388 -13677315 -12895895 -3690109
13655 -3690109 6381730 10329928 8373607 4391926 1066404 -375214 -69391 -761515
13647 -761515 -5184489 -10497826 -9629070 -1042967 6626130 3898591 -7592133 -16399068
13639 -16399068 -13701583 -1329914 12023800 19391203 19695692 15712712 10112385 4431170
13631 4431170 1132090 3440829 10463609 14865440 10031603 -1222125 -9822054 -11641123
13623 -11641123 -9910709 -7188830 -2772790 794793 -2295479 -10992594 -15669734 -11237854
13615 -11237854 -3829587 487219 4014819 7781477 4836505 -6260134 -11983988 -2499825
13607 -2499825 8600004 1137975 -19694770 -28265967 -15597283 -1373560 -3817442 -15923503
13599 -15923503 -20786663 -15599445 -9036282 -5743466 -4915750 -6630510 -9540307 -8239530
13591 -8239530 -1215903 4485459 3795688 1989593 4797082 7534684 3406261 -3928681
13583 -3928681 -6484085 -5225827 -6073367 -6973585 -1512410 6358361 4159717 -10670162
13575 -10670162 -24713824 -24581944 -11635090 2083949 6498268 -90735 -11479591 -17962386
13567 -17962386 -14645220 -7022623 -4536563 -8368533 -10553031 -5858800 1038907 2455645
13559 2455645 -2488290 -7429526 -5540386 4476829 16867081 23088970 20097305 13714854
13551 13714854 10819297 10070717 5363857 -2986308 -7460131 -4376340 1415523 5250856
13543 5250856 9142550 15350464 19479618 16220880 8510851 4583506 7226666 11537103
13535 11537103 13137548 13475345 15693231 19167958 20400418 17360742 11416074 6269333
13527 6269333 5733745 10618081 16425330 16112168 7739418 -1515424 -2201731 6018358 13135899
13518 13135899 11051349 4136346 3483861 11787525 19164144 15643074 3429399 -6818377
13510 -6818377 -9276417 -8083371 -9787392 -14933198 -18629015 -16878057 -10487014 -4105845
13502 -4105845 -2921935 -8880957 -17800245 -20877425 -12496220 2086868 10036071 5129039
13494 5129039 -3669627 -2579428 9326054 19394337 19031588 13807310 11812849 10419066
13486 10419066 2961922 -7489680 -11769784 -8880800 -5452883 -2599238 4235352 12011209
13478 12011209 10773239 1277663 -2333826 5524294 11025514 2371924 -10488345 -11694329
13470 -11694329 -5151982 -6972703 -17737437 -21525909 -12637781 -4725708 -8284459 -15021358
13462 -15021358 -13273440 -6501043 -5422340 -9951465 -10646440 -4226589 2891374 5843770
13454 5843770 7482523 11577606 15883934 15205513 8702719 1405260 -1267271 937371
13446 937371 3856624 4616559 4393908 4592563 3416210 -402839 -2809699 1561696 10978784
13437 10978784 17284469 15994037 11414889 9998995 12032787 12200836 6856469 -447366
13429 -447366 -788506 10542455 25002353 26181019 9148287 -10271952 -13413356 -2341517
13421 -2341517 4880654 530639 -4553312 -929389 5925340 8612927 10730084 16259582
13413 16259582 17341672 6347655 -7621247 -9535679 -1257062 2312610 -1937604 -1620656
13405 -1620656 7550769 11812920 974602 -14231980 -17963862 -12390349 -11820422 -19650370
13397 -19650370 -24834008 -19634377 -8569953 1337947 8380107 11294112 6317835 -5435362
13389 -5435362 -14567827 -13495721 -5677199 217767 1347612 816525 644232 862981 3045608
13380 3045608 8051042 11540834 8448133 1664681 -271799 5461468 13456918 19414663
13372 19414663 24231481 26866329 22044275 9981939 479462 421578 3598187 816654
13364 816654 -5471149 -6054366 -309030 4123034 4984255 7299971 11401634 10632501 3707851
13355 3707851 -1404209 -451787 63909 -5137147 -9864047 -5972710 3538458 9352751
13347 9352751 9066332 7448082 6904768 5621571 2977118 -454894 -6442591 -15526716
13339 -15526716 -21524506 -17163480 -4756929 5824487 9811193 11324796 14619006 19307846
13331 19307846 25395140 34599495 43401042 42700418 29975614 15867544 12162552 17238460
13323 17238460 20192905 16567221 12014630 10601610 7892064 -486207 -9384068 -9801881
13315 -9801881 -2105956 3172536 -575698 -6596359 -3689726 8814587 20801075 24731239
13307 24731239 22258141 16469202 5662314 -9996238 -22093031 -22408727 -14724148 -9888290
13299 -9888290 -10214107 -7456730 2766646 13453807 16810921 14907559 14142824 14500400
13291 14500400 11145747 4067551 -493080 1674286 7512014 10660409 8246503 3131711
13283 3131711 329026 940779 39235 -7113368 -16726362 -18380926 -7173793 9673676
13275 9673676 20892625 22490782 18348787 13378812 9895973 7678470 3847129 -4332371
13267 -4332371 -13248251 -14035996 -4564935 4844816 4503616 -689807 690598 8478018
13259 8478018 12269432 9417953 8543062 12956524 13735401 5144816 -4317324 -4420276 1980692
13250 1980692 5326388 3398313 -224343 -5780644 -15183948 -23951130 -25070481 -19052575
13242 -19052575 -12085355 -6662364 -2104066 -1238836 -6822386 -13107072 -11157042 -2119762
13234 -2119762 4484628 5281573 5407093 6206452 2428558 -5749115 -9367313 -3706359 5375120
13225 5375120 12266150 18231429 22424291 18169029 5813434 -2102744 1379611 4926140
13217 4926140 -3492231 -14789272 -10308493 8770564 20159804 10232074 -8697799 -15776702
13209 -15776702 -6495141 5843428 7647742 -1479277 -10682140 -10360920 -2534908 2386059
13201 2386059 -753646 -6125193 -7179682 -5887529 -6165755 -5100195 724660 6052016
13193 6052016 4600149 1270612 4795358 11534728 10133277 1124110 -2395364 5173985
13185 5173985 14979415 19255129 20304236 20643547 17944247 14366453 17062456 23654169
13177 23654169 21416507 7916977 -2562126 -2126154 -2414498 -11696270 -15172244 2738935
13169 2738935 28291893 33472982 16056067 1960919 7325646 19273739 19565046 9497975
13161 9497975 2281479 3266305 7721380 10923654 12272251 12865686 13462846 12656908 6890908
13152 6890908 -3452525 -9773797 -4490016 6358825 8816260 -39588 -8481583 -7491385
13144 -7491385 -1769741 533252 -299111 64240 1011940 -814479 -4818088 -7442610 -6873430
13135 -6873430 -3277087 2394903 7499656 9538461 10765536 16215395 24990078 28706105
13127 28706105 21739639 8882701 -64316 -311414 4667876 6966718 1659191 -6162983
13119 -6162983 -4445922 9882298 22198648 17298997 1892929 -3760725 3857097 6359072
13111 6359072 -7189378 -22803807 -22574319 -8810278 3766135 7883842 4499178 -4753874
13103 -4753874 -13547477 -10316823 4700730 12574807 997345 -14126551 -10490574 6465273
13095 6465273 12616896 2312363 -7156876 -6293403 -4109769 -5766979 -3668537 2626639
13087 2626639 337783 -12677513 -18474943 -6064378 10025316 12510088 6787500 7578368
13079 7578368 13932490 15701229 14300533 17548983 20852272 13417069 -66464 -3191207
13071 -3191207 6516613 13256053 7214756 -2256012 -2991369 3054477 5959006 2007533
13063 2007533 -4484284 -7662728 -4517958 2353158 4802863 -2203575 -11512630 -11066909
13055 -11066909 -1304773 4090621 -2018373 -9597179 -6772126 2749618 6330696 845876
13047 845876 -5370516 -6627210 -5983089 -6027694 -2265267 9098903 21438407 22496190
13039 22496190 9182214 -7179677 -13014398 -7067281 816216 3378223 2449096 1375205
13031 1375205 -1558623 -7682559 -12024746 -9779230 -4749799 -3488669 -3601898 2910453
13023 2910453 14973962 20823303 13749654 1466978 -4079391 46271 8220308 13817017
13015 13817017 12417692 3412654 -6930600 -9141404 -1945411 4988733 4250908 577869
13007 577869 1312851 3487254 23356 -5407310 -1827713 10635830 17704420 10515113
12999 10515113 -1490546 -4087929 2457813 6511433 3624530 1699912 6610748 11698080
12991 11698080 7055022 -5674628 -14529732 -12146246 -3532103 2126821 2333266 995079
12983 995079 1074758 2032650 3104529 4684772 6128790 5430659 1931635 -2700190 -6431930
12974 -6431930 -8061196 -6992047 -4130054 -2367424 -3437022 -4969376 -3995634 -2741832
12966 -2741832 -6520055 -15189727 -21058884 -17210398 -5001718 8075005 15375135 15128783
12958 15128783 10391039 6023009 3829830 1308309 -2469406 -2696256 3987366 11038559
12950 11038559 9437545 2645196 3253023 12941652 18245976 11667728 3978368 5591726
12942 5591726 7557853 -3823868 -21000210 -22178683 -3553280 13075753 9735981 -5019076
12934 -5019076 -11151413 -4352603 2457694 -582242 -9135320 -13506095 -10833917 -5672095
12926 -5672095 -2169589 702671 5823657 11988561 14331235 11320534 7789531 8150015
12918 8150015 9733340 7296110 1766215 -1260640 -857090 -2379698 -8950738 -16870218
12910 -16870218 -21175568 -20909242 -16829571 -8693517 1724577 8262582 5314916 -5462492
12902 -5462492 -16034357 -19872331 -17800903 -15650267 -16800651 -18499124 -16443494 -10927805
12894 -10927805 -5315485 -272958 4926612 6230219 -1685588 -13694515 -15718452 -3567991
12886 -3567991 8799692 7944255 -349838 -1197632 7597926 15832594 17492230 14071445
12878 14071445 5739486 -6421638 -12275297 -2309572 15374618 23084832 17978906 12081370
12870 12081370 8629020 -1197492 -15072229 -16036619 -1016993 8896811 -272632 -13398083
12862 -13398083 -11380796 -190283 4602892 6542925 17872525 31124239 27179981 7905689
12854 7905689 -3619532 3489705 15264262 16725866 9866504 3110753 -1030826 -1918126
12846 -1918126 2342372 8421834 9032781 4412324 2145102 3598853 2633767 -86083
12838 -86083 4326655 15611797 20075353 11018065 322339 336251 5617657 3827347
12830 3827347 -4125620 -7122730 -1548631 5777943 9967957 13175886 17214489 18679903
12822 18679903 13507313 3046069 -5501317 -4829148 4135522 10512833 5002340 -7166000
12814 -7166000 -11773686 -4925568 1906139 -887565 -8108564 -9421232 -3461575 4521008
12806 4521008 11532695 15522394 11932715 526761 -9424822 -9758464 -5170973 -5737481
12798 -5737481 -11779991 -15707061 -15426887 -15045195 -13991172 -7236035 2771790 5741962
12790 5741962 -1369321 -8284786 -5133635 5226325 13490941 15802650 13498553 6541297
12782 6541297 -5213982 -16481480 -19369780 -12544149 -3178793 1479340 1694132 3086693
12774 3086693 8696045 14970410 15788974 9714599 2310340 823563 7307345 17620766
12766 17620766 25880180 28246036 23854178 15542397 9825384 12081504 19472721 21785410
12758 21785410 12914568 -386384 -5693677 -294738 5996470 4836109 88493 -89796
12750 -89796 3269295 2584827 -2091019 -1675414 6716503 12862435 7950483 -1823485 -4913995
12741 -4913995 -2073315 -3566397 -11423091 -16433995 -13869888 -10822394 -13746877 -18231466
12733 -18231466 -17219432 -12123825 -9005828 -9079860 -9780257 -11168706 -14427578 -16628613
12725 -16628613 -13338426 -4888220 5012203 14710769 23190637 25692685 18142233 5848298
12717 5848298 510205 6321181 14746683 16248909 12365906 11451519 15488396 17429110
12709 17429110 12187817 4654824 2978179 7056319 9100004 4884569 -1740492 -6958377
12701 -6958377 -12461967 -18227228 -16800646 -3458455 12095518 14960797 5256175 -1759062
12693 -1759062 2739937 10692079 12327911 10456713 11832942 13460202 8042654 -2233981
12685 -2233981 -8098229 -7240035 -6481198 -10116164 -14276811 -14264479 -10941311 -7377616 -3719134
12676 -3719134 1443655 6449963 6096417 -2681298 -14412514 -17206933 -5213644 12510293
12668 12510293 21041520 16642043 7959036 1370792 -4340525 -7340121 -250191 15341768
12660 15341768 24789893 20614604 15083426 20132319 25849141 15759435 -4175632 -11598853
12652 -11598853 -330323 12479942 13084732 6749257 2382581 -1376230 -7096997 -9394092
12644 -9394092 -3859445 4674394 10050385 12321375 11953484 6319210 -2072040 -4079745
12636 -4079745 2335798 6914383 3411414 820262 8525713 19601908 20777941 12245023
12628 12245023 5278150 4770642 6042716 5976637 5861999 4692439 89619 -4780799 -4569123
12619 -4569123 -1309091 -1686181 -5644508 -7121665 -5630017 -6757470 -10110236 -7493167
12611 -7493167 3497149 13654928 14940789 11109408 9668050 9879354 6116591 -935132
12603 -935132 -4286401 -1111086 3163995 3018914 1206888 5524376 17476332 27392540
12595 27392540 24408669 10748819 631123 2505187 8638312 8164855 4127029 7047055
12587 7047055 15101462 14950677 4224405 -1660551 7539033 20078740 19778831 10222443
12579 10222443 6687780 10478480 8833932 -1103655 -6993245 -4129347 -5573426 -19528352
12571 -19528352 -31739146 -25387855 -8242328 -2089177 -9963056 -13188433 -2128480 9102196
12563 9102196 5974259 -4236460 -5512728 2711761 8655956 9056337 11692022 18520345
12555 18520345 20690377 13512274 5101553 4761803 10728865 14871617 13454169 8074942
12547 8074942 1206681 -3758369 -2502283 4322711 8725864 5002159 -1156638 -12360
12539 -12360 7574264 10734895 4262108 -4142783 -4992573 1517883 9550109 16989843 24006675
12530 24006675 26297017 18603767 4892392 -3120629 -177760 6282626 7475687 4410586
12522 4410586 2417320 653347 -4552419 -9394864 -5748945 5427628 13683779 14290097
12514 14290097 14298716 19010859 21794629 15070984 4252779 848694 5439680 7441470
12506 7441470 756003 -9226173 -14762171 -14187243 -9822892 -4191093 -516776 -1663405
12498 -1663405 -6221274 -9421599 -9101331 -7261336 -5675886 -4240218 -3563649 -4365395 -4303199
12489 -4303199 -568199 4476112 6063590 5365909 8165274 14444663 17072246 13101043
12481 13101043 8564463 8438596 9201499 5908403 -179762 -6109952 -12548683 -18498656
12473 -18498656 -17510764 -7190937 2960938 2527486 -4755178 -6994812 -2910407 -2840435
12465 -2840435 -10012772 -13291460 -4756034 5362701 1579131 -13680756 -21225475 -10230726
12457 -10230726 7714704 14670043 9080535 4309503 8321555 15085272 16906637 15175084
12449 15175084 14262158 13294363 10924260 11242304 16430907 19553497 14831900 9865624
12441 9865624 14941918 23642532 19434234 1473444 -12774458 -14027516 -13005977 -18451835
12433 -18451835 -20542913 -8808127 7410062 12156502 6782948 4433498 7816586 9465809
12425 9465809 9346534 14042977 19795997 14613203 -406906 -8758795 -2613454 5820213
12417 5820213 4123930 -2498634 -2578520 3285324 6716464 7010879 10573792 17915766 21176917
12408 21176917 14684270 1526468 -10472403 -14978153 -10258613 -273476 7658324 9090306
12400 9090306 5672446 868700 -4498777 -9663198 -10456141 -3540958 7072017 12390100
12392 12390100 7878738 -1915327 -7786279 -3048992 11697347 27337406 31232799 18703840
12384 18703840 437329 -6299687 3718327 17618000 20254746 12474816 7895635 12926960
12376 12926960 17733553 10453064 -5538835 -15285260 -11181243 -1283363 2487783 -1434790
12368 -1434790 -5410258 -4160643 -116116 2407960 4110878 9118617 17493803 22543118
12360 22543118 18115724 7327135 -2645 873428 5271702 8314227 11911666 17522673
12352 17522673 18901579 11077437 1680516 1808403 7955923 6185903 -5327172 -12235885
12344 -12235885 -6253365 2675597 3343105 -571589 -871492 -173549 -5035921 -11794940
12336 -11794940 -11426544 -3491779 5044170 10235534 11328703 6289150 -2921755 -6306217
12328 -6306217 2071689 12813753 12958262 4371865 -910222 928590 4057676 6076593
12320 6076593 9545112 12977879 12638800 10909985 11199331 8467629 -1887069 -10208862
12312 -10208862 -3581771 12336310 19594852 14204442 7817437 4254358 -4748179 -18218557
12304 -18218557 -22119603 -12629508 -3155782 -1339139 849276 6308002 3836510 -8761429
12296 -8761429 -14141141 -3137581 6682104 -1541559 -15163108 -11748624 5704343 15378085
12288 15378085 9150234 -2774959 -12789981 -20812402 -23207294 -16478019 -8783471 -9787233
12280 -9787233 -12618791 -4083239 11015188 15726979 8920187 6059346 11470973 11688172
12272 11688172 711817 -8709639 -6412265 459779 2655801 2935431 5520809 5458293
12264 5458293 -987484 -6784559 -5243957 -1240788 -2132852 -6099920 -8009634 -8424788
12256 -8424788 -8452687 -4318277 3812450 5985876 -4078961 -16419695 -16521549 -4432633
12248 -4432633 8150013 15189220 19512360 21831798 18453298 10119181 3464339 2299835
12240 2299835 4550771 7982490 11892036 13251071 8981496 3138282 4239437 13041082
12232 13041082 19618893 16033406 6584716 1456046 3873542 7635091 5446712 -3395723
12224 -3395723 -12752912 -15398669 -9965561 -2845617 -1742921 -7075402 -11810099 -10006947
12216 -10006947 -2740822 5130787 10687443 13481065 13262219 10196355 6165911 3672859
12208 3672859 3976245 6814691 9861272 8045373 -2159714 -15024297 -17302264 -3820235
12200 -3820235 12180572 12787450 -1264121 -10630112 -2966337 11415685 15198223 6451012
12192 6451012 -3645522 -8900550 -12143005 -13749300 -8875707 1607112 7886730 3811431
12184 3811431 -4468147 -7323291 -3624646 782462 2293337 2662356 5514943 12732445
12176 12732445 21944430 26293203 20438063 8121046 -724543 -1721941 450723 1673882
12168 1673882 4345173 10366290 15509391 16136704 15371706 16566983 16153393 9787800 1145738
12159 1145738 -2462249 69680 4443391 8056360 9908188 7117593 -1135546 -8720473
12151 -8720473 -8593644 -1987033 4060901 5599874 2823226 -3400041 -9317914 -7672442
12143 -7672442 2113831 7933983 -395991 -14448090 -17202755 -7282103 373250 -2454993
12135 -2454993 -8237910 -9830025 -10326924 -11203355 -5156010 9776875 20558596 15357999
12127 15357999 1858101 -2296260 7185060 18308825 20775837 16658877 12886699 11568394
12119 11568394 10494258 8329997 6429924 6914027 9758035 11981696 11348902 10515412
12111 10515412 13686825 18574991 17149903 7056677 -3268243 -5393019 -2309487 -3581876
12103 -3581876 -12150076 -21463538 -23761381 -16301398 -1504073 13427111 18316347 8008115
12095 8008115 -10093982 -21241921 -18268330 -8442364 -3965693 -8361139 -14467406 -14237937
12087 -14237937 -7647529 -1321493 -237968 -2995658 -5274225 -5238681 -3635167 -981019
12079 -981019 1801491 1465276 -4082760 -10339456 -9343584 31595 9214192 9722355 2370102
12070 2370102 -5419711 -7862843 -3869413 4333408 12002090 13977559 9558708 3564401
12062 3564401 240171 -1128762 -2118040 -940835 3106208 4833457 -467767 -7720983
12054 -7720983 -6916250 2046926 6974530 -943042 -15253911 -22805442 -19511105 -11763483
12046 -11763483 -5537371 -1546201 -367041 -4083192 -10156670 -10569634 -1952748 8294521
12038 8294521 11453623 9015323 8342806 10396873 10420498 9344641 14123440 24609012
12030 24609012 29982362 23317087 11778881 6177978 7003388 7783400 6603467 6118044
12022 6118044 5967151 3503485 42358 -881244 -61285 -1133996 -4149073 -6393962 -7544255
12013 -7544255 -8358375 -7080419 -3240942 -1607598 -5471074 -9831278 -8959265 -6097470
12005 -6097470 -6218949 -4461589 5448849 15153667 10012819 -6833168 -15975799 -10768968
11997 -10768968 -7342107 -17664904 -28722874 -21551577 71851 14799460 12153752
11990 12153752 2397411 -621379 4486088 9551405 8711554 4020529 1307766 2443689
11982 2443689 3469810 1354173 -1394561 -3198358 -9098549 -21090846 -27487702 -15520561
11974 -15520561 6622813 16093818 6060382 -6249440 -6870838 -2444827 -1483213 2872909
11966 2872909 16366225 25433559 14875000 -6017345 -14586251 -6282832 3798826 7337334
11958 7337334 11258428 19054822 21669851 12356699 -2266214 -11688486 -13293744 -11028236
11950 -11028236 -9334228 -10476271 -12227551 -8556167 1633690 9341095 6847786 433438
11942 433438 1436305 8071047 9032463 3604336 3254050 11441297 17037362 13255856 9350805
11933 9350805 14805628 22610810 19051082 3988767 -8737220 -8922724 -657214 4197159
11925 4197159 -1194614 -12288800 -17940544 -12450642 -2436014 1119560 -3552269 -8312644
11917 -8312644 -7294204 -3028726 777939 5487146 13050861 20678381 24107838 22821452
11909 22821452 18958523 14029396 9268726 6469526 5907750 5367079 3107496 368471
11901 368471 -245686 2133933 5461900 6127175 2501200 -2179082 -2784511 758203 3121386
11892 3121386 1980143 1538700 4145812 4645336 -804228 -6027292 -3072516 5211300
11884 5211300 9783824 9081052 8273275 7618305 2811180 -3679511 -3194801 5323942 12190498
11875 12190498 10593155 4988944 2784092 4547193 5321310 617880 -9647361 -18571193
11867 -18571193 -15815786 -510909 12899061 11230350 1459666 608889 9238423 10940884
11859 10940884 -641272 -11865626 -11994469 -9558955 -15878365 -25590453 -25990039 -16712816
11851 -16712816 -7964757 -4869075 -4185698 -2945890 -1445667 481207 4077245 9926267
11843 9926267 18021446 25960010 26731778 15710182 1265518 -1136398 11217911 24045470
11835 24045470 25338283 18066828 9497102 906554 -5476521 -3663574 2053592 -5326159
11827 -5326159 -30230926 -49667275 -40822121 -14047936 510624 -6977438 -18968797
11820 -18968797 -20565427 -16046576 -13530687 -11863029 -8811210 -7754142 -9104836 -6293485
11812 -6293485 2828545 9605098 6230653 -3132296 -8785394 -7722350 -4348549 -2867568
11804 -2867568 -3116126 -1964532 2847754 8567634 8165660 -1154449 -11814276 -13380844
11796 -13380844 -5167653 4001704 7256476 4863411 -542504 -6472992 -8527735 -3492142
11788 -3492142 4237512 5956791 -68832 -6386273 -6566025 -1985893 2673103 5017231
11780 5017231 4492949 1481398 -1316979 -479591 3904490 8126958 8295844 1724523 -11382074
11771 -11382074 -23330284 -21578503 -4020611 12978802 12415477 -384339 -4816295 6263870
11763 6263870 18971286 21158981 17529471 16293164 14910446 8607541 2052290 1370203
11755 1370203 2264615 -2775401 -10941923 -13620221 -10601535 -9096544 -10528663 -8617602
11747 -8617602 -819030 7248007 10398764 9736786 7876462 4421038 -902404 -5071963
11739 -5071963 -5018201 -1664647 1574602 2826415 2701389 2333643 2033015 1775500 1904093
11730 1904093 2286718 897678 -4763315 -13350899 -18955092 -17775240 -13667324 -12541408
11722 -12541408 -12603477 -6663595 5263798 13163440 10068628 1202935 -4667993 -6870226
11714 -6870226 -9371659 -10958110 -7600445 -2253493 -2973429 -10493097 -15789295 -12706277
11706 -12706277 -6201372 -3799584 -4188445 -376174 8205522 13282598 8682365 -764473
11698 -764473 -4531072 1046462 8930317 10485260 5323233 -145466 -1681146 -691970
11690 -691970 890088 4277186 9967456 14079195 12789140 8683901 8187317 12802724
11682 12802724 17221104 17377500 16416656 19564314 25405364 26372753 18038328 4643266
11674 4643266 -5936448 -10218654 -10016543 -7440801 -2730379 2929037 6118684 4710625
11666 4710625 714601 -2188687 -2546577 -1155987 1060554 3263731 4219721 3742120 3581633
11657 3581633 5074731 7169535 8533359 9744958 11034889 10113089 5809149 2121770
11649 2121770 4141354 10485123 14247568 11782985 6596164 4057594 5961997 10567872
11641 10567872 13969929 11206819 994848 -9436136 -9585874 1612425 13000781 14394637
11633 14394637 8422277 5293642 9415281 16013761 18661626 15116359 6797983 -2783676
11625 -2783676 -8982593 -9121378 -5207944 -1217029 1760783 4792681 6342627 2405685
11617 2405685 -7519736 -17810020 -21946203 -18703122 -12138805 -7217734 -6426697 -8778656
11609 -8778656 -10564083 -8357753 -2752541 1922479 2928673 2873498 6110893 12149004
11601 12149004 15206744 10774265 748493 -8464573 -11374378 -6913738 997856 5859375
11593 5859375 4633737 2502567 7456153 17637285 19525210 4820054 -15003356 -20096727
11585 -20096727 -7238328 6573538 7256862 -425262 -5288714 -7351308 -12946262 -19490978
11577 -19490978 -18226168 -10372753 -8149318 -17187589 -27576299 -27026361 -16436605 -7357865
11569 -7357865 -7801006 -14881900 -19843546 -17512435 -10951350 -7159543 -8144508 -8647246 -4573290
11560 -4573290 409561 1648210 3130659 12209170 25636057 30071857 19112849 2335195
11552 2335195 -6511891 -4318673 2665982 9420950 15330123 19567559 19756508 16257839
11544 16257839 14195293 18513183 26878477 29596055 19894981 4398796 -1757323 6938157
11536 6938157 18694396 19954667 12758657 8763915 11258962 14128079 15726721 20756114
11528 20756114 28057662 29663856 24715442 21819183 23405242 20219089 7551736 -4726121
11520 -4726121 -6275199 -533339 3210606 2750829 -190829 -6443667 -13101708 -9934501
11512 -9934501 6526943 22788836 24206774 14812905 9272759 10803366 10583284 5212827
11504 5212827 494443 -902874 -2258822 -3044518 1542813 10110865 15029138 14404515
11496 14404515 14123754 16234888 14866684 6435528 -3921706 -8689263 -5098757 4396891
11488 4396891 13266857 14165534 7404141 3098673 7471461 12050966 6789778 -1938330
11480 -1938330 -998773 5919341 2562618 -11990127 -19106002 -8778219 6132948 10908369
11472 10908369 7312849 2252348 -5281164 -14459557 -14847512 -2219398 10104137 9953207
11464 9953207 5341222 9638756 17947834 16133706 6411172 4564975 14053588 20951263
11456 20951263 15595328 3653045 -6589219 -13770948 -16710593 -11105085 1080626 8649695
11448 8649695 4184959 -5961921 -9671520 -3225579 5629098 6483340 -2713427 -12225139
11440 -12225139 -10585082 229905 5725412 -787986 -7525991 -2476286 6921587 5893593
11432 5893593 -2952678 -4325801 3702652 7488692 2092797 -2016509 -525398 -3650521
11424 -3650521 -15109968 -21571476 -14554175 -6207716 -9206917 -15199188 -9531465 3871703
11416 3871703 9878657 6225362 2637007 1715988 -1677036 -5645743 -3350140 1870195
11408 1870195 575867 -3856913 2285338 19754316 32247306 29330544 17704927 5257862
11400 5257862 -9359027 -24093691 -27214270 -14967777 -1887385 -610989 -2705431 6272882
11392 6272882 21961226 27616263 19786641 11225907 10130915 11611482 10393835 8280809
11384 8280809 6452767 2338415 -2217568 -193424 8830645 15314359 12934986 6946291
11376 6946291 4486691 4584996 3907101 5072318 11271543 17565989 15948196 6785882 -1848474
11367 -1848474 -5006022 -4854565 -4471667 -3371425 50294 5521937 10921884 12896730
11359 12896730 8369846 -1742733 -11412167 -14837410 -11638343 -4842681 2769658 6821005
11351 6821005 1011375 -13995237 -24913864 -19092635 -2910753 3926557 -5466613 -16302310
11343 -16302310 -14577215 -6380762 -4954686 -8655695 -6344088 831584 172733 -9776681
11335 -9776681 -14232044 -5772702 2054082 -4757785 -17760943 -17354866 -1038656 13682188
11327 13682188 13174474 2012392 -7622051 -9836013 -5296044 3018647 9904175 10908439
11319 10908439 9204177 13005559 22610215 27455767 21046729 11174148 8038432 8792564
11311 8792564 3506674 -7448736 -12835510 -7131717 1970300 5106983 3081589 3655723
11303 3655723 11028737 21363665 26135742 18997333 2223972 -13491084 -18876565 -15494705
11295 -15494705 -12185672 -13684257 -17407015 -19679229 -18626915 -12039433 -554447 6832427
11287 6832427 222876 -15516227 -22728880 -13893936 -2572641 -3338719 -10033497 -6068380
11279 -6068380 9406257 20016155 16008610 5717323 -43130 -2762632 -8375218 -13563897
11271 -13563897 -9580192 3895751 17173727 22490862 21473345 19978686 20296692 20495342
11263 20495342 18597771 14861233 10678182 6917877 3623032 530756 -2793630 -7109995
11255 -7109995 -12638747 -17322300 -17029585 -9319396 2818702 12440527 14642089 10450879
11247 10450879 4488598 -85604 -3196227 -5145481 -4560672 -691494 3315745 2572468
11239 2572468 -2747874 -5477850 392945 10876414 15362525 9221317 -804684 -5168047
11231 -5168047 -1990431 3169391 5084740 3537488 1779329 2520194 4770043 4406659
11223 4406659 -169239 -3660899 494494 9969500 15257035 13445060 12617034 17902268
11215 17902268 21480765 15085403 5931314 8399261 22517055 32964398 29918317 19446923
11207 19446923 11185309 7167155 6944735 12375969 20339108 20520986 9691655 739720
11199 739720 6950598 22110491 27394577 16171573 1507810 -1466647 8187050 19991348
11191 19991348 23415670 14535866 -1775219 -13756627 -12670508 -3180812 1594214 -2827651
11183 -2827651 -6930220 -2065240 6936900 10006941 6258813 1988649 -1331499 -7198805
11175 -7198805 -13810615 -14256588 -8761294 -6923666 -13249071 -18829716 -14070890 -3141255
11167 -3141255 2545704 867938 -373939 2518748 4183140 108245 -6984313 -12697288
11159 -12697288 -15362737 -12897844 -3647045 6401636 6641796 -2126136 -4197167 9437292
11151 9437292 24233995 19477044 -2297485 -17836334 -14528443 -4367611 -2952774 -8443878
11143 -8443878 -9718633 -5313641 -3313787 -7153604 -11285900 -9835233 -2759219 6326879
11135 6326879 13788226 17648757 18401209 17132183 11908051 -42749 -14402068 -19578525
11127 -19578525 -9414548 7939065 19009876 19328846 13885912 8041979 5066203 8662173
11119 8662173 18645474 25544884 18949774 1977923 -10888482 -11614090 -6072729 -2139248
11111 -2139248 286689 3231635 3480171 -1688544 -7766256 -9174752 -7612797 -7305124
11103 -7305124 -6220436 -446092 5389889 1957138 -9913199 -17445521 -12414991 -2077949
11095 -2077949 1283415 -3954152 -9685714 -10784824 -9374771 -7480201 -3189191 3615738
11087 3615738 7942289 6521079 3866541 6116356 11165424 11276544 5320223 1607348
11079 1607348 6109410 14027996 17781803 18378392 21836322 26954695 25289582 14447131
11071 14447131 3673232 2335090 8413513 13207151 13154926 11085295 8410507 3222601
11063 3222601 -3388735 -5452303 264893 8417971 10718727 6172065 2335318 5809740
11055 5809740 13845083 17494366 12586711 4896338 2801056 6954393 10655986 9561479
11047 9561479 6234753 4049804 1969935 -1237545 -2359633 1474956 6773713 8511154
11039 8511154 8550333 12341975 18724626 21009768 18204914 16392106 17270277 14738532 6783304
11030 6783304 1278740 3380759 5605112 -604803 -9940124 -10263556 -345137 10266127
11022 10266127 16445849 20996584 23563748 18196329 4743917 -7179085 -9313657 -2409754
11014 -2409754 8879273 20001550 23818366 14788592 -144199 -5690094 1229137 6107192
11006 6107192 -776999 -8522216 -3100496 9699244 13252909 5268337 -1783359 -2184019
10998 -2184019 -2858156 -7294191 -8612418 -2573011 4609963 6502215 4964391 3663264
10990 3663264 1397565 -3065994 -6254001 -4835962 -221712 4634555 8081115 7996457
10982 7996457 3298331 -1637086 -1122693 2330616 1096247 -3794107 -2677998 5503486
10974 5503486 7919338 -3255705 -17438985 -20636526 -15181784 -13548301 -18818722 -23072476
10966 -23072476 -21528701 -16882450 -11086788 -3303588 3796746 4914329 835352 -1010927
10958 -1010927 3412044 9725784 11779874 9080388 6346229 8438744 15852208 23394685
10950 23394685 24662674 19202680 12280265 6483397 -723100 -8505211 -9854234 -3382594
10942 -3382594 159238 -7562745 -17902613 -16436717 -4045990 5606805 6677023 5709301
10934 5709301 6651129 5850217 3911791 8138866 18208188 22312458 14652679 5899354
10926 5899354 7887350 16684664 19903790 14128906 5896327 94489 -3650329 -5650416
10918 -5650416 -5039973 -3069623 -1940939 -1284318 88560 567078 -2207670 -7023115 -9952374
10909 -9952374 -8562770 -4023413 -1108640 -5764800 -17809001 -26033323 -18341570 652838
10901 652838 10976786 1749961 -14120382 -17712766 -9134612 -3874942 -8683990 -13885827
10893 -13885827 -9981513 -623109 4739908 3523642 857860 2065473 7487135 12531632
10885 12531632 11880104 5675053 729291 2682961 8679311 11899843 11277429 11026144
10877 11026144 11930126 10198921 5522772 3250800 6270647 10491553 11247691 9506692
10869 9506692 8900522 10584640 13647178 16972338 18250469 14615645 6753276 -601881
10861 -601881 -4108977 -4598228 -3281809 280982 4499572 5256156 2317824 1258015 5154389
10852 5154389 9655631 11148627 13859907 21434879 26601950 19537217 4458465 -3391712
10844 -3391712 1575215 8496883 7413658 2883449 3755573 8270712 8631667 4736478
10836 4736478 3237021 5552303 6400840 3696888 1217270 650241 -1200075 -5596747
10828 -5596747 -9156326 -10077778 -10976761 -13351188 -14915906 -14412763 -13400415 -11753593 -7922405
10819 -7922405 -5151855 -9268666 -17540059 -19079439 -10849305 -3136631 -2646807 -1391967
10811 -1391967 7652651 14910236 8456208 -4619178 -8254279 -3397804 -4628688 -12820314
10803 -12820314 -12592145 46566 9317865 6948964 7097999 20876150 33942622 27385563
10795 27385563 7935582 -2800386 -1226282 -2842162 -13458981 -20088562 -13291428 -1230438
10787 -1230438 4573256 4310321 4031125 4896173 4890340 3612644 -234125 -9575237 -22185506
10778 -22185506 -29047967 -24430941 -13158103 -4256876 -1792483 -4486029 -8741280 -8869806
10770 -8869806 -287816 13378435 21632826 19440319 12753343 8001847 3230719 -4121814
10762 -4121814 -7702459 34462 14471097 23015975 21228915 15854718 12585326 10383821
10754 10383821 8841023 11062357 15705479 15351636 8330456 4030821 8973115 14516320
10746 14516320 8568080 -4423971 -7042352 7092441 23829563 26804232 16395477
10739 16395477 4795788 -630623 -1524191 -653537 1676351 4396564 5431183 4739989
10731 4739989 3007059 -1540363 -9773891 -16290084 -13621184 -2005073 10581562 18027324
10723 18027324 19783551 15615739 4878641 -7468993 -12758516 -9980118 -7210745 -7642486
10715 -7642486 -3463167 9443407 19816795 14794183 -592238 -9917619 -8269086 -5540813
10707 -5540813 -7057483 -5245161 4258216 10453457 899826 -18615686 -28597940 -18613626
10699 -18613626 2028489 16508137 17303322 9539285 3007433 4345364 13985896 25961322
10691 25961322 30412186 20329325 -1089172 -20918119 -27183861 -19520836 -7902630
10684 -7902630 -1653119 -2143380 -5313651 -6955640 -4443334 2373345 9327604 10217034
10676 10217034 3880347 -3365089 -4951601 -1545209 1081356 -523755 -4574694 -6772989
10668 -6772989 -4325785 799758 2266269 -3419243 -9996332 -7553590 3245090 10592513
10660 10592513 8352343 4666140 7878925 12971756 11350539 6481534 7562323 12531872
10652 12531872 11213587 3742279 1694292 9181562 15989238 13878795 8341234 7951572
10644 7951572 11302766 11934996 9460554 7899444 6975497 2340850 -6873390 -15872772
10636 -15872772 -19442438 -16591615 -10272708 -4108322 397477 3198992 2766295 -2817982
10628 -2817982 -10075970 -10534604 -1857897 6088823 3366298 -5806623 -9657593 -6230692
10620 -6230692 -3055593 -1343010 5672012 16465839 17597959 3325580 -12414741 -12874491
10612 -12874491 251414 11440849 11628487 4836723 -1833282 -5476530 -4927589 1228011
10604 1228011 11244136 18451266 16429239 6528441 -1435827 1095159 10718886 15436431
10596 15436431 10489594 4450875 5161546 7754621 5233787 3034088 10154529 21295135
10588 21295135 23342118 16914865 14494385 17559398 14289972 2912469 -2024050 6640515
10580 6640515 16637313 16673363 12130833 10412440 7224127 -212436 -1840268 8719969
10572 8719969 19631916 18080713 10186351 8148065 9165243 4510229 -948258 2253302
10564 2253302 7962070 4108360 -2918573 4439516 25041827 37958091 32930137 22135033
10556 22135033 17490481 14809354 7867665 2252273 4500415 8143238 1987209 -12344021
10548 -12344021 -19985640 -9888580 11596860 25649339 20376111 4543944 -2349691
10541 -2349691 6016396 16547555 17081439 12528128 13779534 20679142 25958181 27619825
10533 27619825 26618429 20081494 8330066 1101059 4643228 9961550 6399421 -1087236
10525 -1087236 -2066158 326723 -3481720 -10469435 -10359936 -4320458 -957856 1161722
10517 1161722 8958583 17342825 15079665 5104431 835506 4843069 8412107 8773735
10509 8773735 9469763 8307593 2927341 2372207 14101278 26992027 27764009 24576883
10501 24576883 30920120 38109199 32071330 24602361 34326009 49476848 48682674 44869518
10493 44869518 61153575 77809498 64850172 57016412 113774073 194415905 169222109
10486 169222109 22 -176587854 -214414319 -137903237 -76307954 -75431632 -75083707
10479 -75083707 -43172874 -22384701 -38008462 -53664326 -43541302 -34164689 -44743098
10472 -44743098 -48580859 -26685384 -6877190 -14798616 -30250713 -26868317 -16855649
10465 -16855649 -21098426 -28034280 -18894516 -6946357 -14639227 -31870043 -32594606 -18855672
10457 -18855672 -15057022 -26926888 -35680425 -29372828 -16265553 -8375339 -9460598 -17466128
10449 -17466128 -25840283 -26135135 -18740598 -14111463 -15865423 -14041175 -3946684 2556821
10441 2556821 -3585721 -12425675 -12116830 -8345290 -11063344 -14831714 -9736437 -801077
10433 -801077 1376309 -176125 3183065 7317859 3676460 -1228979 5719051 20857601
10425 20857601 27568128 20952824 11535529 6137418 1437470 -4220775 -8011854 -11664012
10417 -11664012 -19302773 -26137964 -22580922 -10222697 -1516593 -2926197 -9382641 -15140458
10409 -15140458 -18912833 -18697024 -13078029 -7771904 -9695806 -14581528 -12002263 -2917995
10401 -2917995 202634 -7395949 -15546522 -14744251 -8128370 -3280293 -1512130 -1043965
10393 -1043965 -3474965 -10614920 -18777013 -21021836 -13735775 155694 12489462 15233401
10385 15233401 8173534 492242 1145796 8978499 15694194 15901101 9940709 244509
10377 244509 -9361053 -13589933 -11008931 -7149843 -7160787 -8763742 -7908736 -6526913 -7588623
10368 -7588623 -7668391 -3242859 320347 -3830687 -11603498 -13963488 -11948286 -13302840
10360 -13302840 -16443524 -11822716 411693 8195598 5586699 -24450 -2486256 -5885041
10352 -5885041 -13282846 -18114013 -14583810 -7787929 -5684547 -7800131 -8975254 -8572655
10344 -8572655 -9185168 -10579852 -10780700 -9825428 -8232314 -5386125 -2771259 -4431916 -10831293
10335 -10831293 -16692891 -18121401 -17133450 -16003717 -12589574 -5518048 941673 2233505
10327 2233505 204299 -99296 2406753 4708108 4525480 2377412 584288 1483945 4247996
10318 4247996 3911492 -1934612 -6482971 -1128063 10164553 13734159 6517071 2304560
10310 2304560 10904493 21994596 20937229 12139075 11600932 20106952 21082758 7839116
10302 7839116 -2998998 5773262 26648169 36650307 26600210 9241130 -899562
10295 -899562 -4188807 -8475308 -13947466 -13458964 -4651691 5813256 10360812 7469847
10287 7469847 -170507 -9295221 -15808165 -15378555 -7767236 1750748 7654464 8812504
10279 8812504 6663244 2458763 -1320917 -721600 4975878 11290259 14431577 15819813
10271 15819813 17509565 17306669 12855381 6687212 2385379 -387464 -2237855 -515037
10263 -515037 4396031 5119125 -1836114 -6621366 1594973 16497542 21366014 12544258
10255 12544258 3130975 2597748 5891515 5642418 2831599 952013 396314 2753252
10247 2753252 9956812 15436683 8319694 -8487822 -17567844 -11302079 -3121105 -4934229
10239 -4934229 -7593729 2215639 17663159 21935820 15093755 12125359 17641556 20832101
10231 20832101 15729031 9221228 5744467 -316287 -10943792 -16291143 -8327620 6283628
10223 6283628 14507836 11908636 3521854 -4576704 -9267683 -10577445 -12109954 -17089197
10215 -17089197 -21444304 -16965955 -4680225 2478057 -3647991 -13699230 -12772072 -489659
10207 -489659 10017015 10824895 7253192 6793790 9114259 10191793 9215665 6980372 2873856
10198 2873856 -1647060 -1209217 5869820 11674538 7902948 -541871 78876 12853993
10190 12853993 23866309 20170846 6914976 -772441 2110167 7459608 8643296 7862542
10182 7862542 8118514 7553979 5651338 7067182 13478039 17390383 11005020 -1789232
10174 -1789232 -8829821 -4262103 5441670 10236865 7190057 1153639 -2618707 -4110764
10166 -4110764 -6282553 -8567645 -6078073 2605247 10442261 9788550 3108240 -602600
10158 -602600 1032734 2105156 31859 -874462 -218415 -5450108 -18657250 -28354672
10150 -28354672 -23161125 -7436928 5573891 11225437 14694123 18277517 17634363 10310639
10142 10310639 205881 -6776230 -6482879 2003497 13050157 15835191 6030710 -6553833
10134 -6553833 -9171815 -1918141 5632041 9819231 14438647 18985713 17635777 11265547
10126 11265547 9191053 15429824 22474759 22582449 17236892 11433889 5700035 -1794771
10118 -1794771 -10336940 -16959382 -17786776 -9258439 5996203 15784115 9923519 -4471315
10110 -4471315 -9333643 1323981 15483931 22006593 22376259 19303162 8346142 -9915963
10102 -9915963 -21835495 -16640851 -1540027 9878718 15433299 19117095 17893975 8809769
10094 8809769 1910076 8616362 20973105 20399444 6248547 -2625675 3040724 10655228
10086 10655228 8588763 4069588 8231934 17283645 20986429 19457550 18257204 14633046
10078 14633046 3291446 -8594307 -7602113 4557002 9858315 -1900681 -18963683
10071 -18963683 -23795196 -14982018 -4978318 -1062663 2132823 11151738 22351496 26038911
10063 26038911 19122809 9587230 7708045 14850085 22714243 23221936 17138941 12044412
10055 12044412 13308455 18704142 21261877 16128237 5328388 -3011991 -1472188 8538776
10047 8538776 16701705 14792811 6748081 3520096 8140328 11935451 7984872 1778383
10039 1778383 2491096 8426536 9869353 4879660 2273454 6533443 9217659 1614051
10031 1614051 -10783592 -14650607 -6328030 4989275 10107013 8224132 2619825 -4051504
10023 -4051504 -7891253 -4140547 6231723 14712327 14122276 6310749 -2198980 -8691745
10015 -8691745 -14076297 -17154772 -15013143 -8913780 -4519206 -4649139 -5863089 -4793374
10007 -4793374 -4461478 -9812643 -18213755 -20144705 -11637816 -1296940 -76429 -7040605
9999 -7040605 -11898779 -10531465 -9415174 -12640599 -13951436 -7700728 174397 752927
9991 752927 -3936493 -5178012 -1437763 2593579 7190319 15168356 20057450 11394374
9983 11394374 -6533258 -15994533 -10032346 -990487 829454 1519279 7548010 11029750
9975 11029750 4631931 -1809464 3906577 14847725 16270575 10825045 12407340 19398042
9967 19398042 16141826 1388668 -6833859 259396 8978911 6715961 852729 3254501
9959 3254501 10985068 15050698 16231194 19247250 21176950 18618773 17545438 22636434
9951 22636434 24807835 14033146 -1890450 -7208315 -2178482 -315127 -4502846 -4594057
9943 -4594057 637034 -604416 -9545417 -8644494 11699427 34154167 37076956 24459474
9935 24459474 16423464 17873101 15876059 5526582 -1662139 1355127 5709636 3648079
9927 3648079 1680498 5866217 7085595 -4211865 -17799860 -15988750 -1973974 3202555
9919 3202555 -6881129 -13757873 -2993166 13834112 17621509 8611312 340541 -3100213
9911 -3100213 -6962730 -9154941 -1946997 10832975 15602426 10259246 7940884 15346388
9903 15346388 22285418 19661520 14118203 15066974 18289917 14181062 4762490 468893
9895 468893 4019726 8252410 8585627 8901665 14371737 23724119 29628888 25741216 15121752
9886 15121752 10101059 17683088 26998443 22107102 7055825 2660726 14425080 22512892
9878 22512892 13506125 2178318 5487250 14537492 15619727 21192271 47205698 70084991
9870 70084991 46610851 -20017796 -72521680 -71421001 -41507982 -27672007 -34447925
9863 -34447925 -36271470 -24990259 -14742131 -11229566 -6852490 -2408403 -7220870 -18056226
9855 -18056226 -20692504 -13566935 -9381673 -11648879 -9906607 -1599918 1364706 -5803160
9847 -5803160 -10981434 -5398582 2478312 3263168 2466767 8237101 15134917 13321209 5618811
9838 5618811 2615573 6382735 10600063 12396694 12859895 9143345 -2253863 -15208121
9830 -15208121 -17698950 -7280830 5332508 9537979 4510518 -5525851 -17649927 -28258048
9822 -28258048 -31312711 -24333460 -13153209 -5994860 -4377590 -3843960 -2398311 -3082174
9814 -3082174 -7018212 -8928801 -3955761 3755270 5414557 596967 -1097553 5347395
9806 5347395 10870633 4309012 -10556970 -18777318 -13571827 -2892378 3664654 5144662
9798 5144662 4128059 753550 -3351993 -3166285 1658355 3344497 -3216380 -12429439
9790 -12429439 -17425393 -20867229 -27550212 -32008225 -24825314 -8511427 4572220 9556081
9782 9556081 12803169 17419273 17511632 11198249 7653622 13344434 20065805 16395307 5448742
9773 5448742 810456 7086799 14533880 13943467 8573593 7915082 14893063 23130607 24417518
9764 24417518 16300977 3822121 -4532521 -3770283 3273312 8870706 7993014 2538558
9756 2538558 -1480284 176281 6346542 11317066 9968936 3602183 -730753 751207
9748 751207 2011606 -5448807 -18926727 -24849854 -15906197 -1814237 2906193 -2406133
9740 -2406133 -6090214 -2371269 1727911 -427651 -4557438 -3921271 -888761 -1581210 -3348809
9731 -3348809 2310357 14766186 21837042 15477664 2743591 -3416757 518434 7062582
9723 7062582 7898243 1025209 -9812544 -18160517 -18424082 -10524603 -932034 3735804
9715 3735804 3649464 3695417 5377515 4503081 -2236847 -11302157 -15055187 -9882298 -367637
9706 -367637 5114686 2928881 -2575955 -5224523 -4796010 -5481783 -7202476 -3755909 7741531
9697 7741531 19951779 22527513 14128842 2839383 -4158481 -6776430 -8002651 -8131108
9689 -8131108 -5020824 1518827 7002636 4839141 -6348905 -17965699 -18257893 -6306605
9681 -6306605 5248035 5613263 -397504 -42108 9467114 18630131 19710977 14788094
9673 14788094 9276272 5084160 1922933 -895655 -5222145 -10748724 -11183743 -1586733
9665 -1586733 10536170 11769989 2400621 -2343664 4517168 9879125 713847 -15096775
9657 -15096775 -20191531 -11954029 -2017246 2918709 5731864 7272354 4197237 -1785882
9649 -1785882 -5002210 -6667345 -12939437 -21523892 -22474410 -14075627 -5750550 -2804990
9641 -2804990 -891568 1411423 -1204043 -6606260 -2332082 13939594 24641719 15231037
9633 15231037 -3991020 -12332723 -6281607 1563303 4041692 4161541 2413758 -4313167
9625 -4313167 -11540028 -9634327 610357 7077607 3399039 -3677216 -6017842 -3116401
9617 -3116401 2564203 9144209 11724430 5053026 -7001532 -13444231 -10400554 -4799497
9609 -4799497 -1831342 1333694 6244149 8027598 4354466 416016 136134 768472 141524
9600 141524 213150 -141890 -5395687 -12437436 -11586577 -3831081 -2981853 -12679725 -16624511
9591 -16624511 -3714768 11858576 11451627 -7966 -5743487 -6099791 -13138461 -22884539
9583 -22884539 -18503134 -1137630 7191780 -3062189 -14578963 -10865783 639828 4561064
9575 4561064 1029891 -184978 2414504 3494223 2896957 4446435 7284278 7347581 3832553
9566 3832553 -1969353 -9480471 -15511333 -14519206 -7524773 -3633152 -6772451 -8754853
9558 -8754853 -2698057 4566932 2421627 -7690086 -15718158 -17007138 -13470328 -5564697
9550 -5564697 6610981 17016251 18269017 11662399 5168549 2972775 3399555 4509401
9542 4509401 4876572 1753966 -4424791 -6893378 -1211421 6662342 8969476 8302332 11139936
9533 11139936 13567132 6589650 -5669815 -7766520 4087397 14260833 9386588 -2822561
9525 -2822561 -5107389 5854029 16745875 15706060 5312426 -3329585 -4713021 -3861755
9517 -3861755 -6951621 -10044506 -3140810 12695929 20415601 7547645 -13581750 -18219040
9509 -18219040 -1019014 17089752 16901900 3755251 -4455346 -2232732 823251 -2601464
9501 -2601464 -7832281 -6013942 5209466 20282876 30966197 31611550 21915928 6773045
9493 6773045 -6153611 -9897405 -2392296 10472489 18326470 16391271 10429169 8129703
9485 8129703 8611091 6366982 2673697 3931510 8798785 7336216 -3727316 -14239280
9477 -14239280 -14597259 -8669734 -6069584 -8000958 -8774893 -7024954 -6926440 -9972943 -12635431
9468 -12635431 -11746365 -7024244 648773 8598021 11629196 7438594 1704523 2178301
9460 2178301 8312620 12599882 12051897 11632302 14675572 16570512 12064260 4291588 1530747
9451 1530747 6978947 15704157 20606477 18236948 9819807 -183190 -7017804 -10052089
9443 -10052089 -13582080 -20186706 -24758255 -20416167 -10225363 -5857474 -11600125 -16809779
9435 -16809779 -10132706 4716621 15268123 17591122 17336493 16805733 13415611 10694581
9427 10694581 16857353 29000719 32311612 21213418 8480146 5306840 5410612 -107620
9419 -107620 -5001522 -116227 6915932 2398016 -9339900 -11688526 -2626202 3417922
9411 3417922 459247 -1379082 4049586 9092339 7660781 4397363 2672192 -1614609
9403 -1614609 -8071323 -8383178 -1793312 449244 -6123535 -10354601 -4158579 4369344
9395 4369344 6644756 7961021 14152168 17742545 11590934 4074608 5070895 7560102
9387 7560102 67393 -11627930 -13208812 -5272327 286103 1926276 7328564 14031724
9379 14031724 11410288 1949003 909560 11632921 18929111 12324627 380152 -4533927
9371 -4533927 -2271736 1234110 4476985 7133814 5555608 -1246830 -7799808 -9445745
9363 -9445745 -7317337 -3010855 4262315 12085855 14399228 10459636 6800331 6706129 5512725
9354 5512725 459361 -2676875 1675368 9591947 12470528 6888160 -3900924 -14096858
9346 -14096858 -18646376 -16986978 -14878615 -17479801 -20804095 -17273088 -9351483 -7484261
9338 -7484261 -12675535 -12806722 -1400943 10944443 11569050 3239429 -2192947 -671768
9330 -671768 2722749 4212946 4042960 2021862 -1610364 -3070074 457031 5265136 5994797
9321 5994797 3551615 2152873 1010309 -4143368 -12218035 -16014640 -11288400 -2420586
9313 -2420586 1891628 -3268134 -14361884 -21381833 -16920649 -5224600 900196 -5400168
9305 -5400168 -17275928 -23774793 -22588445 -18631410 -14175457 -7124357 2413663 10104200
9297 10104200 12597489 10796722 7438976 4241120 1688416 -324832 -1796525 -1952771
9289 -1952771 -176096 2660122 6023904 11915821 20684683 25228376 16981718 322186
9281 322186 -7415651 3222255 19550302 21982758 9281240 -1419539 1709293 12142525
9273 12142525 17542965 15447618 10930442 5997497 -366249 -4753086 -1044565 8918945
9265 8918945 13723388 6132439 -6276728 -10556116 -5729859 -2498827 -5628955 -6512678
9257 -6512678 2331527 14450169 19060943 16515298 14323768 12969129 7521125 702401
9249 702401 1364992 9555475 15379358 14709493 14223087 17789143 19712271 16181919 12394662
9240 12394662 12740356 14092386 14383888 17399734 22910411 22874046 14702106 7563375 7440738
9231 7440738 6972229 -497309 -8075780 -7819745 -5344689 -8856323 -13158427 -9181461 -1382496
9222 -1382496 -93237 -3227274 -1965709 845425 -4443821 -14555453 -16558246 -9723142
9214 -9723142 -6442003 -10769522 -13095130 -8164249 -2236936 451904 2877535 3936126
9206 3936126 -2305930 -12142493 -12618229 -1445286 8421861 9380703 8914031 12459976 12732958
9197 12732958 5043643 -1608012 806820 6564123 8307830 9229711 12264599 9836897
9189 9836897 -2946009 -15955367 -17861546 -12265629 -7651400 -2455426 5625242 7205036
9181 7205036 -4037399 -13872350 -5392249 12049959 13976764 -1907533 -12571740 -5158556
9173 -5158556 7264067 11213128 12343540 18709881 22545600 13440139 -2219140 -9532156
9165 -9532156 -5484207 1396229 6143701 10058990 11586069 5957130 -5957033 -16610141
9157 -16610141 -20245259 -17113295 -10361793 -4086787 -2901055 -7351454 -10626497 -6080714
9149 -6080714 2165506 2997994 -5860090 -12696399 -6515522 8369982 18227316 17333994
9141 17333994 12644820 11463461 11940868 9066296 4037273 1672164 1879879 604612
9133 604612 -2062363 -2044743 173137 -892228 -5266006 -4776859 4238102 12582318 9702079
9124 9702079 -1428627 -8849276 -7915857 -4930355 -5900533 -9634648 -12583044 -14035876
9116 -14035876 -14819776 -14841456 -12703135 -5783043 7061407 20346777 24407351 17864972
9108 17864972 11650198 13268767 14082441 3484920 -10584501 -11038151 1308349 8413559
9100 8413559 3869096 1046177 6582306 6699192 -7749927 -21162237 -15558102 1031958
9092 1031958 8564582 7025313 11981804 23882828 26283328 15437558 8363103 15218964
9084 15218964 23817601 21197916 13543466 12513841 15436966 12967700 6578168 4193392
9076 4193392 5013642 2487391 -1645516 462625 8183563 12108259 8519979 3545251
9068 3545251 1789156 756495 -1249937 -1126135 1337418 74690 -7486077 -13652996
9060 -13652996 -10014358 162067 5808224 2963388 -363604 4347743 13846592 15714980
9052 15714980 3202466 -14810451 -21283387 -9084958 10822641 21308509 17013242
9045 17013242 7214809 2800227 5458482 9825747 10962858 7526580 1421951 -3124392
9037 -3124392 -2863985 194702 595136 -2818701 -4442727 249772 7777089 10997295 7709945
9028 7709945 1072191 -6399770 -14623959 -22432091 -26539186 -24796960 -18119639 -9382959
9020 -9382959 -2584618 -1939368 -8270800 -16276428 -18634469 -13522034 -5672888 107116
9012 107116 3430268 5545279 5248145 153707 -8751242 -15797661 -15123657 -7159759 171428
9003 171428 -811905 -8267771 -12788717 -10118278 -6960805 -10020064 -14367498 -10170184 1829631
8994 1829631 10483365 9540360 3840363 -806780 -4351422 -6216511 -2320847 5987029
8986 5987029 9104953 2970386 -1956939 5423546 20162620 28516674 26964537 22787911
8978 22787911 19178236 12424180 3054795 -2987761 -5487374 -9775119 -13023306 -4446274
8970 -4446274 14855630 25412633 12970278 -10781846 -22481021 -15945939 -5395633
8963 -5395633 -3781087 -9478738 -13584940 -10322548 579138 13758905 19655346 13156985
8955 13156985 1306252 -4445172 -3419007 -4779488 -10645050 -10500280 2502297 18329282
8947 18329282 21364773 10293051 -1596378 -4190766 -730653 778174 -615763 -7016
8939 -7016 3693728 4961879 -320368 -7803549 -9225096 -3041630 3468527 3717672 -255803
8930 -255803 -1675554 2278690 8753984 13498197 13256882 6582547 -3053638 -6915919 654443
8921 654443 13973927 21037441 16795881 7243778 1096171 2125843 8470295 13562105
8913 13562105 8778544 -7399709 -22650764 -21413448 -4088584 12168339 14215510 6247451
8905 6247451 -751075 -3320169 -3249351 473763 8932231 17928147 23151201 26424710 30075663
8896 30075663 30162289 23092006 14242560 11105715 11566262 8440435 2661473 1342445 4020802
8887 4020802 2156026 -6326599 -12454478 -9604236 -2824709 -159234 -1287908 -39516
8879 -39516 5901652 12418338 14355100 11005134 6879505 6884857 9677731 8236513 -254675
8870 -254675 -8707772 -8966758 -2652561 2775729 4868396 5646324 4394047 702203 1319493
8861 1319493 12052596 24435508 23867988 11589588 4408568 10006653 17269674 15937394
8853 15937394 10636982 7780908 3376136 -5425596 -9782366 -3078830 5378266 4359054
8845 4359054 -789845 1542766 8112055 6296431 -4348095 -12416900 -13471730 -12277957
8837 -12277957 -8234670 3838376 17413204 16641432 7697 -13808931 -10552727 2126954
8829 2126954 9082902 7517182 3655431 -80608 -4215023 -5725204 -2493469 258280
8821 258280 -3568376 -11501362 -16556791 -17260965 -16800160 -15323912 -10316739 -3161329 857503
8812 857503 -1097424 -6820908 -11583942 -10610147 -2059558 9073753 13635174 9030918
8804 9030918 3538337 5100581 9956505 8939104 1796344 -2927362 -1336268 659736
8796 659736 -3130152 -11380670 -19155710 -23674060 -23302391 -16068321 -3315692 8585317
8788 8585317 14285945 15237734 16148320 17577632 15863936 9588348 2199161 -2546211 -4891204
8779 -4891204 -7389445 -10620933 -12180734 -9450338 -2705910 4157146 6257032 2562978
8771 2562978 -1811955 -473379 6121006 10268278 7043327 1507366 1527675 5871833 6108953
8762 6108953 77110 -4612687 -3257043 -2015635 -7003533 -12161868 -7259679 5449741
8754 5449741 13002572 10261437 6743277 11794863 21289107 24469795 18174658 8035167
8746 8035167 -718440 -6939009 -9498180 -6261719 1107902 5756011 2336589 -6416746
8738 -6416746 -12502624 -11661820 -6891084 -2338162 2660020 9836517 14884944 10551323
8730 10551323 -2379751 -13594620 -15533363 -11297933 -6862508 -2400581 2758786 3717169
8722 3717169 -2319860 -7272000 -2130414 7560254 8503616 782803 -1485977 7413971
8714 7413971 15577261 12146125 2933902 -461876 2874570 6688585 9599970 13782533
8706 13782533 17110922 16153547 13496698 13820462 15496559 13524712 8210260 3683585
8698 3683585 -154949 -7234996 -17946453 -27823289 -32515714 -29879165 -19685087 -5885718
8690 -5885718 3765143 5163376 1973958 -1533982 -6485234 -12735851 -12921514 -2287889
8682 -2287889 10261077 11643416 2900891 -2529377 1839401 8298612 8066762 2313035
8674 2313035 -2168719 -919990 6160399 14330637 15339665 6363800 -2799291 60618
8666 60618 12164853 18278564 11749642 2266068 -346933 1115695 153448 -1920452 -813122
8657 -813122 2396743 5394940 10303833 17582960 20782242 15941296 10526108 13425923
8649 13425923 20531736 20805078 13696694 8782900 8602292 4442515 -7343368 -16048212
8641 -16048212 -10781728 3473816 12172689 9593484 3206188 1503069 4922319 9356067
8633 9356067 12143093 12083388 8263930 2139928 -2444272 -4261064 -6529413 -10405627 -10634043
8624 -10634043 -3485490 3999973 1214682 -9506506 -13032218 -1739604 12894737 15436371
8616 15436371 6434238 -1052857 -97562 4603776 7757126 9820029 11162911 8524078
8608 8524078 747513 -7560668 -11442802 -11395073 -11951620 -16624609 -24129651 -27611671 -20099291
8599 -20099291 -4336607 6721100 5196536 -189955 3526558 13597819 16042604 8825280
8591 8825280 5944288 14937512 24514691 22281179 13287938 11053639 18207354 25822646
8583 25822646 26195847 17821915 3322063 -9177591 -8363938 7100671 22392387 23196460
8575 23196460 14460198 12101577 19579379 25110311 21404082 15093052 13406317 12654234
8567 12654234 5977594 -5032920 -12906637 -14057882 -10758385 -6212973 -2028767 840236
8559 840236 1834364 1280390 -10781 -1126782 -1128689 -86554 348398 -738036 -1006648
8550 -1006648 3051374 11187174 18220564 18397732 10599063 -242579 -6770021 -5650772
8542 -5650772 -782829 1357836 -967293 -4584820 -7225603 -8831689 -7747092 -2117909
8534 -2117909 4226937 4884139 1699280 3641779 11490307 13979665 5419327 -3568641
8526 -3568641 -2209321 3516195 2208799 -3312780 -2516913 2955566 2769477 -1957892 70540
8517 70540 8931429 11527194 4032548 -1616128 503161 -191138 -9720304 -14152232 372045
8508 372045 23444042 32176228 21396660 7621308 5424837 12703337 19605846 21167010
8500 21167010 18140902 12522307 6007054 52083 -4121685 -5044016 -2248940 742475
8492 742475 -2074598 -11979569 -22181053 -23849509 -13776434 3638434 17966085 17522188
8484 17522188 250272 -19130498 -21756587 -7276132 5487789 4197210 -2298168 -1895935
8476 -1895935 840581 -4777876 -14684997 -15594425 -6818857 -730776 -2446176 -3907688
8468 -3907688 106732 3722553 1922833 -527205 2303132 8466603 12991680 15023988
8460 15023988 15655300 14771112 14134768 17438949 22635997 20156462 5043633 -13031922
8452 -13031922 -18817028 -9640833 1237210 825739 -8146223 -11696099 -3469668 6321254
8444 6321254 5027996 -3507669 -3369491 9683885 20472352 16427701 6419976 6843166
8436 6843166 17419311 24683813 23870794 21424101 18639428 10480169 992161 1039305 6878318
8427 6878318 702073 -19470827 -30396168 -17431597 375853 -2127659 -17534655 -18114329
8419 -18114329 956203 16071306 12702588 3941803 4975456 10231756 8254088 3710262
8411 3710262 8895410 21720642 27205244 18296673 3539988 -5890668 -7873306 -6863557
8403 -6863557 -6431550 -6538823 -4687174 1296774 9522730 13881004 10503942 3457160 548727
8394 548727 3847747 7902531 7586396 4046926 1433399 650961 -1035632 -5238023 -9682967
8385 -9682967 -10892204 -8663941 -6688336 -8190968 -11706651 -12565872 -8674908 -3273118
8377 -3273118 -1175470 -3490187 -6871054 -6806783 -1066356 8068457 13600434 8409111 -6846824
8368 -6846824 -21866355 -26271472 -20297915 -12300747 -6686416 -209676 8548131 13039149
8360 13039149 7401636 -3055197 -6798106 -324918 8267008 9805566 3009353 -7189385
8352 -7189385 -14857609 -15501436 -8601611 149660 3562214 1785767 1740464 5909612 8026581
8343 8026581 3927719 169124 4908752 14730435 18965532 15224542 12186201 16585955
8335 16585955 24882576 29583599 27733056 21014349 12778839 7486601 8579747 14080747
8327 14080747 17437597 14599070 7481925 -160276 -6427601 -10139392 -10560939 -9502578
8319 -9502578 -9204708 -7234005 933684 12711161 18415339 13645427 5086883 -384109
8311 -384109 -5663634 -16093308 -27751030 -31201234 -24073927 -12618540 -2879695 2687172
8303 2687172 1992350 -5093109 -12319153 -12095161 -5694413 -1238961 -697402 2896813 12513186
8294 12513186 19657313 15457964 3376118 -5752137 -7731721 -7287196 -8178099 -8268764 -5647241
8285 -5647241 -3821076 -7059128 -13151275 -14784207 -8413270 767826 4374615 432546
8277 432546 -4559059 -3407979 3962902 11679866 14890055 13241659 8802669 3873216
8269 3873216 987581 1885619 5048007 6255556 3122512 -2029353 -4867774 -3877599 -1858618
8260 -1858618 -2940262 -7807542 -11441866 -7370130 3604838 10938259 5437287 -7264628
8252 -7264628 -10701897 1738867 16027505 13864081 -3715176 -17734829 -16034081 -6978701
8244 -6978701 -4507026 -8487544 -8671727 -2790985 872868 -1290961 -1877101 4551674 11518633
8235 11518633 10377351 2954417 -3421438 -7809134 -13025156 -15092080 -6848662 8318764
8227 8318764 17478690 14816670 7307074 1318326 -5430574 -13746792 -16192591 -9016091
8219 -9016091 -1855106 -4974611 -13042383 -12700303 -2144143 8080630 11245003 9958200
8211 9958200 6636523 402414 -5252000 -3132354 5862083 11270852 7380178 189823
8203 189823 -4013390 -7592024 -13016673 -14470277 -6818415 3537352 6570904 3212145
8195 3212145 1936820 3202352 -1580828 -14451584 -24576205 -22081035 -11003401 -2814349
8187 -2814349 -1708716 -2203931 1293309 8384737 15509863 19929262 20281331 17096583 13881546
8178 13881546 14404701 17538326 17799852 12448917 4722357 -1693890 -6937311 -10455339
8170 -10455339 -7671880 2308056 9928856 5445612 -5713145 -8534070 -18825 6894073
8162 6894073 4628573 2844152 10689563 19447586 15712023 2985322 -5029822 -6973777
8154 -6973777 -12780296 -22269456 -22825252 -10991035 285584 1708639 231958 4036073
8146 4036073 8320381 6008303 1535988 2542735 6116008 4835528 180776 -1383752
8138 -1383752 -666474 -2851200 -6226567 -5126078 -1527290 -2481353 -7344122 -8632165 -5403803
8129 -5403803 -4942119 -10047825 -14984733 -16183561 -17220297 -20108509 -20828220 -17500274 -14622444
8120 -14622444 -14557655 -12532570 -5280987 2547551 6376929 9208481 14435973 17668749
8112 17668749 13986765 8070459 7512808 9704185 6161442 -1696191 -3071476 4371208
8104 4371208 9178484 3687390 -3714508 -2049818 4965536 5888952 609756 -45571 7301238
8095 7301238 13036023 10225319 4954554 5344731 8863638 7948559 2088627 -3509688 -6725992
8086 -6725992 -7969142 -4538336 5429060 15427247 16536984 10668539 8398477 12564995
8078 12564995 14037385 7100750 -860772 -1222260 2471104 1161902 -5212368 -9135733
8070 -9135733 -8737958 -10048579 -15226962 -16644986 -6749397 10502857 22596368 22027997
8062 22027997 13940210 9250351 11795770 14890633 11156477 2385570 -3628874 -3607411
8054 -3607411 -1120698 468200 1369398 1285743 -1587680 -5582765 -5671688 -1224238 2255072
8045 2255072 2212463 3482296 9410044 14989675 14591258 10751383 8379670 5185063 -3915845
8036 -3915845 -16035962 -22395666 -19648457 -11507023 -384657 14192188 28456776 34093576
8028 34093576 28179447 17859362 12041881 12245994 14008211 14025254 12973922 12487098 11562476
8019 11562476 7361411 513694 -2313208 4146703 13759161 13632916 1913018 -7044987
8011 -7044987 -1694051 9973330 12165932 4075519 -913649 3968022 11539533 14375925
8003 14375925 13700335 12092354 8330127 3490689 2494033 4755480 1846651 -10217272
7995 -10217272 -23725629 -29363659 -26596348 -19209194 -8260148 4157794 11263708 9561582
7987 9561582 5313324 5642425 7946767 5990593 2098231 3947645 11473441 16308932
7979 16308932 14166851 9624442 7680691 7766550 7884349 8496442 9852411 10128970 8373477
7970 8373477 5708901 2592582 -1187127 -3191895 112788 7200396 12055653 12756776
7962 12756776 13598931 15519851 11330582 -2865603 -16747954 -15859367 -1330078 10238213
7954 10238213 8459886 1530460 2184663 9365259 11809738 4993145 -4557685 -9950564
7946 -9950564 -10230106 -6180788 1462825 7817541 6079576 -2321443 -6595944 -123543
7938 -123543 10686819 15966940 15396183 15598500 18709273 20279067 16462444 7682921 -3290082
7929 -3290082 -12359693 -15260396 -12105721 -8475811 -7865589 -6380127 68954 7134308
7921 7134308 7240570 683977 -5427542 -7327122 -6780730 -4921514 -1128192 3040136 5474749
7912 5474749 7547201 9882748 7070887 -4561071 -16317853 -15254095 -2763452 6164267
7904 6164267 3661331 -2329776 -2873472 -37931 1010845 1684359 5055842 9110375 11109781
7895 11109781 12038613 11564200 5741674 -4746706 -11332091 -8865725 -3589069 -3178939
7887 -3178939 -5000258 -1566244 7384197 15660051 19627996 19802320 16732847 11474051
7879 11474051 7718960 8517732 12741840 17253330 19065278 14597616 3726941 -3890087
7871 -3890087 3531075 21781661 31392559 23212762 11275529 10497204 14213722 8254500
7863 8254500 -3496194 -6410712 -1470681 -3194555 -12520306 -13281848 10959 10600573
7855 10600573 4661489 -7825449 -9026474 1527080 10276911 10517908 7462744 6458231
7847 6458231 7341142 9410633 12920910 15100207 11732588 4059023 -1162642 -49682
7839 -49682 4078619 6528343 7666768 10336560 13130801 11233190 5065278 3093026 10964325
7830 10964325 20437438 16731436 -1919734 -19711403 -22163801 -12703487 -4792477 -4136144
7822 -4136144 -6702612 -9148981 -11103584 -9708967 -2349426 5570430 5156804 -3162054
7814 -3162054 -10166704 -11364099 -10353415 -8222932 -1206288 7948695 8310806 -3016477
7806 -3016477 -13116339 -9921469 1437260 7918079 7382178 7604857 10797614 10615553
7798 10615553 4310216 -1896085 -2081835 1122697 427038 -7369197 -17846869 -22039550
7790 -22039550 -13657469 3772435 17715600 17974257 7231405 -2125181 -1058024 8448545
7782 8448545 17353181 18224016 10856217 1972011 -1341207 407892 -254793 -7184526 -14414515
7773 -14414515 -14816979 -11251948 -12107153 -17307871 -17140555 -6651768 6284708 11113102
7765 11113102 7179919 1788544 292359 3203196 9556008 17186193 21503183 19699661
7757 19699661 15428398 14161689 14687740 11072059 3019991 -2485113 -1454816 2072222
7749 2072222 4163519 6806971 10505581 8422447 -3575151 -15950908 -14978231 -1450631
7741 -1450631 10392507 12630874 11439347 12887496 12551519 5423512 -3356490 -6117977
7733 -6117977 -4304723 -3679239 -2963321 3109619 12228659 15621830 10381406 2695791 -1545004
7724 -1545004 -2358524 -1298762 1783273 5910187 8220898 7878033 6983639 6857122 6766528
7715 6766528 6240498 5373485 3848003 2941576 5929819 11894937 12802478 3835691 -6472581
7706 -6472581 -5727844 4108028 8597472 1697334 -6360377 -5170189 2567415 8986711
7698 8986711 12450511 14061087 11109587 2411377 -5694232 -6853235 -3950659 -3579601
7690 -3579601 -5235427 -3495705 2075309 6556528 7288040 5559000 2548376 -690762
7682 -690762 -1298552 1774669 4572811 4057914 4197830 9765075 17163974 19005992 15490611
7673 15490611 13041867 13348037 12796474 11990721 15607482 21376393 19240170 5154239
7665 5154239 -12325841 -22683739 -23127401 -14928543 449193 16496055 22473001 16886718
7657 16886718 12406462 18542853 26409679 21357095 5308426 -5958770 -4874449 1792860
7649 1792860 7962978 14810265 19775840 14180896 -808207 -8737351 935621 15909230
7641 15909230 17580531 7233091 1526373 6015390 9211950 3834095 -1599883 1816079
7633 1816079 8749585 8992448 3025097 -960584 -480419 -690582 -5538652 -13705188 -21511107
7624 -21511107 -24652286 -19473835 -7738493 2214180 4128875 1233667 211859 1403373
7616 1403373 1407343 1857873 6928198 13659488 14302216 8979784 6706627 11348283 15561664
7607 15561664 13130543 9195347 11542921 17587586 17839611 9372997 -1366030 -8015002
7599 -8015002 -10095384 -9150356 -4964854 2091122 8605572 10827387 8603645 5239260
7591 5239260 4367371 7691033 14319825 20547531 21050110 13268543 2133345 -2071335
7583 -2071335 5801934 18205487 22389142 16029253 9704136 11211904 14282693 9367919
7575 9367919 34239 -1622344 5809065 9886342 2965207 -6364788 -6515298 372021
7567 372021 3092880 -1945983 -7439060 -7043931 -2767312 313847 755898 284326 833877
7558 833877 4065373 10628691 17717815 19887774 15086193 8466598 7002207 10321558
7550 10321558 10369699 2133136 -8298538 -10558267 -3643889 2876099 2317278 -857607
7542 -857607 -30519 2535083 653453 -4002406 -4184158 170637 1116961 -3981802 -7653309
7533 -7653309 -4618519 -579947 -2758822 -7990944 -7546319 -89067 7364842 9821972
7525 9821972 9209926 8695377 7074760 599158 -11438383 -23477058 -26092253 -14060547
7517 -14060547 6412992 21150160 21076039 9965025 -2138021 -9419755 -11418383 -8263169
7509 -8263169 -779260 6420079 7948564 4154115 250081 -1253893 -2732955 -5270581
7501 -5270581 -5297747 -140382 6978473 11452272 14180206 18804838 23054863 19580776 8029460
7492 8029460 -95453 4971214 16702196 19924727 11718260 4119699 3827181 1270165
7484 1270165 -12574817 -28927052 -32609196 -24033356 -16306244 -13994863 -9299926 1035260
7476 1035260 9554999 11258900 9668387 6329954 -2391922 -13218324 -14524292 -4310006
7468 -4310006 3724971 1466162 670483 13365829 29352418 29440012 14232945 2948553
7460 2948553 6422310 16808343 23644597 25638308 24566739 20085432 14196920 11214094
7452 11214094 10390930 6826580 1207605 -105311 3832492 6652525 5859903 6220863 9006100
7443 9006100 7921882 587601 -5204164 -2903800 3066526 5717419 6235857 8349123
7435 8349123 8332343 519871 -10795062 -15184814 -11040889 -7392423 -9659260 -12204369
7427 -12204369 -8460329 -1350992 1739873 -260004 -2398179 -2218302 -1794157 -2006502 -1085427
7418 -1085427 135742 -2223625 -7448911 -8197325 -1101108 5747814 2887427 -6642394
7410 -6642394 -12002508 -10900006 -11010553 -14952766 -15431801 -9120331 -4442719 -8737723 -16483224
7401 -16483224 -18263885 -14212869 -10055682 -6224090 -303106 4991571 6188062 7013819
7393 7013819 11800972 15131514 9608019 752430 884734 8996082 10723192 336504
7385 336504 -10825323 -12313099 -8525442 -8208038 -10759474 -11195015 -10241903 -10420478 -8238449
7376 -8238449 462950 11193463 15358779 12074849 8131305 7388444 7061582 4662392
7368 4662392 2515945 3442990 5933918 6238257 3691745 1775056 3363647 5967999 3965861
7359 3965861 -3275399 -8234147 -3730434 6985183 13353252 10614096 4931574 4319814
7351 4319814 8844249 11822366 7629821 -3138288 -13591098 -15066625 -5074425 8534329
7343 8534329 14507696 9701366 615203 -5622142 -6947962 -3615543 3634796 11021274
7335 11021274 13347874 10699465 8315641 7645435 3677755 -5259814 -11234109 -6095943
7327 -6095943 6621784 15138432 13081492 4967653 -971743 -1160525 2408637 6464706
7319 6464706 9758385 12023413 10785208 2444022 -10899307 -18781763 -12171222 4493972
7311 4493972 16498585 14769024 3978277 -5277365 -6827767 -920472 7980574 13744451
7303 13744451 14143015 14643602 20928223 28016569 25208736 12808975 3693891 4701072
7295 4701072 7100701 1743996 -6364732 -7238128 -1382958 3748795 6287333 8422977
7287 8422977 7412238 -587530 -10527703 -13145949 -8275514 -3577044 -1166304 3991057
7279 3991057 12122884 15797097 11548130 5314266 2892280 2491939 256041 -3362352
7271 -3362352 -6134670 -7220616 -5015959 2162351 10380829 11697125 5422901 1169920
7263 1169920 5332497 10815184 7527057 -1721340 -4943945 1410486 8197309 8014765
7255 8014765 5002179 6220217 10235104 10430877 5685127 1349627 1284432 4443193 8401318
7246 8401318 10814912 7915967 -2168165 -13763856 -17789517 -13633836 -10463455 -13776532
7238 -13776532 -17844160 -16112208 -11326895 -8301195 -4401389 2795143 5430030 -3319150
7230 -3319150 -12216105 -3253932 19564865 30741636 18314503 1601235 3620616 19696041
7222 19696041 27278018 17367866 1151996 -9113404 -11221066 -7167728 873447 8351978
7214 8351978 11706835 13583940 16826225 16302742 6929999 -3213306 -1070238 10258610
7206 10258610 13085282 1354523 -8979495 -3341378 9976578 12993576 4436494 -521188
7198 -521188 6017973 14479953 13835001 7330792 5616235 9940437 10715640 2728265 -5461633
7189 -5461633 -1802765 12936015 24991358 23805874 13139813 4150572 2274868 4657466
7181 4657466 6737072 6088739 1247615 -8170947 -19334382 -26706249 -25382394 -14102079
7173 -14102079 2573317 14660788 14118249 4561465 -1126511 3360471 9552149 6983626
7165 6983626 -1704940 -6350480 -5234858 -5107525 -7155884 -4314458 5681043 14473157
7157 14473157 14369024 8189058 3720525 4054593 7204201 10266511 10001361 3448207 -7736008
7148 -7736008 -15998268 -14435789 -3785204 8346987 14034767 11024208 4399512 1860247
7140 1860247 5222326 8262760 5779111 1588692 2587919 8162588 12457364 14437030
7132 14437030 16743378 16010825 5441033 -11217695 -19308618 -11542529 2425212 9898424
7124 9898424 10079205 8854390 7026380 2724442 -11653 4783345 13937492 16443093
7116 16443093 6901499 -7630923 -15738230 -13726923 -8410247 -8580827 -14412394 -17430237
7108 -17430237 -12632497 -6420256 -6648580 -8654792 -1358678 13453756 20395866 12410247
7100 12410247 1160013 -1063910 1532467 -1328597 -7813702 -8003212 -394116 6917615
7092 6917615 8305319 4527834 -2085839 -7607585 -5405431 5760653 15986361 15622341
7084 15622341 8445427 3872193 1408433 -4448520 -8374507 247872 16481787 22120592
7076 22120592 12754494 5880427 14447271 27457338 28160464 19313539 15781251 19317850
7068 19317850 16584841 1241206 -15354719 -18842293 -8758890 3068071 5821748 -1620865
7060 -1620865 -11593023 -14319379 -5799958 8398606 17643613 15964782 7599232 2339499
7052 2339499 5096765 10929249 11832682 7558060 5908829 11057162 16389186 13204837
7044 13204837 2868217 -5486142 -7063560 -4867993 -2525019 -737682 -664556 -3560372
7036 -3560372 -6167461 -3424533 2768706 4251873 -1973806 -9340282 -10717334 -5879833
7028 -5879833 1293760 6494583 5016682 -4006360 -12316906 -10529185 -2453636 -70756
7020 -70756 -2454890 4769150 22740915 30164392 14408348 -4054553 1648990 24130430
7012 24130430 31654985 14963442 -1119150 3260477 15922720 15625927 3463406 -4387755
7004 -4387755 -3437533 -3144714 -7312226 -8085375 -614918 8114568 9478307 5034057 2877774
6995 2877774 5557039 6913351 1270561 -8255963 -13719543 -12534935 -8760859 -4354584
6987 -4354584 3921052 15780688 23069737 20712091 15822120 17124738 20255387 14610459
6979 14610459 1938008 -4613413 -148999 5898063 5760052 3299220 3604446 3776906
6971 3776906 317921 -3331543 -3044057 -468507 1994081 5338747 8475928 6678171
6963 6678171 319481 -3440750 -2646458 -4381951 -10731825 -12242872 -3808230 4460660
6955 4460660 3298554 275909 5850772 12926993 7476140 -6203294 -9380137 3293289
6947 3293289 17328729 21407160 20713778 23014905 25598723 22843282 16225024 9975640
6939 9975640 4594338 496936 1710535 10388853 21662103 27595530 23986148 13242843
6931 13242843 4041444 5691005 16729947 22187359 10794181 -7825097 -14116170 -5086500
6923 -5086500 3611418 2919820 2283908 10991266 22178390 24958859 21345310 19902253
6915 19902253 20268675 15533583 5754907 -1228502 -1034893 2720564 4397618 1896285
6907 1896285 -2347583 -2620133 5095362 16682376 22524070 19614198 15941257 18709610
6899 18709610 23653234 21953756 13777569 8195654 10904668 17190192 17679992 9172989
6891 9172989 -539822 -124936 10721236 17620665 8663513 -8033296 -13808181 -5086543
6883 -5086543 3243831 1666165 -1479064 2732752 8321755 6004756 -1384491 -6320000
6875 -6320000 -9633454 -14135715 -13888518 -3349908 9154091 10802797 2800923 -3167105
6867 -3167105 -3012456 -1900016 -1246686 2298344 6556699 5706255 1964095 3086744 8571766
6858 8571766 10582049 8378769 8885884 12208301 10285553 2445428 -1391424 2472747
6850 2472747 4449399 -2030470 -8454361 -3768285 9459041 19688105 21171673 16928619
6842 16928619 12025593 10485385 14778097 22141829 24297116 16371233 4413710 -462752
6834 -462752 5157445 12959462 11671730 -967678 -14870430 -17226602 -6414481 5994308
6826 5994308 8550808 1108276 -9769017 -19782476 -25404004 -20935036 -7021057 3565619
6818 3565619 671231 -6796078 -2726875 10764054 15580072 4965502 -8504803 -14608589
6810 -14608589 -17180514 -18700679 -11711190 4440377 14707697 9142449 -675035 239883
6802 239883 7273358 6453277 -1831503 -5976903 -3714183 -2824500 -4610648 -2435515 3894958
6793 3894958 6060699 407081 -7678738 -12554387 -12055678 -4495438 7553874 13259495
6785 13259495 5802619 -3421875 2651100 20232031 26953937 13906484 -1187325 -221598
6777 -221598 10805869 14713131 9010768 5167279 8570899 12722188 11281058 4869105
6769 4869105 -3923140 -13224153 -18747979 -15797918 -6745434 -949872 -4480326 -13144413
6761 -13144413 -17415647 -11946207 605947 12867793 18863384 18237123 14931448 11593154
6753 11593154 7118775 999587 -3169342 -2557683 -1328438 -6141507 -15277412 -18544255
6745 -18544255 -10662835 818391 5601696 4332850 5768121 12469990 17088012 13755017
6737 13755017 5778726 -1253920 -7382181 -13906343 -16790014 -12512405 -7504950 -11899794
6729 -11899794 -22987765 -24589721 -7767172 15101586 24062323 15313168 3531562 1921201
6721 1921201 7808834 10154854 5248507 -41280 1352347 7644989 10864429 6647790
6713 6647790 -764001 -3793460 -382487 4151590 3788606 -1860447 -8517843 -12205642
6705 -12205642 -11591295 -7386807 -2102630 574336 -758339 -2224214 1843408 11214221
6697 11214221 18365263 17260694 11421220 9299544 12211902 12084967 3385538 -7687640
6689 -7687640 -10898870 -5724485 -1027919 -2326195 -6509918 -9277614 -9616675 -5116869
6681 -5116869 7699797 23640335 28851310 18235784 4706113 1665403 4094701 -689066
6673 -689066 -10264205 -11287402 -3369483 -390304 -6335222 -8520525 -1027381 3060880
6665 3060880 -6511418 -18463368 -17049125 -6022968 3460 -734377 893278 4817202
6657 4817202 1679937 -8333762 -13524548 -9742284 -6599525 -10482646 -14317385 -10026055
6649 -10026055 -467591 7325866 11877287 14042601 12076619 6310575 1696822 -389531
6641 -389531 -5536152 -14727059 -17599034 -7034413 6203925 5975749 -5445551 -9783947
6633 -9783947 877169 14268642 18540848 18804497 23872575 27680226 18121327 -540849
6625 -540849 -9398202 -330891 13109137 14827780 5746191 -2446895 -4655652 -4699803 -5548447
6616 -5548447 -6362993 -6901113 -7267664 -5193804 -530190 171674 -7895257 -16439494 -11428534
6607 -11428534 6849378 20662455 15473342 -3491696 -18829951 -19088801 -6608698 6577060
6599 6577060 8081356 -3457072 -14315362 -9955435 5139596 11168679 -335834 -14528825
6591 -14528825 -14179253 -1889733 7629802 8131837 3421431 -4287733 -14649172 -21977185
6583 -21977185 -20417357 -14585911 -14058191 -18754541 -20448190 -17274203 -15195412 -15390312
6575 -15390312 -12298007 -5752056 -3304374 -7113347 -9023999 -3048572 6315665 12406379
6567 12406379 14210276 11443038 1189690 -14036905 -22912413 -17898425 -5611440 2692616
6559 2692616 5887751 10282645 16345857 17753858 12969197 8915158 10674653 13754865
6551 13754865 10570150 1400984 -5264342 -2991484 5013892 10132970 8510146 4102291
6543 4102291 1794133 1839479 3385278 8697114 18553637 26690177 25870771 18341748 12985603
6534 12985603 12179496 9434802 1466484 -5885486 -7293958 -5712065 -5559507 -5115234 -1908397
6525 -1908397 318834 -2511631 -6549276 -5814808 -3052495 -5740570 -12544217 -13370149 -4503212
6516 -4503212 4931394 5417741 -789361 -4935746 -4308220 -3732951 -7135161 -12910560 -16743307
6507 -16743307 -15008491 -6454318 5444186 12895318 11401434 6554694 7593625 13725239
6499 13725239 14013212 3766362 -6783917 -6493855 690050 3020821 -400030 -278418
6491 -278418 4898693 5426591 -1717981 -4975278 4149095 16680908 19729206 15688827
6483 15688827 15535345 18996254 15596064 3446765 -6935760 -9045376 -8442708 -10855389
6475 -10855389 -12509612 -7542561 2281670 10006921 10439618 2207511 -11073702 -19701638
6467 -19701638 -15296322 -2440559 4429897 -447567 -6446035 -2392543 7726112 12202539
6459 12202539 8446263 3587465 2099595 1707489 72862 -2259509 -5159866 -8478433
6451 -8478433 -8663399 -2465443 5688948 6826670 -449583 -7194582 -6125939 -709610
6443 -709610 1635357 457812 768500 3647171 5101446 3956081 4254295 7689945 9390121
6434 9390121 5360117 -299718 -1368023 121968 -3337611 -12057240 -16997340 -12422957
6426 -12422957 -3788367 749826 686381 246667 286316 -1187010 -4287892 -8492354 -14804936
6417 -14804936 -21184114 -20400419 -9766779 839752 -534576 -11418265 -17609273 -11383788
6409 -11383788 1342846 11185327 13817853 8923818 420145 -1746049 9439072 25090947
6401 25090947 27003290 11165601 -5178771 -5262063 7448585 17469431 16876635 8883345
6393 8883345 -1183127 -9020337 -9271829 343567 12919590 16732893 6961193 -9772445
6385 -9772445 -22377973 -25159150 -21583020 -19159822 -20166274 -19268248 -12517140 -4779976
6377 -4779976 -2687488 -4026277 -2244381 1812813 3053985 4186229 11237260 18218026
6369 18218026 12644217 -1737987 -6314137 2562214 5111273 -9699142 -23358577 -15741182
6361 -15741182 3160021 10437851 6465346 9725961 22726943 28478616 20120198 10851125
6353 10851125 11003794 14983800 15918971 15835797 15289406 8482660 -4183451 -11724551 -7479323
6344 -7479323 2572113 11200605 17919471 20922799 14067841 -1094732 -11811186 -10293930
6336 -10293930 -3569822 -665175 -443677 698173 -127072 -4867706 -7672462 -4323372
6328 -4323372 -11228 308357 48483 1350585 -1842647 -10926500 -14312113 -5052758 3915783
6319 3915783 -1805089 -13343874 -11127629 3724635 11589806 5979834 920055 4054352
6311 4054352 4226509 -6321165 -16615517 -15102914 -7378463 -3092243 1123580 10793556
6303 10793556 16937117 7862589 -8886619 -14258557 -5250300 1746166 -3999960 -14186747
6295 -14186747 -16545321 -10104386 -50525 11589480 23170517 29430654 27157938 19471831
6287 19471831 9995875 -935351 -10027698 -9014136 3978409 17355221 18613988 9820456
6279 9820456 2834831 2780763 4549779 3270122 -336441 -4245526 -7080616 -5813849 1791176
6270 1791176 12384941 20367037 24963150 27968459 26742587 17745894 5812106 316271
6262 316271 1705209 1627849 -2317275 -2891875 2423784 4575121 -3288934 -14326324 -17542421
6253 -17542421 -11568474 -2180628 6664956 11756118 7576247 -6268988 -19077783 -19528059
6245 -19528059 -9424213 382519 4657523 6799892 9866595 12463193 12833773 11325119
6237 11325119 9602366 10560376 15501071 18726958 11865302 -1775490 -6466871 4191062
6229 4191062 14675118 8672638 -6156133 -10251798 -2343492 1522600 -3408664 -4016400
6221 -4016400 5651558 12769489 6868079 -4221951 -9361298 -10935707 -15647985 -20246062
6213 -20246062 -18582262 -14014551 -12783462 -11757565 -4293456 6533121 11144177 6706795
6205 6706795 -1386929 -7833505 -9651947 -4457269 5424841 11172618 7676344 1124256
6197 1124256 -1599772 -5210616 -16831821 -29256992 -27249738 -10103378 5334684 6754547
6189 6754547 46463 -3216920 -1529264 -130800 281745 3321015 8892047 12289411
6181 12289411 10572631 5391429 -535891 -6537549 -12400477 -15107920 -9578508 5114507
6173 5114507 20807200 25543517 16113846 2329315 -3824307 -298569 6228667 9145791
6165 9145791 5222751 -5914712 -18990053 -23427911 -14249561 -353431 5704977 3670796
6157 3670796 2443041 3689696 798869 -5543904 -4665390 6491902 15879209 14231046
6149 14231046 9257283 11641462 16228113 10581044 -3157309 -9743556 -3461405 4333103
6141 4333103 3094608 -3045550 -4628194 -1028208 1869100 2295892 3370532 6017565
6133 6017565 7662884 7265332 6607527 6416803 5178418 2540880 689306 858779 541320
6124 541320 -3962657 -12625659 -20253796 -20178375 -9908979 5788920 17322180 17299562 6641054
6115 6641054 -6512783 -14795155 -17761056 -18658488 -16764110 -7733496 6940439 16568218
6107 16568218 13138680 3147724 -353782 3601086 3171419 -6114478 -11814918 -2813949
6099 -2813949 12271579 16385722 7722745 -1271115 -5303210 -10905210 -18792276 -18546030
6091 -18546030 -7440394 637129 -4433575 -12327452 -9026075 354250 1640121 -3065303
6083 -3065303 661618 13072405 18444562 12544530 11339212 23470138 32217365 19608242
6075 19608242 -4142085 -13044819 -1272387 10757724 6066330 -8300818 -14915828 -9236661
6067 -9236661 -1900633 -2871572 -9808509 -12186375 -4627139 5507376 6255899 -2949414
6059 -2949414 -8751173 -1205417 11979126 15966217 9647952 5888992 11519125 18180947
6051 18180947 16774122 11368193 11606515 17566114 20911792 18682787 17184073 20562345
6043 20562345 22493987 14501449 -364868 -8744283 -3633227 5547103 4937202 -4693066
6035 -4693066 -9071581 -1407876 7243574 4246276 -5911484 -8534970 99397 9248055
6027 9248055 10452963 7362894 6918116 9656742 12409286 13758282 12950993 8766419 2875500
6018 2875500 -219101 802839 2616750 3601566 6127862 10157555 10599395 4623330 -3534834
6009 -3534834 -8449293 -9121241 -5743739 2910440 14371482 20518356 16291617 6081150
6001 6081150 -3140722 -10129446 -15952405 -17929909 -13529026 -5942149 594027 6885642
5993 6885642 13935950 16960109 12012411 4408121 2043513 3781470 3336534 1324927
5985 1324927 3253714 7885820 8856842 6994261 9193995 14378958 12861634 2286419
5977 2286419 -7727346 -10736322 -11338951 -12659783 -8649666 2522183 8855544 340835
$$ [...]
##END NTUPLES=NMR SPECTRUM
##END=
