##TITLE=31Pdec_51-2023
 CDCl3 24 sc
 11.8.2023
##JCAMPDX= 6.0         $$ Bruker NMR JCAMP-DX V2.0
##DATA TYPE= NMR SPECTRUM
##DATA CLASS= NTUPLES
##ORIGIN= UXNMR, Bruker Analytische Messtechnik GmbH
##OWNER= root
$$ XWIN-NMR		Version 3.5
$$ Fri Aug 11 13:59:25 2023 Russian Standard Time (UT+4h)  she@DPX200
##.OBSERVE FREQUENCY= 81.013821
##.OBSERVE NUCLEUS= ^31P
##.ACQUISITION MODE= SIMULTANEOUS
##.ACQUISITION SCHEME= undefined
##.AVERAGES= 24
##.DIGITISER RES= 16
##SPECTROMETER/DATA SYSTEM= spect
##.PULSE SEQUENCE= zgpg30
##.SOLVENT NAME= CDCl3
##.SHIFT REFERENCE= (INTERNAL, CDCl3, 0, 248.564)
##AUDIT TRAIL= $$ (NUMBER, WHEN, WHO, WHERE, WHAT)
$$ ##TITLE= Audit trail, XWIN-NMR		Version 3.5
$$ ##JCAMPDX= 5.01
$$ ##ORIGIN= Bruker BioSpin GmbH
$$ ##OWNER= she
$$ F:/spectra/data/she/nmr/P31/1/pdata/1/auditp.txt
$$ ##AUDIT TRAIL=  $$ (NUMBER, WHEN, WHO, WHERE, WHAT)
(   1,<2023-08-11 13:58:37.35 +0400>,<she>,<DPX200>,
      <created by zg, POWCHK disabled, PULCHK disabled
       configuration hash MD5:
       00 E9 B6 7A A2 85 ED C7 34 08 36 98 17 FE 4E 26
       data hash MD5: 32K
       21 D3 0F 92 93 D7 9C 0B B0 FE AC 25 77 5E 05 5C>)
(   2,<2023-08-11 13:58:39.90 +0400>,<she>,<DPX200>,
      <Start of raw data processing
       efp BC_mod = 2 LB = 5 FT_mod = 6 PKNL = 1 PHC0 = -10622.56 PHC1 = 11.08485 SI = 64K 
       data hash MD5: 64K
       34 D6 7E 2E C9 6A 03 8E CD 73 A9 96 F4 64 7F 7C>)
(   3,<2023-08-11 13:58:51.93 +0400>,<she>,<DPX200>,
      <pk PHC0 = 2.733286 PHC1 = 0 
       data hash MD5: 64K
       4F AB A7 39 0D 9D 81 1F CD E6 6B FD EC 9C 1C 0D>)
(   4,<2023-08-11 13:58:55.28 +0400>,<she>,<DPX200>,
      <abs ABSG = 5 
       data hash MD5: 64K
       9E E1 8C 4E 1F BA 83 12 AA 44 04 69 46 A8 74 79>)
$$ ##END=
$$ 
$$ hash MD5
$$ 20 43 11 53 75 E4 31 2B 4A 07 11 95 26 7A CB FF
##$RELAX= 
##$RELAX= 
##$RELAX= 
##$RELAX= 
##$RELAX= 
##$RELAX= 
##$RELAX= 
##$RELAX= 
##$RELAX= 
$$ Bruker specific parameters
$$ --------------------------
##$DU= <F:/spectra>
##$EXPNO= 1
##$NAME= <P31>
##$PROCNO= 1
##$TYPE= <nmr>
##$USER= <she>
##$AMP= (0..31)
100 100 100 100 100 100 100 100 100 100 100 100 100 100 100 100 100 100 
100 100 100 100 100 100 100 100 100 100 100 100 100 100 
##$AQSEQ= 0
##$AQ_mod= 1
##$AUNM= <au_zg>
##$AUTOPOS= <>
##$BF1= 81.014009
##$BF2= 200.13
##$BF3= 200.13
##$BF4= 200.13
##$BF5= 200.13
##$BF6= 200.13
##$BF7= 200.13
##$BF8= 200.13
##$BYTORDA= 1
##$CFDGTYP= 0
##$CFRGTYP= 5
##$CHEMSTR= <none>
##$CNST= (0..31)
1 1 145 1 1 1 1 1 1 1 1 1 1 1 1 1 1 1 1 1 1 1 1 1 1 1 1 1 1 1 1 1 
##$CPDPRG= <waltz16>
##$CPDPRG1= <>
##$CPDPRG2= <waltz16>
##$CPDPRG3= <>
##$CPDPRG4= <mlev>
##$CPDPRG5= <mlev>
##$CPDPRG6= <mlev>
##$CPDPRG7= <mlev>
##$CPDPRG8= <mlev>
##$CPDPRGB= <>
##$CPDPRGT= <>
##$D= (0..31)
0 1 0 0 0 0 0 0 0 0 0 0.03 2e-05 3e-06 0 0 0 0 0 0 0 0 0 0 0 0 0 0 0 0 
0 0 
##$DATE= 1691747916
##$DBL= (0..7)
120 120 120 11 120 120 24 19 
##$DBP= (0..7)
150 150 150 150 150 150 150 150 
##$DBP07= 0
##$DBPNAM0= <>
##$DBPNAM1= <>
$$ [...]
##$SUBNAM3= <"">
##$SUBNAM4= <"">
##$SUBNAM5= <"">
##$SUBNAM6= <"">
##$SUBNAM7= <"">
##$SUBNAM8= <"">
##$SUBNAM9= <"">
##$SW= 501.771253377433
##$SWIBOX= (0..15)
0 1 3 0 0 0 0 0 0 0 0 0 0 0 0 0 
##$SW_h= 40650.406504065
##$TD= 32768
##$TD0= 1
##$TE= 0
##$TE2= 300
##$TE3= 300
##$TEG= 300
##$TL= (0..7)
0 120 53 12 22 120 120 120 
##$TP= (0..7)
150 150 150 150 150 150 150 150 
##$TP07= 0
##$TPNAME0= <>
##$TPNAME1= <>
##$TPNAME2= <>
##$TPNAME3= <>
##$TPNAME4= <>
##$TPNAME5= <>
##$TPNAME6= <>
##$TPNAME7= <>
##$TPOAL= (0..7)
0.5 0.5 0.5 0.5 0.5 0.5 0.5 0.5 
##$TPOFFS= (0..7)
0 0 0 0 0 0 0 0 
##$TUNHIN= 0
##$TUNHOUT= 0
##$TUNXOUT= 0
##$USERA1= <user>
##$USERA2= <user>
##$USERA3= <user>
##$USERA4= <user>
##$USERA5= <user>
##$V9= 5
##$VALIST= <valist>
##$VCLIST= <CCCCCCCCCCCCCCC>
##$VD= 0
##$VDLIST= <DDDDDDDDDDDDDDD>
##$VPLIST= <PPPPPPPPPPPPPPP>
##$VTLIST= <TTTTTTTTTTTTTTT>
##$WBST= 1024
##$WBSW= 4
##$XGAIN= (0..3)
0 0 0 0 
##$XL= 0
##$YL= 0
##$YMAX_a= 10726
##$YMIN_a= -11386
##$ZGOPTNS= <>
##$ZL1= 120
##$ZL2= 120
##$ZL3= 120
##$ZL4= 120
##$ABSF1= 248.5645
##$ABSF2= -253.2056
##$ABSG= 5
##$ABSL= 3
##$ALPHA= 0
##$AQORDER= 0
##$ASSFAC= 0
##$ASSFACI= 0
##$ASSFACX= 0
##$ASSWID= 0
##$AUNMP= <proc_1d>
##$AZFE= 0.1
##$AZFW= 0.5
##$BCFW= 0
##$BC_mod= 2
##$BYTORDP= 0
##$COROFFS= 0
##$CY= -3
##$DATMOD= 1
##$DC= 0
##$DFILT= <>
##$DTYPP= 0
##$F1P= 0
##$F2P= 0
##$FCOR= 1
##$FTSIZE= 65536
##$FT_mod= 6
##$GAMMA= 0
##$GB= 0
##$INTBC= 1
##$INTSCL= 6.047779e-11
##$ISEN= 30
##$LB= 5
##$LEV0= 0
##$LPBIN= 0
##$MAXI= 10000
##$MC2= 0
##$MEAN= 0
##$ME_mod= 0
##$MI= 50
##$NCOEF= 0
##$NC_proc= -5
##$NLEV= 6
##$NOISF1= 182.463
##$NOISF2= 159.3651
##$NSP= 0
##$NTH_PI= 0
##$NZP= 0
##$OFFSET= 248.5645
##$PC= 4
##$PHC0= -10619.83
##$PHC1= 11.08485
##$PH_mod= 1
##$PKNL= yes
##$PPARMOD= 0
##$PSCAL= 0
##$PSIGN= 0
##$REVERSE= no
##$SF= 81.0140089999694
##$SI= 65536
##$SIGF1= 159.3651
##$SIGF2= -187.1042
##$SINO= 113.3802
##$SIOLD= 16384
##$SREGLST= <1H.CDCl3>
##$SSB= 0
##$STSI= 65536
##$STSR= 0
##$SW_p= 40650.406504065
##$SYMM= 0
##$S_DEV= 0
##$TDeff= 32768
##$TDoff= 0
##$TI= <>
##$TILT= no
##$TM1= 0
##$TM2= 0
##$TOPLEV= 0
##$USERP1= <user>
##$USERP2= <user>
##$USERP3= <user>
##$USERP4= <user>
##$USERP5= <user>
##$WDW= 1
##$XDIM= 65536
##$YMAX_p= 356390354
##$YMIN_p= -1603506
$$ End of Bruker specific parameters
$$ ---------------------------------
##NTUPLES= NMR SPECTRUM
##VAR_NAME=  FREQUENCY,     SPECTRUM/REAL,   SPECTRUM/IMAG
##SYMBOL=    X,             R,               I
##VAR_TYPE=  INDEPENDENT,   DEPENDENT,       DEPENDENT
##VAR_FORM=  AFFN,          ASDF,            ASDF
##VAR_DIM=   65536,         65536,           65536
##UNITS=     HZ,            ARBITRARY UNITS, ARBITRARY UNITS
##FACTOR=    0.620285442955139, 1,           1
##FIRST=     20137.2065510682, 0,            0
##LAST=      -20513.1999529968, 0,           0
##MIN=       -20513.1999529968, -1603506,    0
##MAX=       20137.2065510682, 356390354,    0
$$ Real data points
##PAGE= N=1
##DATA TABLE= (X++(R..R)), XYDATA
$$ [...]
39330A52657O7121M5886K2982Q248o086l1183o5281r4829j06476r5391o7352l6694
$$ 152657 219778 265664 288646 296894 290808 259625 194344 99515 -6961 -102352 -169704 -206398
39318b06398j7968j4701j7623j6426j1005q190j0002r803n9J9614M2899O2326
$$ -206398 -224366 -239067 -256690 -273116 -284121 -292311 -302313 -312116 -312175 -292561 -249662 -187336
39306a87336P2996P3320O5460N5555N0853N3617N7712N3561L8138J8904O634N674
$$ -187336 -114340 -41020 24440 79995 130848 184465 242177 295738 333876 352780 359414 365088
39294C65088J2455K0969K6263K4093J2393n783k4892m4173o7902r4645j09767
$$ 365088 377543 398512 424775 448868 461261 455478 430586 386413 318511 223866 114099
39283A14099r5546n1018J576L3487L3379J4548l30M1R531J5395J0589m345k5422
$$ 114099 18553 -32465 -30889 2598 35977 50525 50195 50236 59767 75162 85751 81406 55984
39270E5984m5870n5501m7280k7373j3941k0931m3262o0286n4400k6898K579J1988
$$ 55984 10114 -45387 -92667 -120040 -133981 -154912 -198174 -258460 -312860 -339758 -337179 -325191
39258c25191m742l3124n2452n4771m8033m2335l8977l4797l0213k6379j7673N086
$$ -325191 -329933 -363057 -415509 -470280 -518313 -560648 -599625 -634422 -664635 -691014 -708687 -703601
39246g03601M2922Q5177J18998J38629J44494J37812J19332R1082N6405J9151
$$ -703601 -660679 -575502 -456504 -317875 -173381 -35569 83763 174845 231250 250401
39236B50401j5674m1631n3530n0754l7448k0031m771L888N357M031O639J5810
$$ 250401 234727 193096 139566 88812 51364 31333 26562 30450 35807 39838 46477 62287
39224F2287K5514K4850R130j2923k5939k3365j3882j0239j4004j5715r915m995
$$ 62287 87801 112651 121781 108858 82919 59554 45672 35433 21429 5714 -4201 -9196
39212i196j4562m0828o9859q3455p3793m6774j4588J2120K6706K6664J5063P57
$$ -9196 -23758 -64586 -134445 -217900 -291693 -338467 -353055 -340935 -314229 -287565 -272502 -271745
39200b71745o083l81J5364L3497M4935M3003K8038R387o40K467J1370J5100J0855
$$ -271745 -277828 -278209 -262845 -229348 -184413 -141410 -113372 -103985 -104625 -102158 -90788 -75688 -64833
39187f4833O880J3852L3278N4026O1947N5032M6977N1526O4445O7708N3172L4706
$$ -64833 -57953 -44101 -10823 43203 105150 160182 207159 258685 323130 390838 444010 478716
39175D78716L1367M3705N4020M7619K6332J729j6808k4844k1129r439L02j435
$$ 478716 510083 553788 607808 655427 681759 683488 666680 641836 620707 611268 611570 610135
39163F10135j4706k9823l7258l6682l5172l7029l7498k8260q600J1075J7676O688
$$ 610135 595429 565606 528348 491666 456494 419465 381967 353707 345107 356182 373858 380546
39151C80546j4077k9731k7770o425K3917M8743N9397N4401L4262J685l2891n4237
$$ 380546 366469 336738 308968 302543 326460 375203 434600 489001 523263 524948 492057 437820
39139D37820n5201m1213j8970J1645M8465P8188Q6794P4745N2578K5752m959l1368
$$ 437820 382619 341406 322436 334081 382546 460734 547528 622273 674851 700603 695644 664276
39127F64276m0695l2640k1478j7489j7223j6416k0223l2058m1815l6608j9553
$$ 664276 623581 590941 569463 551974 534751 518335 498112 466054 424239 387631 368078
39116C68078q797j9218n0533r0153j20934j28234j07614o8644k9455o389o432
$$ 368078 359281 340063 289530 199377 78443 -49791 -157405 -226049 -255504 -261893 -268325
39105b68325k3270l8749l5508j4214N938Q853p51n864K731K1900M5081O4720O9340
$$ -268325 -291595 -330344 -365852 -380066 -374128 -365275 -366026 -371890 -369159 -347259 -302178 -237458 -168118
39092a68118N1652K1949L047P190K4461L6748L6111K6364J4700Q045J1934K5269
$$ -168118 -116466 -94517 -91470 -84280 -59819 -23071 13040 39404 54104 62149 74083 99352
39080I9352L7940L8998K6542P135j1470k3175k3121j1198M673J4255J4026O018
$$ 99352 137292 176290 202832 209967 198497 175322 152201 141003 145676 159931 173957 179975
39068A79975j0537l7783o7147p8065n7778j9126R796J3870K413p179q425n214
$$ 179975 169438 131655 64508 -13557 -71335 -90461 -80665 -66795 -64382 -71561 -79986 -85200
39056h5200r32L508M313m001k0853l7462m3132l1809n180K6059M6128M5918L1825
$$ -85200 -86132 -82624 -78311 -82312 -103165 -140627 -183759 -215568 -220748 -194689 -148561 -102643 -70818
39043g0818J9492J9787L3988N7618Q0236Q4857O1178K2654j413K485J6930J6621
$$ -70818 -51326 -31539 2449 60067 140303 225160 286338 308992 307579 310064 326994 343615
39031C43615k165k3490l5358l9863m3549m9261n7726o7977p4018o6932m2543n058
$$ 343615 341450 317960 282602 242739 199190 149929 92203 24226 -49792 -116724 -159267 -164325
39019a64325L4787O2198O4300M1642J1846n876r422j0986j7442k1640j3283R186
$$ -164325 -129538 -67340 -3040 38602 50448 44572 35150 24164 6722 -14918 -28201 -19015
39007a9015L8286O1861O6723M5983O378l5800o6836p9255o6679k6802K7094O8262
$$ -19015 19271 81132 147855 193838 200216 164416 97580 18325 -48354 -75156 -48062 20200
38995B0200P8412O3006M0013J9391n20k2295m4098o2612p3523p0118m9272k0131
$$ 20200 98612 161618 201631 221022 220502 198207 154109 91497 17974 -52144 -101416 -121547
38983a21547K9K738k481O3J2788K1390J1930j1355k8016k0584J0684N1228Q5046
$$ -121547 -121518 -118780 -121261 -121198 -108410 -87020 -75090 -86445 -114461 -135045 -124361 -73133 11913
38970A1913J01633R5775O8564K9431q076l5191n1074n7772n5558m4021k5382o074
$$ 11913 113546 209321 277885 307316 299240 264049 212975 155203 99645 55624 30242 24168
38958B4168M416m17j5373k3682j1696J7197M7956P0413Q3621Q6974P8865O5907
$$ 24168 28584 28167 12794 -10888 -22584 -5387 42569 112982 196603 283577 362442 428349
38946D28349O1291O7130O7564M7781J3923j4294k6585k9331l2661l8620m2081
$$ 428349 489640 556770 624334 672115 686038 671744 645159 615828 583167 544547 502466
38935E02466l7198k2696m836N824M470l141r968j8284l4356n4939o7974o7931
$$ 502466 465268 442572 437736 443560 448030 444889 434921 416637 382281 327342 259368 191437
38923A91437o2564o0898o0658n2686l4348j3335J474R672J9220L7678O3423Q5324
$$ 191437 128873 67975 7317 -45369 -79717 -93052 -91578 -81906 -62686 -25008 38415 123739
38911A23739R1470P8109N0131J5457j8032m1962m9673m1375k4165n135J2599K5253
$$ 123739 215209 293318 343449 358906 340874 298912 249239 207864 183699 178564 191163 216416
38899B16416K4690N601k4598m9548n9609n9057n5267m6970k9830r720k27m914
$$ 216416 241106 246707 222109 172561 112952 53895 -1372 -48342 -78172 -87892 -88119 -93033
38887i3033j0552k911J6722L6417M9117N5249N3716M1252K2126R355J1491K3218
$$ -93033 -103585 -106496 -89774 -53357 -4240 51009 104725 145977 168103 177458 188949 212167
38875B12167L2811L4934L2478K9157K5104J9078J1903O622N052M172k431j7487
$$ 212167 244978 279912 312390 341547 366651 385729 397632 404254 409306 413478 411047 393560
38863C93560l5789m9356n4826n3016m4671l1617j8852q601M737K5362M4471M9326
$$ 393560 357771 308415 253589 200573 155902 124285 105433 96832 101569 126931 171402 220728
38851B20728M3513M4446N7230O5264N4603L4831K4346K4446K0733L278k7671p0031
$$ 220728 264241 308687 365917 431181 485784 520615 544961 569407 590140 593418 565747 495716
38839D95716j17555j50522j46034j04191n3734k4776k1459k4736j5405J0630M4475
$$ 495716 378161 227639 81605 -22586 -76320 -101096 -122555 -147291 -162696 -152066 -107591
38828a07591P3846Q9772Q7558O5629K8295r228k5151q509K8019N8011O4558N1038
$$ -107591 -33745 56027 143585 209214 237509 228281 203130 194621 222640 280651 345209 396247
38816C96247L2283K1497K3726L3239L4824J4375k7486p4394j07776j19223j11418
$$ 396247 428530 450027 473753 506992 541816 556191 528705 454311 346535 227312 115894
38805A15894r2826p2348n3444l0655M291N0330R2967J13867J04076O9480K6604
$$ 115894 23068 -49280 -102724 -133379 -129088 -78758 14209 128076 232152 301632 328236
38794C28236p858k7372l6863m3180m7124m7451m7947n3554o1050o0382m5278j7838
$$ 328236 320378 293006 256143 212963 165839 118388 70441 16887 -44163 -104545 -149823 -167661
38782a67661J5262M4278N6357M3886J4828j2772k8486l4877l4758k2835N291M2863
$$ -167661 -152399 -108121 -51764 -7878 6950 -5822 -34308 -69185 -103943 -126778 -121487 -78624
38770g8624P5640R1205Q2815N2098J2818j5352k3847k2590k6889m2727o8788j03721
$$ -78624 -2984 88221 171036 223134 235952 220600 196753 174163 147274 104547 35759 -67962
38758f7962j41565j65816j60846j30007r3404o6102m5690k2883L872K9349N1452
$$ -67962 -209527 -375343 -536189 -666196 -759600 -825702 -871392 -894275 -890403 -861054 -809602
38747h09602P2993R4444J10520J16015J12297J05709J01036R9043R9204J00566
$$ -809602 -736609 -642165 -531645 -415630 -303333 -197624 -96588 2455 101659 202225
38737B02225R8745Q6600O1783L1470O398p709j0408l243P642R725n434k9626m4512
$$ 202225 300970 387570 449353 480823 487221 479512 469104 465861 473503 483228 477794 448168 403656
38724D03656m2609l4352l2134l5575l6855l3176k7621k2522j8212j5643j5306
$$ 403656 361047 326695 294561 258986 222131 188955 161334 138812 120600 104957 89651
38713H9651j4706r705K791K2904M3832N0331K9989r914m4179n4094m4622l2958
$$ 89651 74945 65240 68031 90935 134767 185098 215087 205173 160994 106900 62278 29320
38701B9320k7643k6440k7615l1939l6270l5737l2535l3442l6820k9689j801M0943
$$ 29320 1677 -24763 -52378 -84317 -120587 -156324 -188859 -222301 -259121 -288810 -290611 -249668
38689b49668P9748R8671R7967R3923J03469J25624J39831J26354Q7294M4592J9217
$$ -249668 -169920 -71249 26718 120641 224110 349734 489565 615919 703213 747805 767022
38678G67022J5147K0392J8632J895k2475l7431l3133j8530j3436k9580o0998r0393
$$ 767022 782169 802561 821193 823088 800613 763182 730049 711519 698083 668503 607505 517112
38666E17112j02380r3757p4676n7484m2444j9303J3921M1207M5021K7337O110
$$ 517112 414732 320975 246299 188815 146371 127068 140989 182196 227217 254554 260664
38655B60664m808l477P390K2863L1978K4380L683j5594k7631m2678p0779j05795
$$ 260664 255856 252379 259769 282632 314610 338990 342673 327079 299448 256770 185991 80196
38643H0196j30564j32337j09241o6892j3109M6341J07592J60805J84964J61099
$$ 80196 -50368 -182705 -291946 -358838 -371947 -325606 -218014 -57209 127755 288854
38633B88854R5284K1270k6365l9917l8642m6304o9746r3231r1426n4075l83L7241
$$ 288854 384138 405408 379043 339126 300484 254180 184434 91203 -223 -54298 -54681 -17440
38621a7440M5746M0356L9166M0551L3306J8869J0387J3173J7692J2417m455k6726
$$ -17440 28306 68662 107828 148379 181685 200554 210941 224114 241806 254223 249768 223042
38609B23042m6655n8116n8112m7366k8314m397J6850K4683J5350o50p829k326
$$ 223042 176387 118271 60159 12793 -15521 -19918 -3068 21615 36965 36315 28486 26160
38597B6160N691O009j11l005N112K4059M6516O3118O8069O0430M0703R966k4808
$$ 26160 31851 37860 37749 34744 39856 63915 110431 173549 241618 302048 342751 352717 327909
38584C27909m8372m6569j9289J8289M7191N6031M4563K1860J265p760n878j854
$$ 327909 279537 232968 213679 231968 279159 335190 379753 401613 402878 395118 389240 387386
38572C87386m659j7787l8312n8383o8988o5673n0648k8748m275J6420K4361J5720
$$ 387386 382727 364940 326628 268245 199257 133584 82936 54188 49913 66333 90694 106414
38560A06414j846j5844k0612j8447j2321m002K675M623N525J1495K0135K2090
$$ 106414 104568 88724 68112 49665 37344 33342 36017 40640 46165 57660 77795 99885
38548I9885J5750J2097K0493L6480M8904N2857M8592L2740K01m5108q8117j13284
$$ 99885 115635 127732 148225 184705 233609 286466 335058 367798 367999 322891 234774 121490
38536A21490j14609r6523o9967m7852l8308l8603l8014k9307j5882n860j363K593
$$ 121490 6881 -89642 -159609 -207461 -245769 -284372 -322386 -351693 -367575 -373435 -374798 -372205
38524c72205Q954J2983Q997N22q18J2805L8000O5306Q6937R6436Q6476N5335J5365
$$ -372205 -363251 -350268 -341271 -340749 -341567 -328762 -290762 -225456 -138519 -42083 44393 99728 115093
38511A15093j2470j6164j930J4483K1203J4674j666j8062k2544j0866Q898K5668
$$ 115093 102623 86459 84529 99012 120215 134889 133223 115161 92617 81751 90649 116317
38499A16317L7188M8333O0003O5743N9427M1462J6726r300l1429m5958n2929n5114
$$ 116317 153505 201838 261841 327584 387011 428473 445199 435899 404470 358512 305583 250469
38487B50469n4183n0165m4039l6978k6987j1116P904K2081K7182K5950J9799M074
$$ 250469 196286 146121 102082 65104 38117 27001 34905 56986 84168 110118 129917 133991
38475A33991k2136m6872n5325m7658l8095l5725l5234k9570k2595k2243k7500
$$ 133991 111855 64983 9658 -38000 -76095 -111820 -147054 -176624 -199219 -221462 -248962
38464b48962l0716k9348k6066j8379J317L1706N6748O0694M5353K7112J9220K1860
$$ -248962 -279678 -309026 -335092 -353471 -352154 -320448 -263700 -203006 -157653 -130541 -111321 -89461
38452h9461K7481K9174K3096Q707r327k1923k2366j3128m821p123j9530l0362
$$ -89461 -61980 -32806 -9710 -1003 -10330 -32253 -54619 -67747 -72568 -79691 -99221 -129583
38440a29583k6416n864J8422L0088K4115R754N45M007J9378L9857N5616N9700
$$ -129583 -155999 -161863 -143441 -113353 -89238 -79484 -78939 -74932 -55554 -15697 39919 99619
38428I9619N4813N1154N3980N6533M9983L7469L1192L5784M1896L8587K5023N730
$$ 99619 154432 205586 259566 316099 366082 403551 434743 470527 512423 551010 576033 581763
38416E81763j8613m7145o9275p0354m9844k6058j7598k4518l2701l2815k8188
$$ 581763 563150 516005 446730 376376 326532 300474 282876 258358 225657 192842 164654
38405A64654k5251k3486j7336m052J3125K7647L4001L1321K3782J5989Q035k316
$$ 164654 139403 115917 98581 94529 107654 135301 169302 200623 224405 240394 248429 246113
38393B46113j2948j7598j4665j1007j3166j8823k2039k3956l1186m4205n4692
$$ 246113 233165 215567 200902 189895 176729 157906 135867 111911 80725 36520 -18172
38382a8172n6376n2013m5611l3298q732K3969M8910N1765L1869J040k5925l8615
$$ -18172 -74548 -126561 -172172 -205470 -214202 -190233 -141323 -89558 -57689 -56649 -82574 -121189
38370a21189l3580j5363M248J2274M561r389j3991j819K0270L9464M9107N0562
$$ -121189 -154769 -170132 -165884 -153610 -149049 -158438 -172429 -174248 -153978 -114514 -65407 -14845
38358a4845M5889L3548J2135j4864l8852m8566l4193M471N1177Q0062P5503M4639
$$ -14845 31044 64592 76727 61863 23011 -25555 -59748 -55277 -4100 75962 151465 196104
38346A96104P690k1265m0069m9340m6477l1095j0683L435M842l842j2918j1677
$$ 196104 203794 182529 142460 93120 46643 15548 4865 8300 13142 9300 -3618 -15295
38334a5295L101K2387L2033K7481J8828J8275K5218K7462J5339r791l9670o5579
$$ -15295 -12194 10193 42226 69707 88535 106810 132028 159490 174829 165038 125368 59789
38322E9789p9153p3378m9344k1178q211j8459m0617n4297m8601l0426j5338j1529
$$ 59789 -19364 -92742 -142086 -163264 -171475 -189934 -230551 -284848 -333449 -363875 -379213 -390742
38310c90742j2736n539J7244M9710P7542Q8714Q0566N9313L5342J8895J6384K7029
$$ -390742 -403478 -409017 -391773 -342063 -264521 -175807 -95241 -35928 -586 18309 34693 61722
38298F1722M3195N6522O3626O3509N1446K2058j9292n4693o9592o7547o3133o2311
$$ 61722 104917 161439 225065 288574 340020 362078 342786 288093 218501 150954 87821 25510
38286B5510n7137l9528j2616J3373K9227K8337Q878j8979l5053k8285j1896j0441
$$ 25510 -31627 -71155 -83771 -70398 -41171 -12834 -3956 -22935 -57988 -86273 -98169 -108610
38274a08610l1253n6648o5849n6693m1818l1019k4832k1433k0645j9886j3296
$$ -108610 -139863 -196511 -262360 -319053 -360871 -391890 -416722 -438155 -458800 -478686 -491982
38263d91982J031J6556K5549K9311L6601N1412O6615P2427O8371O2989O3029O7265
$$ -491982 -490951 -474395 -448846 -419535 -382934 -331522 -264907 -192480 -124109 -61120 1909 69174
38251F9174P0933P0796O3328M3171R550k7085n1009n5797m9988m6847n0897n5701
$$ 69174 140107 210903 274231 317402 326952 299867 248858 193061 143073 96226 45329 -10372
38239a0372n1837l4935q645J6471K7966K0515K449r252m038J2565K7016L4490
$$ -10372 -62209 -97144 -105789 -89318 -61352 -40837 -38388 -47640 -51678 -39113 -12097 22393
38227B2393M2768N8110P3064P4301N9794M1222K9059K1572R945j1616m2351p4131
$$ 22393 65161 123271 196335 270636 330430 371652 400711 422283 432228 420612 378261 304130
38215C04130r0965p8129l9943l389M997j5797m5029o4657p1489o9086o0659n1744
$$ 304130 213165 135036 95093 91704 96701 80904 35875 -28782 -100271 -169357 -230016 -281760
38203b81760m8519m8621m1852k4507n735M621O890N394l54j0679j8413j5504l682
$$ -281760 -330279 -378900 -420752 -445259 -450994 -446373 -439483 -434089 -434443 -445122 -463535 -479039 -482721
38190d82721Q722J7387K2671K4135K3348K8889M7716P1432Q1440P0039M7968K8613
$$ -482721 -473999 -456612 -433941 -409806 -386458 -357569 -309853 -238421 -156981 -86942 -38974 -10361
38178a0361J3396k876k0648l6320m8678n7327n8232m7722k9005q476J3017L8268
$$ -10361 3035 159 -20489 -56809 -105487 -162814 -221046 -268768 -297773 -306249 -293232 -254964
38166b54964O3351P7165P4814O5611O2657O7991P3412P3253O8573N8544L6783
$$ -254964 -191613 -114448 -39634 25977 88634 156625 230037 303290 371863 430407 467190
38155D67190K419l0874m5724m0364k9926k7994l4015m0790m5767m8465m2874k1887
$$ 467190 469609 438735 393011 352647 322721 294727 260712 219922 174155 125690 82816 60929
38143F0929J1162M2349N9778O2373N6120M6310L4547J9926J795j6498k7166k4532
$$ 60929 72091 114440 174218 236591 292711 339021 373568 393494 395289 378791 351625 327093
38131C27093j1905J304R345J3774J7831K1735K4193K4103J9212P220q931j9482
$$ 327093 315188 316492 325837 339611 357442 379177 403370 427473 446685 453905 444974 425492
38119D25492j4765O008L2221M6612L4799m221n4965r6054j15637j15113r9948
$$ 425492 410727 416735 448956 495568 530367 526146 471181 375127 259490 144377 44429
38108D4429p3715m2743j8997j1333j5912j9933j3947K132K2577M0549M9819M6340
$$ 44429 -29286 -72029 -91026 -102359 -118271 -138204 -152151 -150019 -127442 -86893 -37074 9266
38096I266L0414O785j7144l2976l3688j7614Q858L3749M6506M5121L8240L8499
$$ 9266 39680 46465 29321 -3655 -37343 -54957 -46099 -12350 34156 79277 117517 156016
38084A56016N0212O4143O7719N9429M8036L7785K1862n853l8493o0953o3825m9201
$$ 156016 206228 270371 338090 397519 445555 483340 505202 499349 460856 399903 336078 286877
38072B86877k6964r563n424j0861j1776m84J1638O397j6831l7533l7065j8490
$$ 286877 259913 250350 244926 234065 222289 221805 233443 239840 223009 185476 148411 129921
38060A29921n07K171j1948l6396o3980q8285j02327r8968p4259l1083K1235P2110
$$ 129921 129414 131585 119637 83241 19261 -69024 -171351 -270319 -344578 -375661 -354426 -282316
38048b82316J13969J41484J50705J43251J28767J16689J05281Q5225N6246L3870
$$ -282316 -168347 -26863 123842 267093 395860 512549 617830 703055 759301 793171
38038G93171L4180N4325P2707O8363L8734P16k2996k0913j475J3214M421k9692
$$ 793171 827351 881676 954383 1022746 1061480 1062196 1039200 1018287 1016812 1030026 1034447 1004755
38026A004755p4960j13141j32835j32497j17408r5072p1585m9765k8773n321K2541
$$ 1004755 929795 816654 683819 551322 433914 338842 267257 217492 188719 183398 205939
38015B05939N0135O4956N4267J6800l2776p1568q1997o1550k3719J0639K7400
$$ 205939 256074 321030 375297 392097 359321 287753 205756 144206 120487 131126 158526
38004A58526K8105K4862K6477L1382L3400K9970K2784J4121N807n36n485j2286
$$ 158526 186631 211493 237970 269352 302752 332722 355506 369627 375434 374898 369413 357127
37992C57127k1857k8647k5428j2660lK736n285j5963j9910j3602l34J4311K6673
$$ 357127 335270 306623 281195 268535 268532 271268 265983 250020 230110 216508 216174 230485 257158
37979B57158L3705K9907J1192j5797l3456k8804q320Q299R426J630j708M628J6750
$$ 257158 290863 320770 331962 316165 282709 253905 245585 253884 263310 264940 263232 267860 284610
37966B84610K9059L6146L1027R926k0181m4986n6888o1875o9576p9933q4019p6573
$$ 284610 313669 349815 380842 390768 370587 325601 268713 206838 137262 57329 -26690 -103263
37954a03263o2871n1969m6222l9362k3575K401L0236M5707L8363J1729j6019k5271
$$ -103263 -166134 -218103 -264325 -303687 -327262 -324861 -294625 -248918 -210555 -198826 -214845 -240116
37942b40116j1709J0530K2862J8467M887n787o129M978K4262M4975N8539N8756
$$ -240116 -251825 -241295 -218433 -199966 -195079 -200866 -206995 -202017 -177755 -132780 -74241 -15485
37930a5485M4987K0819q675l6386n1937m6110j9137J7566N0916P6632R7982J15270
$$ -15485 29502 50321 41646 5260 -46677 -92787 -111924 -94358 -43442 33190 131172 246442
37918B46442J20953J06894P3474K9000j7014n5269p3066n7846j1359M1674O7395
$$ 246442 367395 474289 547763 576763 559749 504480 431414 373568 362209 403883 471278
37907D71278N1016J0615k0096k2547n535J0454J4511Q800j951j5710k8498l3446
$$ 471278 522294 532909 512813 490266 484731 495185 509696 518496 516545 500835 472337 438891
37895D38891k8925k2650k2825k8679l4921m1946n3885o7064o8978n2081k2986
$$ 438891 409966 387316 364491 335812 300891 258945 205060 137996 69018 16937 -6049
37884f049N446K6249L8386M0050K9172R665q977j9610k2142k0991k1170k6383
$$ -6049 -603 25646 64032 104082 133254 142919 133942 114332 92190 71199 50029 23646
37872B3646l6829m8345n6361o0364o1361n6553m2279k2690r243q071j1736o270
$$ 23646 -13183 -61528 -117889 -178253 -239614 -296167 -338446 -361136 -370379 -378450 -390186 -396456
37860c96456J6243N2972R2475J18190J15774Q3816L5911j1242m8412o9752o6241
$$ -396456 -380213 -327241 -234766 -116576 -802 83014 118925 107683 59271 -10481 -76722
37849g6722l4022J3159N1065O6640O4947N4729L8102J7784K801j556j721n225
$$ -76722 -110744 -97585 -46520 20120 85067 139796 177898 195682 198483 196927 195206 189981
37837A89981q222l290M982L309j2605l3397m8947n6488n5051m1610j6738J3068
$$ 189981 181759 178469 183451 186760 174155 140758 91811 35323 -19728 -61338 -78076 -65008
37825f5008M2166O9116R0987J01943J01474R7063R3165Q3855O3159L7491J9331
$$ -65008 -22842 46274 137261 239204 340678 437741 530906 614761 677920 715411 734742
37814G34742J0737J044j8897m6094o9611q0580p7274o3914m5821k4575P59K6475
$$ 734742 745479 746523 727626 681532 611921 531341 454067 390153 344332 319757 320516 346991
37802C46991M2158M0136K4539O135r417k2621l1675l1159k0515p366O37L261N254
$$ 346991 389149 429285 453824 459959 450542 427921 396246 365087 344572 337206 337843 341104 346358
37789C46358J0143J7949K5357K6930J9713P654k288q933j7208k8938l9014m2613
$$ 346358 356501 374450 399807 426737 446450 454104 451816 442883 425675 396737 357723 315110
37777C15110m0386l3556k0346k067J2981J8682K0565K8647M2383M9925M3100K6934
$$ 315110 274724 241168 220822 218755 231736 250418 270983 299630 342013 391938 435038 461972
37765D61972J2617N494K156m276j8354l8837n7351o1061m0223L465N5002R4594
$$ 461972 474589 480083 482239 477963 459609 420772 363421 302360 262137 265602 320604 415198
37753D15198J11599J10834J03445R2809P4300M9251L1447L3627N1219O5576O1920
$$ 415198 526797 637631 741076 833885 908185 957436 988883 1022510 1073729 1139305 1201225
37742A201225L9692Q279k0609l7151l7539k6698j4164p302j0509k5922m7078n5174
$$ 1201225 1240917 1249196 1228587 1191436 1153897 1127199 1113035 1105733 1095224 1069302 1022224 967050
37730I67050l4332O282L5644L1529J93l8363p3438j02640j18429j12435r2441
$$ 967050 932718 939000 974644 1006173 1006366 968003 894565 791925 673496 561061 468620
37719D68620q0871r1708j17016j38477j43435j26312q5377k8331K3701M8668M2238
$$ 468620 387749 296041 179025 40548 -102887 -229199 -314576 -342907 -319206 -270538 -228300
37708b28300J9404k884k0142l7148n6365p4221q6572r2517r1129p8091m9392p933
$$ -228300 -208896 -211780 -231922 -269070 -325435 -399656 -486228 -578745 -669874 -747965 -797357 -805290
37696h05290L6637P4456R8607J02838Q3967N1331K7380K9218N0174O7702O9705
$$ -805290 -768653 -694197 -595590 -492752 -408785 -357454 -330074 -300856 -250682 -182980 -113275
37685a13275O4331O2049N9475M9037L6460L5733M7364N2423L2834p593m5747n9946
$$ -113275 -48944 13105 72580 121617 158077 193810 241174 293597 326431 318838 273091 213145
37673B13145m6376j8445O589K0838K7544L1371K9733J6286q856l6643n7282o7450
$$ 213145 166769 148324 154913 175751 203295 234666 264399 280685 271829 235186 177904 110454
37661A10454o9038o4709n7037m9155m3005l7146k7510j0676J2727L6138M9811
$$ 110454 41416 -23293 -80330 -129485 -172490 -209636 -237146 -247822 -235095 -198957 -149146
37650a49146M8965M0012L5324M0064M6561M3518K8579R890k841o795p066j1292
$$ -149146 -100181 -60169 -24845 15219 61780 105298 133877 143767 140926 134131 127065 115773
37638A15773k2424l5584m2625l9822k9100j2617Q594K8427L4270J8801q431k7731
$$ 115773 93349 57765 15140 -24682 -53782 -66399 -57805 -29378 4892 23693 15262 -12469
37626a2469k8859j9448j3108j3671j3526l791J6933M0986N5268M8232J8357k2695
$$ -12469 -41328 -60776 -73884 -87555 -101081 -104872 -87939 -46953 8315 56547 74904 52209
37614E2209n7117p2439o6727m5007j4339J7909M5698O7651Q6661J02976J09257
$$ 52209 -4908 -77347 -144074 -189081 -203420 -185511 -139813 -72162 14499 117475 226732
37603B26732R6865O7595L5253J3720N519L109j702j1185k1079k3664j4234K154
$$ 226732 323597 391192 426445 440165 445684 448793 447091 435906 414827 391163 376929 379083
37591C79083J2810R741k098j1786j4220j0574j743J0719J9686J8838J4875K3073
$$ 379083 391893 401634 399536 387750 373530 362956 361213 371932 391618 410456 425331 448404
37579D48404M6639O9055P2238N4719K6109p931m5054p5673q5457p0255m1793j7257
$$ 448404 495043 564098 636336 691055 717164 709233 664179 588506 503049 432794 391001 373744
37567C73744p426j3619k9376m3904m9185m6329m2783m3340m6173m5876l6703j5022
$$ 373744 366318 352699 323323 279419 230234 183905 141122 97782 51609 5733 -30970 -45992
37555d5992J5694M3007N4910N2545M9129N4824O6425P2598O5255M4648J7453p718
$$ -45992 -30298 12709 67619 120164 169293 224117 290542 363140 428395 473043 490496 482778
37543D82778k4992l3011l1746j9380M746L5328O2821P9142P9229O0251K5027j5542
$$ 482778 457786 424775 393029 373649 378395 413723 476544 555686 634915 695166 720193 704651
37531G04651n0524p9809j11007j45060j71109j76854j58566j20374p0873k2428
$$ 704651 654127 574318 463311 318251 147142 -29712 -188278 -308652 -379525 -401953
37521d01953J3014L1902L9247L9498L2603K0596J0963R107J2301J5069J6234J7450
$$ -401953 -388939 -357037 -317790 -278292 -245689 -225093 -214130 -205023 -192722 -177653 -161419 -143969
37509a43969J9127K1116K3676K5417K4713K4641L0583M0886M6898M4982M0075
$$ -143969 -124842 -103726 -80050 -54633 -29920 -5279 25304 66190 113088 158070 198145
37498A98145L3549J8018p937k9165k9177j0339J1479K7112L7503M1267L3170J5539
$$ 198145 231694 249712 241775 212610 183433 173094 184573 211685 249188 290455 323625 339164
37486C39164j114j1557k0130k9105l2340k4590r094Q432K6680M5403O1246P1844
$$ 339164 338050 326493 306363 277258 244918 220328 211234 219666 246346 291749 352995 424839
37474D24839P9438Q5838Q7252P8135N7748L0248R73k5114m4371n6690o4792o9847
$$ 424839 504277 590115 677367 755502 813250 843498 844471 819357 774986 718296 653504 583657
37462E83657o9784o2561m8649l0410j2489j947k424q094r921q880j4626k7819
$$ 583657 513873 451312 402663 372253 359764 357817 355393 347299 337378 328498 313872 286053
37450B86053l3743k1726l701j639j8541l3359k7042m274J5509K1996K1840K5393
$$ 286053 252310 230584 226883 225244 206703 173344 146302 142028 157537 179533 201373 226766
37438B26766L2618L4151K3435N463p099o811k43j994j8682m0761n2370m7470l2418
$$ 226766 259384 293535 316970 322433 315334 308523 308280 306286 287604 246843 194473 147003 114585
37425A14585j3925Q507L4807N5612N9599M7893L2995K2262J0451p926k6405l2809
$$ 114585 100660 109167 143974 199586 259185 307078 340073 362335 372786 364860 338455 305646
37413C05646k2230K965M1114Q9549J36149J62657J60002J34929R9803O1640K4055
$$ 305646 283416 286381 327495 417044 553193 715850 875852 1010781 1110584 1172224 1196279
37402A196279n958j9576j4339J373J2156M946k2132n8992r3015j18516j34615
$$ 1196279 1190321 1170745 1156406 1157779 1169935 1174881 1152749 1093757 1000742 882226 747611
37391G47611j36963j18972q2676m1600q883J3291K8825L6894L2174J4765n779
$$ 747611 610648 491676 409000 367400 358517 371808 400633 437527 469701 484466 478687
37380D78687j8799k3162k7224l7686n0280n4621m8251m0680m0203m2139l6852
$$ 478687 459888 436726 409502 371816 321536 266915 218664 177984 137781 95642 58790
37369E8790k5314j7066j4382r972k408j664j2785k4073k1359q049j047r451k5917
$$ 58790 33476 16410 2028 -7944 -10352 -12016 -24801 -48874 -70233 -78282 -79329 -88780 -114697
37356a14697l8221m2325m4243n4229p7879j07331j22453j06828o3621j2941K4755
$$ -114697 -152918 -195243 -239486 -293715 -371594 -478925 -601378 -708206 -771827 -784768 -760013
37345g60013L9775L3257J5080J021L729K3618N2130Q2697J12842J36861J45096
$$ -760013 -720238 -686981 -671901 -670880 -667151 -643533 -591403 -508706 -395864 -259003 -113907
37334a13907J33371J07652P7089M7439K2746P303K263L796O507N412n043k7083
$$ -113907 19464 127116 204205 251644 274390 281693 283956 287752 294259 299671 294628 267545
37322B67545n2912o8984p0288o3357n1729k8589P302L6757L5675M703k8671l9993
$$ 267545 214633 145649 75361 12004 -39725 -68314 -61012 -24255 11420 16123 -12548 -52541
37310e2541l0092j4797l464M779J1499J6371K1388K8001L0043J8562l148j6845
$$ -52541 -82633 -97430 -100894 -96115 -84616 -68245 -46857 -18856 11187 29749 26601 9756
37298I756p784J7662L8534M1706L2556K4314K3296K6725K9637K9043K3372J2546
$$ 9756 1972 19634 58168 99874 132430 156744 180040 206765 236402 265445 288817 301363
37286C01363j172j5011k8162m0060m6911m3590k9930j2168L733J7891L3364M8462
$$ 301363 300191 285180 257018 216958 170047 126457 96527 84359 88092 105983 139347 187809
37274A87809N5115M5735K1235p227k4057j9171L809K8134L5591K0846n454k8286
$$ 187809 242924 288659 309894 302667 278610 259439 263248 291382 326973 347819 342365 314079
37262C14079m1064m5023l9689k2346L19Q759j0854m5879o5758n5309l1742k2350
$$ 314079 273015 227992 188303 165957 166276 175035 164181 118302 52544 -2765 -34507 -56857
37250e6857l1635l9525k9158o083J1650J3784M053p468j2559q887j282J922k700
$$ -56857 -88492 -128017 -157175 -163258 -151608 -137824 -133771 -141239 -153798 -162685 -163967 -162045 -164745
37237a64745r991j3341j3544j7005k6440l7410m3991m4114l8761k9601j9405j2031
$$ -164745 -174736 -188077 -201621 -218626 -245066 -282476 -326467 -370581 -409342 -438943 -458348 -470379
37225d70379q861n834L414K0638M0357N4754O0471O0037N7950N7624O2078P4364
$$ -470379 -479240 -485074 -481660 -461022 -420665 -365911 -305440 -245403 -187453 -129829 -67751 6613
37213F613R4202J14808J25547J18302R1027M7583k347m4659o7900p1592o4942
$$ 6613 100815 215623 341170 459472 550499 598082 595735 551076 483176 411584 346642
37202C46642n6520m8707m2763m2636m8866n3128m5403k5376k287J4683K1139J5629
$$ 346642 290122 241415 198652 156016 107150 54022 8619 -16757 -19044 -4361 16778 32407
37190C2407P79j3976j8816j4857j2221j3564o249K2951O8225J04799J08031P1788
$$ 32407 33186 19210 394 -14463 -26684 -40248 -46497 -23546 44679 149478 257509 329297
37178C29297J2635m0129o2618n1379k1952P805L0381M4942M9669M5152M0135M3596
$$ 329297 341932 301803 239185 187806 165854 173659 204040 248982 298651 343803 383938 427534
37166D27534N1198M8250K7684j939k7983m5821n6389n9402n5063m7701m1093l2614
$$ 427534 478732 526982 554666 552727 524744 478923 422534 363132 308069 260368 219275 186661
37154A86661j7933l12J0532R317N39q460j5898k3859k9600k2730M857M5286P4441
$$ 186661 168728 168416 178948 188265 188804 180344 164446 140587 110987 88257 93114 138400 212841
37141B12841P0734L5524p369l2832l2664j4698Q178K4112K4407Q911j0437j7723
$$ 212841 283575 319099 311730 278898 246234 231536 239714 263826 288233 297144 286707 268984
37129B68984p284J2361K8496L4692L1421K1348P657m649r326k317J5386L8249
$$ 268984 261700 274061 302557 337249 368670 390018 397675 393026 383700 381383 396769 435018
37117D35018N9665P5452Q5178R1678R9923J14012J32295J46207J47548J37003
$$ 435018 494683 570135 655313 746991 846914 960926 1093221 1239428 1386976 1523979
37107A523979J22285J08512R5901Q6935Q7119R4105R4382Q0046O4229O8888R7163
$$ 1523979 1646264 1754776 1850677 1937612 2024731 2118836 2213218 2293264 2357493 2426381 2523544
37096B523544J27373J36889J24737J07577J00027J03391J09111J08181R9233R0669
$$ 2523544 2650917 2787806 2912543 3020120 3120147 3223538 3332649 3440830 3540063 3630732
37086C630732R3099J07260J21105J20961J04150P9812O0315N3966O2790Q2956
$$ 3630732 3723831 3831091 3952196 4073157 4177307 4257119 4317434 4371400 4434190 4517146
37076D517146J07319J30232J50813J70355J86079J88439J66882J20736O4452J8620
$$ 4517146 4624465 4754697 4905510 5075865 5261944 5450383 5617265 5738001 5802453 5821073
37066E821073o476j5994j8079j1937N470K5444L1350J9053N198R413L2076N3658
$$ 5821073 5814597 5798603 5780524 5768587 5774057 5799501 5830851 5849904 5855102 5864515 5896591 5950249
37054E950249N3278K5461j7344n4622p2331p1731o4351n8435n2656m2194k5638
$$ 5950249 6003527 6028988 6011644 5957022 5884691 5812960 5748609 5690174 5637518 5595324 5569686
37043E569686m699J6777L0432K6367L931k4694m7357o5065q6431j12008j31774
$$ 5569686 5564987 5581764 5612196 5638563 5642494 5617800 5570443 5505378 5418947 5306939 5175165
37032E175165j38530j37747j41884j57816j80819j99220k05240k02725k02664
$$ 5175165 5036635 4898888 4757004 4599188 4418369 4219149 4013909 3811184 3608520
37023C608520k09218k13246k03515j81948j62608j55994j58921j59856j49833
$$ 3608520 3399302 3186056 2982541 2800593 2637985 2481991 2323070 2163214 2013381
37014B013381j27781j00103p7475o8756p4532q6731r5492r6428r1577q4204p2789
$$ 2013381 1885600 1785497 1708022 1639266 1564734 1478003 1382511 1286083 1194506 1110302 1037513
37003A037513n0921j5844K2338M4716M1349K2582P275R50q008k9522n5919o9428
$$ 1037513 986592 970748 993086 1037802 1079151 1101733 1109008 1109958 1101950 1072428 1016509 947081
36991I47081o1852m1495k1769q648j319l63r317k7848m8427o3142p0832p3699
$$ 947081 885229 843734 821965 813317 811998 811635 802318 774470 726043 662901 592069 518370
36979E18370o9665n4405l0537p841P568J7707K3310J7522m118l2362n1307n4894
$$ 518370 448705 394300 363763 355922 363490 381197 404507 422029 417911 385549 334242 279348
36967B79348m8731l6669j4986J6911M7314O0055M9577K4708q59j8232k4365j8229
$$ 279348 230617 193948 178962 195873 243187 303242 352819 377527 376668 358436 334071 315842
36955C15842p8K5099M6765N5382N0309L8786K6631J2763o205k8918m8436n6171
$$ 315842 315764 340863 387628 443010 493319 532105 558736 571499 565294 536376 487940 431769
36943D31769m6606k2331M365J9833K1692J9088J8697J6986R957K773K243N366
$$ 431769 385163 362832 367197 387030 408722 427810 446507 463493 473450 476223 478466 483832
36931D83832M038k372p626q988q055l194R237K6610M1633N1677N7026N0607K1920
$$ 483832 487870 485498 477872 468884 460829 457635 466872 493482 535115 586792 643818 694425 716345
36918G16345k4814o7329q6972q6616q1320p7960p1002n3669k6193N096L2085M9757
$$ 716345 691531 624202 537230 450614 369294 291334 220332 166663 140470 145566 177651 227408
36906B27408N9903O8164P5924P8306P1663N8331M1624K1069l512k7226m3584n0473
$$ 227408 287311 355475 431399 509705 581368 639699 681323 702392 698880 671654 628070 577597
36894E77597n0297m7062m4978m5768m5302l7362k3175j2266j1056j5849k0010
$$ 577597 527300 480238 435260 389492 344190 306828 283653 271387 260331 244482 224472
36883B24472k2063k2828k1464j9942k4520l5010l8567k4137K69J5117J3194N621
$$ 224472 202409 179581 158117 138175 113655 78645 40078 15941 16210 31327 44521 50142
36871E0142L028P92j2136l6286n9071o6153n2218k3476O928K7238L3830L0669
$$ 50142 53170 53962 41826 5540 -53531 -119684 -171902 -195378 -188450 -161212 -127382 -96713
36859i6713K2925J2626P03q433n604J8110O1479J06970J29272J15766P8354M1700
$$ -96713 -73788 -61162 -60459 -68892 -74496 -56386 5093 112063 241335 357101 435455 477155
36847D77155K0589J1511L422r793k7332m4800n6352n8019n2582m8800n2823o1862
$$ 477155 497744 509255 512677 502884 475552 430752 374400 316381 263799 214999 162176 100314
36835A00314o8075o6796n8952m7570l5070k3086j1763J000J6682L1390L6940L0112
$$ 100314 32239 -34557 -93509 -141079 -176149 -199235 -210998 -209998 -193316 -161926 -124986 -94874
36823i4874J9784K0461L6699N6582O3358N1780L0603J1587N10k608p23J296j31
$$ -94874 -75090 -54629 -17930 38652 102010 153790 184393 195980 196490 193882 193159 194455 194324
36810A94324l003k478J058J849r86Q90J4446L4636M9348N1406M0571J7849j4424
$$ 194324 191321 188843 189901 191750 190764 191654 206100 240736 290084 341490 382061 399910 385486
36797C85486m8072p2394q3509q5402q0927o6919l9982k980L5933O7550Q3698P9253
$$ 385486 337414 265020 181511 96109 15182 -51737 -91719 -94699 -58766 8784 92482 171735
36785A71735N5695K1915j0360l3111m6209n6981p3626r5476j10398j05077p7422
$$ 171735 227430 249345 238985 205874 159665 102684 29058 -66418 -176816 -281893 -359315
36774c59315l6099R819N5099R2884J13026J10492R1730O8780M8871L2397J8244
$$ -359315 -395414 -385595 -330496 -237612 -124586 -14094 77636 146416 195287 227684 245928
36763B45928O824k006j1300k6398n1820q6658j21025j38717j27345q8465l7898
$$ 245928 252752 250746 239446 213048 161228 74570 -46455 -185172 -312517 -400982 -438880
36752d38880M553K7023K9844K0746P439n324j3586j2565P97K4512N2432P8339
$$ -438880 -434327 -407304 -377460 -356714 -349275 -354599 -368185 -380750 -379953 -355441 -303009 -224670
36740b24670R8212J09420J09978J00003Q3815P0029O7447P7731R1574R5450Q4878
$$ -224670 -126458 -17038 92940 192943 276758 346787 414234 491965 583539 678989 763867
36729G63867O8853N8456N3199M2537J9515j1941m3139o8074q1923p7247m8559
$$ 763867 832720 891176 944375 986912 1006427 994486 951347 883273 801350 724103 675544
36718F75544j870M3739O6813N6681J8224l2328p4696r2784q4204o4608n6609o7710
$$ 675544 673674 717413 784226 840907 859131 826803 752107 659323 575119 510511 453902 386192
36706C86192q1199p4870m7471j9179n674j385O991J9120K2484J1455m280j0892
$$ 386192 304993 230123 182652 163473 157799 156414 163405 182525 205009 216464 212184 201292
36694B01292l972J0198K2888L1268L9494M9549N0646K4768l0510q9267j16479
$$ 201292 197320 207518 230406 261674 301168 350717 401363 426131 395621 306354 189875
36683A89875r9846n6681j2390J8308L0366K2880J867j9363l0978l5331m0347m7296
$$ 189875 90029 33348 20958 39266 69632 92512 94379 75016 44038 8707 -31640 -78936
36671g8936m9323m0146k0792J008J6410K2437K4588K9997L7656L9486L1975K1599
$$ -78936 -128259 -168405 -189197 -188189 -171779 -149342 -124754 -94757 -57101 -17615 14360 35959
36659C5959J6191J5522J3618O423n754j9334k7736k4744j1785J479P672R594J4253
$$ 35959 52150 67672 81290 87713 81959 62625 34889 10145 -1640 -161 7511 17105 31358
36646C1358K3690L6831N5833Q2357J08613J19689J07134P6569M1581J3579k626
$$ 31358 55048 91879 147712 230069 338682 458371 565505 642074 683655 697234 694608
36635F94608p927n670J788J2367J8926R237k1726o0000q0210o8125l2576N600
$$ 694608 686681 681011 682799 695166 714092 723329 701603 641603 561393 493268 460692 466292
36623D66292L1785M3459M4436L9304L1962K4802J7897R942j49j2389k4207k9335
$$ 466292 498077 541536 585972 625276 657238 682040 699937 709879 709730 697341 673134 643799
36611F43799k2343p567k42j2299l6345m9016l3512L936M2393O7455P9783Q5550
$$ 643799 621456 613889 613647 601348 565003 515987 482475 486411 528804 596259 676042 761592
36599G61592Q6619Q2443P4577O3058M2295Q175l1117n8328o3474n2723l9620l2278
$$ 761592 848211 930654 1005231 1068289 1110584 1118759 1087642 1029314 965840 913117 873497 841219
36587H41219l1266l4575l9992m5732n2945o5146q1046q9903p8451m2082J2482
$$ 841219 809953 775378 735386 689654 636709 571563 490517 400614 322163 280081 292563
36576B92563P1618J18094J35699J20677Q8741O2170M7497L2772Q762j6136k7873
$$ 292563 364181 482275 617974 738651 827392 889562 937059 969831 978593 962457 934584
36565I34584k5934k1442k0252j8471j4758j6554k9100m4572m8547l5063j0902
$$ 934584 908650 887208 866956 848485 833727 817173 788073 743501 694954 659891 648989
36554F48989J3253L1349M1954M4855M0654L2167K3104J4120J395j8518m1567n6517
$$ 648989 662242 693591 735545 780400 821054 853221 876325 890445 891840 873322 831755 775238
36542G75238n5860m5621l9522m1907m1521k6530j923J4607J3537L646o35L316
$$ 775238 719378 673757 634235 592328 550807 524277 522354 536961 550498 554144 553509 556825
36530E56825N256m323k3026l8061l7228j9571M219K3783M0793O4089R2649J10708
$$ 556825 562081 557758 534732 496671 459443 439872 444091 467874 508667 572756 665405 776113
36518G76113J05027Q1383N6635L8419K2349P661L274J3472K6960K8604J7307L977
$$ 776113 881140 962523 1019158 1057577 1079926 1087587 1090861 1104333 1131293 1159897 1177204 1181181
36506A181181n729j7418l5487n2905n8856n2708m5001m5813n6538p1980q4264
$$ 1181181 1175452 1158034 1122547 1069642 1010786 958078 913077 867264 810726 738746 654482
36495F54482q2928n8515j3925K9814M7774L4453Q759n872j538J5128L5280N1633
$$ 654482 571554 513039 499114 528928 576702 611155 619914 614042 612504 627632 662912 714545
36483G14545N4968L7733L393l3012n5154n4251l0834N605L9244N7020N6918M4151
$$ 714545 769513 807246 810639 777627 722473 668222 637388 642993 682237 739257 796175 840326
36471H40326K1863p055l1267l6043k0908l027J981n350j7362l2707n1945o7857
$$ 840326 862189 855134 823867 787824 766916 763889 765870 760520 743158 710451 658506 590649
36459E90649p1995o7043o1840n6813m6166l3651l2583m5467n4423m0288o422K3370
$$ 590649 518654 451611 389771 332958 286792 253141 220558 175091 120668 80380 73958 97328
36447I7328K8587R506j6880l3755l6995l3031k6379j3203R110K9741L1062J0061
$$ 97328 125915 135421 118541 84786 47791 14760 -11619 -24822 -15712 14029 45091 55152
36435E5152j4800k4009j8943j6672k6597m0646m6224m0721l0366k0795j3851j0763
$$ 55152 40352 16343 -2600 -19272 -45869 -86515 -132739 -173460 -203826 -224621 -238472 -249235
36423b49235j3115j9827k5872k5771j8457q743m114r606k4938m5320o3302o9796
$$ -249235 -262350 -282177 -308049 -333820 -352277 -361020 -365134 -374740 -399678 -444998 -508300 -578096
36411e78096n6803k3736J8133N0939O2798N5792M2702L8141N1352Q1210J14442
$$ -578096 -634899 -658635 -640502 -589563 -526765 -470973 -428271 -390130 -338778 -257568 -143126
36400a43126J32561J25996J00588O7834L3390J201j6437o579K3363M4254L3911
$$ -143126 -10565 115431 216019 283853 317243 318444 302007 295428 318791 363045 396956
36389C96956J468k4301k5696p193J8018L9995N1998N2229M9876N8750P8016Q6665
$$ 396956 398424 374123 348427 341234 359252 399247 451245 503474 553350 612100 690116 776781
36377G76781O5019J8003k8978n3960n2987l5649j5558n684j4354l9276o5954p5403
$$ 776781 841800 859803 830825 776865 723878 688229 672671 666987 652633 613357 547403 472000
36365D72000n6609j4532L2883O7635Q3942Q7755Q4838P2725M6357R057k5187m0204
$$ 472000 415391 400859 433742 501377 585319 673074 757912 830637 876994 886051 860864 820660
36353H20660k8760J114K9286L7169K2846J689r818q560j654O020J5358K6756L7063
$$ 820660 791900 793014 822300 859469 882315 884004 874186 865626 863972 869992 885350 912106 949169
36340I49169M3375M4778L9246K3303l219l4964o5101q8655j00299r2845o3030
$$ 949169 992544 1037322 1076568 1099871 1096652 1061688 996587 907932 807633 714788 651758
36329F51758j9076K1499M4861N1269N0878N0112M5578L1829J0149j3921l7340
$$ 651758 632682 654181 699042 750311 801189 851301 896879 928708 938857 924936 887596
36318H87596n7956o9724o8318o0646n8396n9832m8696j7018K0995M6738O0922
$$ 887596 829640 759916 691598 630952 572556 512724 464028 447010 468005 514743 575665
36307E75665P7844J00584J15190J09737Q7748O0007L2620P679j1391k1047k1183
$$ 575665 653509 754093 869283 979020 1066768 1126775 1159395 1167074 1155683 1134636 1113453
36296A113453j4598n614k07l279j3634k4554l0761l2513l3555l8563n0987o7010
$$ 1113453 1098855 1093241 1093034 1089755 1076121 1051567 1020806 988293 954738 916175 865188 798178
36284G98178p2071n1934j0763K8651M7556M9270N0308N8858O8277O8386N5770
$$ 798178 726107 674173 663410 692061 739617 788887 839195 898053 966330 1034716 1090486
36273A090486L3790R642o515n025J5453M3798O3102O3836N0834L6608K7589J8327
$$ 1090486 1124276 1133918 1127403 1122378 1137831 1181629 1244731 1308567 1359401 1396009 1423598 1441925
36261A441925l94l0420o5088r5497j13270j10063q2696m1007m275J4397J7370
$$ 1441925 1441531 1411111 1346023 1250526 1137256 1027193 944497 903490 899215 913612 930982
36250I30982J4507J0740M750m807j7553l3553n1144o2239n5068k4953J8738N8422
$$ 930982 945489 956229 960979 956172 938619 905066 853922 791683 736615 711662 730400 788822
36238G88822Q2103R1572R6608J01458R9407Q2579N4010K5255L102j4974l0846
$$ 788822 870925 962497 1059105 1160563 1259970 1342549 1396559 1421814 1424916 1409942 1379096
36227A379096l8206l0679j4133m283j0419k4190k6242m496L3522O6583P8796P2160
$$ 1379096 1340890 1310211 1296078 1291795 1281376 1257186 1230944 1226448 1259970 1326553 1405349 1477509
36215A477509N9744N0012M2253L4773K9819K9193L1730L7711M9876O7008Q1930
$$ 1477509 1537253 1587265 1629518 1664291 1694110 1723303 1755033 1792744 1842620 1909628 1991558
36204A991558Q9129Q9158Q2944O8994N0643L8451L8566M5405N3007O5344Q4042
$$ 1991558 2080687 2169845 2252789 2321783 2372426 2410877 2449443 2494848 2547855 2613199 2697241
36193B697241R3147P3118K9973n449j1956J311J4437K3505L6722N3340O1363N4939
$$ 2697241 2790388 2863506 2893479 2888030 2876074 2877385 2891822 2915327 2952049 3005389 3066752 3121691
36181C121691M2367L4444L2411L0269K3496J2046j709j3994j9068j0791J2467
$$ 3121691 3164058 3198502 3230913 3261182 3284678 3296724 3295015 3281021 3261953 3251162 3263629
36170C263629M3060O5951O9881N8644M8235N0194O0311O6766O6375O7930Q0790
$$ 3263629 3306689 3372640 3442521 3501165 3549400 3599594 3659905 3726671 3793046 3860976 3941766
36159C941766J05377J35397J64635J89780K09816K24756K33455K32291K18623
$$ 3941766 4047143 4182540 4347175 4536955 4746771 4971527 5204982 5437273 5655896
36150E655896J96162J74298J61622J63342J85133K32991L03740L77632M25202
$$ 5655896 5852058 6026356 6187978 6351320 6536453 6769444 7073184 7450816 7876018
36141G876018M22604L61080K48133J06714k8805j26325j73309j80957j70560j56764
$$ 7876018 8298622 8659702 8907835 9014549 8985744 8859419 8686110 8505153 8334593 8177829
36131H177829j42335j23405r6858o5472l8349k3866j9995j3898O688M3393Q9064
$$ 8177829 8035494 7912089 7815231 7749759 7711410 7687544 7667549 7653651 7660339 7703732 7792796
36120G792796J34914J72868J96024K03494K03117K03822K06834K10684K23403
$$ 7792796 7927710 8100578 8296602 8500096 8703213 8907035 9113869 9324553 9547956
36111I547956K59925L23119L93948M47141M74474M88533N06310N34685N71191
$$ 9547956 9807881 10131000 10524948 10972089 11446563 11935096 12441406 12976091 13547282
36102A3547282O12432O57531P04808P48960P84863Q15591Q55159R19357J011746
$$ 13547282 14159714 14817245 15522053 16271013 17055876 17871467 18726626 19645983 20657729
36093B0657729J120469J230713J338673J451428J576098J714485J868718K046539
$$ 20657729 21778198 23008911 24347584 25799012 27375110 29089595 30958313 33004852
36085C3004852K256689K501175K776923L085058L434003L831221M276475M768808
$$ 33004852 35261541 37762716 40539639 43624697 47058700 50889921 55166396 59935204
36077E9935204N319263N950867O684429P528620Q485439R558620J0749587J2047705
$$ 59935204 65254467 71205334 77889763 85418383 93903822 103462442 114212029 126259734
36069A26259734J3432819J4890534J6420359J8021794J9663060K1245601K2573431
$$ 126259734 139692553 154583087 171003446 189025240 208688300 229933901 252507332
36062B52507332K3335138K3113065K1443310J7947787J2525161N518561k267691
$$ 252507332 275842470 298955535 320398845 338346632 350871793 356390354 354122663
36055C54122663r772378j6022385k0427589k2877576k3641476k3179820k1972365
$$ 354122663 344350285 328327900 307900311 285022735 261381259 238201439 216229074
36048B16229074k0406402j8731646j7073213j5478458j3963507j2538519j1213914
$$ 216229074 195822672 177091026 160017813 144539355 130575848 118037329 106823415
36041A06823415r999014q899628p916447p044522o273183n587496m974432m430936
$$ 106823415 96824401 87924773 80008326 72963804 66690621 61103125 56128693 51697757
36033E1697757l963064l572125l242255k946284k664990k398372k159085j958948
$$ 51697757 47734693 44162568 40920313 37974029 35309039 32910667 30751582 28792634
36025B8792634j800819j676309j567393j455246j333678j212877j105616j011053
$$ 28792634 26991815 25315506 23748113 22292867 20959189 19746312 18640696 17629643
36017A7629643r17496q20783p32672o66903o22390n86641n52641n23429m99451
$$ 17629643 16712147 15891364 15158692 14491789 13869399 13282758 12730117 12206688 11707237
36008A1707237m71233m30745l83933l44153l16102k93716k71961k51688k31732
$$ 11707237 11236004 10805259 10421326 10077173 9761071 9467355 9195394 8943706 8711974
35999H711974k05068j67465j24469q5744n7184m2585m7356p2831j08179j34652
$$ 8711974 8506906 8339441 8214972 8129228 8072044 8029459 7982103 7909272 7801093 7666441
35989G666441j39696j24352r7095o4326k8237Q937M2336O7888Q7366J06596J25458
$$ 7666441 7526745 7402393 7305298 7240972 7212735 7221672 7264008 7331896 7419262 7525858 7651316
35978G651316J31486J08391N1990k5659j08153j85999k55075l10510l47294l64485
$$ 7651316 7782802 7891193 7943183 7917524 7809371 7623372 7368297 7057787 6710493 6346008
35968F346008l65447l55725l41852l28209l12477k88226k54730k19962j91366
$$ 6346008 5980561 5624836 5282984 4954775 4642298 4354072 4099342 3879380 3688014
35959C688014j69104j52053j43630j45551j51704j55589j58571j62293j58152
$$ 3688014 3518910 3366857 3223227 3077676 2925972 2770383 2611812 2449519 2291367
35950B291367j35651r8758o2244l2417m018K2278L3595K3418O198L239J8328L5106
$$ 2291367 2155716 2056958 1994714 1962297 1958279 1980557 2014152 2037570 2043768 2047007 2065335 2100441
35938B100441L6191J9250m051j9920k3526k1034k0984k4610k7473k8252k8510
$$ 2100441 2136632 2155882 2151831 2131911 2108385 2087351 2066367 2041757 2014284 1986032 1957522
35927A957522k3793n652K2019L8303K6948k089k2911k3347j5134j5182k6761m1864
$$ 1957522 1933729 1928077 1950096 1988399 2015347 2013258 1990347 1967000 1951866 1936684 1909923 1868059
35915A868059n3535n9965o0898n6129m7301l8537l5317m2467o0198q0654r1137
$$ 1868059 1814524 1754559 1693661 1637532 1590231 1551694 1516377 1473910 1413712 1333058 1241921
35904A241921q4047o3534m1479k7953k5711l0855l5425l0466j1071J8332M4182
$$ 1241921 1157874 1094340 1052861 1024908 999197 968342 932917 902451 891380 909712 953894
35893I53894N1645L4869J435l2405n1906n1856l7300j7722k95J2736K1889K7206
$$ 953894 1005539 1040408 1041843 1009438 957532 905676 868376 850654 850359 863095 884984 912190
35881I12190K7406K1454J0084m434j9685l3681m3732m5186l3732j1740Q514J2876
$$ 912190 939596 961050 971134 966700 947015 913334 869602 824416 790684 778944 787458 800334
35869H00334k84j7031k3601k2340k5279l2978k9262j588L9790O8937O6970L3778
$$ 800334 800050 783019 759418 737078 711799 678821 649559 647971 687761 756698 823668 857446
35857H57446j6589o3594q6462p3901l2164J9809O3963Q9918R3066P4961M5929
$$ 857446 840857 777263 690801 616900 584736 604545 668508 758426 851492 926453 972382
35846I72382J8664l839k8067n6205p9967r1047q9629p7678n2071j3310K3937L9642
$$ 972382 991046 987207 959140 902935 822968 731921 642292 564614 512543 499233 523170 562812
35834E62812K8730O335p870o221N283J5977J9549J7421J4483J0341k992l0987
$$ 562812 591542 597877 590007 583786 589069 605046 624595 642016 656499 666840 663848 632861
35822F32861o5831r0935r6322q5220o5821m3204k2507j4088k7783o0346r1858
$$ 632861 567030 476095 379773 294553 228732 185528 163021 148933 121150 60804 -31054
35811c1054r7827o7386j1696M4996Q3868J02969J12102J19112J22908J18317J04161
$$ -31054 -128881 -196267 -207963 -162967 -79099 23870 135972 255084 377992 496309 600470
35800F00470Q5443O9055N8217N0964M4715M2289M9641O4191O8422M2946j1299
$$ 600470 685913 754968 813185 864149 908864 951153 1000794 1064985 1133407 1176353 1165054
35789A165054o8648j00447r8858p6847m9166k0191J0128L6171M8123M1820K3016
$$ 1165054 1096406 995959 897101 820254 771088 750897 761025 797196 845319 887139 910155
35778I10155J026j9703m0258o0303p2577o6188l6227J0165N7423R0809J02902
$$ 910155 911181 891478 851220 790917 718340 652152 615925 626090 683513 774322 877224
35767H77224R4509P2980M9127L1284J9544P842o076j5354j2633k391J353q802
$$ 877224 971733 1044713 1093840 1125124 1144668 1152510 1146434 1131080 1118447 1116056 1117409 1108607
35755A108607k5140l5993m0836m7972n8933o2824m9035k1236N250J8246J8129
$$ 1108607 1083467 1047474 1006638 958666 899733 836909 787874 766638 771888 790134 808263
35744H08263J3592J0985Q915K903n710q369p7R784L559k4501n8849p8816q1628
$$ 808263 821855 832840 841755 844658 838948 830579 830502 840286 843845 819344 760495 681679 600051
35731F00051q2547r2363j02903r8798p7314m9309k3429J708K7549M5416M2841
$$ 600051 517504 425141 322238 223440 146126 96817 73388 75096 102645 148061 190902
35720A90902J8151j6480m6495o5336p3249p1449o1862n0552m6078n2215o3597
$$ 190902 209053 192573 146078 80742 7493 -63956 -125818 -176370 -222448 -274663 -338260
35709c38260o9711o2922m3062j6656O616J8295J6002O399K134J2773L7078O4195
$$ -338260 -407971 -470893 -513955 -530611 -523995 -505700 -489698 -483299 -481165 -468392 -431314 -367119
35697c67119Q1975Q3175O5527L0996j2190n0483p2904p7966p0471n3667k8720
$$ -367119 -285144 -201969 -136442 -105446 -117636 -168119 -241023 -318989 -389460 -443127 -471847
35686d71847K08K6843M9012O7412P7167O8686M1375R834r986j6598j9187k2814
$$ -471847 -471639 -444796 -395784 -328372 -251205 -182519 -141144 -131310 -141296 -157894 -177081 -199895
35674a99895k5339k6159k8449l2058l2120k6896k0655j6241j0255R41J4350K2996
$$ -199895 -225234 -251393 -279842 -311900 -344020 -370916 -391571 -407812 -418067 -417126 -402776 -379780
35662c79780K3578J9829K0271L2864N8578Q8799J11019J17334J06195P9162M1535
$$ -379780 -356202 -336373 -316102 -283238 -224660 -135861 -24842 92492 198687 277849 319384
35651C19384M060k4291m6367p1905j00489j18284j16409j03532r2248p9696n2828
$$ 319384 323444 299153 252786 180881 80392 -37892 -154301 -257833 -350081 -429777 -482605
35640d82605j0579K9965N0964M9465L3943J3565m218j1436l209J5468L0518K8829
$$ -482605 -493184 -463219 -412255 -362790 -328847 -315282 -319500 -330936 -334145 -318677 -288159 -259330
35628b59330P874k3359n1248o5235o1126m0544r750K1615M3300M8248L5101R266
$$ -259330 -251456 -274815 -326063 -391298 -452424 -492968 -502718 -481103 -437803 -389555 -354454 -345188
35616c45188j7298l0540k4027m952J2999K3056K7782K8755K1379L793j5289k4089
$$ -345188 -362486 -393026 -417053 -422005 -409006 -385950 -358168 -329413 -308034 -304241 -319530 -343619
35604c43619j9976q605N849K2332L6415M0685L3997K4345J9450J8777J7596J4469
$$ -343619 -363595 -372200 -366351 -344019 -307604 -266919 -232922 -208577 -189127 -170350 -152754 -138285
35592a38285J0878O842K226J196R943K8413M7954N9795O4120O8246P6554Q4876
$$ -138285 -127407 -120565 -118339 -117143 -107200 -78787 -30833 28962 93082 161328 237882 322758
35580C22758Q5199P3610N2493K7122K290j8536l3149m0333l8988k8315r862J1794
$$ 322758 407957 481567 534060 561182 563472 544936 511787 471454 432466 404151 394289 406083
35568D06083L1474M4920M6837L1639J315k9545m3885l9336l0420l1539m2211n1622
$$ 406083 437557 482477 529314 560953 562268 532723 488838 449502 419082 387543 345332 293710
35556B93710n2888m7452l7748k1815J989K6797L7668K4687k786j9583q561K0384
$$ 293710 240822 193370 155622 133807 135796 162593 200261 224948 222162 202579 194018 214402
35544B14402M1324M1663L2819L1015L7597M3571M4402M1025L1670J3678o984j7121
$$ 214402 255726 297389 330208 361223 398820 442391 486793 527818 559488 573166 566182 549061
35532E49061j0078O498J8195J6107J519j7620l2929l9861l7817k8395j6196r857
$$ 549061 538983 545481 563676 579783 581302 563682 530753 490892 453075 424680 408484 398627
35520C98627j6296l2120m5945n1584n3293n5603n6152n3794n4505n9643n5867
$$ 398627 382331 350211 304266 252682 199389 143786 87634 33840 -20665 -80308 -136175
35509a36175l0046Q930L7051M4021M2200M4392M6209L7639K1667J1072J1335J5439
$$ -136175 -166221 -157291 -120240 -76219 -34019 10373 56582 94221 115888 126960 138295 153734
35497A53734J4323O126n235j6416k7733m0016m8846m5182k6238m259K713q933
$$ 153734 168057 174183 168948 152532 124799 84783 35937 -9245 -35483 -39742 -37029 -45962
35485d5962k3095k1915m313J6528K8630K8611J7729j238k1664l2783k5976j918
$$ -45962 -69057 -90972 -95285 -78757 -50127 -21516 -3787 -5025 -26689 -59472 -85448 -87366
35473h7366K8670N1200N5168L8443P041k7183n0623n5455m6243l5886l1994l0119
$$ -87366 -58696 -7496 47672 86115 93156 65973 15350 -40105 -86348 -122234 -154228 -184347
35461a84347k2854j0105N459K7021N6880Q3110Q5666N9700K3285l041j6095k3588
$$ -184347 -207201 -217306 -211847 -184826 -127946 -44836 40830 100530 123815 120774 104679 81091
35449H1091k6214j6823M879K6076L1572J6936r689l5478n1805n7715n7047n3835
$$ 81091 54877 38054 42933 69009 100581 117517 107828 72350 20545 -37170 -94217 -148052
35437a48052n1085n0992n2454m9924m0100k9168k6585l0431k6314m766K6260N0713
$$ -148052 -199137 -250129 -302583 -352507 -392607 -421775 -448360 -478791 -505105 -509871 -483611 -432898
35425d32898O1279O2429O1560O2309O2239N2001K1937k3115n9409o3920l7957
$$ -432898 -371619 -309190 -247630 -185321 -123082 -71081 -49144 -72259 -131668 -195588 -233545
35414b33545m117J9537L4137M8225O1128O3658N0074K3509p864l5212n1249n3196
$$ -233545 -237662 -218125 -183988 -135763 -74635 -10977 39097 62606 54742 19530 -31719 -84915
35402h4915m4474l0808j4105P105L0349M5699M3479K5072K753j2286j8823k1263
$$ -84915 -129389 -160197 -174302 -167197 -136848 -91149 -47670 -22598 -19845 -32131 -50954 -72217
35390g2217k0489j3493l38J3416K1650K2010J6088R181Q777J7713K8527L0234
$$ -72217 -92706 -106199 -106537 -93121 -71471 -49461 -33373 -24192 -15415 2298 30825 61059
35378F1059K1822J2992R990Q626N419P541K3252M6836O2691O3745N7906N4950
$$ 61059 82881 95873 105863 114489 119908 127449 150701 197537 260228 323973 381879 436829
35366D36829N3853M6232K8006M141j6554k9073l5559m2077n2029o2913o9697o9556
$$ 436829 490682 536914 564920 569061 552507 523434 487875 445798 393769 330856 261159 191603
35354A91603o1511m3524j3836K3778N8685P9328Q0790O6639M4359K0528P91p997
$$ 191603 130092 86568 72732 96510 155195 234523 315313 381952 426311 446839 447630 439633
35342D39633j118J5834K6675J9027j797j9234k5266k6469k9012k7126j2627J0553
$$ 439633 438515 454349 481024 500051 498254 479020 453754 427285 398273 371147 358520 369073
35330C69073K9451L6539L3607K3057L550k4073n2466p2465p9398p3131n4293k3263
$$ 369073 398524 435063 468670 491727 495277 471204 418738 346273 266875 193744 139451 116188
35318A16188J6705N6142Q1756Q5586P2484N5511M2810L1770J6801j586j7672k6598
$$ 116188 132893 189035 270791 356377 428861 484372 527182 558952 575753 574167 556495 529897
35306E29897k7293k3568k4809l9845o5023q2408p5882m7101j1730J6515L2801
$$ 529897 502604 479036 454227 414382 349359 266951 191069 143968 132238 148753 181554
35295A81554L6357K7313R297j0151k4012k9942l1700l6816m7857n3584l5894Q206
$$ 181554 217911 245224 254521 244370 220358 190416 158716 121900 74043 20459 -15435 -7229
35283g229N6708Q1834P5116M7580J2708j9748l8665l6288k0082q010q445j3312
$$ -7229 49479 131313 206429 254009 266717 246969 208304 172016 151934 143924 135479 122167
35271A22167j2135k490J5331M1280O6556P1675M3095j1648o9751j09425j18765
$$ 122167 110032 107542 122873 164153 230709 302384 345479 333831 264080 154655 35890
35260C5890r8697o5249m2414m2599n4719n6994l9871j2722Q808J6888J5237J3338
$$ 35890 -62807 -128056 -170470 -213069 -267788 -324782 -364653 -377375 -368567 -351679 -336442 -323104
35248c23104J6369J9221J3398P66n121N310K5942M2687M6840L6273J1119k2303
$$ -323104 -306735 -287514 -274116 -273350 -278471 -273161 -247219 -204532 -157692 -121419 -110300 -132603
35236a32603m7960n1427l4788j2426O907K4625L8556L6048P690l7485p6865r2448
$$ -132603 -180563 -231990 -266778 -279204 -272297 -247672 -209116 -173068 -165378 -202863 -279728 -372176
35224c72176q1406n2673j9107P939K2658K7224K8920L2710L6500L4404K3860Q067
$$ -372176 -453582 -506255 -525362 -517423 -494765 -467541 -438621 -405911 -369411 -335007 -311147 -303080
35212c03080p771j9383k1829r743J5391L9848M6260L0597P219m838K256K3694
$$ -303080 -310851 -330234 -352063 -361806 -346415 -306567 -260307 -229710 -222491 -227329 -225073 -201379
35200b01379N0627P5339R0859R1830P7272N0717J7778j4798l9294m9786m6257
$$ -201379 -150752 -75413 15446 107276 184548 235265 253043 238245 198951 149165 102908
35189A02908l4844k3071j4120n325P027K0424K5340J4439q260l0636m3895m6597
$$ 102908 68064 44993 30873 25548 32575 52999 78339 92778 84518 53882 9987 -36610
35177c6610l8803j9858N606K6365L4496L2753K8346K3429J6001N842n385j6428
$$ -36610 -75413 -95271 -89665 -63300 -28804 3949 32295 55724 71725 77567 72182 55754
35165E5754k3440j8576J277K5947L9498L6961K8375K5339K8171K7478J5169p305
$$ 55754 32314 13738 15015 40962 80460 117421 145796 171135 199306 226784 241953 234648
35153B34648k9500m0661l9012l1266k2448j0589N509J8514J9147P539q585k4835
$$ 234648 205148 164487 125475 94209 71761 61172 66681 85195 104342 111881 103296 78461
35141G8461m1472n4770n5682l9243r486K5914N9474Q1739Q3787O6636M2636K3146
$$ 78461 36989 -17781 -73463 -112706 -122192 -96278 -36804 44935 128722 195358 237994 261140
35129B61140Q435p125k4568l9232m6599m4950l4813j9788o046K830R697J9832
$$ 261140 269575 262450 237882 198650 152051 107101 72288 52500 46454 49284 58981 78813
35117G8813L3729M5776M9127M0346K0621n433l1854n2970o3589n9641m0501r618
$$ 78813 112542 158318 207445 247791 268412 262979 231125 178155 114566 54925 14424 4806
35105D806K8660P0193J06473J23859J14973Q8889O1899L8639J1456k1278m8506
$$ 4806 33466 103659 210132 333991 448964 537853 599752 638391 649847 628569 580063
35094E80063o2859p1907q3657q9485p3913l8068k578J2713M452j6851l6575m3249
$$ 580063 517204 445297 361640 272155 198242 160174 157596 170309 174761 157910 121335 78086
35082G8086l4957k1090j2395p962L242K7186N5608P2916O9509N0062L3080L9394
$$ 78086 43129 22039 9644 1682 4924 32110 87718 160634 230143 280205 313285 352679
35070C52679P3435J15369J37678J29760J01829O8574L9427K3739L0582N5866P9277
$$ 352679 426114 541483 679161 808921 910750 979324 1018751 1042490 1073072 1128938 1208215
35059A208215Q3933P4952P1316Q2279R7770R9726P8366M0340N128j0007o408k697
$$ 1208215 1292148 1367100 1438416 1520695 1618465 1718191 1796557 1836897 1842025 1832018 1825610 1822913
35047A822913j3527l4103n0077n6077n6402n3420m7686m8149o8286j07075j43010
$$ 1822913 1809386 1775283 1725206 1669129 1612727 1559307 1511621 1463472 1395186 1288111 1145101
35036A145101j53769j36922j06997p7966n4482l6114k2588j4568j3400k0049l1610
$$ 1145101 991332 854410 747413 669447 614965 578851 556263 541695 528295 508246 476636
35025D76636m0390m0849l7848m3612o3360q5668r0942p0777l6751q015P753J7042
$$ 476636 436246 395397 357549 313937 250577 164909 73967 3190 -33561 -41576 -33823 -16781
35013a6781K5571K8603K0558Q062M584J3289K3382K4656J8271R652k924k6291
$$ -16781 8790 37393 57951 66013 70597 83886 107268 131924 150195 159847 156923 130632
35001A30632o0348r1863j01447p8758l4742J878P213j5503m0530m8567m5143m6778
$$ 130632 70284 -21579 -123026 -201784 -236526 -234648 -227435 -242938 -283468 -332035 -377178 -423956
34989d23956n6667o2430n3878l3576j0238J0725K8951M7108O7612Q6237R0194
$$ -423956 -480623 -543053 -596931 -630507 -640745 -630020 -601069 -553961 -486349 -400112 -309918
34978c09918P0259L5943J0110M310O341k100k1098l3422k6742o597J3090K5062
$$ -309918 -239659 -203716 -193606 -189296 -182955 -185055 -206153 -239575 -266317 -272914 -259824 -234762
34966b34762L0978L3859L3769L0416K6131K4088K3937K0259O717j6901m1908n6246
$$ -234762 -203784 -169925 -136156 -105740 -79609 -55521 -31584 -11325 -4608 -21509 -63417 -119663
34954a19663n3479l6091j0902J5779L7331M5205L4434J2215l697O49K3374N0565
$$ -119663 -173142 -209233 -220135 -204356 -167025 -121820 -87386 -75171 -78868 -78219 -54845 -4280
34942d280O8973P1733N5717K2023j8995n0571o3167o2800o1949o4051o0402m0824
$$ -4280 64693 136426 192143 214166 195171 144600 81433 18633 -43316 -107367 -167769 -208593
34930b08593m515L7667O8356P2849M8189N016m0089p3418q7007p9025n5584k7601
$$ -208593 -213108 -175441 -107085 -34236 13953 18969 -21120 -94538 -181545 -260570 -316154 -343755
34918c43755Q7L3458P6655J16948J31005J07683N8872P654k7898l9773k9529q500
$$ -343755 -343668 -310210 -233555 -116607 14398 122081 180953 188607 160709 120936 91407 82907
34906H2907P874J2392J0446J0023J2769J8206K9444M7131O2175O2946M8688K9015
$$ 82907 90781 103173 113619 123642 136411 154617 184061 231192 293367 356313 405001 434016
34894D34016J1361l795j5451j8560j1971m434p377k2873m1127m8438l6737q701
$$ 434016 445377 441582 426131 407571 395600 391166 383789 360916 319789 271351 234614 225913
34882B25913K2865M2051M0837K5593J1710R876J7002K1245J5794N899Q69J138
$$ 225913 248778 290829 331666 357259 368969 378845 395847 417092 432886 438785 439654 440792
34870D40792k692j7782m0137n9704p0593p2668o5954m9104k4276J79J4049J2325
$$ 440792 438100 420318 380181 320477 249884 177216 111262 62158 37882 38061 52110 64435
34858F4435r51j4494j7488r033K99p49j1822k1898k2002j3246k113P311J3444
$$ 64435 63484 48990 31502 22469 22768 22019 10197 -11701 -33703 -46949 -49062 -41751 -28307
34845b8307J3325L811j3053k9317l7569l7302l3967l2194l0944k6016j6862r036
$$ -28307 -14982 -11171 -24224 -53541 -91110 -128412 -162379 -194573 -225517 -251533 -268395 -277431
34833b77431q216j2406j2599k307J4756K7486K7086J3316p021k5199l4510l2395
$$ -277431 -285647 -298053 -310652 -312959 -298203 -270717 -243631 -230315 -237336 -262535 -297045 -329440
34821c29440k1213o228R212K6142M5662O2682O7870N8593M5349M2791N3987O6992
$$ -329440 -350653 -356881 -347669 -321527 -275865 -213183 -145313 -86720 -41371 1420 55407 122399
34809A22399O8356N7450M5553M2267M4837M0723K0440j1379l8137m6117l7127
$$ 122399 190755 248205 293758 336025 380862 421585 442025 430646 392509 346392 309265
34798C09265k4759j9472k1482k7471l6680m6131m6284k9682k769J7639K0404Q025
$$ 309265 284506 265034 243552 216081 179401 133270 86986 57304 54535 72174 92578 100603
34786A00603j0456k7422l6199l0744j2306P443J6754J6638J7855K5013K9421K0608
$$ 100603 90147 62725 26526 -4218 -16524 -9081 7673 24311 42166 67179 96600 117208
34774A17208K15k0454l4071m1696m2831k8755P527N6783R6100J08014R3917O8118
$$ 117208 117423 96969 62898 21202 -21629 -50384 -42857 13926 110026 218040 311957 380075
34762C80075M3815K7327K0619K2538K7638K8189J8757k124l2815o7432r4750j03074
$$ 380075 423890 451217 471836 494374 522012 550201 568958 566834 534019 466587 371837 268763
34750B68763q8999o0406l0291q319L253R063J6982L2121N2226O9308P5833O8839
$$ 268763 179764 119358 89067 80748 84001 93064 110046 142167 194393 263701 339534 408373
34738D08373M9494K1946o815k8789l8691l5647k1985k128J8087L4307M6323N5107
$$ 408373 457867 479813 472998 444209 405518 369871 347886 345758 363845 398152 444475 499582
34726D99582N7663N0225L8804M0051O4145R8526J16605J05096P7129N4697M3499
$$ 499582 557245 607470 646274 686325 750470 848996 965601 1070697 1147826 1202523 1246022
34715A246022L1930J2043q426j8261j9074k2059l2559m6587o1694q1044j03116
$$ 1246022 1277952 1289995 1281569 1263308 1244234 1222175 1189616 1143029 1081335 1000291 897175
34704H97175j16098j10012q9740o8621n2301l7208k3008j6488k0821k9479l4964
$$ 897175 781077 671065 581325 512704 460403 423195 400187 383699 362878 333399 298435
34693B98435l6370l3258j9457P690L5170M2208K2764o845k5940k9481k6471k4409
$$ 298435 262065 228807 209350 217040 252210 294418 317182 310337 284397 254916 228445 204036
34681B04036k2727j9929j9256k4739l6229n0793o4766p1347o1285l2881M20J9638
$$ 204036 181309 161380 142124 117385 81156 30363 -34403 -105750 -167035 -199916 -199496 -179858
34669a79858J9178J0871P757J0114J1285J1038J5666K6798L6942L7046K4500M014
$$ -179858 -160680 -149809 -142052 -131938 -120653 -109615 -93949 -67151 -30209 6837 31337 35351
34657C5351j4916k1201q043K1239N4451P8104Q3110O6525L3791p59k2567k9576
$$ 35351 20435 -766 -8809 12430 66881 144985 228095 294620 328411 327652 305085 275509
34645B75509l2199l7807m0330l0275j1249J304j615j1900j4966p295O00k594j5949
$$ 275509 243310 205503 165173 134898 123649 124953 123338 111438 96472 89177 89777 87183 71234
34632G1234k6084j7813J3741N7234Q9908R3039O7288L1477L005j8219m1954o7386
$$ 71234 45150 27337 41078 98312 188220 281259 348547 380024 383029 364810 322856 255470
34620B55470q0555p3927n8710n1013n1989m9697l6851j8291k096R701K1526L9901
$$ 255470 174915 100988 42278 -8735 -60724 -110421 -147272 -165563 -167659 -157958 -136432 -96531
34608i6531O6023Q7320Q1021L6248k8579p9652r8621r0356o3338j9484L1714O6244
$$ -96531 -30508 56812 137833 174081 145502 65850 -32771 -123127 -186465 -205949 -174235 -107991
34596a07991O6882M2863J5698q158l6614o7455q0833o1291j7706K4565M6503M6752
$$ -107991 -41109 1754 17452 9294 -27320 -94775 -175608 -236899 -254605 -230040 -183537 -136785
34584a36785L5056K0531P171k340k941Q630K6793L9773M1283L4588K2976L818
$$ -136785 -101729 -81198 -74027 -76367 -79308 -70678 -43885 -4112 37171 71759 94735 98553
34572I8553k2497m5144n3922n3602n7296o7396p2970o5687m8256k5972k87K5588
$$ 98553 76056 30912 -23010 -76612 -133908 -201304 -274274 -339961 -388217 -414189 -414476 -388888
34560c88888M3614M9132M6490M2291L8465L5333L4664L4082K4252r89l4412o1215
$$ -388888 -345274 -296142 -249652 -207361 -168896 -133563 -98899 -64817 -40565 -41554 -75966 -137181
34548a37181p3270p2262o0607l5833M138N2851R3742J07224Q3392L2068k0554
$$ -137181 -210451 -282713 -343320 -379153 -375015 -322164 -228422 -121198 -37806 -5738 -26292
34537b6292m9025m4471j5586K1417N1683O6189O4814N5514M6275L6953K1241m145
$$ -26292 -75317 -119788 -135374 -113957 -62274 3915 68729 124243 170518 207471 228712 224567
34525B24567l5249o4919q6575r3378p8701m2100N542M6020O5821O5619N7482N1182
$$ 224567 189318 124399 37824 -55554 -134255 -176355 -170813 -124793 -58972 6647 64129 115311
34513A15311M3452K2796j4823n8330r0805j03038r5987p4959m7128k2139p402
$$ 115311 158763 181559 166736 108406 17601 -85437 -181424 -256383 -303511 -325650 -333052
34502c33052j080N809J9157L7036N4079O4112N7900K7682j9542n9382p0239n5647
$$ -333052 -334132 -328323 -309166 -272130 -218051 -153939 -96039 -68357 -87899 -147281 -217520 -273167
34490b73167l9882m1035n3998n9858m5218j0490L2822O6909P4705N0894P578l4324
$$ -273167 -313049 -354084 -408082 -467940 -513158 -523648 -490826 -423917 -349212 -298318 -290740 -325064
34478c25064n9783o5293n4678l5532j7906q335k993P496K4546L9431M7732N7822
$$ -325064 -384847 -450140 -504818 -540350 -558256 -566591 -569584 -562088 -537542 -498111 -450379 -392557
34466c92557P7292R6654R7287P4827M4959K4687J6913J6121J9149K2863J8305
$$ -392557 -315265 -218611 -121324 -46497 -1538 23149 40062 56183 75332 98195 116500
34455A16500k536l4773o1968o9509n4090k4215K465P305j2572l5043l1816j526
$$ 116500 113964 79191 17223 -52286 -106376 -130591 -128126 -120821 -133393 -168436 -200252 -201778
34443b01778K4433J5858k2744n9717p1505o0223l9159j4569J2444L4962M1590
$$ -201778 -177345 -161487 -184231 -243948 -315453 -375676 -414835 -429404 -416960 -381998 -340408
34432c40408K8828O774r167j0106K924K4332M9824P6419R8880J09442J02770P9954
$$ -340408 -311580 -304806 -313973 -324079 -321155 -296823 -246999 -170580 -71700 37742 140512 220466
34420B20466M6287P140l1641o1815p6984p9805q0238q3668q4049p2074m7840k1353
$$ 220466 266753 273893 242252 180437 103453 23648 -56590 -140258 -224307 -296381 -344221 -365574
34408c65574j194J3688L0168N1071O9974P5483O1349L3419N714j1225j7096j6777
$$ -365574 -366768 -353080 -322912 -271841 -201867 -126384 -65035 -31616 -25902 -37127 -54223 -71000
34396g1000j1819L45K0945M7183P4061R6158J09184J13235J12949J10244R8823
$$ -71000 -82819 -82474 -61529 -14346 59715 155873 265057 378292 491241 601485 700308
34385G00308P2320L7900J4025J0949J8778J9477O785j0110j9021j5267k170J2327
$$ 700308 772628 810528 824553 835502 854280 873757 880542 870432 851411 836144 833974 846301
34373H46301J9299J4517K681o723q606n132K11P173J5493K0751J7730P566k092
$$ 846301 865600 880117 882798 876075 867469 862337 862548 869721 885214 905965 923695 931261 929169
34360I29169o538j2270l1948o8647j07182j25066j12658p9776m3314j3621N765
$$ 929169 922631 910361 878413 809766 702584 577518 464860 385084 341770 328149 333914
34349C33914J2644P452l233j1707j7492k5543l6710m5733m9023m8675m7195m3442
$$ 333914 346558 354010 350777 339070 321578 296035 259325 213592 164569 115894 68699 25257
34337B5257l6724l1114l2846m5102o5610q5777r1968p3677l3983J1256M6860O7531
$$ 25257 -11467 -42581 -75427 -120529 -186139 -271916 -363884 -437561 -471544 -460288 -413428 -345897
34325c45897P3170O2977M0537J9285J3353K2413L1567K7404J0414q498j9512k1462
$$ -345897 -272727 -209750 -169213 -149928 -136575 -114162 -82595 -55191 -44777 -53275 -72787 -94249
34313i4249k1400k7254l8017m1480k5110R984M7804O9621O6199M2120J3702L51
$$ -94249 -115649 -142903 -180920 -222400 -247510 -237526 -189722 -120101 -53902 -11782 1920 2271
34301B271R760K9392L7967K7151P636o061r809p775n027o927j7707l2214l4901
$$ 2271 12031 41423 79390 106541 114177 108116 98307 90532 85505 78578 60871 28657 -6244
34288f244j5752J5627L9127M4604L6287K0825J502j6508k6152k7012k5709k4965
$$ -6244 -21996 -6369 32758 77362 113649 134474 135976 119468 93316 66304 40595 15630
34276A5630j9611o194J1198K8062M3989N4854M9325K1961j5121m2226n0777m5751
$$ 15630 -3981 -10175 1023 29085 73074 127928 177253 199214 184093 141867 91090 45339
34264D5339l4407k1594j2930j1282r584L010K5138M1232L8563J9812l456k2308
$$ 45339 10932 -10662 -23592 -34874 -44458 -41448 -16310 24922 63485 83297 79841 57533
34252E7533l1811k8970j6612n304m500j2720k0363k0162j1733P66J0382R191n368
$$ 57533 25722 -3248 -19860 -25164 -29664 -42384 -62747 -82909 -94642 -93876 -83494 -74303 -79671
34239g9671k5272l7090l3473j7679K139J9680L1788L6961L4533K4673R447n202
$$ -79671 -104943 -142033 -175506 -193185 -191046 -171366 -139578 -102617 -68084 -43411 -33964 -39166
34227c9166j0706k896J1756J9837J2733n767k3378k9628k2953j0269r61K8m711
$$ -39166 -49872 -52768 -41012 -21175 -8442 -14209 -37587 -67215 -90168 -100437 -101398 -101370 -106081
34214a06081q093n616p77k936j7544l8102n1712n4938n9329p5024r2506r0549
$$ -106081 -114174 -119790 -120567 -123503 -141047 -179149 -230861 -285799 -345128 -420152 -512658 -603207
34202f03207o2966k7023j208J5166L2739N1592O1364N7442M5556L1839J8789J0609
$$ -603207 -666173 -693196 -694404 -679238 -646499 -594907 -533543 -476101 -430545 -398706 -379917 -369308
34190c69308J1900J9501K4933K6643L0203L4429K8891J0765o633j0702p074j0881
$$ -369308 -357408 -337907 -312974 -286331 -256128 -221699 -192808 -182043 -188676 -199378 -206452 -217333
34178b17333k6476m5586o0976p0650p0373n3392j9699K2103O3003R6485J13587
$$ -217333 -243809 -289395 -350371 -421021 -491394 -544786 -564485 -542382 -479379 -382894 -269307
34167b69307J05704P6546M3234J9627M178j1111k6440l6460m1894m9033n8140
$$ -269307 -163603 -87057 -43823 -24196 -20018 -31129 -57569 -94029 -135923 -184956 -243096
34156b43096o0935n1764l4580j5877L497K4318M0773M3286L0477J3893Q318J8578
$$ -243096 -304031 -355795 -390375 -406252 -402755 -378437 -337664 -294378 -263901 -250008 -241690 -223112
34144b23112L6511M8985M7723L3444J3623l246j3296j8956k4814l1441l4462l0736
$$ -223112 -186601 -137616 -89893 -56449 -42826 -46072 -59368 -78324 -103138 -134579 -169041 -199777
34132a99777k4029k1715k5382k7501j9648k618J4126K2643K3548K2686K3495K4004
$$ -199777 -223806 -245521 -270903 -298404 -318052 -320670 -306544 -283901 -260353 -237667 -214172 -190168
34120a90168J9490O871j1673k7881l2565k4891j5612j7284l0100l9757l0928j945
$$ -190168 -170678 -163807 -175480 -203361 -235926 -260817 -276429 -293713 -323813 -363570 -394498 -396443
34108c96443L4337O3104P9935R1125J02641J10386J03797P8937M3733P770k7928
$$ -396443 -362106 -299002 -219067 -127942 -25301 85085 188882 267819 311552 319322 291394
34097B91394o4346r1192r0800n8862j3877J9321L1139K8818K2346J5294O160p807
$$ 291394 227048 135856 45056 -13806 -27683 -8362 22777 51595 73941 89235 95395 87588
34085H7588k6774m3536m5298k6761K2J5675J3497L546k603l572l094j390L193
$$ 87588 60814 17278 -28020 -54781 -54759 -39084 -25587 -22041 -24644 -28216 -31310 -32700 -29507
34072b9507Q789J2208J5056K3579M2031O7454R0111R8696Q7363N9543K5026o354
$$ -29507 -20718 -8510 6546 30125 72156 139610 229721 328417 415780 475323 500349 493995
34060D93995k8473m0385m7642n8468p2327p4257m8993j920M1211N7763M5431J5940
$$ 493995 465522 425137 377495 319027 246700 172443 123450 121530 162741 220504 265935 281875
34048B81875j8042m5278n6267n1654m5213m8854n7316n5934m1048k4207j7392
$$ 281875 263833 218555 162288 110634 65421 16567 -40749 -96683 -137731 -161938 -179330
34037a79330k2225l2764m0115l4202j0930J9169L7134L4305J8981K265j4216l1540
$$ -179330 -201555 -234319 -274434 -308636 -319566 -300397 -263263 -228958 -209977 -207712 -221928 -253468
34025b53468m3272m1845l0961k1491j5532l821J8872M3846N8837O2899O4725O8510
$$ -253468 -296740 -338585 -369546 -391037 -406569 -410390 -391518 -347672 -288835 -225936 -161211 -92701
34013i2701O8153N6800L7287J9574R483K908q696k8920n2539o9072o9446n0846
$$ -92701 -24548 32252 69539 89113 98596 101504 92808 63888 11349 -57723 -127169 -178015
34001a78015j8002J8288M3987M5977J8576l0252p9886j08211j05221p7337m0567
$$ -178015 -196017 -177729 -133742 -87765 -69189 -99441 -179327 -287538 -392759 -470096 -510663
33990e10663j0836K237j492j2502j7301p741J4310M0162N9915O6617O0372M9896
$$ -510663 -521499 -519262 -520754 -533256 -550557 -558298 -543988 -503826 -443911 -377294 -316922 -267026
33978b67026M5096M5497M0623K4684N482n768p614m560M404K2696M2964M9006
$$ -267026 -221930 -176433 -135810 -111126 -105644 -111412 -119026 -123586 -119182 -96486 -53522 -4516
33966d516L5329J6920J3944L0707N2745O0626M4344J0126k2530l5099k6684j4407
$$ -4516 30813 47733 61677 92384 145129 205755 250099 260225 237695 202596 175912 161505
33954A61505j4554k7569m5053o4552q8486j11148j17060r5364n0621K129M7814
$$ 161505 146951 119382 74329 9777 -78709 -189857 -306917 -402281 -452902 -450773 -402959
33943d02959P5220P7144N3690J6012j6698k7962j5487O506J9557J9074J8348L1159
$$ -402959 -327739 -250595 -196905 -180893 -197591 -225553 -241040 -234534 -214977 -195903 -177555 -146396
33931a46396N3723P0165P3276O9991O5036N0441J8676k1087m9295n5996m6921
$$ -146396 -92673 -22508 50768 120759 185795 236236 254912 233825 184530 128534 81613
33920H1613l1438j2188J2902M4387P8063J03873J09286R0339N9848L8097L2856
$$ 81613 50175 37987 50889 95276 173339 277212 386498 476837 536685 574782 607638
33909F07638L3353K5275O326j5054l0049l4964l1705k7360k9486l7736m3585m1310
$$ 607638 640991 666266 672592 657538 627489 592525 560820 533460 503974 466238 422653 381343
33897C81343l4622k8652k1494j0346j509n967k6338n4262p8482q9072p7416m2458
$$ 381343 346721 318069 296575 286229 284720 278753 252415 198153 119671 30599 -46817 -89275
33885h9275J894L4115M2817L2760J4624l109j2754r313J599O261j271j2211j6030
$$ -89275 -87381 -53266 -10449 22311 36935 33826 21072 11759 13358 19619 18348 6137 -9893
33872i893j2681o430L952J9997L4107L5100K1021l43k0292l1169k4357K246L5034
$$ -9893 -22574 -29004 -25052 -5055 29052 64152 85173 84830 64538 33369 9012 11258 46292
33859D6292N3685N2075M2489L6940L2379J8372p607l7819o2342p4422p1613n7561
$$ 46292 99977 152052 194541 231481 263860 282232 274625 236806 174464 100042 28429 -29132
33847b9132m1447l1251k7440k5235k1544j6913j1982n594K963J2142J9492K3650
$$ -29132 -70579 -101830 -129270 -154505 -176049 -192962 -204944 -210538 -207575 -195433 -175941 -152291
33835a52291K4234K0534J1793k01r304q029N562K4202L6175L4120J9113k161k1650
$$ -152291 -128057 -107523 -95730 -95931 -105235 -113264 -107702 -83500 -47325 -13205 5908 3747 -17903
33822a7903l1903k7779j0123J1475K1688R314k2347n5007o8751n8351l5483j4592
$$ -17903 -49806 -77585 -87708 -76233 -54545 -45231 -67578 -122585 -191336 -249687 -285170 -299762
33810b99762N28J4867L1175M4986M8707L6889R547k4703m9723n2640l6532j8750
$$ -299762 -299234 -284367 -253192 -208206 -159499 -122610 -113063 -137766 -187489 -240129 -276661 -295411
33798b95411j3582j8212j7854l240J9495L6033L8911L4218L3913M3179N6647O5380
$$ -295411 -308993 -327205 -345059 -348299 -328804 -292771 -253860 -219642 -185729 -142550 -85903 -20523
33786b0523O4382N3378L4623J2056j0728l4045o0123q4870r6061q5094n8035k9868
$$ -20523 43859 97237 131860 143916 133188 99143 39020 -45850 -141911 -227005 -285040 -314908
33774c14908r824K639J0155J3505J5255J9786K6865K9497K0435j175k8398m7993
$$ -314908 -324732 -322093 -311938 -298433 -283178 -263392 -236527 -207030 -186595 -187770 -216168 -264161
33762b64161m6070k0200J3616L3557L3679K6758K4679K5203K2421K0503K7412
$$ -264161 -310231 -330431 -316815 -283258 -249579 -222821 -198142 -172939 -150518 -130015 -102603
33751a02603L9391M1425K3567q737m0164n6840n3909l8351k5884k9982m9817o9270
$$ -102603 -63212 -21787 1780 -6957 -47121 -103961 -157870 -196221 -222105 -252087 -301904 -371174
33739c71174o9595m4986p986J9937K5779J4967L170j336l470q913j2141k325K1855
$$ -371174 -440769 -485755 -493741 -473804 -448025 -433058 -429888 -431224 -434694 -443607 -455748 -458073 -436218
33726d36218M9674P0064Q0085Q0787P0754M8864K1863L941N160K0374L2034K6359
$$ -436218 -386544 -316480 -236395 -155608 -84854 -35990 -14127 -10186 -5026 15348 47382 73741
33714G3741O819r627r164P481K8762M3059M4430L2502J2089o990j3801l586J8005
$$ 73741 80560 70933 61769 69250 98012 141071 185501 218003 230092 223102 209301 205715 223720
33701B23720L9033N1466N7816O6165P8078Q4103P3539M6343J2430j8009l9132
$$ 223720 262753 314219 372035 438200 516278 600381 673920 720263 732693 714684 675552
33690F75552m7235m1485k8089j8241j9600l2283n2052p2317q4563q4925q1445
$$ 675552 628317 586832 558743 540502 520902 488619 436567 364250 279687 194762 113317
33679A13317q6183r7011r5915p0812l1825O10J7715K5340L0504L4011L4270L0547
$$ 113317 27134 -69877 -165792 -236604 -268429 -267819 -250104 -224764 -194260 -160249 -125979 -95432
33667i5432K2815J3468P755P793Q953P660R687K3480M6846O7298P4785O7461M6460
$$ -95432 -72617 -59149 -51394 -43601 -34648 -26988 -17301 6179 53025 120323 195108 262569 309029
33654C09029J4132k0527m2764m3480k6721l841J6272K9833L5715L4241K7408J8418
$$ 309029 323161 302634 259870 216390 189669 185828 202100 231933 267648 301889 329297 347715
33642C47715J0524M699k803j7834l9979n9208o5376n9250m9204l8560k2804K05
$$ 347715 358239 362938 360135 342301 302322 243114 177738 118488 69284 30724 7920 8125
33630H125K3200L4547K6990J895k9918n1592n1426l4042j6671j2080j8048k4139
$$ 8125 31325 65872 92862 94757 64839 13247 -38179 -72221 -88892 -100972 -119020 -143159
33618a43159k4076j9493j5337j3943j1252J078K5740N1724O1796M9827K5977L379
$$ -143159 -167235 -186728 -202065 -216008 -227260 -226182 -200442 -148718 -86922 -37095 -11118 -7739
33606g739j3795k6006k9682k0410j879J5130K2651K0754J4213Q042N813Q569J4507
$$ -7739 -21534 -47540 -77222 -97632 -99511 -84381 -61730 -40976 -26763 -18721 -12908 -4339 10168
33593A0168K0854K4927K2222O572k3236n7203p8154p4290m7991j3694J1623J7803
$$ 10168 31022 55949 78171 84743 61507 4304 -73850 -148140 -196131 -209825 -198202 -180399
33581a80399N324j8024m3756o5530p6674o9857m3782r035J7879K8660K9146K9432
$$ -180399 -175075 -193099 -236855 -302385 -379059 -448916 -492698 -501733 -483854 -455194 -426048 -396616
33569c96616L0525K4117M879k0765l9122l9412j8289K0734O6730J02507J14247
$$ -396616 -366091 -341974 -337095 -357860 -396982 -436394 -454683 -433949 -367219 -264712 -150465
33558a50465J02741Q0663N7097L0193k230l1612m4677l7097j5862Q232K4729K4867
$$ -150465 -47724 32939 90036 120229 117999 86387 41710 4613 -11249 -3017 21712 46579
33546D6579Q660r991j4425l627P273O667l1L75J1861K5497K9709K1335Q050K32
$$ 46579 55239 45248 30823 27196 34469 41136 41105 41480 53341 78838 108547 129882 137932 138164
33532A38164j349p611k6840n1129o3975n9255m3910k3445K408K6745L2117R738
$$ 138164 136815 129204 102364 51235 -12740 -71995 -115905 -139350 -136942 -110197 -78080 -68342
33520f8342k5984n1286n6155m6948l3428k3016k2119l1055l8979l4121j9082p053
$$ -68342 -94326 -145612 -201767 -248715 -282143 -305159 -327278 -358333 -397312 -431433 -450515 -457568
33508d57568k689L992K2506M8736P0122P7706O9837N0311K7808J3189J1420J6797
$$ -457568 -460257 -456265 -433759 -385023 -314901 -237195 -167358 -117047 -89239 -76050 -64630 -47833
33496d7833J9406J5727J0235P179M556j489q325p644L663J7454K3805K3873K6433
$$ -47833 -28427 -12700 -2465 4714 9270 7781 -544 -8188 -4525 12929 36734 60607 87040
33483H7040L2317L1244J6958l325j9826l2234m3182m8128m3660m0620n3665p6718
$$ 87040 119357 150601 167559 164234 144408 112174 68992 20864 -22796 -63416 -117081 -193799
33471a93799q2872n4761n524L6394N5134N3473L9417J8253l662j7717j9662j3115
$$ -193799 -276671 -331432 -336956 -300562 -245428 -191955 -152538 -134285 -137947 -155664 -175326 -188441
33459a88441l410R670L0003N6335P8238Q3694P1131N1556L6959K8441J8100N71
$$ -188441 -191851 -182181 -152178 -95843 -17605 66089 137220 188776 225735 254176 272276 272847
33447B72847k0806l7865m3489l5039j7574m043o124k1760l5549l3704j5499J0663
$$ 272847 252041 214176 170687 135648 118074 114031 107907 86147 50598 16894 1395 12058
33435A2058L6287N4158N6866M1656J5629r493k7491l8242m0377l1398j7395j4612
$$ 12058 48345 102503 159369 201025 216654 207161 179670 141428 101051 69653 52258 37646
33423C7646l3271o1600p3310n3436j3091K2809L7950L2564J5876n66l927J4364
$$ 37646 4375 -57225 -130535 -183971 -197062 -174253 -136303 -103739 -87863 -88429 -92356 -77992
33411g7992M8084P6683Q2292O4184L3962K648k1078k6631q726J9680L3296K0178
$$ -77992 -29908 46775 129067 193251 227213 229861 208783 182152 173426 193106 226402 246580
33399B46580m369j5715p605M258L746q055j8339k0600k2554l5792o0015q0458
$$ 246580 242211 226496 218891 223149 226895 218840 200501 179901 157347 121555 61540 -18918
33387a8918q2312o5962m5900l5989l8990m9380o1330p1985q0116q4101q1112o9916
$$ -18918 -101230 -167192 -213092 -249081 -288071 -337451 -398781 -470766 -550882 -634983 -716095 -786011
33375g86011n7556o0129q8216j29049j51509j35840r4271n5575l2573j2777K0071
$$ -786011 -843567 -903696 -991912 -1120961 -1272470 -1408310 -1502581 -1558156 -1590729 -1603506 -1583435
33364a583435O4709J05849J31729J41742J39590J26060J00791O7136L1462j570
$$ -1583435 -1518726 -1412877 -1281148 -1139406 -999816 -873756 -772965 -705829 -674367 -675937
33354f75937k9393m6648m4812k1773R948L1020L3541K7483K7143L5917M7587N7052
$$ -675937 -705330 -751978 -796790 -818563 -808615 -777595 -744054 -716571 -689428 -653511 -605924 -548872
33342e48872O3311O4864O0295N3618N1513N2762M6709K6827J398j4558j5460p749
$$ -548872 -485561 -420697 -360402 -306784 -255271 -202509 -155800 -128973 -127575 -142133 -157593 -165342
33330a65342K081J5004L3141N2099O4965P1243P6366Q2552Q5325Q0936P2812O7153
$$ -165342 -163261 -148257 -115116 -63017 1948 73191 149557 232109 317434 398370 471182 538335
33318E38335O4373N8405M3511J9252r813l6000n1187n2008m3328l4196l0366l3130
$$ 538335 602708 661113 704624 723876 714063 678063 626876 574868 531540 497344 466978 433848
33306D33848m3542o2211q4382j00984j06916j03292q9032n6526k181O1632J11575
$$ 433848 390306 328095 243713 142729 35813 -67479 -156511 -213037 -215218 -153586 -42011
33295d2011J30925J19762R0364N7391L1336J5511O774L81o229j5017k8703m5997
$$ -42011 88914 208676 299040 356431 387767 403278 410052 410433 404204 389187 360484 314487
33283C14487n8181n6774m4207l1176k3787j9816j7838k1066k8251k8970j5535
$$ 314487 256306 199532 155325 124149 100362 80546 62708 41642 13391 -15579 -31114
33272c1114N100J9371K4590L0078M0857M8585M2255K2340j24j5314k1526k2935
$$ -31114 -26014 -6643 17947 48025 88882 137467 179722 202062 201938 186624 165098 142163
33260A42163k5432l4265n0918o9571p8691o9025m1396o970K0189L2182L1440K6959
$$ 142163 116731 82466 31548 -38023 -116714 -185739 -227135 -234105 -213916 -181734 -150294 -123335
33248a23335K5288K4433J7607L571q755q397N848K4306L7157M3296M7383N0930
$$ -123335 -98047 -73614 -56007 -52436 -61191 -69588 -63740 -39434 -2277 41019 88402 139332
33236A39332M9297L6949J3614j4750m0042n7518o8237p5657p9060p1643m6994
$$ 139332 188629 225578 239192 224442 184400 126882 58645 -17012 -96072 -167715 -214709
33225b14709p533L4076O1672O4631M4012J2382j4457k8971l4807l7065l3163j7671
$$ -214709 -222242 -188166 -126494 -61863 -17851 -5469 -19926 -48897 -83704 -120769 -153932 -171603
33213a71603O489K8538M1294M5288M0495K2481q241l9713n8587o3135n9762n0161
$$ -171603 -165114 -136576 -95282 -49994 -9499 12982 4741 -34972 -93559 -156694 -216456 -266617
33201b66617l0687l887J8440K6618K1896J1954L921M665K0472M8945P4146P7299
$$ -266617 -297304 -301191 -282751 -256133 -234237 -222283 -218362 -213697 -193225 -144280 -70134 7165
33189G165N4155J9594m125k132K5752O5427R5562J00230P9134M5330J2342j5666
$$ 7165 61320 80914 76789 74657 100409 165836 261398 361628 440762 486092 498434 482768
33177D82768m1944o8420r0127r7529q5051n8870l4909k5868k9795l3227k4593
$$ 482768 440824 372404 282277 184748 99697 40827 5918 -19950 -49745 -82972 -107565
33166a07565j956K9629O1567Q1791P9484N5326K3206l223k2971m2061n8577o0487
$$ -107565 -109521 -79892 -18325 63466 142950 198276 221482 218259 195288 153227 94650 34163
33154C4163l8991J027M4966P9009R5936R5468Q2500O3811M4787K9222K0373J8369
$$ 34163 -4828 -3801 41165 120174 216110 311578 394078 457889 502676 531898 552271 570640
33142E70640J6384L979k2919n6955q5194r7480q8764n8848j5244K5970M8825N0164
$$ 570640 587024 591003 568084 511129 425935 328455 239691 180843 165599 191569 240394 290558
33130B90558M1588L6615L6680L1503J3101j2853l1476l3121k0187L74K5350N1215
$$ 290558 332146 368761 405441 436944 450045 437192 405716 372595 352408 352782 378132 429347
33118D29347O6149N5400J7141l2615p3343r3872r2349p1666m2121k2252k5434
$$ 429347 495496 550896 568037 535422 462079 368207 275858 204192 162071 139819 114385
33107A14385m4092n4583m1005j0911J3370J5430l023k5545l5011k8719k1577l0726
$$ 114385 70293 15710 -25295 -36206 -22836 -7406 -10429 -35974 -70985 -99704 -121281 -152007
33095a52007n5117p3915o7339l6064J633K7741L6514L3208K6750K2846K0457J5079
$$ -152007 -207124 -281039 -348378 -384442 -382809 -355068 -318554 -285346 -258596 -235750 -215293 -200214
33083b00214P032L760J0245J9714J9397N406j2867k3580k3500j8036j5427k2267
$$ -200214 -193182 -189422 -179177 -159463 -140066 -134660 -147527 -171107 -194607 -212643 -228070 -250337
33071b50337l9006n5869n7111l4532L693L9638N9285N8531M1237J7482J354K595
$$ -250337 -289343 -345212 -402323 -436855 -433162 -393524 -334239 -275708 -234471 -216989 -215635 -213040
33059b13040J8139L5442M4521M3464L4128K0287J1289J8228L9655N6848N1457
$$ -213040 -194901 -159459 -114938 -71474 -37346 -17059 -5770 12458 52113 108961 160418
33048A60418K5720j615j7359k3665k6174k2405p425J4799L2164L5350K4747Q513
$$ 160418 186138 184523 167164 143499 117325 94920 87495 102294 134458 169808 194555 203068
33036B03068l111l837M053J0888Q194l140j4295j7613j3341q079p857j2662j7481
$$ 203068 199957 196120 200173 211061 219255 216115 201820 184207 170866 162787 154930 142268 124787
33023A24787j9090k0596k7065l7743m6939n3152o1355p2735p7223o2731l0274
$$ 124787 105697 85101 58036 20293 -26646 -79798 -141153 -213888 -291111 -353842 -384116
33012c84116N537L0714M2160M4744M4098M3971M5806M7544M4682L4554J8773J334
$$ -384116 -378579 -347865 -305705 -260961 -216863 -172892 -127086 -79542 -34860 -306 18467 19801
33000A9801j3746k2806k3315j5618k671J1937K4409L0380K7483J8202P136m569
$$ 19801 6055 -16751 -40066 -55684 -58355 -46418 -22009 8371 35854 54056 61192 56623
32988E6623j8452l2833m2752m7105n0325n3807n0749l4717j0232J0923K2760K9154
$$ 56623 38171 5338 -37414 -84519 -134844 -188651 -239400 -274117 -284349 -273426 -250666 -221512
32976b21512L5063L9121L6884K7638J5064L126n950j0488r059k686L855M909j105
$$ -221512 -186449 -147328 -110444 -82806 -67742 -64616 -70566 -81054 -90113 -92799 -88944 -84035 -85140
32963h5140j0465j8460k3564k5519k0755l653K5813N7354P5105O7879L7322q19
$$ -85140 -95605 -114065 -137629 -163148 -183903 -187556 -161743 -104389 -29284 38595 75917 75098
32951G5098k5217k5438j2679r588k5983m8730n9039n4165m4753l5022j6949J3588
$$ 75098 49881 24443 11764 2176 -23807 -72537 -131576 -185741 -230494 -265516 -282465 -268877
32939b68877M4483N7956M8949K6991K835j9730l8741m8212m2335k3267N9K1463
$$ -268877 -224394 -166438 -117489 -90498 -87663 -107393 -146134 -194346 -236681 -259948 -259889 -238426
32927b38426M2281O4583Q2878Q7749P7842O2961N2137M2623K5364j141k8413m8784
$$ -238426 -196145 -131562 -48684 39065 116907 179868 232005 274628 299992 298851 270438 221654
32915B21654o1956o8703o4259m3495j0421K2465M4506N3780N4038M7900L4571
$$ 221654 159698 90995 26736 -16759 -27180 -4715 39791 93571 147609 195509 230080
32904B30080J3135j2920l4713m2578l3208j2475R692K7045L8756M3786L6316J0171
$$ 230080 243215 230295 195582 153004 119796 107321 117013 144058 182814 226600 262916 273087
32892B73087l1088p0850r0019q2722o0708m1688l4626l6170l7552l1584j5465
$$ 273087 241999 171149 81130 -1592 -62300 -103988 -138614 -174784 -212336 -243920 -259385
32881b59385P905L0315M3382M4769L7915K6545J2936J334k188M143J5179K4616
$$ -259385 -251480 -221165 -177783 -133014 -95099 -68554 -55618 -54284 -56472 -52329 -37150 -12534
32869a2534L0522L3023L0430K1683J0120O16n728j0056r814J158K5129N5020P7157
$$ -12534 17988 51011 81441 103124 113244 113860 108132 98076 88262 89420 114549 169569 246726
32856B46726P9194N7842K2101j1602l0657l4020k9092k3552k2104k7238l7347
$$ 246726 325920 383762 405863 394261 363604 329584 300492 276940 254836 227598 190251
32845A90251m4419l9171k0415K844J8532J8116j515l6101p2526r5058r6726q1526
$$ 190251 145832 106661 86246 89090 107622 125738 124223 88122 15596 -79462 -176188 -257714
32833b57714n4412j5198L3035P4417Q7596O4569J9486k2024m1206l5762j5495
$$ -257714 -312126 -327324 -294289 -219872 -132276 -67707 -48221 -70245 -111451 -147213 -162708
32822a62708Q805L1463M8136N0840L3422L023k0426k1502l908J5317K3467K0873
$$ -162708 -153903 -122440 -74304 -23464 9958 12981 -7445 -28947 -32855 -17538 5929 26802
32810B6802J5803J6206K4400L4535L6609K7978J9174K2002L2880L5669K1882N2
$$ 26802 42605 58811 83211 117746 154355 182333 201507 223509 256389 292058 313940 313992
32798C13992j7983l2159m9047o6695p2824n8761l1401j0257j2282l6098n9712
$$ 313992 296009 263850 214803 148108 75284 16523 -14878 -25135 -37417 -73515 -133227
32787a33227n8922l2523n905m424k5722m4119m0337j9445O37R833J0826R390O892
$$ -133227 -192149 -224672 -230577 -235001 -260723 -304842 -345179 -364624 -363987 -354154 -343328 -333938 -327046
32774c27046J780n709j1166p248J1549M3155P7192J01395J08598R7303O8743K7692
$$ -327046 -325266 -330975 -342141 -349389 -337840 -294685 -217493 -116098 -7500 89803 158546 186238
32762A86238j3778l8214l3000R1M5631Q4052J00982R1265N9209J6444k3544n1960
$$ 186238 172460 134246 101246 101337 146968 231020 332002 423267 482476 498920 475376 423416
32750D23416o6385o6947n4397l3900j6620j1967j8843k9029l8311m8241n6603
$$ 423416 357031 290084 235687 201787 185167 173200 154357 125328 87017 38776 -17827
$$ [...]
##END NTUPLES=NMR SPECTRUM
##END=
