##TITLE=31Pdec_51-2021
 CDCl3, 24 sc
 6.07.2021
##JCAMPDX= 6.0         $$ Bruker NMR JCAMP-DX V2.0
##DATA TYPE= NMR SPECTRUM
##DATA CLASS= NTUPLES
##ORIGIN= UXNMR, Bruker Analytische Messtechnik GmbH
##OWNER= root
$$ XWIN-NMR		Version 3.5
$$ Tue Jul  6 10:16:49 2021 Russian Standard Time (UT+4h)  she@DPX200
##.OBSERVE FREQUENCY= 81.013821
##.OBSERVE NUCLEUS= ^31P
##.ACQUISITION MODE= SIMULTANEOUS
##.ACQUISITION SCHEME= undefined
##.AVERAGES= 24
##.DIGITISER RES= 16
##SPECTROMETER/DATA SYSTEM= spect
##.PULSE SEQUENCE= zgpg30
##.SOLVENT NAME= CDCl3
##.SHIFT REFERENCE= (INTERNAL, CDCl3, 0, 248.564)
##AUDIT TRAIL= $$ (NUMBER, WHEN, WHO, WHERE, WHAT)
$$ ##TITLE= Audit trail, XWIN-NMR		Version 3.5
$$ ##JCAMPDX= 5.01
$$ ##ORIGIN= Bruker BioSpin GmbH
$$ ##OWNER= she
$$ F:/spectra/data/she/nmr/P31/1/pdata/1/auditp.txt
$$ ##AUDIT TRAIL=  $$ (NUMBER, WHEN, WHO, WHERE, WHAT)
(   1,<2021-07-06 10:15:06.25 +0400>,<she>,<DPX200>,
      <created by zg, POWCHK disabled, PULCHK disabled
       configuration hash MD5:
       00 E9 B6 7A A2 85 ED C7 34 08 36 98 17 FE 4E 26
       data hash MD5: 32K
       CA 4E 9D ED E3 CE A4 D4 14 ED EB 34 C3 17 E5 44>)
(   2,<2021-07-06 10:15:08.68 +0400>,<she>,<DPX200>,
      <Start of raw data processing
       efp BC_mod = 2 LB = 1 FT_mod = 6 PKNL = 1 PHC0 = -6791.067 PHC1 = -1136.314 SI = 64K 
       data hash MD5: 64K
       4E 92 C0 DD E6 4B 8B 90 83 8A FB E2 B0 EB 8B 8D>)
(   3,<2021-07-06 10:15:43.20 +0400>,<she>,<DPX200>,
      <pk PHC0 = -176.2765 PHC1 = 375.2 
       data hash MD5: 64K
       E8 DF C4 CD E5 80 39 62 A2 B4 F0 B3 30 EC 80 45>)
(   4,<2021-07-06 10:15:47.15 +0400>,<she>,<DPX200>,
      <abs ABSG = 5 
       data hash MD5: 64K
       B7 F6 2F 3D 5A A8 CA 94 20 4F FE 85 3A 42 FB C2>)
(   5,<2021-07-06 10:16:14.17 +0400>,<she>,<DPX200>,
      <pk PHC0 = -8.167787 PHC1 = 9.999999 
       data hash MD5: 64K
       80 D3 99 6A 02 19 BF DD 4F CF 4E 7F AE 9F A7 F5>)
$$ ##END=
$$ 
$$ hash MD5
$$ AD E5 6F 66 D3 4D 89 86 6B CD 0E 77 A3 05 DD 0B
##$RELAX= 
##$RELAX= 
##$RELAX= 
##$RELAX= 
##$RELAX= 
##$RELAX= 
##$RELAX= 
##$RELAX= 
$$ Bruker specific parameters
$$ --------------------------
##$DU= <F:/spectra>
##$EXPNO= 1
##$NAME= <P31>
##$PROCNO= 1
##$TYPE= <nmr>
##$USER= <she>
##$AMP= (0..31)
100 100 100 100 100 100 100 100 100 100 100 100 100 100 100 100 100 100 
100 100 100 100 100 100 100 100 100 100 100 100 100 100 
##$AQSEQ= 0
##$AQ_mod= 1
##$AUNM= <au_zg>
##$AUTOPOS= <>
##$BF1= 81.014009
##$BF2= 200.13
##$BF3= 200.13
##$BF4= 200.13
##$BF5= 200.13
##$BF6= 200.13
##$BF7= 200.13
##$BF8= 200.13
##$BYTORDA= 1
##$CFDGTYP= 0
##$CFRGTYP= 5
##$CHEMSTR= <none>
##$CNST= (0..31)
1 1 145 1 1 1 1 1 1 1 1 1 1 1 1 1 1 1 1 1 1 1 1 1 1 1 1 1 1 1 1 1 
##$CPDPRG= <waltz16>
##$CPDPRG1= <>
##$CPDPRG2= <waltz16>
##$CPDPRG3= <>
##$CPDPRG4= <mlev>
##$CPDPRG5= <mlev>
##$CPDPRG6= <mlev>
##$CPDPRG7= <mlev>
##$CPDPRG8= <mlev>
##$CPDPRGB= <>
##$CPDPRGT= <>
##$D= (0..31)
$$ [...]
##$SUBNAM3= <"">
##$SUBNAM4= <"">
##$SUBNAM5= <"">
##$SUBNAM6= <"">
##$SUBNAM7= <"">
##$SUBNAM8= <"">
##$SUBNAM9= <"">
##$SW= 501.771253377433
##$SWIBOX= (0..15)
0 1 3 0 0 0 0 0 0 0 0 0 0 0 0 0 
##$SW_h= 40650.406504065
##$TD= 32768
##$TD0= 1
##$TE= 0
##$TE2= 300
##$TE3= 300
##$TEG= 300
##$TL= (0..7)
0 120 53 12 22 120 120 120 
##$TP= (0..7)
150 150 150 150 150 150 150 150 
##$TP07= 0
##$TPNAME0= <>
##$TPNAME1= <>
##$TPNAME2= <>
##$TPNAME3= <>
##$TPNAME4= <>
##$TPNAME5= <>
##$TPNAME6= <>
##$TPNAME7= <>
##$TPOAL= (0..7)
0.5 0.5 0.5 0.5 0.5 0.5 0.5 0.5 
##$TPOFFS= (0..7)
0 0 0 0 0 0 0 0 
##$TUNHIN= 0
##$TUNHOUT= 0
##$TUNXOUT= 0
##$USERA1= <user>
##$USERA2= <user>
##$USERA3= <user>
##$USERA4= <user>
##$USERA5= <user>
##$V9= 5
##$VALIST= <valist>
##$VCLIST= <CCCCCCCCCCCCCCC>
##$VD= 0
##$VDLIST= <DDDDDDDDDDDDDDD>
##$VPLIST= <PPPPPPPPPPPPPPP>
##$VTLIST= <TTTTTTTTTTTTTTT>
##$WBST= 1024
##$WBSW= 4
##$XGAIN= (0..3)
0 0 0 0 
##$XL= 0
##$YL= 0
##$YMAX_a= 3962
##$YMIN_a= -4149
##$ZGOPTNS= <>
##$ZL1= 120
##$ZL2= 120
##$ZL3= 120
##$ZL4= 120
##$ABSF1= 248.5645
##$ABSF2= -253.2056
##$ABSG= 5
##$ABSL= 3
##$ALPHA= 0
##$AQORDER= 0
##$ASSFAC= 0
##$ASSFACI= 0
##$ASSFACX= 0
##$ASSWID= 0
##$AUNMP= <proc_1d>
##$AZFE= 0.1
##$AZFW= 0.5
##$BCFW= 0
##$BC_mod= 2
##$BYTORDP= 0
##$COROFFS= 0
##$CY= -3
##$DATMOD= 1
##$DC= 0
##$DFILT= <>
##$DTYPP= 0
##$F1P= 0
##$F2P= 0
##$FCOR= 1
##$FTSIZE= 65536
##$FT_mod= 6
##$GAMMA= 0
##$GB= 0
##$INTBC= 1
##$INTSCL= 5.30512e-09
##$ISEN= 30
##$LB= 1
##$LEV0= 0
##$LPBIN= 0
##$MAXI= 10000
##$MC2= 0
##$MEAN= 0
##$ME_mod= 0
##$MI= 50
##$NCOEF= 0
##$NC_proc= -5
##$NLEV= 6
##$NOISF1= 182.463
##$NOISF2= 159.3651
##$NSP= 0
##$NTH_PI= 0
##$NZP= 0
##$OFFSET= 248.5645
##$PC= 4
##$PHC0= -6975.511
##$PHC1= -751.114
##$PH_mod= 1
##$PKNL= yes
##$PPARMOD= 0
##$PSCAL= 0
##$PSIGN= 0
##$REVERSE= no
##$SF= 81.014009
##$SI= 65536
##$SIGF1= 159.3651
##$SIGF2= -187.1042
##$SINO= 113.3802
##$SIOLD= 16384
##$SREGLST= <1H.CDCl3>
##$SSB= 0
##$STSI= 65536
##$STSR= 0
##$SW_p= 40650.406504065
##$SYMM= 0
##$S_DEV= 0
##$TDeff= 32768
##$TDoff= 0
##$TI= <>
##$TILT= no
##$TM1= 0
##$TM2= 0
##$TOPLEV= 0
##$USERP1= <user>
##$USERP2= <user>
##$USERP3= <user>
##$USERP4= <user>
##$USERP5= <user>
##$WDW= 1
##$XDIM= 65536
##$YMAX_p= 299421743
##$YMIN_p= -2944039
$$ End of Bruker specific parameters
$$ ---------------------------------
##NTUPLES= NMR SPECTRUM
##VAR_NAME=  FREQUENCY,     SPECTRUM/REAL,   SPECTRUM/IMAG
##SYMBOL=    X,             R,               I
##VAR_TYPE=  INDEPENDENT,   DEPENDENT,       DEPENDENT
##VAR_FORM=  AFFN,          ASDF,            ASDF
##VAR_DIM=   65536,         65536,           65536
##UNITS=     HZ,            ARBITRARY UNITS, ARBITRARY UNITS
##FACTOR=    0.620285442955139, 1,           1
##FIRST=     20137.2065510759, 0,            0
##LAST=      -20513.1999529892, 0,           0
##MIN=       -20513.1999529892, -2944039,    0
##MAX=       20137.2065510759, 299421743,    0
$$ Real data points
##PAGE= N=1
##DATA TABLE= (X++(R..R)), XYDATA
$$ [...]
37207I56206K57833j44243o18307o11490j25296J23058j76008l47741J31072O18591
37197F3675K59827n58119o82374Q7575P22602M73810j65854l05287J27726M50506
37187D74087K46295j09043l7339L50469L15145m13811j015470n88903M55358Q13933
37177D90721J22838n53694l67355J44674J41301j52580n4642K50669O9428m71277
37167c79917n40100K7066M59771K69810j05412j07569J66034K80454Q4544k29387
37157g4706l73169j60678K75982M80888J72924l32013n07609k79124M9827L14388
37147d33290M84641L68810j28472n99680n49698j11005J89390K24077K40906K26259
37137h8062j2432k49593q3569K75984K44806j24084j99654J11030K07206r5774
$$ plain form
37207 956206 1214039 1069796 451489 -160001 -285297 -162239 -338247 -685988 -554916 63675
37197 63675 323502 -234617 -916991 -829416 -106814 366996 201142 -104145 23581 474087
37187 474087 720382 611339 574000 924469 1239614 825803 -189667 -778570 -323212 490721
37177 490721 613559 59865 -307490 -162816 -21515 -174095 -228737 21932 91360 -379917
37167 -379917 -920017 -892951 -433180 -163370 -268782 -376351 -210317 70137 154681 -74706
37157 -74706 -447875 -608553 -332571 148317 321241 -10772 -518381 -797505 -747678 -433290
37147 -433290 51351 420161 291689 -307991 -857689 -968694 -779304 -555227 -314321 -88062
37137 -88062 -100494 -350087 -433656 -157672 87134 -36950 -236604 -125574 81632 -14142
37127a4142k38873K6101J90023j9114j18362J46082J94908l44547q03667m71192
37117a452783K32233M34226J47515M2059K68861M15460L92306M74162N55586K04090
37107A713715m99101q96195o60933j88881M5091J3360j07806k51354l59319l18056
37097a509479j47875j5114J8950N4597J53083K80310M07391M67364L14828l1310
37087g255k35832l2820L46641M42736J66738j77371l61146l80020k34344N8497
37077d14176K88547K57689J13691J19741J70420k9283l51484l30755P3663L29028
37067B27081J18637k15294k83929k41416l71909m66152j35620M35505O10548K00607
37057a21942k40674k01510R9482J19523j75387l10250p4588J52429R84l33273
$$ plain form
37127 -14142 -253015 -226914 -36891 -56005 -174367 -28285 166623 -177924 -981591 -1452783
37117 -1452783 -1220550 -786324 -638809 -596750 -327889 87571 479877 954039 1509625 1713715
37107 1713715 1214614 318419 -342514 -531395 -486304 -472944 -580750 -832104 -1191423 -1509479
37097 -1509479 -1657354 -1672468 -1653518 -1598921 -1445838 -1165528 -758137 -290773 24055 -7255
37087 -7255 -243087 -275907 70734 513470 680208 502837 141691 -238329 -472673 -414176
37077 -414176 -125629 132060 245751 365492 535912 506629 155145 -175610 -101947 227081
37067 227081 345718 130424 -153505 -394921 -766830 -1232982 -1368602 -933097 -322549 -121942
37057 -121942 -362616 -564126 -464644 -345121 -520508 -830758 -905346 -752917 -751933 -1085206
37047a085206m19060k12303J8686K18200N44048Q82387Q40314L44202j57578k85286
37037F88404k00363k71230n22008o36728l54709K59993P91957P31776N0407n24012
37027A3487k54163N51508Q07890J27247o47305p03334l32416j90343j57291K54505
37017e30215Q06212P78294J47343l41582k83921m8632k0031q1790k6067Q1201
37007D80812J43036K05865K35538Q5967j94578l43214k36742j861K07664K81474
36997H63961J09658k26971l88873k34770j01144k24494k32808K18677O69534M73322
36987I26092q4157j84931J63427J75139l20052o02020l45319j05977j96648j17129
36977f91575M05827P66746M78665k40p9581M9935m1120k39782k97187l70134n13639
$$ plain form
37047 -1085206 -1504266 -1716569 -1697883 -1479683 -935635 -53248 787066 1131268 973690 688404
37037 688404 488041 216811 -305197 -941925 -1296634 -1036641 -244684 487092 537499 13487
37027 13487 -240676 310832 1118722 1245969 598664 -104670 -437086 -627429 -784720 -530215
37017 -530215 275997 1054291 1201634 860052 576131 527499 507468 425678 399611 480812
37007 480812 623848 829713 1065251 1151218 956640 613426 376684 374823 582487 863961
36997 863961 973619 746648 357775 123005 21861 -202633 -435441 -216764 452770 926092
36987 926092 841935 657004 820431 995570 675518 73498 -271821 -377798 -574446 -691575
36977 -691575 -285748 480998 959663 959423 879842 929777 888657 648875 351688 -18446 -532085
36966e32085l02824L39040O30612P3596n51820k87622M66092N92334K5433k93584
36956A59172m2505Q6134l04788o60420m13690K00029N70061M07174j54179o91102
36946h44114o89161n9663N78618N88083J40485j50906j76568k38490k61751N6515
36936a056952M37370K87737k16599k68376K39814M98690J25498k68427k28189
36927d49434j96825n48971p60131k67971N05742P60304M64182J83204J31656P6889
36917a01355o5894j55469j76326j85637p9862J89193L82714L15385J56269N5468
36907C34486j59095n09148n29605M3620O41591N78901R6797m2895K10231J94207
36897H59090k82088o02801l55025O8243J62276j35j01632q9925r435K24196N08990
$$ plain form
36966 -532085 -834909 -495869 134743 208339 -343481 -631103 -165011 427323 452756 159172
36956 159172 116667 202801 -101987 -762407 -1176097 -976068 -406007 1167 -153012 -844114
36946 -844114 -1533275 -1592938 -1014320 -426237 -285752 -436658 -613226 -851716 -1113467 -1056952
36936 -1056952 -619582 -331845 -548444 -816820 -577006 -78316 47182 -221245 -449434
36927 -449434 -646259 -1195230 -1955361 -2223332 -1717590 -957286 -493104 -309900 -178244 -101355
36917 -101355 -167249 -322718 -499044 -684681 -764543 -575350 -192636 122749 279018 334486
36907 334486 175391 -333757 -863362 -819742 -178151 400750 497547 454652 664883 859090
36897 859090 577002 -25799 -380824 -312581 -150305 -150440 -252072 -341997 -351432 -127236 381754
36886C81754M23537j63973o89556n71054l9356K20321Q2178M3304K97458L88478
36876C73091J2069l84165k29487K87501M75692J32938k39362k37807q2409j47375
36866c9314l58486l72145j22518J30718J87090P9463n5284p1092J22044L87106
36856a12418L83710n578m09319l96878m4730K25543K41168J54740M4822j32973
36846e1913k47563j01878J48344J45620n6980k9169K89059M03549M2255l82411
36836A58913l93686j18668O538j29141l07755l51112j99186J49379N22565O16009
36826d6144L50045k5468k88228m07645l04371R6627M66337L02024k29430l30484
36816d16737K15855N95309K13627l54536l56879p7640j52180k93385J58920Q19831
$$ plain form
36886 381754 805291 641318 -48238 -619292 -658648 -438327 -356149 -312845 -15387 373091
36876 373091 385160 995 -228492 59009 534701 667639 428277 190470 108061 -39314
36866 -39314 -397800 -769945 -892463 -761745 -574655 -495192 -550476 -621568 -499524 -112418
36856 -112418 271292 265714 -143605 -540483 -585213 -359670 -118502 36238 81060 -51913
36846 -51913 -299476 -401354 -253010 -107390 -164370 -193539 95520 499069 541324 158913
36836 158913 -234773 -353441 -346903 -476044 -783799 -1134911 -1334097 -1184718 -662153 -46144
36826 -46144 303901 278433 -9795 -417440 -721811 -625184 -158847 143177 -86253 -416737
36816 -416737 -200882 394427 608054 253518 -103361 -181001 -333181 -626566 -467646 352185
36806C52185O76986j82218n59586j9500M67128J45560l91452l23250P7463L8620
36796B81936m26887o38177l05949J87448L94776K35648l6912l8375L52356O60764
36786F66628K83914n53352q78147l00672L76236L48390l3341K3040M19976M24864
36776G77536m5898l20892j02384J45333O2249p6599O0969L21631L76017J55464
36766A353426k25156o06847p01682k85939L37982M99728K5842m57484l76084L9343
36756c96871K26477J35571Q9873Q5034j28220l54117n8530O68177R15574J38660
36746A321628r34310j135048l37887M81007N73161J84510j04430j91605k70809
36737d13783k98428j27747O3985l0747l08288l38780j0335K92716K54880N8756
$$ plain form
36806 352185 1029171 846953 287367 267867 734995 880555 489103 165853 243316 281936
36796 281936 -144951 -783128 -1089077 -901629 -506853 -271205 -308117 -346492 5864 666628
36786 666628 950542 397190 -480957 -781629 -405393 -57003 -90344 -67304 352672 777536
36776 777536 731638 410746 308362 453695 515944 439345 500314 821945 1197962 1353426
36766 1353426 1128270 521423 -180259 -466198 -128216 371512 397354 -60130 -436214 -396871
36756 -396871 -170394 -34823 55050 140084 11864 -342253 -400783 267394 1182968 1321628
36746 1321628 387318 -747730 -1085617 -604610 -31449 153061 48631 -142974 -413783
36737 -413783 -712211 -839958 -775973 -806720 -1115008 -1453788 -1464123 -1171407 -916527 -857771
36727h57771P6917L38269N01210L02378r5874k55753J9259L78185L06175j69628
36717E43367m51286k10359R2802j01063n25358m12402L34242Q97137O21900j60551
36707F28429o45850n20478j19856J21542Q0921o4864m9868K13331M79259L98385
36697E20951l3700m14355m11570j54494k8917j71247k81721K2245O54575R70163
36687F71930M68749m29043p34486j76595L98357K72473j11692j0165L10730Q5666
36677G45924m99716n42476p834J74822k43804l81823J63927N16370J3611o17161
36667f78160m63926J30135L15602J48419J97550L61320J71731j69004j23304J45750
36657C6113R0395j52292j8498L71828L71178o1201l41335k82797k22461k23944
$$ plain form
36727 -857771 -780854 -442585 58625 361003 265129 9376 28635 406820 712995 543367
36717 543367 92081 -118278 -25476 -126539 -651897 -1064299 -730057 167080 788980 628429
36707 628429 -17421 -537899 -657755 -536213 -455292 -520156 -570024 -356693 122566 520951
36697 520951 487251 72896 -338674 -493168 -522085 -693332 -975053 -952808 -298233 671930
36687 671930 1140679 711636 -22850 -199445 198912 471385 359693 349528 660258 745924
36677 745924 246208 -296268 -304102 -129280 -373084 -754907 -590980 -74610 -60999 -678160
36667 -678160 -1142086 -1011951 -696349 -547930 -350380 10940 182671 13667 -109637 36113
36657 36113 126508 -25784 -44282 327546 698724 637523 296188 13391 -209070 -433014
36647d33014o6411P5340j31674l74692j00735L96900L56087r2731j20267K77410
36637b13787K58837k48300l28682K16982M16149j04081l69184J53000M63149k12812
36627C1271q87677l64941P20160R07610K04422k00578k7179q5105n28723n16492
36617g47232J95811O96089L63112k24525k99617N9484L70297M68966L39322j12749
36607A108958o47625o43005M8078O80531N56964l3296l30065j97060j08823k64749
36597A69908l58704k25995j33069k35832k12699K18737P00500N94121r7855n94692
36587a75580k93741M45285P59091L35827l25543o17170m19367l737K93301K33842
36577B32208j50861m64735l29583Q0955K43249N7006m9764J03831J44681j14418
$$ plain form
36647 -433014 -499425 -424085 -555759 -930451 -1031186 -634286 -278199 -370930 -491197 -213787
36637 -213787 45050 -203250 -531932 -314950 101199 -2882 -372066 -219066 244083 31271
36627 31271 -856406 -1221347 -501187 406423 610845 410267 383088 297983 -230740 -747232
36617 -747232 -551421 144668 507780 283255 -16362 43122 413419 882385 1221707 1108958
36607 1108958 461333 -181672 -133594 546937 1103901 1070605 740540 543480 434657 169908
36597 169908 -188796 -414791 -547860 -783692 -996391 -777654 -77154 516967 419112 -175580
36587 -175580 -469321 -24036 735055 1070882 745339 128169 -291198 -294935 -1634 232208
36577 232208 81347 -383388 -712971 -632016 -388767 -331761 -381525 -277694 -133013 -247431
36567b47431k17319J94171O73184N78706M7317k48748q7051J49490J64650M3565
36557A050534q3953j95325k19616j15651l3250p0111m1018J59142K30904m0893
36547F40763k82483q9766K10534O9429k67964j21544L75737L88605j87951m67571
36537B67789n2670K72432j15464n95161l52095K50040L06744j37570k78147L7923
36527c96179J48416j77123l27885O1508M61802L11561j22805k60464j02515n3688
36517d57372j53404o4036K87383N60335M99501J95364j63473m46451m84387j92332
36507d18872J65033K13168L6723P6389L57372L65995n8805l25557m2639K23889
36497E92696j61353p38015n73804K23870O34759L03801o4759j8343K4114k07585
$$ plain form
36567 -247431 -464750 -270579 402605 981311 1028628 779880 692829 842319 1006969 1050534
36557 1050534 966581 771256 551640 435989 402739 332628 291610 450752 681656 640763
36547 640763 358280 268514 479048 548477 280513 158969 534706 923311 735360 267789
36537 267789 215119 487551 372087 -223074 -575169 -325129 -18385 -155955 -434102 -396179
36527 -396179 -247763 -424886 -752771 -691263 -229461 82100 -40705 -301169 -403684 -457372
36517 -457372 -610776 -674812 -387429 172906 672407 867771 704298 257847 -226540 -418872
36507 -418872 -253839 -40671 -3948 72441 429813 795808 737003 411446 368807 592696
36497 592696 431343 -306672 -880476 -656606 -21847 281954 217195 198852 222966 15381
36487A5381k62294O0745J68373k23529l83245K13735Q14078N18978k47051m83670
36477A91501k08168j21359k04180L9025L03933j13976p94386n56643N59233J141653
36467B36633N40725k50518l26135j29292k94511m54531j05015L21582K21410r3675
36457c33327j5360K71436K37191L0392J25000L38566J29336l61128m34344P0225
36447E7987N34855M29394j30579o74726p93741l44856L67434P20201M17510j33207
36437D50272l61607k17403k4593N7669Q5138R2030J11041J85445J61839j65836
36427C73995n43438m27242J00760K78620j05789k45850L36404Q38956M42709k55498
36417G93627j94113L60552K86676m46205p14800j47257K68588j71417p82873n94447
$$ plain form
36487 15381 -246913 -186168 -17795 -241324 -624569 -410834 403244 922222 675171 191501
36477 191501 -16667 -138026 -342206 -303181 752 -113224 -907610 -1464253 -905020 236633
36467 236633 777358 526840 200705 71413 -223098 -677629 -782644 -461062 -239652 -333327
36457 -333327 -348687 -77251 159940 190332 315332 653898 783234 422106 -12238 57987
36447 57987 592842 1022236 891657 216931 -576810 -921666 -554232 165969 583479 450272
36437 450272 88665 -128738 -153331 -95662 -10524 81506 192547 377992 539831 373995
36427 373995 -169443 -596685 -495925 -217305 -323094 -568944 -232540 606416 1049125 793627
36417 793627 599514 960066 1246742 800537 85737 -61520 207068 35651 -747222 -1341669
36407a341669K68698Q90114P28660L8101n24308m57710J15336M87910K08961k56770
36397A57323k10769J79216K14826q0123k6308L74866K82613n06982j004018m94905
36387a114261L49043N19221P7252k40476k29854k14863k28629L736M32190O65499
36377A8858N14459J14248l55749o96434o31878j33984L52219L84847R9245k5811
36367c59980J50313L11444J85276j06776k14603L6314L96890M10552J1616k70472
36357E50574l2438K97768M6702n57740o22587k9438K97777j09413m55616R788
36347f04623P12178O34608j18349n89228m38501j97541k05172j87196N1879K56620
36337f85325K05016L2099p8984j38386j87362j84733q6353J44260M88764O76784
$$ plain form
36407 -1341669 -1072971 -182857 545803 583904 59596 -398114 -282778 205132 414093 157323
36397 157323 -53446 125770 340596 260473 234165 609031 891644 384662 -619356 -1114261
36387 -1114261 -765218 -245997 -168745 -409221 -639075 -853938 -1082567 -1078831 -646641 18858
36377 18858 533317 647565 291816 -404618 -1036496 -1170480 -818261 -433414 -334169 -359980
36367 -359980 -209667 101777 287053 180277 -34326 1988 398878 809430 821046 550574
36357 550574 518136 815904 862606 304866 -317721 -347159 -49382 -158795 -614411 -604623
36347 -604623 107555 742163 623814 34586 -403915 -601456 -806628 -993824 -941945 -685325
36337 -685325 -480309 -448210 -527194 -665580 -852942 -1037675 -1124028 -979768 -491004 185780
36327A85780L27494m35679q66860m89758K29229N41264L82028J55892m8133l39392
36317c58135m39676k4150N01329L88867k91330o58212k75957L14581M72078K10260
36307a60345j14801k91195k17674J07014L75437K13238k29188l81142n4558L27972
36297d25242L95425K18586m1947l29219m25800q9951L82805L47387k22870n80876
36287g71702k98424J35374J97287J59445M56904P45558L43114n98432j075996
36278g06872m90286N50874R20819K86468n08079m72849K56019N66107q2286q19393
36268d99478o00966K29925M97218K4048k07581K33503N60323J89035k94420k24192
36258i2585N0988m5181k27446N8101N41387N29788K420m77937n93841l50384K26541
$$ plain form
36327 185780 513274 77595 -789265 -1279023 -1049794 -508530 -126502 29390 -18743 -358135
36317 -358135 -797811 -821961 -320632 68235 -223095 -881307 -1157264 -842683 -370605 -160345
36307 -160345 -275146 -566341 -784015 -677001 -301564 -88326 -317514 -698656 -753214 -425242
36297 -425242 -29817 188769 146822 -182397 -608197 -698148 -315343 32044 -190826 -771702
36287 -771702 -1070126 -934752 -737465 -578020 -121116 624442 967556 369124 -706872
36278 -706872 -1197158 -646284 274535 561003 52924 -419925 -163906 402201 319915 -499478
36268 -499478 -1100444 -870519 -373301 -349253 -556834 -323331 236992 426027 131607 -92585
36258 -92585 -41597 -86778 -314224 -256123 285264 815052 817472 339535 -254306 -604690 -378149
36247c78149P81917N63814n14057j283122p56012L45060O08348N8821n6846N92486
36237c7740R67871M88173j00878j24484n756k71878n73040m23096r6984n4489
36227b32301j32323m939J30828J1873p6200J62363L40000l1786o19333o76959
36217a128777j55992L06586L73184K98998K81922J69820q3617k02738k0465K28008
36207F6929K12055j08498m86614o15315l45399J62496N24240N13995L03492J86338
36197D13719J75943P0135j70578l28336k05484J38276M19648L63658o994l06374
36187E63613j98489J02240M6263m24319o51903j60115N64457O43159j1804n86099
36177a12997m50743Q6549K96484j1494l27853j61125L28489N36526J79019l45678
$$ plain form
36247 -378149 403768 967582 453525 -829597 -1585609 -1240549 -632201 -573380 -630226 -37740
36237 -37740 930131 1418304 1317426 1192942 1187186 915308 342268 -80828 -177812 -232301
36227 -232301 -364624 -369563 -238735 -226862 -303062 -140699 199301 167515 -451818 -1128777
36217 -1128777 -1284769 -978183 -604999 -306001 -24079 145741 62124 -140614 -161079 66929
36207 66929 278984 170486 -316128 -931443 -1276842 -1114346 -590106 -76111 227381 413719
36197 413719 589662 659797 489219 160883 -44601 93675 513323 876981 869987 563613
36187 563613 365124 467364 513627 89308 -562595 -722710 -158253 484906 473102 -112997
36177 -112997 -563740 -477191 -180707 -192201 -520054 -681179 -352690 183836 362855 17177
36167A7177m58681r5481L14019M35518K96732K7930k87117m71390l52865r0163
36157f64321k3739j18644M372L63467M76273J59626j10053j1024L2078l83416
36147b75381p92804n03482K57816O18437L29272L595R6420L48975L70911J85210
36137F38969Q818n8346K2514K19727K84193j9548m90741o79835n17327l46681
36127i38257l18135k11520P9440L60341N26026O59346O31431J41248o21669q80992
36117e72741k25953O99710Q82628J45072o70098o77410R0959P46453N53333j87623
36107G84330n12733j14696K16310j44890n60176j11486P62868P86890j07382o02738
36097C96297j28042K50667k55400p12049n8416R32101P56918l89883q88745j94822
$$ plain form
36167 17177 -441504 -536985 -222966 212552 509284 537214 250097 -221293 -574158 -664321
36157 -664321 -688060 -806704 -802332 -438865 37408 197034 86981 75957 108035 -275381
36147 -275381 -1068185 -1571667 -1313851 -695414 -366142 -362547 -266127 82848 453759 638969
36137 638969 647787 589441 611955 831682 1115875 1096327 605586 -74249 -591576 -938257
36127 -938257 -1256392 -1467912 -1388472 -1028131 -502105 157241 788672 929920 308251 -572741
36117 -572741 -798694 -98984 783644 928716 258618 -418792 -327833 418620 971953 784330
36107 784330 271597 156901 373211 228321 -331855 -443341 319527 1106417 999035 396297
36097 396297 268255 518922 263522 -448527 -506943 425158 1182076 792193 -96552 -291374
36087b91374M81910J89680m59253n09916p7256J68873J34425J59768K56332J83667
36077B36856j620m8742J2537l3337j37256l6885K75153M53198K19911k75477n67952
36066I6386l34367K22362N17484K45406k24281l51157j67088j07644k04718l4614
36056c42231M39375O23379K08376k52215j57411K20421K19185j57178l46900j97512
36046B57289r1943j37903J7714M09966N09883R3357k77738j30946J00158k06358
36036E43479p13213n30533L38540Q52652M31314k26071k72948M0776m0752m43497
36026b0253m19720J32864M48347J32204k21507k5299L89770L93002N7065r2669
36016G73804J3218J871j97384k87556k44695l75182o30421m83876K22714Q03978
$$ plain form
36087 -291374 190536 380216 -79037 -588953 -666209 -497336 -362911 -203143 53189 236856
36077 236856 235236 186494 199031 165694 28438 -8447 266706 719904 939815 664338 96386
36066 96386 -237981 -15619 501865 747271 522990 171833 4745 -102899 -307617 -342231
36056 -342231 97144 720523 928899 676684 519273 739694 958879 801701 454801 257289
36046 257289 165346 27443 45157 455123 965006 1058363 780625 649679 749837 543479
36036 543479 -169734 -700267 -361727 490925 922239 696168 423220 463996 423244 -20253
36026 -20253 -439973 -307109 141238 273442 51935 26636 416406 809408 866473 773804
36016 773804 787022 788893 591509 303953 59258 -315924 -946345 -1430221 -1207507 -403529
36006d03529N32383l51132q62036m37098M73408J014945Q44699K85249k35614
35997H61275n82903p19308m64255K16114Q34441P59181L5993n83162n77688j99036
35987d19348J24899L97513O72495N98920j5689n68088l55560K93591M09446j57725
35977I80454n43401k59142J18046k348k85994j37722K95781M15343Q6154k99222
35967C67949m30654k97555j0777K13028J22577j74599j80886K70433O18511L66837
35957H64864p5365M3754O37357Q55530L04818m69937q27233p56395n41963k18108
35947a82678K67448O52036N31723j09450p82700r42657m81340K05039N94417M88993
35937B40831J12666j78973j98617J8109K84415L71293K29007J13815K64601M59753
$$ plain form
36006 -403529 128854 -222278 -1084314 -1521412 -1048004 -33059 811640 1096889 861275
35997 861275 278372 -440936 -905191 -689077 145364 904545 940538 357376 -220312 -419348
35987 -419348 -294449 103064 775559 1374479 1358790 790702 435142 728733 1138179 980454
35977 980454 437053 177911 295957 293609 7615 -130107 165674 581017 667171 367949
35967 367949 -62705 -360260 -371037 -158009 -35432 -210031 -390917 -120484 498027 864864
35957 864864 789499 833253 1470610 2326140 2630958 2161021 1333788 577393 35430 -182678
35947 -182678 84770 736806 1268529 1159079 376379 -566278 -1047618 -842579 -248162 240831
35937 240831 353497 174524 -24093 -5984 278431 649724 878731 992546 1257147 1716900
35927A716900K48053l16497o23061l80735o1654j38181l55252k38673P6280J10499
35917C7679j46772l03867k56366k06507j35310J23473L70444K36612j31973k08079
35907f20666Q4979K92787K18049J50581K21396J74755o3379k12335k06879l16312
35897b77024m99275l08670K76088N88972K36239k79946l24077K1184K99013L62537
35887I5041K64328m1817m09900l87614J10174M80231K90642m2447j0096J06663
35877D55205j60734m83118k50272K68154K65199k52093m52044m1020L27508J88149
35867a35066q1190n6522N6716l8264j51785k6928J57547J44809O3430J24125J91564
35856B48436N7765j30391j02093P6004J12310o6674k59083k77722j08889J12939
$$ plain form
35927 1716900 1964953 1648456 1025395 644660 583006 444825 89573 -149100 -72820 37679
35917 37679 -109093 -412960 -669326 -875833 -1011143 -887670 -517226 -280614 -412587 -620666
35907 -620666 -535687 -242900 -24851 125730 347126 521881 458502 246167 39288 -277024
35897 -277024 -776299 -1084969 -808881 -219909 16330 -263616 -587693 -566509 -267496 95041
35887 95041 359369 317552 -92348 -479962 -369788 110443 401085 358638 348542 455205
35877 455205 294471 -188647 -438919 -170765 94434 -157659 -609703 -650723 -323215 -135066
35867 -135066 -216256 -272778 -216062 -254326 -406111 -433039 -275492 -130683 -67253 56872 248436
35856 248436 306201 175810 73717 149721 262031 195357 -63726 -341448 -450337 -337398
35846c37398J69590n1987l50571l90255j58068K3120K1903Q5979L25540M01586
35836b60561O7815k83055o9260O10132J002629O38883j06848n22950l84711p8377
35826F13697j6483j63459k14371q0269K3491l9230j09747k1681J26326J76499
35816B94773J80032K16953J55543j02923l28700k69737q2398o2964j31297m7920
35806a78638M2620j31480l11408j1135N55060O35036J29602k05335J4702K19750
35796G58774o9433m22281k90961O6341J09766q4136j09640L4510J24628K10633
35786C28201L44601K45989j63126l62515k6741K93700L0708l86039k58990J21003
35776A66791J174m25518l31563K26756L76152N875l3910M72373O10621r8919q05185
$$ plain form
35846 -337398 -167808 -219795 -570366 -960621 -1118689 -1095569 -1073666 -987687 -662147 -260561
35836 -260561 -192746 -475801 -545061 65071 1067700 1706583 1599735 1076785 692074 613697
35826 613697 597214 433755 219384 139115 162606 123376 13629 -8052 118274 294773
35816 294773 474805 691758 847301 744378 415678 145941 63543 579 -130718 -178638
35806 -178638 -136018 -267498 -578906 -590041 -34981 600055 729657 524322 539024 758774
35796 758774 689341 267060 -23901 42440 152206 68070 -41570 -7060 117568 328201
35786 328201 672802 918791 755665 393150 366409 660109 690817 304778 45788 166791
35776 166791 167965 -257553 -589116 -362360 13792 19667 -14243 458130 1068751 969832 164647
35765A64647o31060Q8258N49149O26544N73087L16087j85465m84817k87506m1324
35755F87600k05932m41016k38060J24020N9100k65504j98372K87798N77785M12910
35745H00329J58945P1947l0572k67006m13262k87440l6416Q4031r866j77587j52018
35734b58915J56628L49395r9092r38133j122970j71892R61251J045730K11297
35725A33299l80985k39279K5655p3684k07763Q261L69700N59426O33031O47385
35715A475046L49040l27715q58732o90951P781N20340L96846j23247m29676j74520
35705A44212L44775M65491m6600o31970o32710j59564J64167J60032J98817L79894
35695C86544L05983j47123m92340l74030q6726j29R00Q8044K3781l36126n10488
$$ plain form
35765 164647 -466413 -378155 170994 797538 1370625 1686712 1501247 1016430 728924 687600
35755 687600 481668 40652 -197408 -73388 -14288 -279792 -478164 -190366 387419 800329
35745 800329 959274 1031221 1000649 733643 320381 32941 -3475 80556 70690 -106897 -258915
35734 -258915 -102287 247108 148016 -790117 -1913087 -2084979 -1123728 -77998 133299
35725 133299 -247686 -486965 -461310 -534994 -742757 -734496 -364796 194630 827661 1475046
35715 1475046 1824086 1496371 637639 -53312 -45531 474809 871655 748408 318732 144212
35705 144212 488987 954478 907878 275908 -356802 -516366 -352199 -192167 6650 386544
35695 386544 692527 545404 53064 -320966 -407692 -407821 -406921 -318877 -295096 -631222 -1141710
35684a141710k1875P13032Q26928K47821j86835M5698M41457K76940l26378n90381
35674B84697j67622L84849L26020l21453p94161n37260J32978M89922L22247O7766
35664A87983P8073J63840K0742k40386k72133p951K71368L02818P5280k34813
35654C44821m11306l49322j74986j31436k47759k36625J44136P07229R51639N66482
35644A162873k14067p58228o16262l1366K70072l7795m24315k57437K23495K61762
35634d21268j84206l22520J80425N92548K74598k52961j22034M85408O13316N351
35624H48657n54165m24160J05257M13313L47235J33947o8246k15054k49365j75487
35614A61932p7004O6159L56357O76070O87809L00915j13799j82042K971Q9957
$$ plain form
35684 -1141710 -1163585 -450553 376375 624196 437361 483059 924516 1201456 875078 284697
35674 284697 117075 501924 827944 506491 -287670 -824930 -691952 -202030 120217 187983
35664 187983 266056 429896 450638 210252 -61881 -69832 201536 504354 579634 344821
35654 344821 -66485 -415807 -590793 -722229 -969988 -1206613 -1062477 -355248 596391 1162873
35644 1162873 948806 190578 -425684 -457050 -186978 -224773 -649088 -906525 -683030 -421268
35634 -421268 -605474 -927994 -747569 -155021 119577 -133384 -255418 229990 843306 848657
35624 848657 294492 -129668 -24411 388902 736137 870084 801838 586784 337419 161932
35614 161932 84928 151087 507444 1183514 1871323 2172238 2058439 1876397 1879368 1969325
35604A969325j1262q5036k1759j0490k42658n75202o32438k48651K85702N14250
35594I41781L25915L5202q4671j49755l78544o28097n27271o3220K87759J68067
35584g2834j53666j40442K40468M25336N2134m28171k88530M05100P43347J95626
35574I78368n84307o44066p3219K37590K2882n4138L23835M92558m1069o22517
35564C5917m11161K58240L97374r1447l67297l8585L46806K89430j7526k16098
35554A85653k31115j0591M68836P58088K84473n89343p24874J27418P25973J06828
35544A101346q78023q02942J44189M81305k45352p97310k08442P52171P99265
35535C46207J8055m08753j0943M03749R0626n31526n70877L2980N12192M28088
$$ plain form
35604 1969325 1958063 1873027 1851268 1840778 1598120 1022918 390480 141829 427531 941781
35594 941781 1267696 1302898 1218227 1068472 689928 61831 -465440 -528660 -240901 -72834
35584 -72834 -226500 -366942 -126474 298862 350996 -77175 -365705 39395 782742 978368
35574 978368 394061 -250005 -323224 -85634 -62752 -116890 206945 699503 658434 35917
35564 35917 -375244 -117004 280370 188923 -178374 -216959 129847 419277 401751 185653
35554 185653 -45462 -56053 412783 1170871 1455344 866001 141127 268545 994518 1101346
35544 1101346 223323 -579619 -435430 45875 -199477 -996787 -1205229 -453058 346207
35535 346207 364262 -44491 -55434 348315 438941 -92585 -663462 -630482 -118290 309798
35525C09798J78956J94616K11326j89770p02909o10293J11719O60880N25227J34229
35515H23779R0420K66519J33370l55756p26972o67274k99561J16468L57280K11828
35505d9899k85443o41646l63666L40243P27173M58302l2393k25603j50039r5618
35495c18589p3055O8595K13316R5163k00366k41574J30484M81541L16483k12564
35485B59434m29917j4001N21585M55190j81805o18240l55431J98365L32877r335
35475A58722k61897j05514J19809k6893m44692o32627l30036J87169M34854K41909
35465f59196q3993j12399J95179M18574K10197k21667l53585k1535L89776M71135
35455B32486K59940P0161O0302J52628K37572K42212O9359l02747o53745o61945
$$ plain form
35525 309798 488754 683370 894696 704926 2017 -608276 -496557 164323 689550 823779
35515 823779 914199 1180718 1314088 958332 231360 -435914 -735475 -619007 -261727 -49899
35505 -49899 -335342 -976988 -1340654 -1000411 -273238 185064 152671 -72932 -222971 -318589
35495 -318589 -391644 -323049 -109733 -14570 -214936 -456510 -326026 155515 471998 259434
35485 259434 -170483 -184484 337101 792291 610486 -7754 -363185 -164820 168057 158722
35475 158722 -103175 -208689 -88880 -115773 -560465 -1193092 -1523128 -1335959 -901105 -659196
35465 -659196 -743189 -855588 -660409 -241835 -31638 -253305 -606890 -628425 -238649 232486
35455 232486 492426 562587 622889 775517 1013089 1255301 1324660 1021913 368168 -293777
35445b93777k93134R7061J59905l9088j32990O9074L47060L41231j4748l80830
35435a40236l41985J18178M98016K75234m07068p64743l14571M09535N03787l9936
35425b03789l25004P3165M57152J84260k21047N9963O68192N51149k73389o56623
35415C14029j74628K00939k08181o05398r4685P14216O18073k63944p12774k69705
35405d82058L09958M25557L47318L88411L17574p2682n27370p49629p03006l64345
35395a110272K21681N85022K50110l88074m09620K50809O58474L63735L6049J75228
35385F33142K42196k16632n58654j21374M83612K85436m00094m70023J36553L87248
35375D01410r7943m80231j37240L90992L53804j09348l59472k12155M824K9942
$$ plain form
35445 -293777 -586911 -489850 -329945 -369033 -502023 -432949 -85889 255342 240594 -140236
35435 -140236 -482221 -364043 133973 409207 2139 -762604 -1077175 -667640 -163853 -203789
35425 -203789 -528793 -455628 1524 185784 -35263 24700 692892 1244041 970652 314029
35415 314029 139401 340340 132159 -473239 -567924 146292 764365 500421 -212353 -482058
35405 -482058 -172100 253457 600775 989186 1306760 1234078 706708 -42921 -745927 -1110272
35395 -1110272 -888591 -303569 -53459 -441533 -851153 -600344 58130 421865 457914 633142
35385 633142 875338 658706 100052 -21322 462290 747726 347632 -122391 14162 401410
35375 401410 303467 -176764 -314004 76988 430792 321444 -38028 -250183 -245359 -215417
35365b15417q3703j34534J2771K52989K67500p3945m26236l79485k8233K39031
35355e69262L45634M46360M29054J03225k53499k42953j37869m82726r28678n15290
35345a806004O55905J177529L49564o15392k94787Q53255J206738K98739p38375
35336A087172q88051l48942J57110K81927M4548l60146n05984p0909N59596N75872
35326E32193j35089o99549m15058K92751N13908R2544l06769k09071J18659J81412
35316c4069p5532l04989k49063J7197K52742K88964J16870j11956j50219J13024
35306a37031M11668K92721k79356p07428m52599J96241M54632J10799k36378j24788
35296d71519J23099J8540k90940l19534m6618J10774r202j50686j33027m6861
$$ plain form
35365 -215417 -299120 -433654 -420883 -167894 99606 25661 -400575 -780060 -808293 -569262
35355 -569262 -223628 222732 651786 755011 501512 258559 120690 -362036 -1290714 -1806004
35345 -1806004 -1150099 27430 376994 -238398 -533185 320070 1526808 1825547 1087172
35336 1087172 199121 -149821 7289 289216 333764 -26382 -532366 -603275 -43679 532193
35326 532193 397104 -302445 -717503 -424752 89156 181700 -125069 -334140 -215481 -34069
35316 -34069 -109601 -414590 -663653 -646456 -393714 -104750 12120 -99836 -250055 -137031
35306 -137031 274637 567358 288002 -419426 -872025 -675784 -221152 -110353 -346731 -471519
35296 -471519 -348420 -329880 -620820 -940354 -986972 -876198 -885400 -1036086 -1169113 -1215974
35286a215974O9750L19089O05643N98939K22495j14005n437M01707N77593K50527
35276A710327l02339o07416n01313k10101Q41R2691J23835N9091r1050j05627
35266A68939J53211L83174J93478k15255k38670J79450L83518M4287k69219m453
35256G78460M56635M14966m2671k75073j38110m8244j38219j12066N8719J7677
35246I72074k77466l76944o4005K67480J91993j99548n27659n67794l25624L8005
35236h69488K67854K47414J62941J88051J54769r2899k35112Q2917N03443L36579
35226G46469l34873o63646k59415L13558M58811K82445J32979M6418j9590L7377
35216G40533J35546o873k83312j95249K53532L43777k27919o89470k91897M99530
$$ plain form
35286 -1215974 -1146224 -827135 -221492 377447 599942 485937 480500 882207 1459800 1710327
35276 1710327 1407988 800572 299259 89158 89999 182690 306525 365616 274566 168939
35266 168939 322150 705324 898802 683547 444877 624327 1007845 1052132 782913 778460
35256 778460 1235095 1650061 1607390 1332317 1194207 1145963 1007744 895678 954397 972074
35246 972074 694608 317664 253659 521139 713132 513584 -14075 -581869 -907493 -869488
35236 -869488 -601634 -354220 -191279 -3228 151541 58642 -176470 -93553 409890 746469
35226 746469 411596 -252050 -511465 -197907 260904 543349 676328 722746 703156 740533
35216 740533 876079 869206 585894 390645 644177 987954 760035 70565 -221332 278198
35206B78198O57978N7633m80525m08442j3920J91066P2512j76119k86576r4197
35196b02392K78854M85733L82718K04012J21246o1062m73872p73646n76915q2355
35186f97679J56945m8415l75554m45961j55430L26653O62418N89166K19710p3092
35176A58761j41629j49005j41928K1880K42473K20701O3137J91084M56259J63855
35166A085588o58607r44979j68448O72019N03443k04142l41010J9377m768l61561
35156d03088j52428O38346R31854L01550l28659j73245K81492K06101l26747o45354
35146C29822m56438K7038N19303P66435N42518n6767n23247m40195L5845L59296
35136A103610J81375k95531n06520j58720L13572K33127l11147m74184O7500N34928
$$ plain form
35206 278198 936176 993809 513284 104842 90922 281988 354500 178381 -108195 -202392
35196 -202392 76462 562195 944913 1148925 1270171 1209109 735237 -38409 -615324 -697679
35186 -697679 -540734 -589149 -964703 -1410664 -1566094 -1239441 -577023 12143 231853 158761
35176 158761 17132 -131873 -273801 -251921 -9448 211253 274390 465474 921733 1085588
35166 1085588 426981 -517998 -686446 -14427 489016 284874 -56136 -36759 -41527 -403088
35156 -403088 -555516 82830 1014684 1316234 987575 814330 1095822 1301923 975176 329822
35146 329822 -126616 -99578 419725 1186160 1728678 1671911 1148664 708469 744314 1103610
35136 1103610 1284985 989454 482934 324214 637786 870913 559766 85582 153082 688010
35126F88010K64344k19681j34565K31610J48762j51703O1597N14633K61778n87151
35116A077634q79827k66951L23038K97577J57321K65107J65341l21588n30675
35107B86977j39017J50741j82154n54630k95903K76628N11596L80997J49047j46479
35097D37803l19222J3347N56038L87083n00099q22658J0614P32785J45364q86121
35087b45066p62797L60371R67302N33965n8961k03312j86987j90857J4677K79133
35077E07468J14446l52485m60685j22879Q4817j5924N647K66998L56925J58506
35067E42834L4450Q2289J4985j45470p6241J00154n5308l73324k22017L11004
35057B13356L95753j43528m44546j6583M55785K70031k13043l14005j28745j33660
$$ plain form
35126 688010 952354 732673 598108 829718 978480 826777 888374 1403007 1664785 1077634
35116 1077634 197807 -69144 253894 551471 708792 973899 1139240 817652 286977
35107 286977 147960 298701 116547 -438083 -733986 -457358 54238 435235 584282 437803
35097 437803 118581 131928 687966 1075049 574950 -247708 -237094 495691 641055 -245066
35087 -245066 -1007863 -647492 319810 853775 794814 591502 404515 213658 228335 507468
35077 507468 621914 269429 -191256 -314135 -229318 -245242 -239595 27403 384328 542834
35067 542834 577284 659573 674558 529088 452847 553001 497693 124369 -97648 213356
35057 213356 609109 465581 21035 4452 460237 730268 517225 203220 74475 -59185
35047e9185k52326q1937L03600M65497K95082L2074k21801m93256n96193l05946
35037i14391J79941L89356J98220m4264o0573k743j16738k64189n7756N04978
35027a88159Q23410L92588m11534o91295k29689K03855J3924l33430j05039M98782
35017b6587O56299J60108m07731n97302m67661j32803L29836N47298J82578l68257
35007a24222l59273J68287M19543J12616j58213m2227N902l05140m37895O8299
34997f52323P09285P10638J34214l33716l50855j30190M3852N0114j03552k25555
34987a48088j00921R5632n0526m26846l37222M32421J079310Q27648J0055m67105
34977I14358l19737M8057K99953L47907P4395m58172p22152l00532L78341N00960
$$ plain form
35047 -59185 -311511 -393448 -89848 375649 670731 702805 481004 -12252 -608445 -914391
35037 -914391 -734450 -345094 -146874 -191138 -251711 -254454 -371192 -635381 -693137 -188159
35027 -188159 635251 1027839 616305 -74990 -304679 -100824 -86900 -420330 -525369 -26587
35017 -26587 629712 789820 382089 -215213 -682874 -815677 -485841 61457 244035 -124222
35007 -124222 -483495 -315208 104335 216951 58738 16511 22413 -282727 -720622 -652323
34997 -652323 56962 767600 901814 568098 217243 87053 130905 181019 77467 -148088
34987 -148088 -249009 -153377 -203903 -630749 -967971 -535550 543760 1371408 1381463 914358
34977 914358 594621 642678 942631 1290538 1364933 906761 184609 -115923 262418 763378
34967G63378j4449m66701m17209j80940j73804l02870k28679J10601M53460N22788
34957F5575K73318p9365k72456k66763j88752k3456L20003N84836L01574m08229
34947C06285p11400j93982M01820J96704m91371o17111L2588O10052N05488M9450
34937H8523k13260k15953j02715R9789K58056J08520k60916l85283j45749k4139
34927g93127l06385n25981j69653M39287N29774j2502m68911k45630L97217P19555
34917d36356L82624k07642l96880l0299L91665L63138K9424n6098K37931M29485
34907G06992J81283j56736p5992L13220M53550J48078k51847m52187n48557o21178
34897c03374m47405N2586M13603J56391m08103m59501J62287O28711K77275l95545
$$ plain form
34967 763378 748929 282228 -134981 -315921 -489725 -792595 -1021274 -910673 -457213 65575
34957 65575 338893 259528 -12928 -279691 -468443 -491899 -171896 412940 714514 306285
34947 306285 -405115 -599097 -197277 -573 -491944 -1109055 -1076467 -466415 39073 88523
34937 88523 -124737 -340690 -443405 -343616 -85560 22960 -237956 -623239 -768988 -793127
34927 -793127 -1099512 -1625493 -1795146 -1355859 -826085 -838587 -1307498 -1553128 -1155911 -436356
34917 -436356 -53732 -261374 -658254 -688553 -296888 66250 95674 39576 277507 706992
34907 706992 888275 731539 655547 968767 1422317 1570395 1318548 866361 317804 -303374
34897 -303374 -750779 -698193 -284590 -128199 -536302 -995803 -833516 -204805 72470 -323075
34887c23075m32427K12786O83584M99277Q6188p6506j04159j95846j57432R8071
34877B90461J66229j49929k79830K59014Q69402O06149l38313q18634l69118K81396
34867E16827M39816K59681M7952l13322p65715p14632O6999Q06852P21322J40650
34857A206430r2787P0454K2634l22161l90935J7989L79401K76792m2602j48975
34847I76240K2314K59157L07055l2831o12171p85206j20219P52323P22396k47307
34837A241751r57192o48237K2125J95876J22678M06050O63721J07181q80877j019585
34827g46509n0353P89246N78610l1929p703M64369M34360k28807o75763m08776
34817A16745N8024N7353l25489n31268l25661M0284K75205L24840K57954J46439
$$ plain form
34887 -323075 -755502 -542716 140868 640145 726333 649827 545668 349822 192390 290461
34877 290461 456690 306761 26931 285945 1155347 1761496 1423183 604549 235431 516827
34867 516827 956643 1216324 1264276 950954 185239 -529393 -462394 344458 1065780 1206430
34857 1206430 1113643 1184097 1206731 884570 493635 511624 891025 1167817 1125215 976240
34847 976240 998554 1257711 1564766 1531935 919764 134558 14339 766662 1489058 1241751
34837 1241751 284559 -363678 -341553 -145677 -22999 383051 1046772 1153953 273076 -746509
34827 -746509 -796862 -7616 570994 539065 531362 995731 1430091 1201284 525521 116745
34817 116745 174769 232122 -93367 -624635 -950296 -910012 -634807 -309967 -52013 94426
34807I4426J04688K37835M29754L36851k04241q23239r17471l54290L59858P05007
34797c0822O71742M85658J39927m14045q33630o66736n4648L30930J55222j88601
34787d05003j90657J57222N19395O33420L85231j81995p19470p58096k66093K72226
34777e53820N03354N54572N46997K62134l29585o83777l68466K02215L13881k592
34767D44913j05007J99532L95954J28940k56387k58083R4381L31600J17594m02889
34757F90548p30595n00889O7141L66393J75661n3622O8874K42196K8194l30063
34747B3838k83673P0127J57791n8475o0317K02781J65943k33507k10266N67902
34737C42144J127372M43507r39616j465020o05417N16304P10277J77010p3445
$$ plain form
34807 94426 199114 436949 866703 1203554 999313 176074 -741397 -1095687 -735829 -30822
34797 -30822 640920 1126578 1266505 852460 18830 -647906 -702554 -371624 -216402 -405003
34787 -405003 -595660 -438438 80957 714377 1099608 917613 198143 -559953 -826046 -553820
34777 -553820 -50466 504106 1051103 1313237 983652 299875 -68591 133624 447505 444913
34767 444913 339906 539438 935392 1064332 807945 549862 644243 975843 1093437 690548
34757 690548 -40047 -540936 -473795 -107402 68259 14637 83511 325707 353901 23838
34747 23838 -259835 -189708 -31917 -90392 -150709 52072 218015 -15492 -225758 342144
34737 342144 1469516 1913023 973407 -491613 -1097030 -580726 129551 306561 233116
34728B33116K46129M55294J06287l11961k09833J38185J10158j31861Q0693N70249
34718A286456L24234p84151j397670n79081O51743P91244R1734p6359M00440L31901
34708A040491n00909q11966n669P32447L64171l81977l87228K7138p1431m41785
34698d36718j58012O03222P14483o3693o82681m13709K02976L49462N0561j28993
34688C6898L4462K64197K32167j00938m77135n92884m25735k20125p8838J62155
34678a165776M81743M88280L8939l30975r3196M38653N16347K4763m18873l55375
34668c75470M1373L63625M05543J98920l6790k2498K17643K65581j19901n75831
34658C62195o44233m18111k21205K2561M78510P41371K78237n52711p50156n3256
$$ plain form
34728 233116 479245 934539 1040826 728865 519032 657217 767375 635514 716207 1286456
34718 1286456 1610690 826539 -571131 -1150212 -498469 292775 384509 308150 708590 1040491
34708 1040491 539582 -272384 -278053 454394 818565 436588 49360 76498 5067 -436718
34698 -436718 -594730 8492 722975 659282 -23399 -437108 -234132 115330 165891 36898
34688 36898 71360 335557 567724 466786 -10349 -603233 -1028968 -1249093 -1327931 -1165776
34678 -1165776 -684033 -195753 -156814 -487789 -580985 -142332 374015 398778 -20095 -375470
34668 -375470 -334097 29528 435071 633991 597201 574703 792346 1057927 938026 362195
34658 362195 -282038 -700149 -921354 -898793 -420283 321088 599325 46614 -703542 -756798
34648g56798O58140N76072n8248m88719m23085j22534J00808J35066N0938N1628
34638b76732K57499M56227L07877j56809n22594n08087k11174J55948M39329M62098
34628D03582J58635j85762k14009k7613k5473k23009k38041q750M5632k44801
34618e59609m62246k65403R3228K32800K02178K26232K60278J62392J9259l3683
34608a24574o0312j03941p732K39463K91286m4656l64991j87431K95114M65420
34598C97646J76832j12258j04285n6275k43809m50422k99892J29752L57809J27036
34588g7866k76895m01044j58184J43519K28317J47306J21316K36623L91142M41041
34578G95275K92499n3172m05201m31168k312N41125O76011K71301k84623n43070
$$ plain form
34648 -756798 -98658 477414 419166 -69553 -492638 -615172 -514364 -379298 -328360 -276732
34638 -276732 -19233 436994 744871 588062 65468 -442619 -653793 -497845 -58516 403582
34628 403582 562217 376455 162446 134833 109360 -113649 -351690 -360440 -314808 -559609
34618 -559609 -1021855 -1287258 -1194030 -961230 -759052 -532820 -272542 -110150 -90891 -124574
34608 -124574 -184886 -288827 -296559 -57096 234190 189534 -175457 -362888 -67774 397646
34598 397646 574478 462220 357935 301660 57851 -392571 -692463 -562711 -204902 -77866
34588 -77866 -354761 -755805 -913989 -770470 -542153 -394847 -273531 -36908 354234 795275
34578 795275 1087774 1034602 629401 198233 195921 737046 1413057 1684358 1399735 856665
34568H56665m17860j37457M1986K1059r7946r9121R4739K54285R8483k62688l67550
34557a5405R17M60897M78671N8701k59256j02374K69713L41568K9673k49959j82495
34546H30651N9982J58229J01732M6838n9255l25597n11020k52776K80565M73048
34536H02397J38896j88791r3299J01625p3099m40477m80014j36786J86779K79662
34526I6893K79924K74034J78453M156j08165j17324j07939j44109k55800m08670
34516c08547l66381R4231O57474O45965N2887j99275M01241R64124M03417q15163
34506A529973j212360m09921M35185M10346m8266j77330k5690k0393j46606j62674
34496A72264j01210m7619J25375L80875L55370j0603j90634J07411L59345L3750
$$ plain form
34568 856665 438805 301348 343334 364393 266447 167326 262065 516350 614833 352145 -15405
34557 -15405 -14488 446409 925080 983781 724525 622151 891864 1233432 1263105 1013146 830651
34546 830651 890633 1048862 1150594 1197432 1138177 812580 301560 48784 329349 802397
34536 802397 941293 752502 659203 760828 687729 247252 -232762 -369548 -182769 96893
34526 96893 376817 650851 829304 833460 725295 607971 500032 355923 100123 -308547
34516 -308547 -674928 -580697 76777 722742 775629 576354 977595 1941719 2345136 1529973
34506 1529973 317613 -92308 342877 753223 704957 527627 501937 481544 334938 172264
34496 172264 71054 23435 148810 529685 885055 874452 683818 791229 1150574 1184324
34486A184324m93627n19567j37224o641k22778k43399P8592K16274q6311l17293
34476e47650j6589M70760N36616K09870j3238J4408K2601l2738J06502L41961
34466A092503J41324n45875q93013l02108N39877N02394l13970o85493j05349
34457e69710M93399K43893l63213l85304J07441L42564J35527n5588r1382k48892
34447c91265m51547k64489K77369N74632L31035q2276k41514j34645N1697J45953
34437a85050J822k63767j74073M47163R40949O17862j23417l30909K049O260m80074
34426D58815n81010M7598M90655M6766n65022l19386N18543Q47849L49824k52109
34416A042523l69578j95814j42007k26261k08718j2679J77061J59815j8958j22525
$$ plain form
34486 1184324 690697 171130 33906 27265 -195513 -438912 -360320 -144046 -230357 -547650
34476 -547650 -564239 -93479 443137 653007 639769 654177 676778 644040 750542 1092503
34466 1092503 1233827 687952 -205061 -507169 32708 535102 221132 -464361 -569710
34457 -569710 -76311 167582 -195631 -580935 -473494 -130930 4597 -50991 -142373 -391265
34447 -391265 -842812 -1107301 -829932 -255300 75735 -6541 -248055 -382700 -331003 -185050
34437 -185050 -183228 -446995 -621068 -173905 767044 1384906 1261489 930580 932629 938889 458815
34426 458815 -122195 -74597 416058 462824 -102198 -421584 96959 944808 1294632 1042523
34416 1042523 672945 477131 335124 108863 -99855 -112534 64527 224342 205384 82859
34406H2859o0119J9893Q9843L58821P36537O24725k00696r11844o14307K85760
34396D11472O23139J97895r2309J94599M96545L86315J24284j60412o93052j161439
34386C27037q19859J13349M52957l6996j35146O86451J118703J50511j058782
34377G98225r16310J34633N53356K27082K16417N48169K27772o94841r65030k33366
34367a03893L62741J34020j61332J69547N87006M08639l5636j44948n7353j12438
34357A046353n1585L99053P33778L41508m05252n89986q2121L60280K55870p0435
34347A937463k06135k12809k16352l3721L57216M33436j78800q75426o81182K99548
34337F23238Q33313K57788n45669m65009K43835N38557K67714J59169L51555J82571
$$ plain form
34406 82859 22740 42633 132476 491297 1227834 1852559 1651863 740019 125712 411472
34396 411472 1034611 1232506 1140197 1334796 1831341 2217656 2341940 2181528 1488476 327037
34386 327037 -492822 -379473 73484 36488 -98658 587793 1706496 1857007 798225
34377 798225 -118085 16548 569904 796986 1013403 1561572 1789344 1094503 129473 -103893
34367 -103893 258848 392868 231536 401083 988089 1396728 1361092 1216144 1158791 1046353
34357 1046353 994768 1393821 2127599 2469107 2063855 1473869 1391748 1752028 2007898 1937463
34347 1937463 1731328 1518519 1302167 1268446 1625662 2059098 1880298 1004872 323690 623238
34337 623238 1456551 1714339 1168670 703661 947496 1486053 1753767 1912936 2264491 2447062
34327B447062m27513o02197M7975O68141M45747k29261n47137m45692k88468o1306
34317A007351L37650N49457K63266j41768j52506N8771K0957j87196j31345K03734
34307A828371M29415L57591J31909n9585q2548R1062K32451R9015r6985K4707
34297B955403K57202R2074k15924J13272R02128R80695N9564o30029k12841N51323
34287D852867O54124L11058J66161J78384K28412O87651J439097J537822Q20550
34278A0876126N37354J338733K101433J937353J757409K474752L394400L928825
34270B8346385M990154O933796Q350635R000497J1324922J6420785K1745783K6455113
34262A33568070L4732713M7089333N1388407L2643220o235708m2118043n4760365
$$ plain form
34327 2447062 2019549 1417352 1465327 2133468 2579215 2349954 1802817 1357125 1068657 1007351
34317 1007351 1345001 1894458 2157724 2015956 1863450 1922221 1943178 1755982 1624637 1828371
34307 1828371 2257786 2615377 2747286 2687701 2605153 2696215 2928666 3027681 2930696 2955403
34297 2955403 3212605 3304679 3088755 3202027 4104155 5084850 5144414 4514385 4301544 4852867
34287 4852867 5506991 5818049 5984210 6162594 6391006 7078657 8517754 10055576 10876126
34278 10876126 11413480 12752213 14853646 16790999 18548408 21023160 24417560 28346385
34270 28346385 33336539 40270335 48620970 57621467 68946389 85367174 107112957 133568070
34262 133568070 168300783 215390116 266778523 299421743 293186035 251067992 196307627
34255A96307627m6248783l3021010k5078519k0315204j5001758j0346818q119760
34248C8175775o914285n238521l980821l791150l314250j795065p32469j258083
34240A1151131k089896j703194p07877m84913r00547r19129m64263k62581m71098
34231C147633o07183m66756k58013p9435J16573K33185J32132j14732l18176l80176
34221A405052l23644k64050l14978l68134j47072L15725N55312L18023l3239j10843
34211A032152p6305j96250k96855j80514j08795k83090l23377Q7635N16862M39090
34201F10553J11268L6449L3167l14671p13444n92182j42495N650j26813k9524
34191a122042K78318L17783O7010p1741n7343j24541j25012J89298M67516K44958
$$ plain form
34255 196307627 150058844 117037834 91959315 71644111 56642353 46295535 38175775
34248 38175775 31261490 26022969 22042148 18250998 14936748 13141683 12409214 11151131
34240 11151131 9061235 7358041 6650164 6165251 5264704 4345575 3881312 3618731 3147633
34231 3147633 2540450 2073694 1815681 1736246 1852819 2086004 2218136 2103404 1785228 1405052
34221 1405052 1081408 817358 502380 134246 -12826 302899 858211 1176234 1142995 1032152
34211 1032152 955847 759597 462742 282228 173433 -109657 -433034 -345399 171463 610553
34201 610553 721821 758270 791437 476766 -236678 -828860 -971355 -965705 -1092518 -1122042
34191 -1122042 -843724 -525941 -458931 -530672 -588015 -712556 -837568 -648270 -180754 64204
34181F4204j40853q5257J29435j82703p26503n85827J33889L77334o0430j99654
34171a276365L50977O58552P3419o39391n42282O5264L19926J55006J37143M14746
34161b83005O02275M75191J95511m1618k11673l86681o23640q15248o84504j84023
34151a957415K27732J30852j66227l4351M64977O35460K31436k01134j91944Q5996
34141g74618K82289L24630K49889R8768O6992K51289K76921j93895o66909l49904
34131d34548N11363P92149J62473m08823j87239K84392K27286j83379l61198l00070
34121A02406k74983j55580K11992M17324M5046n36822o59620l30107n4948L5980
34111a199312J97226L96320L37730Q0611l308J26137J50585K0441M0428K41965
$$ plain form
34181 64204 -76649 -161906 -32471 -215174 -941677 -1527504 -1393615 -1016281 -1076711 -1276365
34171 -1276365 -925388 -266836 -193417 -832808 -1375090 -1309826 -989900 -834894 -697751 -283005
34161 -283005 319270 794461 989972 948354 736681 350000 -273640 -1088888 -1773392 -1957415
34151 -1957415 -1729683 -1598831 -1765058 -1799409 -1334432 -698972 -467536 -668670 -860614 -774618
34141 -774618 -492329 -167699 82190 180958 247950 499239 776160 582265 -84644 -434548
34131 -434548 76815 868964 1031437 622614 435375 719767 947053 763674 402476 102406
34121 102406 -172577 -328157 -116165 301159 346205 -190617 -850237 -1180344 -1235292 -1199312
34111 -1199312 -1002086 -605766 -268036 -187425 -190733 -64596 85989 106430 146858 388823
34101C88823K18744k01397n72145m18328R5063M04069K70031n7334l03769m40867
34091f17110m49330j82611K90400M94988J15882l92353k89266L45833O19168J41395
34081G6996l49739j47363L11188K25412k01602j47628L57888M47260q3650l88029
34071A00733J8271M50755J88304l98714n14854j47848R0783l9596k30500k37894
34061g20560j14855P7102L41615N49543M85641J17234l31168n38398l08157J99947
34051b42056M78091J94596k92254l20923J49535M78774L00466l1164j67900l12082
34041B35083o22022o55399k4466P81040R14386L34363j93546j96285K0232M8420
34031F41806l7174j7088r079k42091n73542o19228l29260q8381j26939j33302
$$ plain form
34101 388823 607567 406170 -165975 -584303 -489240 -85171 184860 127526 -176243 -617110
34091 -617110 -1066440 -1249051 -958651 -463663 -347781 -740134 -1029400 -683567 -64399 76996
34081 76996 -272743 -420106 -108918 116494 -85108 -232736 125152 572412 488762 100733
34071 100733 119004 569759 758063 359349 -155505 -303353 -212570 -252166 -482666 -720560
34061 -720560 -835415 -758313 -416698 132845 618486 735720 404552 -133846 -442003 -242056
34051 -242056 236035 430631 138377 -182546 -33011 445763 746229 715065 547165 235083
34041 235083 -386939 -1042338 -1066804 -285764 628622 962985 769439 573154 593386 641806
34031 641806 604632 587544 578465 336374 -237168 -856396 -1185656 -1274037 -1400976 -1534278
34021a534278K54949P61715P28743Q4459m48252l42430J4817k26k69656k11412
34011i61571K28867N24313M16220J79400K1341j78039m18470m15981o8850L29441
34001c43329M85578L82363J21098j69910k97380k22665j98062l05856j50523M25791
33991b72895O99932m063j025723j084127j72379M82295M02290M11111Q79985R22493
33981A238919N3021p37464n64772j14911l42193p29379k26396Q25668J170270
33972E72763N80013n7201k98495m62677n70285k79513J55753R7901k68749j29518
33962f60008M93421O85539K23509m4848K53915L49790k25138o84611k90443L35195
33952D36321J70001n77334q04673j62258N52281N90278J33364j38349Q6383M79485
$$ plain form
34021 -1534278 -1279329 -517614 211129 295588 -152664 -495094 -480277 -480503 -750159 -961571
34011 -961571 -732704 -208391 207829 387229 408570 230531 -187939 -603920 -672770 -343329
34001 -343329 142249 524612 645710 475800 178420 -44245 -242307 -548163 -698686 -272895
33991 -272895 427037 422974 -602749 -1686876 -1859255 -1376960 -974670 -563559 316426 1238919
33981 1238919 1291940 554476 -10296 -125207 -467400 -1196779 -1423175 -597507 572763
33972 572763 1152776 1095575 797080 334403 -235882 -515395 -359642 -261741 -530490 -660008
33962 -660008 -166587 518952 742461 697613 951528 1301318 1076180 391569 101126 436321
33952 436321 606322 28988 -775685 -937943 -385662 204616 337980 199631 286014 765499
33942G65499N04366N0499l99862l67219k6394O1211k20305m59527m60471m65413
33932a017616n22072l02051J87258L93284J11682p9050K17190M73769J32450l57252
33922g62408k23984L38099M99239J40424j06772m2423r7031l04108j27682M31156
33912b55490N77091J8403m30188j69205J43544k73474q81875o09620L50935P42113
33902g87766J55669m26443k19502K95384L44825K2678j45512j21674j34210l1908
33892a048459L81933O77709K45588o76666j128093o48835J88019N96343M46022
33883i66439J27995n1874q1274o1212l5090N8050K97774N87079O37414L13577
33873H26000j10767k59230j25420j1971q8138k42932k92285j29160J98277L84871
$$ plain form
33942 765499 1269865 1320364 920502 553283 526889 588100 367795 -91732 -552203 -1017616
33932 -1017616 -1539688 -1841739 -1654481 -1261197 -1149515 -1228565 -1011375 -537606 -405156 -762408
33922 -762408 -986392 -648293 -149054 -8630 -115402 -157825 -254856 -558964 -686646 -255490
33912 -255490 321601 340004 -90184 -259389 -115845 -389319 -1271194 -1880814 -1529879 -787766
33902 -787766 -632097 -1058540 -1278042 -982658 -637833 -615155 -760667 -882341 -1016551 -1048459
33892 -1048459 -666526 11183 256771 -419895 -1547988 -2196823 -2008804 -1412461 -966439
33883 -966439 -838444 -890318 -971592 -1032804 -1067894 -1009844 -712070 -124991 512423 826000
33873 826000 715233 456003 330583 318612 230474 -12458 -304743 -433903 -235626 149245
33863A49245J03791m28278n08731O3248N31507K66927k18010j41524J60695j55640
33853a76770p62499n01521N50974R06538K662p97741l64378M37929L08163l46430
33843g43073k92088L42453M10188j52033k45659M06949P76207K97682k47211j13281
33833D40134K94983L00510J5109j27667j61152k64865k52778P218J62584n3785
33823C60291k64612m8937K71913P8053n53525r00693n60669J18584N51878N06046
33813d41671J95263L8524K60476N71901M29444k07800o74463m51613Q1715J84409
33803a3815j91233m19055j79494J58957K08588P4768j289n0786j26930j7700L93496
33792a64493P15196M48166k64478p05892m69393Q1747L81129L55971K86191K15077
$$ plain form
33863 149245 253036 -175242 -683973 -620725 -89218 177709 -40301 -181825 -21130 -176770
33853 -176770 -939269 -1440790 -889816 16722 19384 -778357 -1142735 -704806 -396643 -743073
33843 -743073 -1035161 -692708 -282520 -434553 -680212 -273263 502944 800626 553415 440134
33833 440134 735117 1035627 1050736 923069 761917 497052 244274 251492 414076 360291
33823 360291 95679 46742 318655 396708 -156817 -1057510 -1618179 -1499595 -947717 -441671
33813 -441671 -246408 -207884 52592 624493 1053937 846137 171674 -279939 -198224 -13815
33803 -13815 -205048 -624103 -803597 -644640 -436052 -361284 -362573 -413359 -540289 -557989 -164493
33792 -164493 550703 998869 734391 28499 -440894 -359147 21982 377953 664144 879221
33782H79221p7087n36875p04478l17511K38042L78854Q3420j27674N3763L35030
33772B04705L09803K8797j76809k37069l38389m31349j82177M16735P70635L79489
33762G44371m01205p28801l42207J76903K56620m036j92377j66814l221K68765
33752c92002N19745M30089m2367l78912j53259K66548K12314k61654m75599j81271
33742d56368J45478J33858j6206o4334r7659j18743J36323O28099P96825L23509
33732A410782l25875n16889k27440J49234L75679L52807m2670o30015q11870l10477
33722e76734L02659L42665k9429j65544K7917Q7028j23699k34220q2702L8254
33712d13805n2611j64444j61625j54878j31735J20535N35401O59793K88168j58413
$$ plain form
33782 879221 802134 265259 -439219 -756730 -518688 -139834 -56414 -184088 -130325 204705
33772 204705 514508 543305 366496 129427 -208962 -640311 -822488 -405753 364882 744371
33762 744371 343166 -385635 -727842 -550939 -294319 -298355 -490732 -657546 -660767 -392002
33752 -392002 127743 557832 515465 136553 -16706 249842 462156 200502 -275097 -456368
33742 -456368 -310890 -177032 -193238 -257572 -355231 -473974 -337651 290448 1087273 1410782
33732 1410782 1084907 568018 340578 489812 865491 1218298 1175628 545613 -266257 -576734
33722 -576734 -274075 68590 39161 -126383 -98466 -11438 -135137 -369357 -452059 -413805
33712 -413805 -466416 -630860 -792485 -947363 -1079098 -958563 -423162 236631 524799 366386
33702C66386j86695J04701K38243O3403j02952l0248N6769j46554m55601l49783
33692d42331K25063N81615J67245n62220o99793j91430J31999j07203l00324J6559
33682a180820L58998K19427R166K48196M77494K0791o41524m71563L65530O36600
33672D2295J3943l87881J59127Q28979O01445j61129l93789L4243L08836J1124
33662A057193l83308l35754N7763L28951K19418j16853l02365j01472L00369M48266
33652A172208J33762l54242n76105m07639q7464O5600p3884l26806l72944j48625
33642i76139K3295q9294k01905N6517M37745L44783j93998m40462k0864M95862
33632e64460M28436p6554l50975j24972K81087M85060L87471Q4720k66144n03820
$$ plain form
33702 366386 179691 284392 522635 586038 483086 452838 509607 363053 -92548 -442331
33692 -442331 -217268 364347 531592 -30628 -730421 -921851 -789852 -897055 -1197379 -1180820
33682 -1180820 -821822 -602395 -593229 -345033 132461 153252 -488272 -959835 -594305 42295
33672 42295 56238 -331643 -172516 656463 1257908 1096779 702990 737233 1046069 1057193
33662 1057193 673885 338131 395894 724845 944263 827410 525045 423573 723942 1172208
33652 1172208 1305970 951728 375623 -32016 -119480 -53880 -127764 -454570 -827514 -976139
33642 -976139 -952844 -1042138 -1244043 -1187526 -749781 -404998 -598996 -1039458 -1060322 -564460
33632 -564460 -136024 -212578 -563553 -688525 -407438 77622 465093 549813 283669 -220151
33622b20151n27570l03809J50396O45892P91689L97271j51209k99289p7800M867
33612D10287j98144l21705k39802k74031m41670k51257L59088O40793J77958l00269
33602d38752l1844M70959K30671m96979n35651K83295P66921K35730m11713j61653
33592h9016N20873M91380k66388o97077l41015R9603J0081k39308p6472L00007
33582b87332L47048J10752M2573J42668R109l41272m25049j31588Q8089L3429
33572d11573M1138K01895P6787l60336l27113N02964J096114M22466q16101j024918
33562e98677l0055P35817M04875k56050k94279Q2877K12288P5629k5083j70375
33552A36967m70100n61063j60513L02373K53402j63771l59189j36488K31208M70232
$$ plain form
33622 -220151 -747721 -1051530 -901134 -255242 536447 933718 782509 483220 405420 410287
33612 410287 212143 -109562 -349364 -623395 -1065065 -1316322 -957234 -316441 -138483 -438752
33602 -438752 -470596 363 231034 -265945 -801596 -518301 248620 484350 72637 -89016
33592 -89016 431857 923237 656849 -40228 -381243 -281640 -271559 -510867 -587339 -287332
33582 -287332 59716 170468 213041 355709 364818 23546 -401503 -533091 -445002 -411573
33572 -411573 -370435 -168540 -91753 -452089 -779202 -276238 819876 1242342 426241 -598677
33562 -598677 -628732 107085 511960 255910 -38369 44508 256796 332425 307342 136967
33552 136967 -333133 -894196 -1054709 -752336 -498934 -662705 -1021894 -1158382 -927174 -456942
33542d56942M20841J7487m44674m20824R8547L91059N7615k88441l427M86614
33532a42145L75215j92420m08758j28602P7917M6566J76615M46517K82113l68835
33522A64183p31789l34017L13003N59515M81212M34451L27201r0997n87749o71950
33512a36937k91851J35893L01896K50511J03402j30807m03028m97442k20091K99033
33502e89421O10453L94297r8040k59777J16743N44574M91760O4948k53597l06689
33492G15251k90779k57754p8938J44655J24331j22146k55981j63573r3233j54683
33482d32850j20293J09023K48072P6722j80142j84764L6826J88466J00440j58445
33472c16945m14136m74851k29315J92780M68528M07686J51369q102Q9512L74925
$$ plain form
33542 -456942 -36101 -18614 -463288 -884112 -785565 -394506 -336891 -625332 -628759 -142145
33532 -142145 233070 40650 -368108 -496710 -418793 -372227 -195612 250905 533018 164183
33522 164183 -567606 -901623 -588620 -29105 452107 886558 1213759 1122762 535013 -136937
33512 -136937 -428788 -292895 9001 259512 362914 232107 -170921 -668363 -888454 -589421
33502 -589421 21032 415329 317289 57512 174255 718829 1210589 1275537 1021940 715251
33492 715251 424472 166718 87780 232435 356766 234620 -21361 -184934 -278167 -432850
33482 -432850 -553143 -444120 -196048 -119326 -299468 -484232 -447406 -258940 -158500 -316945
33472 -316945 -731081 -1205932 -1435247 -1242467 -773939 -366253 -214884 -222986 -133474 241451
33462B41451N95786M64634n8974o11346p30939l66173P3460J99183L3605r4909
33452b54222O9862M27380N46702J06787n86774p83336k32728L53634K12197l66072
33442e06570m47827J45387N92421L41378j11100n9894L79858N64003K45898k60628
33432H82926n88129n80007k50309J64609K86327K8473k34107j93528m7889r2980
33422f24614j74979L059K69324K23865l6146k9508K66143L05165j26003m87248
33412d10942l00312R9836J11602j65984j13205L58619N61480K8266p22883q03986
33402a357509r7000O37828P46577L82951J00668O3608l1532l47756n66774l09035
33392g77974K76239N90872K98544k38319m04513j09412J54649N8127r8973J04375
$$ plain form
33462 241451 837237 1301871 1242897 631551 -99388 -465561 -392101 -192918 -159313 -254222
33452 -254222 -184360 243020 789722 896509 309735 -473601 -706329 -352695 -140498 -506570
33442 -506570 -954397 -809010 -216589 124789 13689 -46205 333653 897656 1143554 882926
33432 882926 294797 -285210 -535519 -370910 -84583 -56110 -290217 -483745 -531634 -624614
33422 -624614 -799593 -796534 -527210 -303345 -339491 -368999 -102856 202309 76306 -410942
33412 -410942 -711254 -611418 -499816 -665800 -779005 -420386 141094 169360 -553523 -1357509
33402 -1357509 -1454509 -816681 -70104 312847 413515 477123 445591 97835 -468939 -777974
33392 -777974 -501735 89137 387681 149362 -255151 -364563 -209914 -151787 -250760 -146385
33382a46385N06940N60562J21532l67427m98588l21661r2627J8942j03535m32089
33372g54336n58158l9617Q04635R95246J67192p70688p78758n4372L97278K33990
33362c57588K9627J67277K96559N1136l43724m54569j98725J89727M27653L14929
33352A22302p6362l14006p0426L38805L18032j22917l71251j39109J89808K51940
33342A26816J36592m2319l59571o07505k99175M59938P70743J55656o11321n52423
33332h22569J10527L65874q4437n43635m35369N3485M88318O97878O40105K93610
33322G63787j34854k96402j44482K2103K7592o629m329o4946j47059j4595L10269
33311C10455L91903l8297n89535o32717j16107L60447L28623K8643q155K13939
$$ plain form
33382 -146385 360555 921117 1042649 675222 176634 -145027 -237654 -218712 -322247 -754336
33372 -754336 -1312494 -1352111 -547476 447770 614962 -155726 -934484 -988856 -591578 -357588
33362 -357588 -327961 -160684 135875 187011 -156713 -611282 -810007 -620280 -192627 122302
33352 122302 45940 -268066 -338492 313 318345 195428 -175823 -314932 -125124 126816
33342 126816 263408 221089 -138482 -745987 -1045162 -585224 185519 341175 -270146 -822569
33332 -822569 -712042 -346168 -430605 -974240 -1409609 -1356124 -867806 -169928 470177 763787
33322 763787 628933 332531 188049 210152 237744 231115 226786 161840 14781 186 310455
33311 310455 702358 664061 74526 -558191 -674298 -313851 14772 43415 35260 249199
33301B49199J47714l72917o68658j39140O66268O48254k03729o62639n5898O97283
33291C05737M84163l42548o24669j68663K25774J99089J36381J30323j62661n17964
33281c35038k14682N67838O51396k85115r37919k89429P77581Q48610R8292k29968
33271F51566J24426L03933j1735k02085J287P8098j90167l01829m1004Q9587j66261
33260C35816l29922r5038J40730J15467K07090N52146N42866r7240n68854j85840
33250F17221M20163K79337l27539l89149J27279L00441j60674n41584l93014r4071
33240a61590L6451J89121L50777Q8792n61797q39809l56645K63581L23784l971
33230f71306j66320p9951K1308J03902K04644J90332N7961O2643K03462P6518
$$ plain form
33301 249199 396913 23996 -644662 -783802 -117534 530720 326991 -335648 -391546 305737
33291 305737 789900 447352 -177317 -345980 -120206 78883 215264 345587 182926 -335038
33281 -335038 -549720 18118 669514 384399 -553520 -842949 -65368 783242 881534 651566
33271 651566 775992 1079925 1068190 866105 867392 945490 755323 453494 412490 502077 335816
33260 335816 5894 -89144 51586 167053 374143 926289 1469155 1371915 803061 617221
33250 617221 1037384 1316721 989182 600033 727312 1027753 867079 325495 -67519 -161590
33240 -161590 -125139 63982 414759 503551 -58246 -898055 -1254700 -991119 -667335 -671306
33230 -671306 -837626 -917577 -896269 -792367 -587723 -397391 -339430 -276787 -73325 3193
33220C193l99019o73274m07438k2420P9248J81809N39756O75234J77218l97391
33210b43084l27630P1438M9528k05539O1052O78522O73255j04205o70838m44371
33200d61872K07M6365p9697P42R9753k1287r5765J41040M08940L25281k3478l19161
33188B1068m35013l54598p8547J88561K05006J58629M06805O81039L15885n41523
33178E67312q57000k38803L86293K11627k40077j35420K57024J63221l08171m64870
33168f58864k94464l03023l57924J19186Q50252P94830k14279r93558o14263L68686
33158a303421Q34901N64007J57663j7267j14433k44651k46581o0312Q1795k7909
33148c76208k80263l96628k63335p229K29103M43411O18153N51747R6286m61898
$$ plain form
33220 3193 -395826 -1069100 -1476538 -1498958 -1419710 -1237901 -698145 -22911 154307 -243084
33210 -243084 -570714 -499276 -449748 -655287 -594235 84287 757542 653337 -17501 -461872
33200 -461872 -461665 -415300 -494997 -494255 -394502 -415789 -511554 -370514 38426 363707 340229 21068
33188 21068 -413945 -768543 -847090 -658529 -453523 -294894 111911 792950 1108835 567312
33178 567312 -289688 -528491 -142198 69429 -170648 -306068 -49044 114177 -193994 -658864
33168 -658864 -953328 -1256351 -1614275 -1495089 -644837 149993 -64286 -1057844 -1672107 -1303421
33158 -1303421 -468520 95487 253150 235883 121450 -123201 -369782 -430094 -348299 -376208
33148 -376208 -656471 -1053099 -1316434 -1323663 -1094560 -651149 -32996 518751 615037 153139
33138A53139n83444j48941L47058M36434K07588j6982j95666m21408n26350k56122
33128a004694K69047O18721N35744J28643l10236m78944k26697K42635N04076
33119B78295M21928K70791J91099n6893n01775o17764p2758N87045O03307N9686
33109A162961l48009l45099k26545j68012p7709k2233j34397j82050J17456M46472
33099B22835K46280l32372n56601j74056L54108O44808O74359L37063m07554r51763
33089E7107n78461L13234N59095K075k37971L52115P63601J31190q17231r26486
33079c81732l24985Q5279J33351K48791L54082N7089l50426k00919L68423N45945
33069E34898J18733k97767l15326j98836j65066n8310J35381J57556J1347K030
$$ plain form
33138 153139 -430305 -579246 -232188 204246 411834 394852 199186 -222222 -748572 -1004694
33128 -1004694 -735647 -116926 418818 547461 237225 -241719 -468416 -225781 278295
33119 278295 700223 971014 1162113 1105220 603445 -14319 -87077 499968 1103275 1162961
33109 1162961 814952 469853 243308 75296 -2413 -24646 -159043 -341093 -223637 222835
33099 222835 469115 136743 -419858 -593914 -239806 405002 1079361 1416424 1008870 57107
33089 57107 -521354 -208120 350975 353050 115079 467194 1230795 1361985 544754 -381732
33079 -381732 -706717 -621438 -488087 -239296 114786 171875 -178551 -379470 -11047 534898
33069 534898 653631 355864 40538 -158298 -323364 -381674 -246293 -88737 -77390 -75360
33059g5360J35702R2903j07324p2676J88665J29527m45851r42675p47808J3174
33049a831723P60581J091153Q92283K49624m65775p40880m29716P8541L32557
33040f3355K43147k598j60487l6484L08722M65072J28303m00126n77908l93281
33030d88995k46871j61407J89037O36760N30084j78306o50127l56735J70005K53897
33020c02658N2835M1732J36511K2204j33192j4594J67470N1966j40557K4243L48829
33009B54789K76395j57357l90376k59584j26062j07338P4146M09005M73332J44655
32999E91605j66003j76668q0289o4334k7573L9666p1021l15131l19407k6214J04579
32988e10790j54501l50480n4627M11439M42298O3321j26185J65087N07174K97880
$$ plain form
33059 -75360 60342 153245 45921 -26755 161910 291437 -154414 -1097089 -1844897 -1831723
33049 -1831723 -1071142 20011 912294 1161918 696143 -44737 -474453 -395912 -63355
33040 -63355 179792 177194 16707 -19777 288945 754017 882320 482194 -95714 -488995
33030 -488995 -735866 -897273 -708236 -71476 458608 280302 -369825 -726560 -556555 -302658
33020 -302658 -249823 -208091 -71580 -49376 -182568 -197162 -29692 22274 -118283 -94040 254789
33009 254789 531184 373827 -16549 -276133 -402195 -509533 -435387 -26382 446950 591605
32999 591605 425602 248934 168645 104311 76738 116404 45383 -269748 -589155 -615369 -510790
32988 -510790 -665291 -1015771 -1070398 -658959 -216661 -153340 -279525 -114438 392736 690616
32978F90616m53749j001665o28901L90529Q78514J61760r00283r51367k4384N40180
32968a298750J38477k72677J23479O39748L54777k04354O9050Q99842R89755J37900
32958A577247m63803j96484J29713j62267m74459j05928M53865L40570k78732
32949H19722n65703l14531k762J39516K55190K63941k7640l19290j21913L35662
32939D62192K90372l52911p58198l57921L38473N11387J06606k77055k36366R7532
32929a75889L71103L56364J06675o9652N9628K82861J73064k44113m20274m8693
32919C91074M91844P11174O46496N91199N25797K41402j98675n32087o76440o96546
32909A495238n80089l71747k90308l55470k07332K55889M39161j07538p43090
$$ plain form
32978 690616 236867 -764798 -1393699 -1003170 -124656 37104 -863179 -1814546 -1838930 -1298750
32968 -1298750 -1160273 -1432950 -1309471 -669723 -314946 -519300 -450250 449592 1439347 1577247
32958 1577247 1113444 916960 1046673 884406 409947 304019 757884 1098454 819722
32949 819722 254019 -60512 -63274 76242 331432 595373 567733 248443 126530 462192
32939 462192 752564 399653 -358545 -716466 -377993 133394 240000 -37055 -273421 -175889
32929 -175889 195214 551578 658253 588601 648229 931090 1104154 860041 439767 391074
32919 391074 882918 1594092 2240588 2831787 3357584 3598986 3400311 2868224 2191784 1495238
32909 1495238 915149 543402 253094 -102376 -309708 -53819 385342 277804 -465286
32900d65286m86216M49501Q55409L15887k42993p5584L41879L07643o459j52633
32890H41148k92309o43776p17679o6677O88594N93976j87211o41199m11562n8988
32880h95683N7769J50700K56858J09247j56785r8797J34405l5464m36979k20011
32870a134740O21933R60922K65519n01376m15877K0171p3822m26693k21429M15097
32860d90295O71260M07216J81211J57982j6106l66692n09198l64849k09588r6578
32850f35637Q8460J71385J69k7542M46416Q69376M39288n14184q45875k84854
32840b92998K47623J28895k12794k94187l07177m50335m28205r0454J84117J72766
32830a342749J74033L10419K08635k14763m10355j08234J76101O6359J359L74781
$$ plain form
32900 -465286 -951502 -502001 353408 669295 426302 350718 692597 1000240 993781 841148
32890 841148 548839 -94937 -812616 -879293 -190699 403277 216066 -425133 -836695 -895683
32880 -895683 -837914 -687214 -430356 -321109 -477894 -576691 -442286 -477750 -914729 -1134740
32870 -1134740 -512807 448115 713634 212258 -203619 -183448 -257270 -683963 -905392 -490295
32860 -490295 180965 588181 769392 927374 911268 544576 35378 -329471 -539059 -635637
32850 -635637 -547177 -375792 -375623 -403165 43251 912627 1351915 837731 -8144 -292998
32840 -292998 -45375 83520 -129274 -423461 -730638 -1180973 -1609178 -1699632 -1515515 -1342749
32830 -1342749 -1168716 -858297 -649662 -864425 -1274780 -1383014 -1206913 -1140554 -1139195 -764414
32820g64414P14566M40865j49605l96258k79531k00562j95281p0340N4760J524
32810h44276k1384J76688L03976J07184q9030K5125J14985j46934l37414M85M15432
32799b95163K57209j26830M0635N45933M83611j97798o17019m01504p6622M4656
32789c42892K26881M07328P4961o28584p79620r8894M85883K49368k63424k17519
32779h86512K51040M78097L54890K23546J32196j05377l87530m40449k63289l6053
32769f79441K03179M50385N47798L99411J42023r2889k92088l19679O233M51984
32759H16916M95882J02892j95000j91556k93683o23470o27619p2135L58420J14968
32749a14385k81383j48115J61411q5877o37466n89541J74505Q69110R95536P37153
$$ plain form
32820 -764414 -49848 391017 241412 -154846 -434377 -634939 -830220 -900560 -845800 -844276
32810 -844276 -865660 -688972 -384996 -277812 -366842 -341717 -226732 -373666 -711080 -710595 -295163
32799 -295163 -37954 -164784 -124149 421784 905395 707597 90578 -310926 -387548 -342892
32789 -342892 -116011 291317 366278 -262306 -1041926 -1140820 -654937 -405569 -668993 -886512
32779 -886512 -635472 -157375 197515 421061 553257 447880 60350 -380099 -643388 -679441
32769 -679441 -476262 -25877 521921 921332 1063355 970466 678378 358699 364932 816916
32759 816916 1312798 1415690 1220690 1029134 735451 111981 -515638 -587773 -229353 -114385
32749 -114385 -395768 -543883 -382472 -468349 -1105815 -1695356 -1520851 -651741 343795 1080948
32739A080948K78204l46717p59380n21969L3498J41407j75431j52758L38850N12576
32729D29228O0259k40996J47087N74624L12088k30837k86635o0422k44320o53471
32719a93395m98819J34496K61230l78969p65685j58946O82667O10898j74064m27611
32709i08198K95258J035309Q48492M4504m57576m45197m08872n05706l25644K24844
32699f02786N39152J89562l46249l62481K7979J41941j53712k54637J80580O68904
32689B8253O13850J15431k84465l54272k94837k87598k77175j60624N6756K87893
32679e56788L99874K79346j2040k30680k20272q3815K4309J11009J81663P6173
32669c1221k39716l88013j358O04340O60903q779o36470m98950J20403M04244
$$ plain form
32739 1080948 1359152 1012435 253055 -268914 -235416 -94009 -269440 -422198 -83348 429228
32729 429228 489487 248491 395578 970202 1282290 1051453 764818 704396 460076 -193395
32719 -193395 -692214 -557718 -296488 -675457 -1441142 -1600088 -917421 -306523 -480587 -908198
32709 -908198 -612940 422369 1270861 1315365 857789 412592 3720 -501986 -827630 -602786
32699 -602786 -63634 125928 -220321 -582802 -554823 -412882 -566594 -821231 -640651 28253
32689 28253 642103 757534 473069 118797 -176040 -463638 -740813 -901437 -844681 -556788
32679 -556788 -156914 122432 110392 -120288 -340560 -424375 -400066 -289057 -107394 -31221
32669 -31221 -270937 -658950 -660308 -55968 604935 596156 -40314 -539264 -418861 -14617
32659a4617J63188o4655q79l2447m16258o92123l64377K37547L79373J9952j36403
32648i21699K89648Q05087P69121K24766k68852l30850k7373L15126L33708j15913
32638A072769p01940q23161l08951K84180L22689j46600n52744n21922j32164
32629a507844L80442P87531Q22923L76897k20214m35202j49438J94100J42982
32620C92177k53203n60309m49467l139L90811M24632J69147n9842j07633q1804
32610a38630m7196R0592L01073L60763K31075J38908R2694k03803o66196o65348
32600e06068m8060L37262j03021n59329M779J013983R91251p9912o71001j67089
32590B12795K53850k02899n47832J42229R13108M52057o42820q05263l5898L02583
$$ plain form
32659 -14617 148571 83916 83037 50590 -365668 -1057791 -1422168 -1184621 -805248 -785296 -921699
32648 -921699 -632051 173036 942157 1166923 898071 567221 539848 854974 1188682 1072769
32638 1072769 370829 -452332 -761283 -477103 -154414 -301014 -853758 -1375680 -1507844
32629 -1507844 -1127402 -339871 483052 859949 639735 204533 55095 249195 392177
32620 392177 138974 -421335 -870802 -873941 -483130 -58498 110649 50807 -56826 -138630
32610 -138630 -185826 -95234 205839 566602 797677 936585 1029279 825476 159280 -506068
32600 -506068 -554128 -216866 -319887 -879216 -874437 139546 1130797 1050885 379884 212795
32590 212795 466645 263746 -284086 -141857 771251 1223308 580488 -224775 -260673 41910
32580D1910r2560j05681O36717J030516M08375l60038m00977j44443k38951l20718
32570D54150R6304M42940r695p31574o35243J83965O03661K27373j55499L6863
32560E13245L35752J06383m79993p87933n64319r0589K24851J89315l4465n8382
32550f46135K58043N28697L33843j29335l16326j61621j00678k79442l52631j74955
32540a040540n4018q6662J11360O38231Q66680L05168n49637q12621l59227J94909
32530g86357M22007M02119K79089R7971K0566J48486J74943k31586p36540o65543
32520h74845o5941K54639o1393l84296j30907L23945L10090p7671k28007R051
32510i25335K49201K90690K78715K44741P0846j09499k8766J84966J36871j43949
$$ plain form
32580 41910 -50650 -156331 480386 1510902 1919277 1559239 1158262 1013819 774868 454150
32570 454150 550454 993394 983699 252125 -383118 -199153 404508 631881 476382 513245
32560 513245 848997 955380 475387 -312546 -876865 -967454 -742603 -553288 -587753 -646135
32550 -646135 -388092 140605 474448 345113 28787 -132834 -233512 -512954 -865585 -1040540
32540 -1040540 -1094558 -1181220 -1069860 -431629 435051 740219 190582 -622039 -981266 -786357
32530 -786357 -364350 37769 316858 414829 435395 583881 758824 527238 -209302 -874845
32520 -874845 -940786 -686147 -747540 -1131836 -1262743 -938798 -628708 -706379 -934386 -925335
32510 -925335 -676134 -385444 -106729 138012 208858 99359 70593 255559 392430 248481
32500B48481k15528n330M7979j78503j92899K31426N18094J63369l79523l63661
32490a26095P7440J86566j75150l65722p9649J71487k7283k72127n839N39867
32480g6505O27702O2049n46032n82428j40352K02925J20336j27460p0513L68728
32470a61550P66064P03308K41984k22878m31374l77093j07672K55894L64479o1419
32460I69743o89562p65171o9153O78614O76711O620o02761p16547m82488j55227
32450a149221J76002L92766L25840M9221j13171O148K31440L26699K35429m930
32440D76223l21114n02965l31291O2153K37521L0931j63313N6352M78334N33229
32430E56060O6518m79940o60298m91075k42797m0289J46340K88082L01414K05679
$$ plain form
32500 248481 32953 27623 75602 -102901 -295800 -64374 453720 617089 237566 -126095
32490 -126095 -48655 137911 -37239 -402961 -482610 -311123 -338406 -610533 -616372 -76505
32480 -76505 551197 613246 67214 -515214 -655566 -452641 -332305 -459765 -530278 -161550
32470 -161550 604514 1307822 1549806 1326928 895554 518461 410789 666683 1031162 969743
32460 969743 280181 -484990 -554143 124471 801182 807802 205041 -511506 -993994 -1149221
32450 -1149221 -973219 -580453 -254613 -205392 -318563 -312415 -80975 245724 481153 476223
32440 476223 155109 -347856 -679147 -616994 -379473 -348542 -511855 -455503 22831 556060
32430 556060 622578 142638 -517660 -1008735 -1251532 -1291821 -1145481 -857399 -555985 -350306
32420c50306Q8368n4871k47940l10398J5412N78027P38238J09889p50269q31344
32410a015194O6823R68986Q87310L1358n40139l00343K04159K33840j90514m80815
32400a34529l32784j2795J34685J24968J61675K41355J55723j39439l69525k73225
32390d43891L2434J97435J06857M80R8029L08475L95358K53146p1549m45350o29779
32379a98355m20332M0677L14847K14770M9078R3589J30832j12897l58520j33339
32369c79650L98580N53018R9943m25375n13654k89296j22614o7403L6717K11828
32359d97906L55363L96939K75606k4722l09875l04791m6937J32159R5325L0210
32349A01371J2059j32044l55924k67412K28903N81393K83269l80003o75762l32640
$$ plain form
32420 -350306 -261938 -316809 -564749 -875147 -859735 -281708 456530 566419 -183850 -1015194
32410 -1015194 -948371 20615 907925 939283 399144 98801 302960 536800 346286 -134529
32400 -134529 -467313 -480108 -345423 -220455 -58780 182575 338298 198859 -170666 -443891
32390 -443891 -411457 -214022 -107165 -106685 -8656 299819 695177 948323 876774 431424 -198355
32379 -198355 -618687 -578010 -263163 -48393 685 94274 225106 112209 -246311 -379650
32369 -379650 18930 571948 671891 246516 -267138 -556434 -679048 -746451 -709734 -497906
32359 -497906 -142543 254396 530002 505280 195405 -109386 -156323 -24164 71161 101371
32349 101371 113430 -18614 -374538 -641950 -413047 168346 451615 71612 -604150 -936790
32339i36790K26003M26739R1852m28091n45882o6092M50278L12560k87833m52163
32329a209419J02216N98476M17143J40k2346J04329j59994n73236n06304k8768
32319a277763K87683L47142M19547L41124j80357o56498l14322N23839O92241
32310A82636l3402n32519o8305O40472O16253l051m35055m06791j84893K9751
32300a94904J54308P4193r8682q222L45055M49640Q4702k52101j30787J43774
32290E66976J32637m066O2152J40208j09064m77508n04102j99613O3361J41994
32280a87025J37734R0248P1351K41083M17206P2171p49628j105800m36842M24676
32270a024826M28312m9953J02938P57042O66690l77528r98324l34039O01695N06301
$$ plain form
32339 -936790 -710787 -284048 -192196 -620287 -1166169 -1232261 -781983 -469423 -757256 -1209419
32329 -1209419 -1107203 -508727 -91584 -91444 -113790 -9461 -169455 -742691 -1248995 -1277763
32319 -1277763 -990080 -642938 -223391 117733 -62624 -719122 -1033444 -509605 182636
32310 182636 149234 -383285 -451590 188882 805135 802084 367029 -39762 -224655 -194904
32300 -194904 -40596 33597 -65085 -73307 271748 721388 806090 553989 423202 566976
32290 566976 699613 695547 757699 897907 788843 311335 -192767 -392380 -329019 -187025
32280 -187025 -49291 40957 112308 353391 770597 842768 93140 -1012660 -1449502 -1024826
32270 -1024826 -596514 -646467 -543529 213513 880203 502675 -495649 -829688 -227993 278308
32260B78308k66191m28012J96593N38949K5155o34437n91771R016M25521L21968
32250a24901k6562k29279j11293K72995O34549N69648M374n37105m52281J40205
32240A40350N04977K90707k9910J7452J37925j69915o61536o60599j42811K63570
32230c09790L16801L67877M45923Q1134o40365p98068P570Q39894O84088j59208
32220H35856p02258o63464l83320O1738O62117Q53355J91982o40830o21821L4786
32210c71859K41108j52638k09632L49773O24492J32579l41190j13972K81116J18953
32200E58730k84608k26896J72599K84574K6938j69532j32815m0854L506j3701
32190A77941j53648k88265j04423L00720L31385j77235n26467j97095K82239K00194
$$ plain form
32260 278308 12117 -415895 -219302 319647 344802 -289635 -881406 -872390 -446869 -124901
32250 -124901 -151463 -380742 -492035 -219040 415509 985157 989531 452426 145 140350
32240 140350 645327 936034 906124 923576 1061501 891586 230050 -430549 -573360 -309790
32230 -309790 7011 374888 820811 901945 261580 -536488 -528918 310976 995064 835856
32220 835856 133598 -529866 -913186 -851448 -189331 664024 856006 215176 -406645 -371859
32210 -371859 -130751 -283389 -493021 -143248 481244 613823 272633 158661 439777 558730
32200 558730 274122 47226 219825 504399 531337 361805 228990 188136 191642 177941
32190 177941 24293 -263972 -368395 -67675 263710 86475 -439992 -637087 -354848 -154654
32180a54654j75604j48009J60990Q8719l14976l37931J52126M86772L17916P8624
32170A53973J05306Q6785k62221n95134m17491J98990P05300O61334J03414m65584
32160B74672m67654J02790N35322K59132l51130n24667k34158q0201j50084J06512
32150e29466P15633Q41405O6814p77583p04769P2170N48978L02588k12648m88240
32140a65118m47444k28783j9799m0052k60678k58340K21475P16194N82883k3415
32130G6923l14784l1201K16872l6853l86850k54767J66601K38362j05151k77021
32120g07869L1031L99084L54269N4972m0510R3697Q1674j90145l88513k85617
32110e97927r0531l4420J8110K39453M20654K95901P1657J22326K69810j3928
$$ plain form
32180 -154654 -330258 -478267 -317277 -228558 -543534 -881465 -729339 -242567 75349 153973
32170 153973 259279 346064 83843 -511291 -928782 -729792 -24492 636842 740256 274672
32160 274672 -192982 -90192 445130 704262 353132 -171535 -405693 -485894 -635978 -529466
32150 -529466 186167 1027572 1094386 316803 -387966 -315796 233182 535770 323122 -165118
32140 -165118 -612562 -841345 -861144 -901196 -1161874 -1420214 -1198739 -482545 100338 76923
32130 76923 -237861 -269062 -52190 -89043 -475893 -730660 -564059 -325697 -430848 -707869
32120 -707869 -676838 -277754 76515 131487 90977 184674 266348 76203 -312310 -597927
32110 -597927 -688458 -722878 -704768 -465315 -44661 251240 322897 445223 715033 701105
32100G01105o24990p38783j7138P23026N91114q8057k65173K87656O91941K72459
32090A533160n31579q38519m37919J08348K20704j25644m71889l73277J10936
32081h05679M45770K77008p8544j01417J29222J01799k17231k94989J3160J45404
32071c85497j78352l65305P5791N91830L99831k02706k65737K92173N67329J07622
32061F36979m54941m43913l2242K35964J85886n9036l46978m10373m1875L98902
32051c31627K61006l49513n18310Q8534N89138K44663l43631k47302K62404K76106
32041f8532j38657j21846L68450M26299j97331n90677j72560L89748L25195q1211
32031A38878j61910L0791O3927J1386J91738L93730J73126k81832l45930N1507
$$ plain form
32100 701105 76115 -662668 -679806 43220 634334 546277 281104 568760 1260701 1533160
32090 1533160 1001581 163062 -274857 -166509 54195 -71449 -543338 -916615 -805679
32081 -805679 -359909 -82901 -161445 -262862 -133640 -31841 -249072 -544061 -530901 -385497
32071 -385497 -563849 -929154 -853363 -261533 138298 -64408 -330145 -37972 529357 636979
32061 636979 182038 -261875 -294117 -58153 127733 68697 -278281 -688654 -730529 -331627
32051 -331627 -70621 -420134 -938444 -849910 -260772 -16109 -359740 -607042 -344638 -68532
32041 -68532 -207189 -329035 39415 465714 268383 -322294 -494854 -105106 220089 138878
32031 138878 -23032 7759 71686 83072 274810 668540 841666 559834 213904 265411
32021B65411L28604J76812n7611n6725k4592k39334n43327n95569l59853n9151
32011a165335J70084L22413L52395K13505J7982o4168o6359j80871m06283m57628
32001a264265j79737J36661J24815o8436N8435N60092Q39370M91939n2021j56040
31991D90813P7500P3300k00242k12323J05251J14567m34545p95301k82328N83869
31981d79439P15765k2559o88106o14278j69694K3741q439J03853L03883K14212
31971f21061j24795j97407J88063N24538L34631r6160j73382O2565O0966k33007
31961b75049k43142J73840L28408j54787n44720j23420N25536L61463l93198n79174
31951i24243L79L22750n9120l10954J24572N37546K64077j37524J8686K35091
$$ plain form
32021 265411 594015 770827 713216 656491 631899 392565 -150762 -746331 -1106184 -1165335
32011 -1165335 -995251 -672838 -320443 -106938 -88956 -153124 -219483 -400354 -806637 -1264265
32001 -1264265 -1444002 -1307341 -1182526 -1250962 -1192527 -632435 206935 698874 646853 490813
31991 490813 568313 641613 441371 229048 334299 448866 14321 -780980 -1063308 -479439
31981 -479439 236326 213767 -474339 -1088617 -1258311 -1234570 -1243009 -1139156 -835273 -621061
31971 -621061 -745856 -943263 -755200 -230662 103969 7809 -165573 -103008 -42042 -275049
31961 -275049 -518191 -344351 -15943 -170730 -715450 -838870 -313334 48129 -345069 -924243
31951 -924243 -923864 -601114 -660234 -971188 -846616 -309070 -44993 -182517 -163831 71260
31941G1260k37605q90316o62185K82189P66918M01300m6151l6899J13742J13385
31931a24362J46363K23773P036m35801n23605j15823J83866l954k70076j60355
31921a072938J74036M16802N50611N30672J24427n19373p44797k93014K10662
31912f22912J56359j75525j69182J58870L38591K38274Q9349j3456q7824K7475
31902e9981M00808O42502L51662k20381m74320k98247o5939Q1308L37846O18455
31892A313713M78801j63216p42451p43983l00216J45677L98832M36277J20027
31883I43461n60818j117130r20195j8931P65858P55501J78984k08707q7180J87147
31873h2010K38295J49845J37459J19275o7152k75433k73776j95704l14174m47562
$$ plain form
31941 71260 -166345 -1056661 -1718846 -1436657 -669739 -268439 -314590 -351489 -237747 -124362
31931 -124362 22001 245774 252810 -182991 -706596 -822419 -638553 -642507 -912583 -1072938
31921 -1072938 -898902 -482100 68511 599183 723610 204237 -540560 -833574 -622912
31912 -622912 -466553 -642078 -811260 -652390 -313799 -75525 13824 368 -87456 -59981
31902 -59981 340827 983329 1334991 1114610 640290 342043 276104 357412 695258 1313713
31892 1313713 1792514 1629298 886847 142864 -157352 -11675 387157 823434 943461
31883 943461 382643 -734487 -1654682 -1673613 -907755 -152254 26730 -181977 -269157 -82010
31873 -82010 156285 306130 443589 562864 495712 220279 -53497 -249201 -563375 -1010937
31863a010937j34811N20761P56531J81957n67241o19958O554N28204M46534J4797
31853A22391k85489k99082j54451R176J24349J68461J58481J16119M2317k3235
31843b0963J584R7755J09823k3947j33581o4780O9990P9894J698j7899k3945j42993
31831f7364k47028p2545L11868N00494L03258q020j40545j63892k43864k69071
31821i6709o1523K00195J40040k32870m28314r2275M92040P02628K94787l34294
31811E83705n97152l35649O3949J55874m4248j32558Q8999K92879P9684l96224
31801b40741n73139k47047J66509K55284J36615J21054J82864J32966O6020J79364
31791A79749L02185J09212k62781l42170o8057J48704J59434K36100L48810K1434
$$ plain form
31863 -1010937 -1145748 -624987 131544 313501 -253740 -873698 -867144 -338940 107594 122391
31853 122391 -163098 -462180 -616631 -607455 -483106 -314645 -156164 -40045 2272 -20963
31843 -20963 -19379 78376 188199 164252 30671 -34109 35881 115775 117473 99574 75629 -67364
31831 -67364 -314392 -386937 -75069 425425 728683 720663 580118 416226 172362 -96709
31821 -96709 -158232 41963 182003 -50867 -479181 -571456 -79416 623212 917999 583705
31811 583705 -13447 -349096 -285147 -129273 -173521 -306079 -217080 75799 155483 -240741
31801 -240741 -813880 -1060927 -894418 -639134 -502519 -381465 -198601 -65635 385 179749
31791 179749 481934 591146 328365 -13805 -81862 66842 226276 462376 811186 832620
31781H32620p33777j069785m73985L33297L96850p0196j39912L06202M79927L1543
31771a07216m60136m76185k00265O0608L41019N82742M23483j53169n15919k06129
31761g11167L66571N05136J56143j91323k70236k40953k69856k91106j66997J30684
31751i83104M55608N21667J65658l53065n51139l12624j3776M2988j087R1062
31741i37812K62532L24697K32672K1159k62916m28161k61754Q0889J82231j497
31731g87960o1289J22812J12946k85125n26551j42865M24607M27759q4676m10837
31721a211179k31941J18705L03622L15688K12118K8473n6817R3236K71900K05258
31711D9063J6600j3022J3646j71226l79395j82764K91634M40344J20143j50350
$$ plain form
31781 832620 98843 -970942 -1444927 -1111630 -714780 -784976 -924888 -618686 -138759 -107216
31771 -107216 -567352 -1043537 -1243802 -1183194 -842175 -259433 164050 10881 -505038 -711167
31761 -711167 -344596 160540 316683 125360 -144876 -385829 -655685 -946791 -1113788 -983104
31751 -983104 -527496 -5829 159829 -193236 -744375 -1056999 -1070775 -1027787 -1028874 -937812
31741 -937812 -675280 -350583 -117911 -96752 -359668 -787829 -1049583 -968694 -786463 -787960
31731 -787960 -849249 -726437 -613491 -898616 -1425167 -1568032 -1143425 -715666 -800342 -1211179
31721 -1211179 -1443120 -1324415 -1020793 -705105 -492987 -464514 -521331 -428095 -156195 49063
31711 49063 65663 52641 66287 -104939 -484334 -667098 -375464 64880 185023 34673
31701C4673p5968j1125k30486l97603j65971K00418K76114J40065R7727P4064
31691e8092j52720l39883m1571N60493P24376K06950k95073r4311N08443O55525
31681A674137J15389m95031o44348n04063m52074m40295k30011P7130K08761K22313
31671d68092L43299M32170J70296k56070k80459J35915L56845M6585l41645l69237
31661b30393k60498l03806k38520J61000M52716K06529j46347L8133M92252M73224
31651F44290M9176p7428J00971j13594p19440p97801o0520N28986K79344j30249
31641b96265J09647N20917K28439m08668l24310M12523O02291j76839q85321o19669
31631h37255J35596M37738K48547J31535J80449Q6057p4474K8209J89545j31609
$$ plain form
31701 34673 -41295 -52420 -282906 -680509 -846480 -646062 -369948 -229883 -132156 -58092
31691 -58092 -210812 -550695 -592266 -31773 692603 899553 604480 510169 1018612 1674137
31681 1674137 1789526 1294495 650147 146084 -305990 -746285 -976296 -899166 -690405 -468092
31671 -468092 -124793 307377 477673 221603 -58856 77059 433904 480489 138844 -230393
31661 -230393 -490891 -794697 -1033217 -872217 -419501 -212972 -359319 -321186 171066 644290
31651 644290 693466 616038 717009 603415 -116025 -913826 -974346 -445360 -166016 -296265
31641 -296265 -186618 334299 562738 154070 -170240 242283 844574 667735 -217586 -837255
31631 -837255 -701659 -263921 -15374 116161 296610 382667 308193 336402 525947 394338
31621C94338p72888q53309o9741P24864O81941R0497k07357m3354J06547L9827
31611I1365k8562p4405k77669m69129k73526J66478L12557J40543J72258M65660
31601B25570M22080j02212l76077J3121L76893K7575n44127m31843K63611O59468
31591E34059M05023o7738l77801m97052l86395n2234J71176L1829j55871n6739
31581d51743m332l88294p37185l74306L04658L25280k41187l65480J97986N41505
31571a193098K20628m1854K62406N42800K68726n0337J48438M02125L2625o33568
31561d1109p62502k69997K21959L46499K31541P1587J9565K05991M21581J77625
31551F22740n00988q55910m46629J55708K94613K29201M92731Q27432O27928L1205
$$ plain form
31621 394338 -378550 -1231859 -1301600 -576736 105205 195702 -11655 -55009 51538 91365
31611 91365 62803 -11602 -289271 -758400 -1031926 -865448 -552891 -412348 -240090 225570
31601 225570 647650 545438 169361 182482 559375 586950 42823 -389020 -125409 534059
31591 534059 939082 871344 493543 -3509 -389904 -442138 -270962 -239133 -395004 -451743
31581 -451743 -456075 -844369 -1581554 -1955860 -1651202 -1325922 -1567109 -1932589 -1734603 -1193098
31571 -1193098 -972470 -1014324 -751918 -209118 59608 9271 157709 559834 592459 -41109
31561 -41109 -803611 -1073608 -851649 -505150 -273609 -202022 -182457 23534 445115 622740
31551 622740 121752 -734158 -1180787 -1025079 -730466 -501265 -8534 818898 1446826 1478031
31541A478031l28831l65127m72767o43567n04443j13757Q1829J5003Q228J18633
31531g26768J60260K27468M65878N01442p1716p69410p13732k4809K77187j22783
31521g96983l62851J37863P35440O28739O8673j91090q4170j29435m42128n38330
31511i74272j01453N21729O97551K00021n14852p33597k58319L44070M52110J74629
31501a92383P4399K71962L50282J20248j14617j71258k77548n15896n17389o2293
31491a034493M38551M62286Q6035j89179j31533L2570J9552j66523k63485l9280
31481g85499L86488N58797K23532k28948j91051L05513N78906K36840l04204m47600
31471C32774j91261J4492p6463k89926l37555j19045K10703L59421J60976k20028
$$ plain form
31541 1478031 1149200 784073 311306 -332261 -836704 -950461 -868632 -853629 -845401 -726768
31531 -726768 -566508 -339040 126838 628280 556564 -212846 -926578 -951387 -674200 -796983
31521 -796983 -1159834 -1021971 -286531 342208 410881 219791 135621 6186 -435942 -974272
31511 -974272 -1075725 -553996 143555 343576 -171276 -904873 -1163192 -819122 -367012 -192383
31501 -192383 -117984 153978 504260 624508 509891 338633 61085 -454811 -972200 -1034493
31491 -1034493 -595942 -133656 -47621 -236800 -368333 -335763 -316211 -482734 -746219 -785499
31481 -785499 -399011 159786 383318 154370 -36681 268832 847738 1084578 780374 332774
31471 332774 141513 156005 79542 -210384 -547939 -666984 -456281 -96860 64116 -155912
31461a55912m25505k51869J98581O21327O77397K48204l23430m99800k47207j01177
31451b59391k65920j98712L95292P87576K90343m51150l58700K70434K37702m25665
31441B1809m29280M53623P90906r6591q30588k12937P29188M46703n46539n79884
31431b53590M05542Q83633K71301l83038l38788j40562k69897k54403K59764O76427
31421H56389L92349k46069n47748m08337j46839K9926M632k74615m84379j60925
31411i85616M85695O47116J22257k79279J8953M51898K69053k44211k85294J62345
31401C62917L93066J56031l4737J85089M51014K30305m18410q95133p49812j91844
31391e11514J41057m2794k96256o3674M52053N41100Q6485k35085m9287J15598
$$ plain form
31461 -155912 -581417 -833286 -634705 -13378 664019 912223 588793 88993 -158214 -259391
31451 -259391 -525311 -724023 -328731 458845 749188 298038 -60662 209772 447474 21809
31441 21809 -407471 46152 837058 740467 -90121 -303058 426130 872833 326294 -253590
31431 -253590 151952 1035585 1306886 923848 585060 444498 174601 -79802 179962 856389
31421 856389 1248738 1002669 454921 46584 -100255 -70329 -65697 -340312 -824691 -985616
31411 -985616 -499921 147195 269452 -9827 9126 461024 730077 485866 200572 362917
31401 362917 755983 912014 877277 1062366 1513380 1743685 1325275 430142 -319670 -511514
31391 -511514 -370457 -413251 -709507 -773181 -321128 219972 306457 71372 22085 137683
31381A37683k36525o60731m49761K05997M72388P8974m09595m65890j59286J65772
31371a320974K97111K16263J07322K47821N86364O26997J25862l74887k61287
31362B50592J64210J33286l01446l19196K51651N23722n5396p40150n55531K65578
31352c82680O56797K04362m56696o15769k40155K55743M87190K61449l23162q06485
31342i59406p12109j11546L98650M13311J76724J49078L37251L62030J10935n4010
31332A10908J17764K94703K7236m80370n46771k3494L90420J37239l54086l07812
31322f34263K33605N26373K85307K9431J75405M32942L68754N9048j48844j44813
31312A182945l2097Q4416N5417k30781n31494m18709L4289K31996q814j03999
$$ plain form
31381 137683 -98842 -759573 -1209334 -1003337 -530949 -451975 -861570 -1327460 -1486746 -1320974
31371 -1320974 -1023863 -807600 -700278 -452457 133907 760904 886766 511879 250592
31362 250592 414802 548088 246642 -72554 179097 702819 647423 -92727 -648258 -382680
31352 -382680 274117 478479 21783 -593986 -834141 -578398 -91208 170241 -152921 -959406
31342 -959406 -1671515 -1783061 -1384411 -971100 -794376 -645298 -308047 53983 164918 110908
31332 110908 228672 523375 550611 70241 -476530 -500024 -109604 27635 -326451 -634263
31322 -634263 -400658 125715 411022 440453 615858 1048800 1417554 1476602 1327758 1182945
31312 1182945 1150848 1235264 1290681 1059900 528406 109697 143986 375982 367168 263169
31302B63169K85803N31545K903p69732p66709l744N28625L32700q1877j82777
31292A39906p1222L338M1429P51k39518m43398k02593K76288K91538k14715m24407
$$ plain form
31302 263169 548972 1080517 1083420 313688 -453021 -456765 71860 404560 322683 139906
31292 139906 68684 72022 113451 114202 -125316 -568714 -771307 -495019 -203481 -418196 -842603
$$ [...]
##END NTUPLES=NMR SPECTRUM
##END=
