##TITLE=31Pdec_50-2023
 CDCl3 24 sc
 11.8.2023
##JCAMPDX= 6.0         $$ Bruker NMR JCAMP-DX V2.0
##DATA TYPE= NMR SPECTRUM
##DATA CLASS= NTUPLES
##ORIGIN= UXNMR, Bruker Analytische Messtechnik GmbH
##OWNER= root
$$ XWIN-NMR		Version 3.5
$$ Fri Aug 11 14:07:33 2023 Russian Standard Time (UT+4h)  she@DPX200
##.OBSERVE FREQUENCY= 81.013821
##.OBSERVE NUCLEUS= ^31P
##.ACQUISITION MODE= SIMULTANEOUS
##.ACQUISITION SCHEME= undefined
##.AVERAGES= 24
##.DIGITISER RES= 16
##SPECTROMETER/DATA SYSTEM= spect
##.PULSE SEQUENCE= zgpg30
##.SOLVENT NAME= CDCl3
##.SHIFT REFERENCE= (INTERNAL, CDCl3, 0, 248.564)
##AUDIT TRAIL= $$ (NUMBER, WHEN, WHO, WHERE, WHAT)
$$ ##TITLE= Audit trail, XWIN-NMR		Version 3.5
$$ ##JCAMPDX= 5.01
$$ ##ORIGIN= Bruker BioSpin GmbH
$$ ##OWNER= she
$$ F:/spectra/data/she/nmr/P31/1/pdata/1/auditp.txt
$$ ##AUDIT TRAIL=  $$ (NUMBER, WHEN, WHO, WHERE, WHAT)
(   1,<2023-08-11 14:06:42.68 +0400>,<she>,<DPX200>,
      <created by zg, POWCHK disabled, PULCHK disabled
       configuration hash MD5:
       00 E9 B6 7A A2 85 ED C7 34 08 36 98 17 FE 4E 26
       data hash MD5: 32K
       21 41 ED D7 67 8E B6 B2 86 15 25 D7 C8 28 45 6B>)
(   2,<2023-08-11 14:06:44.92 +0400>,<she>,<DPX200>,
      <Start of raw data processing
       efp BC_mod = 2 LB = 5 FT_mod = 6 PKNL = 1 PHC0 = -10619.83 PHC1 = 11.08485 SI = 64K 
       data hash MD5: 64K
       E6 57 D4 16 66 C4 62 55 20 06 E2 2B BD 4D 9E 75>)
(   3,<2023-08-11 14:07:03.06 +0400>,<she>,<DPX200>,
      <pk PHC0 = 1.223761 PHC1 = 0 
       data hash MD5: 64K
       BA 9B 54 32 B0 A0 C8 C3 87 CA BA E7 56 3D A7 D6>)
$$ ##END=
$$ 
$$ hash MD5
$$ 07 05 6E 4B 56 33 F5 ED BD D2 F4 8F E1 C7 08 88
##$RELAX= 
##$RELAX= 
##$RELAX= 
##$RELAX= 
##$RELAX= 
##$RELAX= 
##$RELAX= 
##$RELAX= 
##$RELAX= 
$$ Bruker specific parameters
$$ --------------------------
##$DU= <F:/spectra>
##$EXPNO= 1
##$NAME= <P31>
##$PROCNO= 1
##$TYPE= <nmr>
##$USER= <she>
##$AMP= (0..31)
100 100 100 100 100 100 100 100 100 100 100 100 100 100 100 100 100 100 
100 100 100 100 100 100 100 100 100 100 100 100 100 100 
##$AQSEQ= 0
##$AQ_mod= 1
##$AUNM= <au_zg>
##$AUTOPOS= <>
##$BF1= 81.014009
##$BF2= 200.13
##$BF3= 200.13
##$BF4= 200.13
##$BF5= 200.13
##$BF6= 200.13
##$BF7= 200.13
##$BF8= 200.13
##$BYTORDA= 1
##$CFDGTYP= 0
##$CFRGTYP= 5
##$CHEMSTR= <none>
##$CNST= (0..31)
1 1 145 1 1 1 1 1 1 1 1 1 1 1 1 1 1 1 1 1 1 1 1 1 1 1 1 1 1 1 1 1 
##$CPDPRG= <waltz16>
##$CPDPRG1= <>
##$CPDPRG2= <waltz16>
##$CPDPRG3= <>
##$CPDPRG4= <mlev>
##$CPDPRG5= <mlev>
##$CPDPRG6= <mlev>
##$CPDPRG7= <mlev>
##$CPDPRG8= <mlev>
##$CPDPRGB= <>
##$CPDPRGT= <>
##$D= (0..31)
0 1 0 0 0 0 0 0 0 0 0 0.03 2e-05 3e-06 0 0 0 0 0 0 0 0 0 0 0 0 0 0 0 0 
0 0 
##$DATE= 1691748402
##$DBL= (0..7)
120 120 120 11 120 120 24 19 
##$DBP= (0..7)
150 150 150 150 150 150 150 150 
##$DBP07= 0
##$DBPNAM0= <>
##$DBPNAM1= <>
##$DBPNAM2= <>
##$DBPNAM3= <>
##$DBPNAM4= <>
##$DBPNAM5= <>
##$DBPNAM6= <>
##$DBPNAM7= <>
##$DBPOAL= (0..7)
0.5 0.5 0.5 0.5 0.5 0.5 0.5 0.5 
##$DBPOFFS= (0..7)
$$ [...]
##$SUBNAM2= <"">
##$SUBNAM3= <"">
##$SUBNAM4= <"">
##$SUBNAM5= <"">
##$SUBNAM6= <"">
##$SUBNAM7= <"">
##$SUBNAM8= <"">
##$SUBNAM9= <"">
##$SW= 501.771253377433
##$SWIBOX= (0..15)
0 1 3 0 0 0 0 0 0 0 0 0 0 0 0 0 
##$SW_h= 40650.406504065
##$TD= 32768
##$TD0= 1
##$TE= 0
##$TE2= 300
##$TE3= 300
##$TEG= 300
##$TL= (0..7)
0 120 53 12 22 120 120 120 
##$TP= (0..7)
150 150 150 150 150 150 150 150 
##$TP07= 0
##$TPNAME0= <>
##$TPNAME1= <>
##$TPNAME2= <>
##$TPNAME3= <>
##$TPNAME4= <>
##$TPNAME5= <>
##$TPNAME6= <>
##$TPNAME7= <>
##$TPOAL= (0..7)
0.5 0.5 0.5 0.5 0.5 0.5 0.5 0.5 
##$TPOFFS= (0..7)
0 0 0 0 0 0 0 0 
##$TUNHIN= 0
##$TUNHOUT= 0
##$TUNXOUT= 0
##$USERA1= <user>
##$USERA2= <user>
##$USERA3= <user>
##$USERA4= <user>
##$USERA5= <user>
##$V9= 5
##$VALIST= <valist>
##$VCLIST= <CCCCCCCCCCCCCCC>
##$VD= 0
##$VDLIST= <DDDDDDDDDDDDDDD>
##$VPLIST= <PPPPPPPPPPPPPPP>
##$VTLIST= <TTTTTTTTTTTTTTT>
##$WBST= 1024
##$WBSW= 4
##$XGAIN= (0..3)
0 0 0 0 
##$XL= 0
##$YL= 0
##$YMAX_a= 9150
##$YMIN_a= -9844
##$ZGOPTNS= <>
##$ZL1= 120
##$ZL2= 120
##$ZL3= 120
##$ZL4= 120
##$ABSF1= 0
##$ABSF2= 0
##$ABSG= 0
##$ABSL= 0
##$ALPHA= 0
##$AQORDER= 0
##$ASSFAC= 0
##$ASSFACI= 0
##$ASSFACX= 0
##$ASSWID= 0
##$AUNMP= <proc_1d>
##$AZFE= 0.1
##$AZFW= 0.5
##$BCFW= 0
##$BC_mod= 2
##$BYTORDP= 0
##$COROFFS= 0
##$CY= -3
##$DATMOD= 1
##$DC= 0
##$DFILT= <>
##$DTYPP= 0
##$F1P= 0
##$F2P= 0
##$FCOR= 1
##$FTSIZE= 65536
##$FT_mod= 6
##$GAMMA= 0
##$GB= 0
##$INTBC= 1
##$INTSCL= 6.047779e-11
##$ISEN= 30
##$LB= 5
##$LEV0= 0
##$LPBIN= 0
##$MAXI= 10000
##$MC2= 0
##$MEAN= 0
##$ME_mod= 0
##$MI= 50
##$NCOEF= 0
##$NC_proc= -6
##$NLEV= 6
##$NOISF1= 182.463
##$NOISF2= 159.3651
##$NSP= 0
##$NTH_PI= 0
##$NZP= 0
##$OFFSET= 248.5645
##$PC= 4
##$PHC0= -10618.61
##$PHC1= 11.08485
##$PH_mod= 1
##$PKNL= yes
##$PPARMOD= 0
##$PSCAL= 0
##$PSIGN= 0
##$REVERSE= no
##$SF= 81.0140089999694
##$SI= 65536
##$SIGF1= 159.3651
##$SIGF2= -187.1042
##$SINO= 113.3802
##$SIOLD= 16384
##$SREGLST= <1H.CDCl3>
##$SSB= 0
##$STSI= 65536
##$STSR= 0
##$SW_p= 40650.406504065
##$SYMM= 0
##$S_DEV= 0
##$TDeff= 32768
##$TDoff= 0
##$TI= <>
##$TILT= no
##$TM1= 0
##$TM2= 0
##$TOPLEV= 0
##$USERP1= <user>
##$USERP2= <user>
##$USERP3= <user>
##$USERP4= <user>
##$USERP5= <user>
##$WDW= 1
##$XDIM= 65536
##$YMAX_p= 399000882
##$YMIN_p= -3901616
$$ End of Bruker specific parameters
$$ ---------------------------------
##NTUPLES= NMR SPECTRUM
##VAR_NAME=  FREQUENCY,     SPECTRUM/REAL,   SPECTRUM/IMAG
##SYMBOL=    X,             R,               I
##VAR_TYPE=  INDEPENDENT,   DEPENDENT,       DEPENDENT
##VAR_FORM=  AFFN,          ASDF,            ASDF
##VAR_DIM=   65536,         65536,           65536
##UNITS=     HZ,            ARBITRARY UNITS, ARBITRARY UNITS
##FACTOR=    0.620285442955139, 1,           1
##FIRST=     20137.2065510682, 0,            0
##LAST=      -20513.1999529968, 0,           0
##MIN=       -20513.1999529968, -3901616,    0
##MAX=       20137.2065510682, 399000882,    0
$$ Real data points
##PAGE= N=1
##DATA TABLE= (X++(R..R)), XYDATA
$$ [...]
39143A751302J56057J04653M3894j4355o8048j08234j12766p2257j6080P177j9521
39132A651822o2268p3121l8294J4046M5064L7999O385k2550l4415m2056p1923
39121A410689j32667j97950k23010j80612q4525J9217Q7064J09879J11115J11836
39111A031036J02612N7430k7699j20339j77510j79715j41294r7341p9994r4051
39101B73135j10450r4094m3630O011K4824J7508L871j3636m4067p9923r8658r2359
39089b51468p5156n6256k4642K9638R4232J47848J84247K08737K18316K02718
39079F78214J65127J27533J10978J18518J38377J53444J45682J05588M8153J0734
39069A802348K1040O7350J09360J17596R3577N3366O046m4811q9679j15776j18472
$$ y = [1751302, 1907359, 2012012, 2055906, 2041551, 1973503, 1865269, 1752503, 1680246, 1664166, 1671343, 1651822, 1589554, 1516433, 1478139, 1492185, 1537249, 1575248, 1581633, 1559083, 1524668, 1482612, 1410689, 1278022, 1080072, 857062, 676450, 591925, 611142, 698206, 808085, 919200, 1031036, 1133648, 1191078, 1163379, 1043040, 865530, 685815, 544521, 447180, 367186, 273135, 162685, 68591, 24961, 30972, 55796, 73304, 77175, 63539, 19472, -60451, -159109, -251468, -326624, -382880, -407522, -377884, -283652, -135804, 48443, 257180, 475496, 678214, 843341, 970874, 1081852, 1200370, 1338747, 1492191, 1637873, 1743461, 1791614, 1802348, 1823388, 1890738, 2000098, 2117694, 2211271, 2264637, 2270683, 2225872, 2136193, 2020417, 1901945]
39058A901945j01177o6549j8957K3368L2442j537n0286o8022l7329J0599K6691
39047A651188p462o6063j10097j21877j06940p4131k7367K4875O5541Q2021P9402
39036A389090P6946R2585J29196J69779J85495J56679R1414K0575k6964m1557
39026B243238l0492j1864j1777m9899j16147j73077j94258j91460j91119j94077
39016A079068j77202j29719o7733j2771K5511M3949M3650M0492N9931J08318J57809
39005A171303J67863J16213R255j22100k30961k77080k57280k07675j67909j50706
38995E0923j49227j55877j61254j51993j29575j19580j40017j67536j59120j06407
38985a389663m6608j6869j6550j7117R778P6752J69340K39706K34623J50263M7824
$$ y = [1901945, 1800768, 1734219, 1715262, 1738630, 1771072, 1769535, 1719249, 1651227, 1613898, 1624497, 1651188, 1643726, 1577663, 1467566, 1345689, 1238749, 1164618, 1137251, 1162126, 1227667, 1309688, 1389090, 1466036, 1558621, 1687817, 1857596, 2043091, 2199770, 2291184, 2311759, 2284795, 2243238, 2212746, 2200882, 2189105, 2139206, 2023059, 1849982, 1655724, 1464264, 1273145, 1079068, 901866, 772147, 704414, 691643, 717154, 761103, 804753, 845245, 905176, 1013494, 1171303, 1339166, 1455379, 1464634, 1342534, 1111573, 834493, 577213, 369538, 201629, 50923, -98304, -254181, -415435, -567428, -697003, -816583, -956600, -1124136, -1283256, -1389663, -1436271, -1453140, -1469690, -1486807, -1477029, -1400277, -1230937, -991231, -756608, -606345, -558521]
38974e58521l597O452L3691L8958K3020N034q447k1611l0784k2712J0366O0523
38962d67628J07731J31329J22681R1257N5584K5006o002m2638p5889r1811q9920
38951b40300q0691o5398l2866J7369O1013P0451M4450N266k9156n6960p9267r1833
38939d77922r3357q7636p1286l2940K5677P9524J04166J03034R8668J02507J06991
38928a42574J04757J00899J03182J09859J10381R2721N1312l986m7256n4529k5383
38917C99383J8652N6332P9851Q7587P6344M6573Q360k3606l9430l9332l5369m6674
38905E88671q3464j32292j63900j59618j26285q4812n0248k4252j85K7268N3415
38894a55702O4445N2276K7271R130P270J8466L9268O5901Q3254P4017M5967L2221
$$ y = [-558521, -562118, -555666, -521975, -483017, -459997, -454963, -463410, -485021, -515805, -538517, -528151, -467628, -359897, -228568, -105887, -14630, 40954, 65960, 59958, 17320, -58569, -150380, -240300, -320991, -386389, -419255, -401886, -340873, -270422, -225972, -220706, -249862, -306822, -386089, -477922, -571279, -658915, -730201, -763141, -737464, -657940, -553774, -450740, -352072, -249565, -142574, -37817, 63082, 166264, 276123, 386504, 479225, 530537, 526551, 479295, 424766, 399383, 418035, 474367, 554218, 641805, 718149, 764722, 773082, 749476, 710046, 670714, 635345, 588671, 505207, 372915, 209015, 49397, -76888, -161700, -211948, -236200, -236385, -209117, -155702, -91257, -38981, -11710, -2580, 4690, 23156, 62424, 128325, 211579, 285596, 331563, 363784]
38882C63784N1395Q0042P8941L9060j1127l7934l1260p762K777k1338p4774j29299
38870C02505j63368j81776j99129k13965k11542j84041j34424o8763j672L8547
38860a017628L3780N543j766K7401O3943P6990P2617P6492R3538J02402Q3055
38849c83633L6001k0432n8747n3382o52O8587J08591R9173O2197L3911K6713K5466
38837e6207J7809J4417L0564N5222N4665J1615n0583r1211r1620o3051k5017R168
38825a84229L0524L6169L5078L8446M2383L3670J4163L090R694J9095J2694j2095
38813G8682m9194r2310j24090j17489p0154k4333k7118p6050j26760j49538j51423
38802i29777j41839j08209m0740M0914J05639J43539J64247J72189J60640J26066
$$ y = [363784, 415179, 495221, 574162, 613222, 602095, 564161, 532901, 525139, 527916, 506578, 431804, 302505, 139137, -42639, -241768, -455733, -667275, -851316, -985740, -1054503, -1056175, -1017628, -983848, -978305, -980071, -952670, -888727, -811737, -739120, -662628, -569090, -466688, -383633, -347632, -368064, -426811, -480193, -480845, -412258, -303667, -204494, -142297, -108386, -81673, -56207, -38398, -23981, 6583, 61805, 116470, 128085, 77502, -13709, -105329, -168380, -193397, -184229, -153705, -117536, -82458, -44012, -1629, 32041, 46204, 49294, 58988, 78083, 90777, 78682, 29488, -62822, -186912, -304401, -374555, -398888, -426006, -502056, -628816, -778354, -929777, -1071616, -1179825, -1220565, -1179651, -1074012, -930473, -766226, -594037, -433397, -307331]
38792c07331P4214J4590l9220o8092o2013l7973l0199n7554j07356j51019j64203
38781i36156j30622m3959P8928J92889K47477K20006J25456J211j10066j71544
38771e26380j67085j13258m6502R400N6909J02361J33281J31871J03553P3058
38761b42792N0788K1361k5344o6740o7700k3335L3851P0808Q5221R4319J02438
38750C2875R1579M5237k4821q0037q4139l2166M5659J05917J20498R1817M6845
38739C59264J4382J992n847k4091m5413n0584l9250l7093o5918j16219j57469
38728a66246j67520j43223r2140k8812K5866N9069Q1105J11590J48095J62781
38718i435J35930Q1336L2686J4789L1554O7248R0329P0391P078o4573j09536j25570
$$ y = [-307331, -233117, -218527, -257747, -325839, -387852, -425825, -456024, -513578, -620934, -771953, -936156, -1066778, -1110737, -1031809, -838920, -591443, -371437, -245981, -244770, -354836, -526380, -693465, -806723, -853225, -843825, -786916, -684555, -551274, -419403, -315850, -242792, -192004, -170643, -195987, -262727, -330427, -353762, -319911, -249103, -163882, -69563, 32875, 124454, 169691, 144870, 64833, -19306, -51472, -5813, 100104, 220602, 312419, 359264, 373646, 375638, 369791, 345700, 300287, 249703, 210453, 173360, 107442, -8777, -166246, -333766, -476989, -569129, -597941, -572075, -513006, -431901, -320311, -172216, -9435, 126495, 207831, 240517, 255306, 286860, 354108, 444437, 514828, 521906, 457333, 347797, 222227]
38706B22227j28113j14574o7939N857P0405R8879J02763J07513J15146J09184
38696E21348Q7289O6746N6409M2568J2174k2400l5603k2762j0156k7207p3900
38685E94506j19245j28769r0026j4945P3836J53938K05613K13780J74915J02710
38675A166313K4133l3800n7815n4104m2671m3605o3154q9213j01842r3636q1475
38664E29131r1586j25994j48989j21096n0622J816j8033j01037j86887k26428
38654e39725k16453j77344j21856n8244n592J7320J7069K3955O1327J22699J77530
38643f99314J92453J51569O9579j2911n8352o1920m7184l3515j8986L595K9837
38632d85149N2178P2387R2304J00713Q5410N5326L5396L7349M6846M1855J4362
$$ y = [222227, 94114, -20460, -88399, -82542, -12137, 86742, 189505, 297018, 412164, 521348, 608637, 675383, 731792, 774360, 786534, 764134, 728531, 705769, 695613, 668406, 594506, 475261, 346492, 256466, 241521, 315357, 469295, 674908, 888688, 1063603, 1166313, 1190446, 1156646, 1098831, 1044727, 1002056, 958451, 895297, 806084, 704242, 610606, 529131, 437545, 311551, 162562, 41466, -9156, -7340, -25373, -126410, -313297, -539725, -756178, -933522, -1055378, -1113622, -1119214, -1101894, -1084825, -1060870, -999543, -876844, -699314, -506861, -355292, -285713, -298624, -356976, -418896, -466080, -499595, -518581, -514986, -485149, -432971, -360584, -268280, -167567, -82157, -26831, 8565, 45914, 92760, 134615, 148977]
38621A48977k7539o8634r4309r9025r1795q5814p9831n9401k0531J9603M3878
38610d14421N6662P2107Q7969Q5853N7377J8886k704O528L6598O0328N3550J6084
38598A34817k9609o6996j06070j62186k17954k26200j59851m7834M8203Q7582
38588g46098P7201N4366N1876P4317R9232J01252P7048M3527J2778k0469o1823
38577b36793r8849j09621q3790k7897M2386J05789J39870J36846J12645Q7836
38567F8422O1959K0483l3388p0231o4103k1287K4935L9836O532o5516j41125j77204
38555c50687j52993q4706q581M7084P3541P6295O6337N1892L3128R206p222O225
38543b40481N2844R9077J00179M4583l5904r8530j21732j05800n7855J2055Q4809
$$ y = [148977, 121438, 52804, -41505, -140530, -232325, -318139, -397970, -457371, -477902, -458299, -414421, -357759, -285652, -197683, -111830, -54453, -35567, -38271, -31743, 4855, 65183, 118733, 134817, 105208, 38212, -67858, -230044, -447998, -674198, -834049, -881883, -833680, -746098, -668897, -614531, -562655, -488338, -389106, -287854, -210806, -167279, -154501, -174970, -236793, -335642, -445263, -529053, -556950, -514564, -408775, -268905, -132059, -19414, 68422, 130381, 150864, 117476, 47245, -16858, -38145, -13210, 26626, 33158, -32358, -173483, -350687, -503680, -588386, -596967, -549883, -476342, -400047, -333710, -281818, -248690, -239484, -246706, -240481, -187637, -88560, 11619, 56202, 20298, -78232, -199964, -305764, -363619, -351564, -266755]
38532b66755J34164J41636J11028O7073L4912J6185j2087o8503j37890j78378
38522a58615j60085r1079l887P4862J35339J72760J77494J41535P2581j145m4924
38511C14836m4810k3687k1379n0643p8981o4745p162N3133Q2412Q5552Q3758P9487
38499D07771O0905L1429J2243J2455J3342r656n8796j13670j49602j49678j08952
38488e2209m0869K2018M6224K3565k1160m9664l9518k25L6386M6227L6899L6664
38476D4338N6386P1545N1254j633n1652o8044m7460j988N6893J15520J53864J57023
38464E36046J27097P8190K5717j4948k9250j4425J2684K6696J2773k5694p0379
38453F64507r4308p6302k2596L0563M9323L6654K3427K7023L4209K8865K0226
$$ y = [-266755, -132591, 9045, 120073, 187146, 222058, 238243, 226156, 157653, 19763, -158615, -318700, -409779, -413666, -338804, -203465, -30705, 146789, 288324, 360905, 359760, 314836, 270026, 246339, 224960, 174317, 95336, 30591, 23429, 76562, 158974, 244526, 328284, 407771, 468676, 500105, 512348, 524803, 538145, 528489, 469693, 356023, 206421, 56743, -52209, -93078, -71060, -24836, -1271, -22431, -72095, -111613, -111838, -75452, -29225, 7674, 44338, 100724, 172269, 223523, 221890, 170238, 102194, 54734, 52746, 109639, 225159, 379023, 536046, 663143, 741333, 767050, 752102, 722852, 708427, 721111, 747807, 760580, 734886, 664507, 570199, 493897, 471301, 501864, 551187, 587841, 611268, 638291, 672500, 701365, 721591]
38442G21591K9569N5555O7923L8910k6573r5407j35763j37947j10533o6259j7867
38431C23199J7634K3614q51l6479o2867q0061j03506j38137j66946j69882j47571
38420e41853j18469r4527o8673l1383N581J2424k6987r2133j41908j51847j28068
38409a377843q6766l3799K8114Q2588J04797Q5656M5493K2241M4815J09569J76124
38398g99011J93576J43258N7515r130k7197r001J4288K3473K3169L2246O1895
38387b94919R9063J17976J13944J13420J35860J56075J27259M0177o1302j24951
38377D22602j31281r1086k9207K0805L2090J1490n985k565J575j3581l3533l6008
38365A45316k9766l4131l3843O462Q2234J38928J32984P7861J7878k2983n2931
$$ y = [721591, 751160, 806715, 874638, 913548, 886975, 791568, 655805, 517858, 407325, 341066, 323199, 340833, 364447, 363596, 327117, 264250, 184189, 80683, -57454, -224400, -394282, -541853, -660322, -754849, -823522, -854905, -849324, -836900, -863887, -956020, -1097928, -1249775, -1377843, -1464609, -1498408, -1470294, -1387706, -1282909, -1197253, -1151760, -1129519, -1084704, -975135, -799011, -605435, -462177, -404662, -413792, -440989, -449990, -435702, -412229, -389060, -356814, -294919, -195856, -77880, 36064, 149484, 285344, 441419, 568678, 608855, 547553, 422602, 291321, 200235, 171028, 191833, 223923, 235413, 229428, 226863, 228438, 214857, 181324, 145316, 115550, 81419, 47576, 54038, 136272, 275200, 408184, 486045, 503923, 480940, 428009]
38354D28009q8810j34340j73299j77630j32780o0750o503N186j0238k2828j9163
38343c93146j445K8370P0145J18781J64578J94606J91622J45001O9544n22m5924
38332E41610p8772j15117j44964j43499j01877l4089L5931Q0189P3264J5961n1199
38321G7438p8328n2854n362K6233K4034j1614o8088j19626j37744j13300o3671
38310e22882j6925O449K282j4434j8883j566J9555K6311L3733P4594J50180K19108
38298d2478K41254K13750J58106R4451M0227J3263J7015L3372M3447M4590L6248
38287H93245M954n8382j36231j97242k25435k23596j97324j52559j01527n3528
38277d47625n221M3442P1247N5269N404m2492o8232q0585q7104p5333l4677K2073
$$ y = [428009, 339199, 204859, 31560, -146070, -278850, -339600, -346103, -340917, -351155, -373983, -393146, -394591, -366221, -296076, -177295, -12717, 181889, 373511, 518512, 588056, 587534, 541610, 462838, 347721, 202757, 59258, -42619, -76708, -40777, 39412, 112676, 128637, 77438, -890, -53744, -59106, -32873, -8839, -20453, -88541, -208167, -345911, -459211, -522882, -539807, -533358, -531076, -545510, -564393, -565959, -546404, -520093, -486360, -411766, -261586, -42478, 198776, 412526, 570632, 665083, 705310, 718573, 735588, 768960, 812407, 856997, 893245, 898199, 839817, 703586, 506344, 280909, 57313, -140011, -292570, -394097, -447625, -452846, -409404, -338157, -282888, -277484, -319976, -388208, -468793, -555897, -631230, -665907, -643834]
38265f43834P2981J11090J43377J74945K02732K16224J98585J39558N6252j1008
38255F60902l6254l3466l3501m3770m4641k1003J7322M6674N0165K6980q660l5130
38243E45618l7068j5512J6743M8019P3319R1519J03552J11501J13710J02743P4399
38232A228543L6862L397k3653n2845q4538j00079p9667l1658M095q760o3119j11269
38220G17309j14142q1921n5701n4849o1238n7431n6472p6967j05356j08026p6296
38209a31090l5732q483J1521L7208O1130O5179M8032K8174K2861L4514N4301O7270
38197B54885N4355K794p6798j48432j74849j47416r1408m1386j3143p12L985k072
38185c80197k2503m5056m6352j4718L7545Q5898J12321J12267R2004O5348M7307
$$ y = [-643834, -570853, -459763, -316386, -141441, 61291, 277515, 476100, 615658, 671910, 660902, 624648, 591182, 557681, 513911, 469270, 448267, 465589, 512263, 562428, 589408, 580748, 545618, 508550, 493038, 509781, 557800, 631119, 722638, 826190, 937691, 1051401, 1154144, 1228543, 1265405, 1268802, 1245149, 1192304, 1107766, 1007687, 928020, 896362, 900457, 891697, 828578, 717309, 603167, 521246, 465545, 410696, 349458, 292027, 235555, 158588, 53232, -54794, -131090, -166822, -175305, -163784, -126576, -65446, -267, 47765, 75939, 98800, 133314, 187615, 254885, 309240, 312034, 235236, 86804, -88045, -235461, -326869, -368255, -381398, -382110, -378125, -380197, -402700, -447756, -494108, -508826, -471281, -385383, -273062, -160795, -68791, -3443, 43864]
38174D3864M1348L2272o70n8801j14986j34764j07850n6316j1260J4194K5748
38163c27221K8484J8707k341j7893q720K6827P2753J11300J31224J25956R7032
38152B56108O0206L5214K3824O806l1464q1943j19220j24133r3939l9588J7750
38141i0379N4819O4652O6155Q3638J14642J28682J03083N0869M421k2562m4710
38130E13310p6499j06626j09535p7808l4344j2102k6770o8074j10676j32704j30735
38119c72563j19124j08498q4702k0596Q5545J94983K61846K72219K39410J74396
38109E22916Q4108o202n8798o3349n2171o2259r5062j25415j36570j30122j10909
38098b33833q1356m9233k5372j1682n43J5731M5073J00929J89466K86167L39950
$$ y = [43864, 85212, 117484, 116814, 58013, -56973, -191737, -299587, -355903, -367163, -352969, -327221, -298737, -280030, -282371, -300264, -308984, -282157, -209404, -98104, 33120, 159076, 256108, 316314, 351528, 375352, 382158, 350694, 268751, 149531, 25398, -68541, -108129, -90379, -35560, 29092, 95247, 178885, 293527, 422209, 525292, 576161, 580582, 558020, 513310, 436811, 330185, 220650, 142842, 108498, 96396, 69626, 1552, -109124, -241828, -372563, -491687, -600185, -684887, -705483, -619938, -424955, -163109, 109110, 348520, 522916, 607024, 600822, 542024, 478675, 426504, 364245, 269183, 143768, 7198, -122924, -233833, -315189, -364422, -389794, -401476, -402019, -386288, -341215, -240286, -50820, 235347, 575297]
38087E75297L14123K21606J13449L4081q328l0957m5559m5776k4585M241J2102
38076A119694j6431o9419j23345j63575j84577j82396j60685j38513j36238j51368
38066b06853j59086j39606r7544n3310k3371r458K627L5841J02437J83958K36650
38055a27715K25007J51217N2293k7210o1713n6053l8550l7258n5326p0116n8487
38044a03911j9262L0423P3178J00286J10261J08681J06528J08153J00787O7020
38034F82144J2197l0639l3683q756K239k7059q0859j24028j40613j38586j23818
38023a1461q7792k5775M5905R8807J11227P5555J619p6883j13784q7868k5044
38012i5494L1810O9467J02908J33669J38135J04862N7480K2406q642o1248j31890
$$ y = [575297, 889420, 1111026, 1224475, 1258556, 1250228, 1219271, 1173712, 1127936, 1103351, 1107592, 1119694, 1103263, 1033844, 910499, 746924, 562347, 379951, 219266, 80753, -55485, -206853, -365939, -505545, -603089, -656399, -679770, -689228, -686601, -650760, -548323, -364365, -127715, 97292, 248509, 300802, 273592, 211879, 155826, 117276, 80018, 24692, -45424, -103911, -123173, -92750, -19572, 80714, 190975, 299656, 406184, 514337, 615124, 682144, 694341, 663702, 630019, 621263, 623502, 596443, 515584, 391556, 250943, 112357, -11461, -99253, -125028, -79123, 19684, 130911, 206466, 208085, 131202, 17418, -70450, -95494, -63684, 5783, 108691, 242360, 380495, 485357, 542837, 565243, 556601, 495353, 363463]
38001C63463j81922j80060j35076q2054m7442l3313k8129k4819k7312m0605n6272
37990d73541n3306j8228L7304Q3366R6926Q0293N8009N6769Q3647J20573J42348
37979B14160J39839J20522Q9450M4226o228l4291k0580J9298M9811N3299L9231
37968G08737K0102m492l8129p7040j13527j38306j37596j03167n1608j8960k4436
37957B1578m8177n4925l1612Q891N1921R1724J19967J21420Q9328L6919j3663
37946C93371n0339p4656q9791r1358p2326l5419K671K3387K4025J9717K3906K9742
37934A02930J7422j9748o3668q9320q9305p5407n9669m2109j8316Q196K7025L2116
37922b69853K7379K1377J9358K0014J7196N644j1085j8729l602L2068O9563R0139
$$ y = [363463, 181541, 1481, -133595, -215649, -263091, -296404, -324533, -349352, -376664, -417269, -473541, -526847, -545075, -507771, -424405, -327479, -247186, -189177, -132408, -48761, 71812, 214160, 353999, 474521, 563971, 608197, 601969, 567678, 547098, 566396, 616207, 669506, 708737, 728839, 724347, 686218, 609178, 495651, 357345, 219749, 116582, 64974, 46014, 21578, -26599, -81524, -113136, -104245, -52324, 39400, 159367, 280787, 370115, 407034, 393371, 343032, 268376, 178585, 87227, 14901, -20518, -17847, 5540, 29565, 49282, 73188, 102930, 120352, 100604, 36936, -52384, -141689, -217096, -276765, -318874, -337190, -328994, -301969, -269853, -242474, -221097, -201739, -181725, -164529, -158885, -169970, -188699, -192301, -160233, -90670, -531]
37910e31Q8256O8244L6429L256j3593%L9308Q3220J12371J18764R9723N4923n274
37897F85096n9346r3332j15628j42545j70393j73700j36715p9842m6132o0025
37887c92562j02559j29536j14180p1521m0187m0893n5215m6145M088Q0107J52578
37876g56025K01191K16307J89670J18039J7370p7612j35910j50548j34344j01340
37866f13202n8697j3111K4904M7325N5578N8712O5679P8529R0479R2239Q4049
37855h7516P8531Q4619R1321P9457N2169M0094O5910J11993J35140J09282M3280
37844H04280l8121j14683j70302j89269j66039j15389o4803l5070k8039k9474
37834a46909k2056O05K9729N1391N9311N4737L7302M907l5399o4831o7277m3587
$$ y = [-531, 87725, 155969, 192398, 195654, 182061, 182061, 221369, 304589, 416960, 535724, 635447, 690370, 685096, 625750, 532418, 416790, 274245, 103852, -69848, -206563, -286405, -332537, -392562, -495121, -624657, -738837, -810358, -850545, -891438, -946653, -992798, -988710, -908603, -756025, -554834, -338527, -148857, -30818, -13448, -91060, -226970, -377518, -511862, -613202, -671899, -685010, -660106, -612781, -557203, -498491, -432812, -354283, -263804, -171565, -87516, -8985, 75634, 166955, 246412, 298581, 338675, 404585, 516578, 651718, 761000, 804280, 766159, 651476, 481174, 291905, 125866, 10477, -54326, -89396, -117435, -146909, -168965, -168360, -138631, -87240, -27929, 26808, 64110, 69017, 33618, -31213, -98490, -142077]
37822a42077q683K3054M8340P4793J10680J50107J69296J47281R4038M8390L9353
37811G54572N5013N8519L1773o253k4864j7202o610k0092n8235r3389j00211q5913
37799D87108q2220j04194j25787j05291l1399O3812J34684J56418J33336Q6673
37789F13140M0130J0367L807K0618N9294J12788J62070J83081J66370J27158R1883
37778A590706P5375P2343O7910N2223K4771j0996n2090r3535j26006j42430j46980
37767A311291j50620j55325j49840j25763r0345n5870k3784Q895L2519L0840P090
37756F39088j0261L748M3889Q3327J02216J01836R6850J00627J13112J16375Q7199
37745A478006K2687m9425r4133j01513q9031p4895o0378m0109j8178n394n473
$$ y = [-142077, -150760, -127706, -79366, -4573, 106107, 256214, 425510, 572791, 666829, 715219, 754572, 809585, 868104, 899877, 893624, 868760, 851558, 844948, 824856, 766621, 673232, 573021, 487108, 404888, 300694, 174907, 69616, 38217, 102029, 236713, 393131, 526467, 613140, 653270, 663637, 667444, 688062, 747356, 860144, 1022214, 1205295, 1371665, 1498823, 1590706, 1666081, 1738424, 1806334, 1858557, 1883328, 1872332, 1820242, 1726707, 1600701, 1458271, 1311291, 1160671, 1005346, 855506, 729743, 639398, 583528, 559744, 568639, 601158, 631998, 639088, 628827, 632575, 676464, 759791, 862007, 963843, 1060693, 1161320, 1274432, 1390807, 1478006, 1500693, 1451268, 1357135, 1255622, 1166591, 1091696, 1031318, 991209, 973031, 967637, 962164]
37734I62164j1933j7681k1696k5936l0880l6197m1813m5321m1327k7909j2823
37723F48648q465j9361l8013n3708o0842n7187m0883j4810J0926K8074L8854M8507
37711D81740N3290M6607L5958M0182O4371Q7397Q1637L9403k4431q7628j31755
37700F86771j47068j37695j18903j00074p2443k1772M8504J14522J51441J50002
37690E53285J18101P6048M8093M5765N5492N1335K3825j0838l3071m2559n2687
37679H32789o9031q1865p8345n6536k8203j1754k1540n9153j11624j56541j69624
37668a1427j33345m7658O3756J62536K17069K17849J75342J08823L8907j5549
37658G76303m1223l4085r3M6835Q9275J13608J14826R1998M0704m2572j45233
$$ y = [962164, 950231, 932550, 910854, 884918, 854038, 817841, 776028, 730707, 689380, 661471, 648648, 640183, 620822, 582809, 529101, 468259, 411072, 370189, 355379, 366305, 394379, 433233, 481740, 535030, 581637, 617595, 657777, 722148, 809545, 891182, 930585, 906154, 818526, 686771, 539703, 402008, 283105, 183031, 110588, 88816, 137320, 251842, 403283, 553285, 671386, 747434, 795527, 841292, 896784, 948119, 971944, 961106, 928035, 885476, 832789, 763758, 681893, 603548, 547012, 518809, 507055, 485515, 426362, 314738, 158197, -11427, -144772, -192430, -128674, 33862, 250931, 468780, 644122, 752945, 791852, 776303, 735080, 700995, 700902, 747737, 837012, 950620, 1065446, 1157444, 1198148, 1155576, 1010343]
37647A010343k34172k74349k52836j83934r4970j1195N0100Q0942Q4269P2660
37637B46858O0653N4459M8475L4361J4515K259N107J3618J4969J2881K0170L1189
37625E59514J9849k3808o8194o8838j9279M0855O8514N5447K2739q612l3282n5248
37613D89657p5450q6752p9581n3923k4219o703j002R156L3530N9106O1522L0791
37601C56132j7667n5995o5922n0978l0083j7231n234K7416Q9736J60727K04550
37590E95451K04103J75131J45508J26118J07878Q4073O4963O4598P9630R0442
37580A737895Q1978N4276J1764m5742j13391j71350j97258j87818j59209j26976
37570H84169r5176o5900m6893m1428l7319j6452K3593O2589P5021N4438K1230
$$ y = [1010343, 776171, 501822, 248986, 65052, -29918, -41113, 8987, 89929, 174198, 246858, 307511, 361970, 410445, 444806, 459321, 461580, 466687, 480305, 495274, 508155, 528325, 559514, 579363, 555555, 487361, 418523, 399244, 440099, 508613, 564060, 586799, 578187, 544905, 489657, 414207, 327455, 247874, 193951, 169732, 163029, 162027, 171183, 204713, 263819, 325341, 356132, 338465, 282470, 216548, 165570, 135487, 118256, 113022, 140438, 230174, 390901, 595451, 799554, 974685, 1120193, 1246311, 1354189, 1438262, 1503225, 1567823, 1647453, 1737895, 1819873, 1874149, 1885913, 1840171, 1726780, 1555430, 1358172, 1170354, 1011145, 884169, 788993, 723093, 676200, 634772, 597453, 581001, 604594, 667183, 742204, 796642, 817872]
37559H17872N773K1053N0043O1227L7816q341n0351p1407p6521q1324r0087q6785
37547E28968n3207K560M4455M4978J9701J3730N3138J19972J76511K01193J94929
37536A346928J65658J20964P1486K8519l739k7479m3326m8788m4106l4784k8991
37525A502342l5405n9245r3187j14927j03792o2674j7888M428l414l6124q9152
37514H90962j58084k26655k64936k47069j73338p3738J2778O5022Q7925R8695
37504A1562J09917J25506J43830J57140J52174J21044P2085K2156k3583p5814
37494H16017j39739j95898k11199j69713q8378k934N7135Q0979P3350M7662K0826
37483B88108P040J0761K5409M0141M7603M5400L3077J0575k0415n4481q1460q9357
$$ y = [817872, 823645, 844698, 894741, 955968, 993784, 985443, 935092, 863685, 787164, 705840, 615753, 528968, 475761, 478321, 522776, 567754, 587455, 601185, 654323, 774295, 950806, 1151999, 1346928, 1512586, 1633550, 1705036, 1733555, 1729816, 1702337, 1659011, 1610223, 1566117, 1531333, 1502342, 1466937, 1407692, 1314505, 1199578, 1095786, 1033112, 1015224, 1019652, 1016238, 980114, 890962, 732878, 506223, 241287, -5782, -179120, -252858, -240080, -175058, -87133, 11562, 121479, 246985, 390815, 547955, 700129, 821173, 893258, 915414, 891831, 816017, 676278, 480380, 269181, 99468, 11090, 8156, 65291, 146270, 219620, 267282, 288108, 295148, 305909, 331318, 371459, 419062, 464462, 497539, 508114, 487699, 433218, 351758, 262401]
37471B62401p4532n1756m6883p0697j01873j04323o2326O615P1256J09959J16637
37460E4478R7384O6468L5385M51m7891r6760j05742m6384N7353J41623J55843
37449C12208R7711M512p4802j03557p5783k0671K1667L6085L7874M1249L6101
37438C12594N675m2198p5666p0546l3112R502L5549M4032N0037P0305J12368J70775
37426E89315K26843K53984K34790J80747J28465J05797J03573Q9703M8550m994
37416A956773m9617q2005j13451j53960k04372k52484k70927k32833j42535m2536
37406D12053K3289M9209N9941P0483P0301M6844O703l5079p4845j17351j57555
37395C53993j77594j65364j29894r2813o6154m4105j8339M641Q916r535l5380
$$ y = [262401, 187869, 136113, 89230, 18533, -83340, -187663, -249989, -243374, -172118, -62159, 54478, 151862, 218330, 253715, 254166, 206275, 109515, 3773, -42611, 14742, 156365, 312208, 409919, 414431, 339629, 236072, 160289, 139618, 161285, 197370, 235244, 276493, 312594, 318269, 276071, 200405, 129859, 96747, 106249, 141798, 185830, 235867, 306172, 418540, 589315, 816158, 1070142, 1304932, 1485679, 1614144, 1719941, 1823514, 1913217, 1961767, 1956773, 1907156, 1825151, 1711700, 1557740, 1353368, 1100884, 829957, 597124, 454589, 412053, 435342, 484551, 544492, 614975, 685276, 732120, 738823, 703744, 628899, 511548, 353993, 176399, 11035, -118859, -211672, -277826, -321931, -340270, -335629, -326713, -336248, -371628]
37384c71628n0370m9971l9621k1787N401L9958P2976R1628Q2317L9014k1280n7553
37372b80916l6270L1185R3633J08969Q0265L8692K897l0638o2173p3479m7624
37361a75459N040N2496P1700O5480M9209L1673J6441J4489M0763R2857J41050
37350D05739J49593J10717N4988K5050L6928O6022P2005L8002j6763o2566q9375
37339G90340j04659j08801q8801l9889J9978O5632Q6061Q2451N4831M749n2013
37328G09879q9561r2586o6765k9296L053J7575Q947j5848m2765o5475q9957j20690
37316A26511j47511j51686j22833o6572J626O5573J13017J37166J37939J23261
37306B16491J08094J07870J27280J54557J70718J66825J50365J33699J19572J00974
$$ y = [-371628, -421998, -471969, -511590, -533377, -527976, -488018, -415042, -323414, -241097, -202083, -223363, -280916, -317186, -286001, -192368, -83399, -3134, 35558, 38455, 7817, -54356, -127835, -175459, -170419, -117923, -46223, 19257, 68466, 100139, 116580, 131069, 171832, 264689, 405739, 555332, 666049, 721037, 746087, 783015, 849037, 921042, 959044, 942281, 879715, 790340, 685681, 576880, 488079, 448190, 468168, 533800, 619861, 702312, 757143, 761892, 709879, 620318, 527732, 460967, 431671, 434724, 452299, 461246, 445398, 402633, 337158, 247201, 126511, -21000, -172686, -295519, -362091, -360465, -294892, -181875, -44709, 93230, 216491, 324585, 432455, 559735, 714292, 885010, 1051835, 1202200, 1335899, 1455471, 1556445]
37296A556445P3381M2744K0121J1362J5170K9814N5340Q4892R8572P5523J4603
37285B077967o2783j32062j80193j98817j75639j05949q583Q2610J44562J74488
37275A615601J76597J52883J09966O1961J8446k2361o1187q6669q7514p1660o1655
37264A744408o9569q5037r1305q6367q2372q7155r2953q4910n5906q603N3773
37253A054004J29051K04306K50766K43074J86042J15108O6526N0376N2483N4263
37243B405999M5659K5942K039j3610j0513J1230M1559P0490R5405J17884J36273
37232B928357J45443J45395J46690J60630J81185J82960J46030Q2889L3077K8135
37222D180791O6667J24976J83529K36518K82415L17567L41705L62307L87731M17487
$$ y = [1556445, 1629826, 1672570, 1692691, 1704053, 1719223, 1749037, 1804377, 1889269, 1987841, 2063364, 2077967, 2015184, 1883122, 1702929, 1504112, 1328473, 1222524, 1213941, 1296551, 1441113, 1615601, 1792198, 1945081, 2055047, 2117008, 2135454, 2113093, 2051906, 1965237, 1877723, 1806063, 1744408, 1674839, 1589802, 1498497, 1412130, 1329758, 1242603, 1149650, 1064740, 1008834, 1000231, 1054004, 1183055, 1387361, 1638127, 1881201, 2067243, 2182351, 2248877, 2299253, 2351736, 2405999, 2451658, 2477600, 2479639, 2466029, 2455516, 2466746, 2508305, 2578795, 2674200, 2792084, 2928357, 3073800, 3219195, 3365885, 3526515, 3707700, 3890660, 4036690, 4119579, 4152656, 4180791, 4247458, 4372434, 4555963, 4792481, 5074896, 5392463, 5734168, 6096475, 6484206, 6901693]
37212F901693M42769M57716M69630M96962N55290O43070P40488Q23046Q78095
37203A2408759R10343R32471R50412R58835R53856R49785R76715J054730J170452
37194B1266358J282066J347235J347276J293852J221828J170713J158338J167735
37186C1255401J166768J142019J105315J067156J017780R41917Q41104P30107
37178C9267567O17095M97398L63272K11146M1931j38447l22571n13324p26845
37169C9297222r71438j224740j444559j605830j717801j802131j864551j894594
37161B6771578j884151j835047j750864j633652j495029j364317j272967j222980
37153A4312571j174262j074846r11000p24964n79561n08103m99879n23499n51050
$$ y = [6901693, 7344462, 7802178, 8271808, 8768770, 9324060, 9967130, 10707618, 11530664, 12408759, 13319102, 14251573, 15201985, 16160820, 17114676, 18064461, 19041176, 20095906, 21266358, 22548424, 23895659, 25242935, 26536787, 27758615, 28929328, 30087666, 31255401, 32422169, 33564188, 34669503, 35736659, 36754439, 37696356, 38537460, 39267567, 39884662, 40382060, 40745332, 40956478, 40998409, 40859962, 40537391, 40024067, 39297222, 38325784, 37101044, 35656485, 34050655, 32332854, 30530723, 28666172, 26771578, 24887427, 23052380, 21301516, 19667864, 18172835, 16808518, 15535551, 14312571, 13138309, 12063463, 11152463, 10427499, 9847938, 9339835, 8839956, 8316457, 7765407]
37144G765407n62593n44989m98277m39687l93404l73355l74128l75504l56442
37135C847028l10363k50533j99336j70721j62359j61473j55004j37344j13922
37126B185973r5987q6704p4872m9274j6507N542J1480J3628K0961K6041K0465
37115A960746J2001J5409L3718N9833R0534J25152J53048J57539J35797J04203
37105B847980P9598O3207M6127K1512j3808o0709j11253j44664j38743q6856k556
37094B499835Q7495J51286J61438J12099K8310n0895j03201j32160j45958j38510
37084B469739r9459l5795K7297O6155P2465N1052J5074j5693k4120j1098M402
37073B520019P125J996J651L698o795l1702n0028m1956j5817j236j6389m9332
$$ y = [7765407, 7202814, 6657825, 6159548, 5719861, 5326457, 4953102, 4578974, 4203470, 3847028, 3536665, 3286132, 3086796, 2916075, 2753716, 2592243, 2437239, 2299895, 2185973, 2089986, 2003282, 1928410, 1879136, 1862629, 1868171, 1879651, 1893279, 1914240, 1940281, 1960746, 1972747, 1988156, 2021874, 2081707, 2172241, 2297393, 2450441, 2607980, 2743777, 2847980, 2927578, 2990785, 3036912, 3058424, 3044616, 2983907, 2872654, 2727990, 2589247, 2502391, 2499835, 2587330, 2738616, 2900054, 3012153, 3040463, 2989568, 2886367, 2754207, 2608249, 2469739, 2370280, 2334485, 2361782, 2427937, 2500402, 2551454, 2566528, 2550835, 2526715, 2515617, 2520019, 2527144, 2529140, 2530791, 2534489, 2527694, 2495992, 2445964, 2404008, 2388191, 2386955, 2370566, 2321234]
37061B321234p2023o5606l0536J8042N5623N5606Q696n7144q7497m7923L8566
37050B137038J08951J16925O6184j0420q8877j60950k14410k26905j87131j14976
37040A425429n3403l8374p3082j25700j52611j31648p9021l3926k5244n2261r3114
37029E67045j24645j33266j15438p6902l1895K746J7130J2615l764k7647n6993
37018B8986q2692q5728n3369m10L5075K6043j5779n2353n6390k9346J2440N5823
37006b17700R2237J13328J15105J03529R1136R0134J09010J47573J89505K06353
36996A040210J78387J11850L2560l4405p6004r0819q8533q7521j01218j23420
36986G61087j34391j24393j04617r2050r1177r6514j05738j19000j25769j04047
$$ y = [2321234, 2249211, 2183605, 2153069, 2171111, 2226734, 2282340, 2291036, 2233892, 2146395, 2098472, 2137038, 2245989, 2362914, 2429098, 2418678, 2329801, 2168851, 1954441, 1727536, 1540405, 1425429, 1372026, 1333652, 1260570, 1134870, 982259, 850611, 771590, 737664, 712420, 660159, 567045, 442400, 309134, 193696, 116794, 84899, 87645, 104775, 117390, 113626, 85979, 28986, -53706, -139434, -192803, -193213, -158138, -132095, -147874, -200227, -256617, -285963, -273523, -217700, -125463, -12135, 102970, 206499, 297635, 387769, 496779, 644352, 833857, 1040210, 1218597, 1330447, 1363007, 1328602, 1252598, 1161779, 1073246, 985725, 884507, 761087, 626696, 502303, 397686, 305636, 214459, 117945, 12207, -106793, -232562, -336609]
36976c36609m0846M8705J27777J64413J52304J10762P0382N6065P2493R8303R9221
36965F22970N6994j1719o8668q6004o2177j1537M8193R4347J00937N9124n879
36954G36581n2626o1857m7532k7631K041N3937J17960J61371J61428J27215Q6142
36943A257029N8644N0059N4920N7491L6223j4863o7881q0168m1072R727K1155
36932A341264j7307p2690j12191j33823j50498j59827j45222j03793n8141l2498
36922C55274k2677O95N6380J25283J64997J51500J02519N8920M7235O1207P3127
36911A174460N6745K592p9800j69653k44842k85306k72733k00325r1074L669M1010
36900f5257K4135p281k4625l4978n5065p8120q1661n9710l0082r388N225K4562
$$ y = [-336609, -377455, -328750, -200973, -36560, 115744, 226506, 296888, 352953, 425446, 523749, 622970, 679964, 668245, 599577, 513573, 451396, 439859, 488052, 582399, 683336, 742460, 736581, 683955, 622098, 574566, 546935, 548976, 602913, 720873, 882244, 1043672, 1170887, 1257029, 1315673, 1365732, 1420652, 1478143, 1514366, 1499503, 1431622, 1351454, 1310382, 1320109, 1341264, 1323957, 1251267, 1139076, 1005253, 854755, 694928, 549706, 445913, 387772, 355274, 332597, 333292, 389672, 514955, 679952, 831452, 933971, 992891, 1040126, 1101333, 1174460, 1231205, 1233797, 1153997, 984344, 739502, 454196, 181463, -18862, -109936, -106267, -65257, -41122, -48403, -73028, -108006, -163071, -241191, -322852, -382562, -412644, -422032, -416807, -392245]
36888c92245M8188O6170P6022Q7459J06112J18634J03686O0391J7646N927K1957
36877C19947L1174P199l9476p5387p8477n3531k1122K98M992R68Q30Q290J6131
36864A21836K0333L0933O2002J12463J61518J81769J55212Q3325j0828r4367j47635
36853F76561j76150j94527k00763j73737r6447K3435J54993K60054L09243K91498
36843H74160K14318R6850l5240j50328k18331k29128k01331j64204j31551r9094
36833d3879o2890k9313p171L17n426j8744k7880k0711M984M0820P5114R5034Q7915
36820H8170N3942J5831N31Q219J2845l271k9882m9049n8894o6653p1115o5766
36808a65092n1713l5238j8110j162P698J04k1002m4284o0587o3819m9313k2315
$$ y = [-392245, -344057, -277887, -201865, -114406, -8294, 110340, 214026, 274417, 292063, 297990, 319947, 351121, 358320, 318844, 243457, 164980, 111449, 90327, 90625, 95617, 96585, 97415, 105705, 121836, 142169, 173102, 235104, 347567, 509085, 690854, 846066, 929391, 918563, 824196, 676561, 500411, 305884, 105121, -68616, -165063, -141628, 13365, 273419, 582662, 874160, 1088478, 1185328, 1150088, 999760, 781429, 552301, 350970, 186766, 55215, -43879, -106769, -136082, -143253, -142936, -148362, -167106, -194986, -215697, -210713, -169893, -94779, 255, 88170, 142112, 157943, 158474, 166693, 179538, 176267, 146385, 97336, 38442, -28211, -99326, -165092, -216805, -252043, -270153, -271315, -263617, -263513, -284515, -328799, -389386, -453205, -502518, -524833]
36796e24833j280J112l739N234K8742M6690M6846L7218K7176J4540P43L075L4897
36783b83579P9080R6980O7306Q345m0956n6366m1667j1789K7827P9069J31726
36772E5976J57939J35602P5663J8068k681J3572L6094L1676p979o0255r1798q8808
36760B73069o7603n3404n3862o0291o8238q1555r5552r3465o8878l9677k7359
36749d36815k9882k7881j3214L494J4661L0541O3759J05902J28914J10442N4468
36738D389j2995o5249q9804q4445m6784K1895J01036J51248J43653Q7837K0951
36727B31732l0602o7228r2620r2065m9898J9224P5527R3182Q0150N5431K3396
36716B46229j7245n2426o1828m7738l6179m3748n7698n6398l6539r106J9683M7166
$$ y = [-524833, -526113, -525001, -528740, -523506, -494764, -448074, -401228, -364010, -336834, -322294, -321551, -318476, -283579, -204499, -107519, -40213, -31868, -72824, -129190, -170857, -182646, -154819, -75750, 55976, 213915, 349517, 425180, 443248, 440567, 454139, 490233, 521909, 513930, 453675, 361877, 273069, 205466, 152062, 98200, 37909, -30329, -111884, -207436, -300901, -369779, -409456, -436815, -466697, -494578, -507792, -504298, -489637, -459096, -395337, -289435, -160521, -50079, 4389, -8606, -73855, -163659, -248104, -294888, -272993, -171957, -20709, 122944, 210781, 231732, 201130, 133902, 41282, -50783, -100681, -81457, -5930, 87252, 167402, 222833, 246229, 228984, 176558, 114730, 66992, 30813, -12935, -70633, -127031, -163570, -172676, -152993, -105827]
36704a05827O1426N1111L0479L5076Q1572J43747J79932J75542J45818J04028
36694I02904M6170k9455j03507j47712j50136j21359q0810m4519k1032q218M999
36683B47325K2649K6538q667p7004j30263j21457n6316J2329M0977L2680J7607
36672F398J5152K5317M2641O0966O9248N8419L3746J1095J803R589L7950Q5690
36660D58014J33467J50038J20811O3210Q744k3326l1770k4648j4130j2339k1193
36649H06878k8848k3751r113L542J0119J2795O518j8479n6068p8023n8947l666
36637E62957N7759R9942J19295J22449J09363P6860L3953R75j1112j1964j4075
36626A146402r552K1927P9548J27649J25478O8064p421n3032m4987L960N5131
$$ y = [-105827, -44401, 6710, 37189, 72265, 153837, 297584, 477516, 653058, 798876, 902904, 949074, 919619, 816112, 668400, 518264, 396905, 316095, 271576, 250544, 242326, 247325, 269974, 296512, 287845, 210841, 80578, -40879, -97195, -84866, -43889, -11209, 6398, 21550, 46867, 89508, 150474, 219722, 278141, 311887, 322982, 324785, 334374, 372324, 458014, 591481, 741519, 862330, 925540, 934284, 910958, 879188, 854540, 840410, 828071, 806878, 778030, 754279, 745166, 748708, 758827, 771622, 778140, 759661, 703593, 625570, 566623, 562957, 620716, 720658, 839953, 962402, 1071765, 1148625, 1182578, 1183553, 1172441, 1160477, 1146402, 1136850, 1158777, 1238325, 1365974, 1491452, 1559516, 1552095, 1499063, 1454076, 1458036, 1513167]
36615A513167O8410K9391l9405r6398j13611r3061n5987k4141j1292k1769m8845
36604A106459p8368j00134j13215j16300r9908n8924r673K0253K3679K2990L9134
36593F35993O2139O5526M3080J4537l899j6327k9902l8783l6238k8368k1388p071
36581F39299K0728M3470L5612M918q754J7565O2709R4788J12270J31526J45630
36570A299761J22177M5913n4075j28425j51404j37184j19799j20953j32136j24325
36560D99550p8334p766N0720P1015N8769L9311K9019K0884m365n5084j14992j51218
36548C57509j38203p7669K029O5884R5933J01890J10257J37940J73201J85863
36538A014634J58848J05463N3218J7530k311q109M131L5357P5795J08081J14220
$$ y = [1513167, 1581577, 1610968, 1571563, 1475165, 1361554, 1268493, 1212506, 1188365, 1177073, 1155304, 1106459, 1028091, 927957, 814742, 698442, 598534, 539610, 529937, 550190, 573869, 596859, 635993, 698132, 763658, 806738, 821275, 817376, 801049, 771147, 732364, 696126, 667758, 646370, 639299, 660027, 703497, 739109, 744027, 735273, 752838, 815547, 910335, 1022605, 1154131, 1299761, 1421938, 1467851, 1413776, 1285351, 1133947, 996763, 876964, 756011, 623875, 499550, 421216, 413450, 464170, 535185, 593954, 633265, 662284, 683168, 678803, 623719, 508727, 357509, 219306, 141637, 143666, 209550, 305483, 407373, 517630, 655570, 828771, 1014634, 1173482, 1278945, 1332163, 1349693, 1347382, 1339273, 1343404, 1378761, 1454556, 1562637, 1676857]
36527A676857Q2701J7857n7254j15347j43735j42631j08682l6818N5601J23643
36517A352192J31917R1758M5129J2629k4015q1221j34183j38156q4714j7486J3723
36506A167573Q17k8343n0208o4706q0550r9889j20707j40770j53647j50854j32389
36495A46327j04957o6465p100O6131J22552J41399J39250J42941J43494J03924
36485H27496J5679p6716j18152r4913l5814K3199O3835Q6883J03148J18588J21074
36474A034307Q9695K5019l9668o8484n6553k2241K3685Q0619J31287J35693O6672
36463A400031n4980j70667k29027k19353j66945j04254m8517k175L3265N0343
36453D87721M2233J0562l5580q4338j22772j39634j31580j04097o4212j8263J9378
$$ y = [1676857, 1759558, 1777415, 1720161, 1604814, 1461079, 1318448, 1209766, 1172948, 1228549, 1352192, 1484109, 1575867, 1620996, 1633625, 1609610, 1528389, 1394206, 1256050, 1171336, 1153850, 1167573, 1168390, 1140047, 1089839, 1025133, 944583, 844694, 723987, 583217, 429570, 278716, 146327, 41370, -25095, -32195, 33936, 156488, 297887, 437137, 580078, 723572, 827496, 843175, 766459, 648307, 553394, 517580, 540779, 604614, 691497, 794645, 913233, 1034307, 1124002, 1149021, 1109353, 1040869, 984316, 962075, 985760, 1066379, 1197666, 1333359, 1400031, 1345051, 1174384, 945357, 726004, 559059, 454805, 406288, 404113, 437378, 487721, 529954, 540516, 504936, 420598, 297826, 158192, 26612, -77485, -141697, -159960, -140582]
36442a40582K5107j3736p8869j31487j44586j19609p4242k5081J6083M1662N3819
36431e91521O6044R0756J25036J52231J56958J36193R8166N5679K1157K818J5
36420C13532K159k571j3501j5611K603L0655M3651L0187L861j7811l5770o0163
36408B81221q6169r5116q0283n6590l7867j5098L2163J05936J78985K14547J96006
36397F37735J40706Q6993O3533O7105P1690N9438L7628K3913K3609K9081L5820
36386A277251M8264O9154R1356J03158R7278P3838M0176R718n473o783j1208l6163
36374A750566q1848j30582j61800j64994j41087r8787n2856k1116j6249l6689
36364H44558o4678p4364m6643J6947R2165J47695J67344J56990J29929R0916L9532
$$ y = [-140582, -115475, -129211, -208080, -339567, -484153, -603762, -678004, -703085, -687002, -645340, -591521, -525477, -434721, -309685, -157454, -496, 135697, 233863, 289542, 310699, 313517, 313532, 315691, 313120, 299619, 284008, 286611, 317266, 360917, 391104, 394965, 377154, 341384, 281221, 195052, 99936, 19653, -36937, -74804, -89902, -57739, 48197, 227182, 441729, 637735, 778441, 865434, 928967, 996072, 1067762, 1127200, 1164828, 1188741, 1212350, 1241431, 1277251, 1325515, 1394669, 1486025, 1589183, 1686461, 1760299, 1800475, 1810193, 1804720, 1797937, 1786729, 1750566, 1668718, 1538136, 1376336, 1211342, 1070255, 971468, 918612, 897496, 881247, 844558, 779880, 705516, 658873, 675820, 767985, 915680, 1083024, 1240014, 1369943, 1460859, 1500391]
36353A500391j5197n3924o4393n4117m0121k7385k163N0451J21993J76027J73785
36342A765347J09925K2533l6487m2784j2155K2963M3269N1246N9275P3498Q5988
36331B142618Q0705M9512K178m2476p3381q9937r1225p2946l7285K569L0794L6238
36319A937364J3853k7940o0035n0970l556L9793M1370Q301k3438l3149k5838p170
36307A808585K8406Q1883J38357J75742J76091J33431O6705K0282K6596O1922
36297B718000O1316j0126j16885j94441k13302j87157j36836p3988j5292J5502
36287A846791J0218j2452k6114j9245M839M0076Q0639J15822J31010J18049Q4785
36276B374418N2276L8408M1401M1638K2332j3822n0167p3413q0998p5942o2344
$$ y = [1500391, 1485194, 1431270, 1366877, 1312760, 1272639, 1245254, 1243091, 1293542, 1415535, 1591562, 1765347, 1875272, 1897805, 1861318, 1818534, 1806379, 1829342, 1872611, 1923857, 1983132, 2056630, 2142618, 2223323, 2272835, 2275013, 2232537, 2159156, 2069219, 1977994, 1905048, 1867763, 1870332, 1901126, 1937364, 1951217, 1923277, 1863242, 1812272, 1808716, 1848509, 1889879, 1898180, 1874742, 1841593, 1815755, 1808585, 1836991, 1918874, 2057231, 2232973, 2409064, 2542495, 2609200, 2629482, 2656078, 2718000, 2779316, 2769190, 2652305, 2457864, 2244562, 2057405, 1920569, 1846581, 1831289, 1846791, 1857009, 1844557, 1818443, 1799198, 1804037, 1844113, 1924752, 2040574, 2171584, 2289633, 2374418, 2426694, 2465102, 2506503, 2548141, 2570473, 2556651, 2506484, 2433071, 2352073, 2276131, 2213787]
36265B213787m5154k7374o572K0274M7438O1850N7193M3435L9136N4998Q5417
36254B544428J13807J24654J12469Q2819M7485J9244Q116J6631L5744M9095M6707
36243C201199L4716K8539L6132N0018N5195M2346J3849j9064m3408n1695m5664
36232C302163l3275k0694o856J3096L8827O1011O9276O4314N9004O4627P7627
36221C689120Q3763P4882N7160M1290K9508J7615Q760J8376N9626J24099J82398
36210D386597K07994J98485J69282J29815P5727O666n8235r0773p5733j8767N9656
36199D990714J30975J69171J69943J56675J53545J53844J30263P8916L6818M6453
36189F217317J12025J97408K59371K77853K63399K43777K38673K42485K35328
$$ y = [2213787, 2168633, 2141259, 2134687, 2154961, 2202399, 2264249, 2321442, 2364877, 2404013, 2459011, 2544428, 2658235, 2782889, 2895358, 2978177, 3025662, 3044906, 3053022, 3069653, 3105397, 3154492, 3201199, 3235915, 3264454, 3300586, 3350604, 3405799, 3448145, 3461994, 3442930, 3399522, 3347827, 3302163, 3268888, 3248194, 3241338, 3254434, 3293261, 3354272, 3423548, 3487862, 3546866, 3611493, 3689120, 3772883, 3847765, 3904925, 3946215, 3975723, 3993338, 4002098, 4020474, 4080100, 4204199, 4386597, 4594591, 4793076, 4962358, 5092173, 5167900, 5174566, 5116331, 5025558, 4949825, 4931058, 4990714, 5121689, 5290860, 5460803, 5617478, 5771023, 5924867, 6055130, 6134046, 6170864, 6217317, 6329342, 6526750, 6786121, 7063974, 7327373, 7571150, 7809823, 8052308, 8287636]
36180H287636K09649J75436J39376R6577N0718K5708M3105R8386J71227K46812
36170I544630L12535L47883L41271L12325K95268K99279L03359K91194K72378
36161A2320122K65229K75662K98458L22874L29448K97670K30869J64980J39828
36152A4645140J63797K11971K52556K68113K57882K31973K05976J94741K04709
36143A6636858K28332K47153K48874K47854K80508L66292M75436N51472N69633
36134A9852412N59596N66607O06280O66908P39215Q24066R16122R98173J054800
36125B6784179J082989J089961J089477J099143J130846J182278J245996J326692
36117C6031561J437772J576475J714439J824603J913374K015506K157510K335117
$$ y = [8287636, 8497285, 8672721, 8812097, 8908674, 8959392, 8985100, 9028205, 9126591, 9297818, 9544630, 9857165, 10205048, 10546319, 10858644, 11153912, 11453191, 11756550, 12047744, 12320122, 12585351, 12861013, 13159471, 13482345, 13811793, 14109463, 14340332, 14505312, 14645140, 14808937, 15020908, 15273464, 15541577, 15799459, 16031432, 16237408, 16432149, 16636858, 16865190, 17112343, 17361217, 17609071, 17889579, 18255871, 18731307, 19282779, 19852412, 20412008, 20978615, 21584895, 22251803, 22991018, 23815084, 24731206, 25729379, 26784179, 27867168, 28957129, 30046606, 31145749, 32276595, 33458873, 34704869, 36031561, 37469333, 39045808, 40760247, 42584850, 44498224, 46513730, 48671240, 51006357]
36109E1006357K527738K724897K933974L172121L459035L807062M202307M601034
36101G8434525M968155N326476N748576O286008O919360P591070Q272102Q976112
36093A32522384R721546J0511012J1348196J2244010J3191750J4153832J5084125
36086B18776855J5948308J6713082J7332559J7757774J7942314J7819231J7282369
36079C39572492J6211274J4517261J2165325R175889N637412J721229k334788
36072C96666094o269441r836302j2833994j5144636j6759274j7751351j8215372
36065B99855724j8234707j7896371j7301902j6542036j5672168j4727813j3754606
36058A85726121j2804948j1906359j1048481j0208165r383748q603935p906777
$$ y = [51006357, 53534095, 56258992, 59192966, 62365087, 65824122, 69631184, 73833491, 78434525, 83402680, 88729156, 94477732, 100763740, 107683100, 115274170, 123546272, 132522384, 142243930, 152754942, 164103138, 176347148, 189538898, 203692730, 218776855, 234725163, 251438245, 268770804, 286528578, 304470892, 322290123, 339572492, 355783766, 370301027, 382466352, 391642241, 397279653, 399000882, 396666094, 390396653, 380560351, 367726357, 352581721, 335822447, 318071096, 299855724, 281621017, 263724646, 246422744, 229880708, 214208540, 199480727, 185726121, 172921173, 161014814, 149966333, 139758168, 130374420, 121770485, 113863708]
36051A13863708p309707o795381o324504n863721n404114m958252m545437m178932
36043F8483660l858967l572355l301488l037440k783511k546636k330688k139575
36035D4913000j979536j852775j753087j672406j606493j547680j477613j378667
36027C1644743j253667j126034j018724r40347q92412q76704q84558q86509q49916
36018B2915872p72678o90212o40582o25767o13560n75203n13250m51840m08675
36009A7624105l83174l66767l53631l37584l05524k43402j52025n4310J6860M0210
35999A5484758J6917l7580j08851j88176k64951l22461l48090l46752l37553l33932
35989A3213329l31089l16944k92244k73559k76849l03810l44384l84764m09854
$$ y = [113863708, 106554001, 99758620, 93434116, 87570395, 82166281, 77208029, 72662592, 68483660, 64624693, 61052338, 57750850, 54713410, 51929899, 49383263, 47052575, 44913000, 42933464, 41080689, 39327602, 37655196, 36048703, 34501023, 33023410, 31644743, 30391076, 29265042, 28246318, 27305971, 26413559, 25536855, 24652297, 23765788, 22915872, 22143194, 21452982, 20812400, 20186633, 19573073, 18997870, 18484620, 18032780, 17624105, 17240931, 16874164, 16520533, 16182949, 15877425, 15634023, 15481998, 15427688, 15444548, 15484758, 15501675, 15464095, 15355244, 15167068, 14902117, 14579656, 14231566, 13884814, 13547261, 13213329, 12882240, 12565296, 12273052, 11999493, 11722644, 11418834, 11074450, 10689686, 10279832]
35980A0279832m07314l78587l41607l13420k93559k74837k65687k83083l18846
35971G402892l32557k93700k20688j61447j39719j35623j16636p1200j0125M8636
35961E969833Q8519R8617P9506M2197q50l8457n6005m1437l355K6218J8288k5304
35949F157770p5542j06097j17789j36787j88480k65976l23629l12192k26843j14677
35939D289758l1485J829r1j3174j9795j1276P780J9258O931k7589o8694j00467
35927D052985j10966r4204o1632m4023o4160j07778j35054j21328p6169k6030
35917C211641O312O604k6163p1176r5166q0793m0999k425J8329K2305K4193M2741
35905C015403Q0643J08683Q5509M670q9180j42787j44434j20769r4637o4764k5200
$$ y = [10279832, 9872518, 9493931, 9152324, 8838904, 8545345, 8270508, 8004821, 7721738, 7402892, 7070335, 6776635, 6555947, 6394500, 6254781, 6119158, 6002522, 5931322, 5921197, 5969833, 6058352, 6156969, 6236475, 6278672, 6277822, 6239365, 6183360, 6141923, 6138568, 6164786, 6183074, 6157770, 6082228, 5976131, 5858342, 5721555, 5533075, 5267099, 4943470, 4631278, 4404435, 4289758, 4258273, 4260102, 4260011, 4246837, 4227042, 4215766, 4223546, 4242804, 4249735, 4222146, 4153452, 4052985, 3942019, 3847815, 3786183, 3742160, 3678000, 3570222, 3435168, 3313840, 3237671, 3211641, 3217953, 3224557, 3198394, 3127218, 3032052, 2951259, 2910260, 2907835, 2926164, 2948469, 2972662, 3015403, 3096046, 3204729, 3290238, 3294908, 3205728, 3062941, 2918507, 2797738, 2703101, 2638337, 2613137]
35894B613137J3322K8942Q693l9775r1295j18444j11216q3785n7664l9532k1973
35883B100410l604L494r116l1433m6268n1042n9229q0420j06976j23372j22381
35872A470063j06347p6594l0652K8030Q5136J25885J46442J49516J33207R4259
35862B018945M3082N436K254L0758O8254R0117Q1596L9916k5104r2918j42692
35851B119644j65618j65336j47353j13354o7362k1784Q988K1344K5093L1788M3005
35840A569055N2679N8352O3845O9305O4864M0234j898m7776q6310j14047j26268
35829A542035j11556o1472J6317R7519J53445J65854J36885Q7899M3380J0397
35819B080703k3798o9614j13588j25843r0312k3156M0849P7022Q3441O8727L5533
$$ y = [2613137, 2626459, 2655401, 2664094, 2624319, 2533024, 2414580, 2303364, 2219579, 2161915, 2122383, 2100410, 2096806, 2100300, 2091184, 2059751, 2013483, 1962441, 1903212, 1822792, 1715816, 1592444, 1470063, 1363716, 1287122, 1256470, 1284500, 1369636, 1495521, 1641963, 1791479, 1924686, 2018945, 2062027, 2067463, 2069717, 2100475, 2168729, 2258846, 2340442, 2380358, 2355254, 2262336, 2119644, 1954026, 1788690, 1641337, 1527983, 1460621, 1438837, 1447825, 1469169, 1494262, 1526050, 1569055, 1621734, 1680086, 1743931, 1813236, 1878100, 1918334, 1916436, 1868660, 1782350, 1668303, 1542035, 1430479, 1369007, 1385324, 1482843, 1636288, 1802142, 1939027, 2026926, 2070306, 2080703, 2056905, 1987291, 1873703, 1747860, 1657548, 1634392, 1675241, 1752263, 1835704, 1904431, 1939964]
35808A939964j7321p7919j16135j04825m7137K2459O6678P2766N2717K4072l366
35797A811953k5252l6897l5711k7568k4358l1013l6711k4355R075M5319O1542
35786A686024N3134L7773L7856N9279Q4451Q5525M9796n678m9963p0044p6911
35775A891242p5751m6801K6001J16169J68786J57005J06460N9118L1303J4924
35765B448456N82j6206l8705o1967o9810n4510l4782l9702p6848j27192j66999
35754A762317j82133j66482j25088q1048o2268p3184q9180q5034o1091l6422k4466
35743G75921k2969k3861k6928m3874q8458j57413k20693k38949j97126j18681
35733c63031m4474p76J1935P328k180j2070k3119l3058l1000n686L6881P0102
$$ y = [1939964, 1922643, 1844724, 1728589, 1623764, 1576627, 1599086, 1665764, 1738530, 1791247, 1815319, 1811953, 1786701, 1749804, 1714093, 1686525, 1662167, 1631154, 1594443, 1570088, 1579163, 1624482, 1686024, 1739158, 1776931, 1814787, 1874066, 1958517, 2044042, 2093838, 2088160, 2038197, 1968153, 1891242, 1815491, 1768690, 1794691, 1910860, 2079646, 2236651, 2343111, 2402229, 2433532, 2448456, 2449038, 2432832, 2394127, 2332160, 2262350, 2207840, 2173058, 2133356, 2056508, 1929316, 1762317, 1580184, 1413702, 1288614, 1207566, 1145298, 1072114, 982934, 897900, 836809, 800387, 775921, 752952, 729091, 702163, 658289, 569831, 412418, 191725, -47224, -244350, -363031, -407505, -408281, -396346, -389018, -391198, -403268, -426387, -459445, -490445, -496131, -459250, -389148]
35721c89148P0512M4944K5924L6876O8153R1918R4130Q2536O6736M5332J8820
35710B56733J884Q553L1302N1130O5933Q8569J12549J03778M4180l3353p8552
35699F52706q5350r3817j30104j71487j81431j56476j20553q8158n4421j4611
35689d43702K6832O5864J00647J22759J21751J01486P7492N3497J6236l6704p7468
35678A28690p2047j7931N5393J18091J56846J64993J39414R5998O9680Q1828J13971
35667A034926J25898R4517K5131o4941j54233k12358k12850j62706j05400q2126
35657B85858r6479j23011j37764j28034q4355o291Q0601J31880J21928P1005K6899
35646A42237J9292L5507M0552J6397k1865m6500m6333l1972j9060j6092k5799
$$ y = [-389148, -318636, -273692, -247768, -210892, -142739, -50821, 43309, 125845, 192581, 237913, 256733, 258617, 267170, 298472, 349602, 415535, 504104, 616653, 720431, 764611, 731258, 652706, 567356, 473539, 343435, 171948, -9483, -165959, -286512, -374670, -429091, -443702, -416870, -351006, -250359, -127600, -5849, 95637, 173129, 226626, 242862, 206158, 128690, 56643, 38712, 94105, 212196, 369042, 534035, 673449, 769447, 839127, 920955, 1034926, 1160824, 1255341, 1280472, 1215531, 1061298, 848940, 636090, 473384, 367984, 285858, 189379, 66368, -71396, -199430, -283785, -290076, -209475, -77595, 44333, 115338, 142237, 161529, 197036, 237588, 253985, 232120, 185620, 139287, 107315, 88255, 72163, 46364]
35635D6364m5068o0249n5404l3785k2275m4326r3072j38995j59119j50315j18602
35624h74846o6506O929R7326J85726K40094K36824J86445J28242R1965P4607O1214
35613C68020N1365M8491L8335L881m4064p7242r0131j03422j23085j23310q3718
35602a34880k2834K2380L7191L4623L1417L3850M1501N1680O1039O8578P4015
35591B98560P2342N9262M3792M1482M9719M5837K0259l850O15K6894M1411K1994
35579G18317k4031p1871r5099p7829k9572J4776K5710R083p015j0988j7620m1486
35567C92375p7714j11000j29469j28407j14651j08318j23812j44824j34195p6732
35557g56747l17N2421O2321L8182j750l9612n8541m9146j6223K6854O8577J02027
$$ y = [46364, 1296, -58953, -114357, -148142, -170417, -214743, -307815, -446810, -605929, -756244, -874846, -941352, -934423, -837097, -651371, -411277, -174453, 11992, 140234, 232199, 306806, 368020, 419385, 467876, 506211, 510092, 466028, 388786, 298655, 195233, 72148, -51162, -134880, -157714, -135334, -98143, -63520, -32103, 1747, 43248, 94928, 155967, 224545, 298560, 370902, 430164, 473956, 515438, 565157, 610994, 631253, 627403, 628018, 654912, 696323, 718317, 694286, 622415, 527316, 449487, 419915, 434691, 460401, 469484, 462469, 451481, 433861, 392375, 314661, 203661, 74192, -54215, -168866, -277184, -400996, -545820, -680015, -756747, -757064, -704643, -642322, -604140, -605890, -645502, -704043, -753189, -769412, -742558, -673981, -571954]
35545e71954J24993J43563J68347J98909K17997K10886J85972J65037J54209J35857
35535A133816R2294K9576k6828n5989n8101n1041n4398p5326j05543j29244j34219
35524E64997j18696r1745o7990n8668o4716p7996q8639q9621p6013m5217l42M9381
35512a65265R2825J18540J12555O3263k3584j17458j79431j90024j59526j11930
35502e60035o3712j9694J7242M1598N2141N6050N9180N4723L0494j0610m6351
35491c88974n6975m3384j5583K7029Q6732J42374J56809J20767P3772O5751J05749
35480B74067J61623K01014K13382J95436J39299M5556o5905j68532k44746k83709
35470D67485k77008k29418j65447j09853o3892j2878M4949R0874J07790R6931
$$ y = [-571954, -446961, -303398, -135051, 63858, 281855, 492741, 678713, 843750, 997959, 1133816, 1226110, 1255686, 1228858, 1172869, 1114768, 1063727, 1009329, 934003, 828460, 699216, 564997, 446301, 354556, 286566, 227898, 163182, 85186, -3453, -93074, -169087, -214304, -214646, -165265, -72440, 46100, 158655, 221918, 198334, 80876, -98555, -288579, -448105, -560035, -623747, -643441, -626199, -584601, -532460, -476410, -417230, -362507, -332013, -342623, -388974, -445949, -489333, -504916, -477887, -391155, -248781, -91972, 28795, 102567, 168318, 274067, 435690, 636704, 850086, 1045522, 1184821, 1230377, 1164472, 995940, 751194, 467485, 190477, -38941, -204388, -314241, -378133, -391011, -346062, -255188, -147398, -50467]
35460e0467P0128L9577K0842K9820O1254P8483M3556l8855j18171j43347j07072
35449a14252m5386k107L071k0179m8837o5450o5509n3075l5996k6054l4607n9307
35437e67688p8846p0577l2839J7977O9245J17580J52069J50305J03415L4775k0095
35426a24679m7887o0370o7782o5254m8598k9485k3716k8196j9170K2040Q2553
35415d10544J20597R9353K1075p2724j34685j43557j07362m7283J4267N8117P4960
35404e27786P0550N8409M5727K9748P036j9015m0959n4784o4322p8617j01510
35393f75523j22244j22251r5276n4529j4486K5651P0065J05400J07716P0526J3378
35382f91573l8032o8538p1041m4007K454N0793R3195J33273J64448J61392J06593
$$ y = [-50467, 19661, 59238, 80080, 109900, 171154, 249637, 293193, 254338, 136167, -7180, -114252, -159638, -161745, -158674, -178853, -227690, -293140, -358649, -411724, -447720, -473774, -508381, -567688, -646534, -717111, -749950, -731973, -662728, -545148, -393079, -242774, -139359, -104584, -124679, -172566, -232936, -300718, -365972, -414570, -444055, -467771, -495967, -515137, -493097, -410544, -289947, -190594, -169519, -242243, -376928, -520485, -627847, -675130, -660863, -602746, -527786, -457236, -398827, -353100, -323352, -316316, -335331, -376290, -431074, -495396, -574013, -675523, -797767, -920018, -1015294, -1069823, -1084309, -1058658, -988593, -883193, -775477, -704951, -691573, -729605, -798143, -869184, -913191, -910737, -859944, -766749, -633476, -469028, -307636, -201043]
35371b01043J6682p1342j34459j71525j83568j65829j23328p8355n0428l3306
35361a196501j146O0947J35656J84872J83199J39932Q6681M5240J3203j8735m6181
35350d12833n7103n3115n1926o6094q7333r4812p2363j4919P2323J70204K43185
35339d24786K53774J90382Q2500j6561o7282o8695m9854m0053m7271o1005o9569
35328c18420p0729o6471n2853k2286K1152N5129N8411L8117K6940M5890P7548
35317b07572Q6745O3061L0290J4784J8320K6614L1617L4458L1670J1157l2768
35306A08376q2730j03287p1556o604M0650L8086Q510K474L7955Q3717J03375R5013
35294B53979P7707N8260K9908o291l7868n5725n7854m0550l58N3935J02753J31716
$$ y = [-201043, -184361, -255703, -390162, -561687, -745255, -911084, -1034412, -1112767, -1163195, -1196501, -1197647, -1136700, -1001044, -816172, -632973, -493041, -406360, -361120, -347917, -366652, -412833, -469936, -523051, -574977, -641071, -728404, -823216, -895579, -910498, -838175, -667971, -424786, -171012, 19370, 101870, 85309, 18027, -50668, -100522, -140575, -187846, -248851, -318420, -389149, -455620, -508473, -530759, -509607, -454478, -396067, -357950, -331010, -285120, -207572, -120827, -57766, -27476, -12692, 5628, 32242, 63859, 98317, 129987, 141144, 108376, 25646, -77641, -149197, -155801, -115151, -77065, -68555, -66081, -28126, 55591, 158966, 253979, 331686, 389946, 419854, 413563, 375695, 319970, 262116, 221566, 221208, 275143, 377896, 509612]
35282E09612J38335J22140P7516J640r2972j76678k16447j98614j41363p7989
35272e4820k3064L7110J14537J90198K26541K04600J39525O4988J1090j1179j8041
35261H81485m0719r1678j47612j78772j86701j93857k02544j90109j46598r1356
35251e88461m3879r05M5193Q4842J04065J04858R7410Q2970N9297L3906J6206
35240d498K021k0086n0489p7641r1903r0230p1469l7878J117L5826O4533Q7202
35228b53495R5454P8719L8578j0652n3230p7792p7760n6272k8286q945j290o06
35216c55577l758m282J3671N9058J11519J31351R8366L2899k4150m4133k3983
35205i019J9280N9897P7664P0563N2922L9429L3674L1366K7801K0384J0378M878
$$ y = [509612, 647947, 770087, 847603, 849243, 756271, 579593, 363146, 164532, 23169, -54820, -77884, -40774, 73763, 263961, 490502, 695102, 834627, 899615, 910705, 899526, 881485, 840766, 749088, 601476, 422704, 236003, 42146, -160398, -350507, -497105, -588461, -632340, -633245, -588052, -503210, -399145, -294287, -196877, -113907, -54610, -20704, -4498, -2477, -22563, -73052, -150693, -242596, -332826, -404295, -442173, -441056, -405230, -340697, -253495, -158041, -79322, -40744, -51396, -104626, -182418, -260178, -316450, -344736, -353681, -354971, -355577, -359335, -363617, -349946, -290888, -179369, -48018, 50348, 83247, 59097, 14964, -9019, 10261, 70158, 147822, 218385, 271307, 310736, 344410, 375776, 403577, 423961, 434339, 439217]
35193D39217J1368K8261M6732O3699Q4937J11247J30226J29997J15738J02326
35183A263748R1189O3658J656q8632j76342k27309k25618j79353j11566m6595
35173C64836J50K5437L4227L2644K5390J9282K3707M1425O1018O6555N6589M6469
35161G97729M8629N7102N5809L5797q43m6779r0469j16054j13105q7703n8405
35150D81708m1338m2114n7875q0339r8813j06100j00066p7344l3628K1947O1451
35139g2511O1168K7675j0170l1408l1999q798M4359J19589J90970K36000K48647
35128G73522K25595J56794M4460p8428j65214j91532j68979j29371j02970j04130
35118B59747j24799j41490j35633j07165o6432k0303K6371O2941P9181P8722P7336
$$ y = [439217, 450585, 478846, 525578, 589277, 674214, 785461, 915687, 1045684, 1161422, 1263748, 1354937, 1418595, 1420251, 1331619, 1155277, 927968, 702350, 522997, 411431, 364836, 364986, 390423, 424650, 457294, 482684, 501966, 525673, 567098, 628116, 694671, 751260, 797729, 846358, 903460, 959269, 995066, 994223, 947444, 856975, 740921, 627816, 540113, 481708, 440370, 398256, 340381, 260042, 161229, 55129, -44937, -122281, -155909, -133962, -72511, -11343, 16332, 6162, -25246, -57245, -66043, -21684, 97905, 288875, 524875, 773522, 999117, 1155911, 1200371, 1121943, 956729, 765197, 596218, 466847, 363877, 259747, 134948, -6542, -142175, -249340, -315772, -336075, -309704, -246763, -167582, -88860, -11524]
35107a1524Q6899J06363J26602J37345J30743J05883P1068L7184R063j3417k9059
35096G57150l6269l7275l3263j6283K4271Q2919J31848J39516R6582K3861m3542
35085A089515q0220q1884n7028j2690M6779J10126J59277J83510J85758J69643
35075A712786J29839O5840j562m2503m8213l8794l8917n3953p2020q1168q0115
35064A451220p7417q3777j00967j15164j05117o1800m94M8330O2179M3702J6141
35053A076836j45o767j9786m5314p2790r5209j22104j60069j89561j78749j21051
35042F5291m6338O863K1057K604l2475p0966j07470j39227j54192j33453p8169
35031f66475k6574k2717o5925j10072j17794r6550p3672n6651l3216N121N7589
$$ y = [-11524, 75375, 181738, 308340, 445685, 576428, 682311, 753379, 790563, 799626, 786209, 757150, 720881, 683606, 650343, 634060, 658331, 741250, 873098, 1012614, 1109196, 1133057, 1089515, 1009295, 927411, 870383, 857693, 904472, 1014598, 1173875, 1357385, 1543143, 1712786, 1842625, 1908465, 1906903, 1864400, 1816187, 1777393, 1738476, 1684523, 1612503, 1531335, 1451220, 1373803, 1290026, 1189059, 1073895, 968778, 906978, 906484, 954814, 1016993, 1060695, 1076836, 1076691, 1069924, 1050138, 1004824, 932034, 836825, 714721, 554652, 365091, 186342, 65291, 18953, 25816, 46873, 49477, 17002, -53964, -161434, -300661, -454853, -588306, -666475, -693049, -715766, -781691, -891763, -1009557, -1106107, -1179779, -1236430, -1269646, -1264525, -1206936]
35020a206936J21305J85236K23407K12653J57412Q5378K0438l1021p2363j07406
35010d11897j35843j48080j29502p9950k1969K2591N5619Q6992J06427R6312O9484
34999d89816O4837R6974J34480J40974J17416Q8675O6711M7657L2438K6146K0028
34988C46520n103n4170j09170j46590j53093j25038o6138R696Q1614J32150J50802
34977F1480J29903O6783k7566j28276k06663k37780k05684j16883j0391O1668
34967f13409P5535N4248M0491N6455R1689J18322J09981N6417k5636r7593j25855
34956b59355j05989n8112m713L9762O6011P1649O4432N0934K3764k4600p5469
34945b11686r2538o6520l3776l4914o5817q5612o4846q717O0547J22053J56081
$$ y = [-1206936, -1085631, -900395, -676988, -464335, -306923, -221545, -201107, -232128, -304491, -411897, -547740, -695820, -825322, -905272, -927241, -904650, -849031, -762039, -655612, -559300, -489816, -424979, -328005, -193525, -52551, 64865, 153540, 220251, 267908, 300346, 326492, 346520, 341417, 287247, 178077, 31487, -121606, -246644, -312782, -303086, -221472, -89322, 61480, 191383, 258166, 230600, 102324, -104339, -342119, -547803, -664686, -675077, -613409, -537874, -483626, -443135, -386680, -294991, -176669, -66688, -10271, -35907, -133500, -259355, -365344, -423456, -428169, -388407, -322396, -250747, -186315, -135381, -111617, -136217, -211686, -304224, -370744, -404520, -439434, -505251, -590863, -655709, -664426, -603879, -481826, -325745]
34934c25745J48400J07083O3610M6166N6167P4594Q3327P5597N4710K9799P345
34923D21053j6786m8794p7197p5103l3183J9233M0029J7473k2537m6714m0150
34912A37324q474K8330M3984K3643k1549o7313j03504j34550j52188j29423n5472
34901d39192L7368R9757J13097R6811P2823M1078o523o3807j11929j35457j29007
34890d24981r4350m1048J2502M9353O8558Q3312J02157J18289J21490J13310J01685
34879B10277Q4735N2124M050m2317p0641q0743q0337p1530n5497m1819l8000l3159
34867a62857q279L5088P0587P6911O0771M4075L8276L9034L7938K9831J2243j4872
34855B58746m9377q7745j20605j28780r7270l9561N106J0508r959k7639l8797
$$ y = [-325745, -177345, -70262, -6652, 39514, 95681, 170275, 253602, 329199, 383909, 413708, 421053, 404267, 355473, 278276, 203173, 169990, 189223, 229252, 246725, 224188, 177474, 137324, 128850, 157180, 201164, 224807, 203258, 135945, 32441, -102109, -254297, -383720, -439192, -401824, -302067, -188970, -92159, -19336, 21742, 15219, -48588, -160517, -295974, -424981, -519331, -560379, -547877, -498524, -429966, -346654, -244497, -126208, -4718, 108592, 210277, 295012, 347136, 351186, 308869, 238228, 157485, 77148, 5618, -49879, -91698, -129698, -162857, -171136, -136048, -65461, 11450, 72221, 116296, 154572, 193606, 231544, 261375, 273618, 258746, 209369, 121624, 1019, -127761, -225031, -264592, -259486, -248978, -258937, -286576, -325373]
34844c25373o1515r8558j27721j34275j32175j40312j51144j38190q9292j9875
34834a418430M5744R6756J37799J73711J95697J84970J34249O5050J5201L530
34824c65723J1792P532j8729m5020m3497q029M1525P5018P2278L6304q937l7442
34812b82928m2173l7673m2633o2302q6666r9744q8611n0603J39L6028L7126J4110
34800g05930K965K7680P0249Q7215N8034Q105k1877k1544j5384k4796l9737l4674
34788f09694m235K7917L5266J4924j5283l9667n6897p0430p5350o0629k0825M0328
34776h34575J15408J94117K58924K90381K82050K43296J83386J03328J2438n7659
34766G91094p3343l3761K6720P0333P8676M7805j5955q3951j06710n0479O5122
$$ y = [-325373, -386888, -485446, -613167, -747442, -879617, -1019929, -1171073, -1309263, -1398555, -1418430, -1372686, -1275930, -1138131, -964420, -768723, -583753, -449504, -384454, -369253, -365723, -353931, -346399, -365128, -410148, -453645, -461674, -420149, -345131, -272853, -236549, -245486, -282928, -325101, -362774, -405407, -467709, -554375, -654119, -742730, -793333, -793194, -757166, -720040, -705930, -702965, -675285, -605036, -517821, -459787, -451682, -473559, -495103, -510487, -535283, -575020, -609694, -613929, -586012, -550746, -535822, -551105, -590772, -647669, -718099, -793449, -854078, -874903, -834575, -719167, -525050, -266126, 24255, 306305, 549601, 732987, 836315, 848753, 791094, 717751, 683990, 710710, 781043, 859719, 907524, 891569, 807618, 700908, 650429, 715551]
34755G15551J75295K18477J77299Q1600j8156q3268j04604r5541p1089l9347j1755
34744I44462o550k9550n8252n9466k4212K2173M3277J8979m3696j13356j48426
34733E45383j23826n2288K4940P2060Q2481P4468P3039R3872J31419J58715J49221
34722A229484J04254N1177J1044k2284o5326j17704j61274j80287j72679j44810
34712E31595j04642o0065j7489J8849M3460M7937K7242j3241n9631r6515j11313
34701B06187r8718o7385l8168k7429l1505l1889j4613J9385N9831R5464J16809
34690A87969J18344J02904Q1776O6215N6502L9312q53o2875j22070j48037j31792
34679A87395r0991m8668j5665M268O687m396r790N439K9320L6992K8401L4045
$$ y = [715551, 890846, 1109323, 1286622, 1368222, 1350066, 1266798, 1162194, 1066653, 995564, 956217, 944462, 937912, 908362, 850110, 790644, 766432, 788605, 831882, 850861, 807165, 693809, 545383, 421557, 369269, 394209, 466269, 548750, 623218, 696257, 790129, 921548, 1080263, 1229484, 1333738, 1384915, 1395959, 1373675, 1308349, 1190645, 1029371, 849084, 676405, 531595, 426953, 366888, 349399, 368248, 411708, 459645, 486887, 473646, 414015, 317500, 206187, 107469, 40084, 1916, -25513, -57018, -88907, -103520, -84135, -24304, 71160, 187969, 306313, 409217, 490993, 557208, 613710, 653022, 652169, 589294, 467224, 319187, 187395, 96404, 47736, 32071, 36339, 43026, 38630, 28840, 34279, 63599, 100591, 128992, 163037]
34667A63037P5148J31603J60980J41332Q4707J5691m8929j00268j32281j44640
34657C46380j44290j36512j16898p9545l3682l316k390j3903n225L1746O5183
34646i2452N6963O458m9669p8927q2610q2577r0149r4009p1644p961Q9015J82810
34634c14752K25373J91461R9361n767q7108j32103j41654j18776p2879k4412P205
34623c74051K1526L6577O7616J09940J44782J57005J40548R1034P846q9098j56426
34612A57299j58318j02039l1586J6019L7646M5593L8959P843m1461q2744r4483
34601b07272p7956m7214j0249L2872P9246J21275J57199J94903K37827K70496
34591G51127K68113K23580J55958Q5111O735r3293k03232k83196l05900k84749
$$ y = [163037, 238185, 369788, 530768, 672100, 756807, 772498, 723569, 623301, 491020, 346380, 202090, 65578, -51320, -130865, -164547, -167863, -170253, -184156, -189381, -157635, -92452, -35489, -29031, -78700, -157627, -240237, -322814, -412963, -506972, -578616, -586577, -497562, -314752, -89379, 102082, 201443, 195676, 108568, -23535, -165189, -283965, -356844, -381256, -374051, -352525, -315948, -248332, -138392, 6390, 163395, 303943, 394977, 402823, 313725, 157299, -1019, -103058, -134644, -118625, -80979, -35386, 3573, 11416, -30045, -112789, -207272, -285228, -332442, -342691, -309819, -230573, -109298, 47901, 242804, 480631, 751127, 1019240, 1242820, 1398778, 1483889, 1490624, 1397331, 1194099, 910903, 605003, 320254]
34581C20254k48869k01777j23918j4185R0591J46407J42545J03125N5725J0082
34571B79980l3179o6206p7367o8076n3734m2572k4033R844L8790K9950j7969o6581
34559i1153q5841r2872j23105j73653k01047j74727j08379l2296M0574J04823
34549i37676J38802J19056N7625K545q434J5820L6752L0488O451j2400j5270p261
34537e73502K926J1422J8105K3381K6844K6705K2236J9727L1875O3408R8458J11787
34525a16628R5044O3706L5663J3523o586k1157k6005k8616l9987n7796o9616o9429
34513b27884n8448l3778O367M5209N3752K3569j8071l3814r347M2291R5920J24447
34501A0213J06529M1980l9869r7665j08590q1239m2403j4926l752L752K4212O0869
$$ y = [320254, 71385, -130392, -254310, -268495, -177904, -31497, 111048, 214173, 269898, 279980, 246801, 180595, 103228, 35152, -18582, -61154, -85187, -75343, -36553, -6603, -24572, -91153, -176994, -269866, -392971, -566624, -767671, -942398, -1050777, -1083073, -1042499, -937676, -798874, -679818, -622193, -619648, -628082, -612262, -575510, -545022, -538571, -550971, -566241, -573502, -570576, -559154, -541049, -517668, -490824, -464119, -441883, -422156, -390281, -326873, -228415, -116628, -21584, 42122, 77785, 91308, 84722, 63565, 37560, 8944, -31043, -88839, -158455, -227884, -286332, -320110, -313743, -268534, -214782, -191213, -209284, -243098, -252445, -210154, -114234, 10213, 116742, 158722, 118853, 21188, -87402, -168641, -211044, -225970, -229722, -225970, -201758, -140889]
34489a40889R7705J10010Q0982J3350o7738j25676j37298j10764p2827l9101p223
34478c99469K1325L0637J1467k0039l7390k9722k522L7430Q2752J17463J26075
34467f1993J11565R1334P3761N0256J3128k9249o0235p1577o8101n9177m7757
34456e8045k7311P869M7337O6018M8690R288k2611l2655l1666l7618n6581p9597
34444a66882q8791o7153j2837N3947J06052J33000J43301J44527J31644R8583
34434D75391N2932J3055p077q863p256j6342l2936l8212k0912O655K4244K8554
34422D69233K8824K2230o700n7484j00944j05170o6262p799M1781O6864O9880
34411C54453O6454P0635Q2271R4329J09589J35982J64328J68862J38773R4889
$$ y = [-140889, -43184, 66826, 147808, 161158, 93420, -32256, -169554, -280318, -353145, -392246, -399469, -378144, -347507, -336040, -356079, -393469, -423191, -425713, -388283, -305531, -188068, -61993, 49572, 140906, 214667, 264923, 278051, 248802, 188567, 116990, 48889, -10288, -58045, -85356, -77487, -30150, 35868, 84558, 93846, 71235, 38580, 6914, -30704, -87285, -166882, -255673, -322826, -335663, -281716, -175664, -42664, 100637, 245164, 376808, 475391, 528323, 541378, 534301, 525438, 518182, 501840, 468904, 430692, 409780, 416435, 440679, 469233, 498057, 520287, 513587, 456103, 355159, 249989, 183727, 175928, 217709, 284573, 354453, 420907, 491542, 573813, 668142, 777731, 913713, 1078041, 1246903, 1385676, 1480565]
34401A480565O4548N2024M4541L4823K3295P175j6885m3371o2744p1781p0891
34390A441299n9159m2383l6633m9895o7227o8104n1522k8886m7M3360R3909J28849
34378A303561J36954J27941J13211R4210P2616N4178L6177O691l6487p9659j12599
34367A716794j40445j68046j84994j76337j40366r0068m6159l1424n5850r7799
34357E85306j14307q3280k6117K1025M5001N1749M0682P330l2454m4284q443N8688
34345E00896J17699J33493R5521K6086l0939m2745j2994K9973O3795P9315O6367
34334A026467J6668n4799j11699j30536j21348j09161j09918j31192j76294k30312
34324a32124k55725k23798j46962o3856L863O2288J14737J42261J24426O7298
$$ y = [1480565, 1545113, 1597137, 1641678, 1676501, 1699796, 1706971, 1690086, 1646715, 1583971, 1512190, 1441299, 1382140, 1339757, 1303124, 1253229, 1186002, 1117898, 1066376, 1037490, 1037443, 1080803, 1174712, 1303561, 1440515, 1568456, 1681667, 1775877, 1848493, 1902671, 1938848, 1945539, 1909052, 1829393, 1716794, 1576349, 1408303, 1223309, 1046972, 906606, 816538, 770379, 738955, 683105, 585306, 470999, 387719, 361602, 382627, 427628, 479377, 520059, 527389, 494935, 450651, 442208, 500896, 618595, 752088, 847609, 873695, 842756, 800011, 787017, 816990, 880785, 960100, 1026467, 1043135, 988336, 876637, 746101, 624753, 515592, 405674, 274482, 98188, -132124, -387849, -611647, -758609, -822465, -818602, -756314, -641577, -499316, -374890, -307592]
34314c07592O03m6306n8932l6223J2760O9285J09302J14027Q0757K6617j9882
34303e5584l7779k9411j7231k3199n0351q2168r6777q3228m9026j3059J1989L0762
34291d95062N5375Q5116J02546R2793O1215K6553J40k1043m0288m7407k6284K2588
34279a83758P2618R1939P5530M9880M0977M4704L8619J7264m38r69L763l957k1578
34266B24594l5108m6412p3068j19544j62836j72785j38908p3987L20O6113J13769
34255d17852J41008J47801J32838R9059O1174L8407L4867L2234O437n1149j29294
34244I5530k04829k49376k37296j61896m7917N8840J20987J31397J08781P5722
34234c10057M2275P881k6135n1392o0748n6675m6050k9431k822K9871N4075N6965
$$ y = [-307592, -306989, -353295, -412227, -448450, -435690, -366405, -257103, -143076, -62319, -35702, -55584, -93363, -122774, -140005, -163204, -213555, -295723, -392500, -475728, -524754, -537813, -525824, -495062, -439687, -354571, -252025, -159232, -98017, -71464, -71324, -92367, -132655, -180062, -206346, -183758, -111140, -19201, 56329, 106209, 147186, 191890, 230509, 247773, 247335, 246366, 250129, 246172, 224594, 189486, 143074, 70006, -49538, -212374, -385159, -524067, -598054, -597734, -531621, -417852, -276844, -129043, 3795, 102854, 164028, 202435, 237302, 269536, 275973, 224824, 95530, -109299, -358675, -595971, -757867, -805784, -746944, -625957, -494560, -385779, -310057, -267782, -259901, -286036, -337428, -398176, -454851, -500901, -530332, -533154, -503283, -449208, -392243]
34222c92243L7020J03m5392q5628j03448r2802o6108l8838j1148K5655O7244R2691
34210f12894Q5624N2074J5076l655L229K6583M8715N8037N8159O0405O9378Q2400
34198e6869J01871J37151J87771K30900K33874J80620Q5397j6124q8394j16197
34188H80000j11849j02215j03518j07999r7742o9845m1730k9114k4368m784L6413
34177B23249P4801P8080M3321L543m913K4054O6402R2154Q2990L5123m0291j17794
34165E60719j68889j78383j48187q8088j1086O2225J05896J04011O3550J0293
34155C12061k8152m0131l7856m5463p1364r4904r1122o6620n4944p2276r3710
34144c84481q3127l3980L0191Q2827J07065R2590M1693k1886o7594q5840r0511
$$ y = [-392243, -355223, -355120, -400512, -486140, -589588, -682390, -748498, -787336, -798484, -772829, -705585, -612894, -527270, -475196, -460120, -463775, -460546, -433963, -385248, -327211, -269052, -208647, -139269, -56869, 45002, 182153, 369924, 600824, 834698, 1015318, 1100715, 1084591, 996197, 880000, 768151, 665936, 562418, 454419, 356677, 286832, 245102, 215988, 191620, 186836, 223249, 298050, 376130, 419451, 422994, 418081, 442135, 508537, 600691, 683681, 718804, 678513, 560719, 391830, 213447, 65260, -22828, -33914, 28311, 134207, 238218, 301768, 312061, 283909, 243778, 205922, 160459, 89095, -5809, -96931, -163551, -218495, -290771, -384481, -467608, -501588, -471397, -388570, -281505, -188915, -147222, -169108, -236702, -322542, -413053]
34133d13053r3203q7388o0801j2312M6951R9270J25176J15569Q5154O2628N9498
34122g2511N7527L5285j841k8679l0113j1322J7371N0724Q1730R7416Q8476N7051
34110C41114J1482l8871p7819q0510l1834N0617J21624J43752J16194O6666K0240
34099F42655j7893n2880q4001j01388r3831n8162o167L6680M7738K8506M867J280
34087C47404J9539M6736P4808J01730J19794J17120R0869M7804q114p6513j46881
34076G34296j96736k09976j89852j50838j06770p0015n0316m6193m5638m2510
34066c74548m4034n4188n8778l9326J950M1884O0316N7336M8533M9092O0554O8772
34054a82437N8826L5453K1212K7723L7536K5137j0779m8236o9549p4174o8059
$$ y = [-413053, -506256, -593644, -654445, -666757, -619806, -520536, -395360, -279791, -194637, -132009, -72511, -14984, 20301, 18460, -10219, -40332, -51654, -34283, 16441, 98171, 195587, 284063, 341114, 352596, 313725, 235906, 155396, 123562, 174179, 295803, 439555, 555749, 622415, 642655, 624762, 571882, 487881, 386493, 292662, 234500, 228333, 265013, 312751, 341257, 346124, 347404, 366943, 413679, 488487, 590217, 710011, 827131, 918000, 965804, 957690, 881177, 734296, 537560, 327584, 137732, -13106, -119876, -189891, -240207, -286400, -332038, -374548, -418582, -472770, -531548, -570874, -568924, -527040, -466724, -409388, -360855, -311763, -251209, -182437, -123611, -88158, -66946, -39223, -1687, 23450, 12671, -35565, -105114, -179288, -247347]
34043b47347n6039m4451l5396j6104L0555R9281J58791J81620J67182J29792P6713
34032D44597R488n9707j05820j08309p0235k1958k006k3682n8247o0794j7006
34021g3679M2736P6617O8261K9360j8992n9284q4100r9683j14675j19496r0693
34010d43628k6452L6455N7828L6906L981k1084m0455n3013m2924r38N9084J12848
33998c21392J44700J51262J39063J23588J18175J16370R5062M3444j8591n9330
33988E32351o8822o7516q2847j18660j45270j22659m3018M8760Q8130N0934k5074
33977D6309q0958r0709p2362n8277o5107q6488j03161r9601p6747n0069l5315
33966g72485l9371o2875j00859j36581j45768j17033o3240o391M1675P6718R1610
$$ y = [-247347, -303386, -347837, -383233, -399337, -368782, -269501, -110710, 70910, 238092, 367884, 444597, 454085, 394378, 288558, 180249, 110014, 88056, 86050, 62368, 4121, -56673, -73679, -30943, 45674, 113935, 143295, 124303, 65019, -19081, -118764, -233439, -352935, -443628, -470080, -433625, -375797, -338891, -334910, -355994, -396449, -449462, -492386, -493324, -434240, -321392, -176692, -25430, 113633, 237221, 355396, 471766, 566828, 610272, 591681, 532351, 463529, 396013, 313166, 194506, 49236, -73423, -116441, -67681, 20449, 71383, 46309, -34649, -125358, -197720, -255997, -321104, -407592, -510753, -610354, -687101, -737170, -772485, -811856, -874731, -975590, -1112171, -1257939, -1374972, -1438212, -1444603, -1402928, -1326210, -1234600]
33955a234600Q3991O9775P1750R2206J10509J12541J10296J24159J53720J75720
33945a29933J67853J28050P2892K3927n892k0539l8887p8543j35586j82196j90382
33934c89236j59154j13918p8722n6111l7167k0519q889Q219N0769J20859J89831
33923d94038K20996K00842J45133Q2839L9107K4314K9647L7199M0235M7526O2454
33912D36254O8518M7744O386l2368n8692q4962j23967j70815k08522k21277k01186
33901e42887j53905j00982o5198m6925k2731K6031Q8184J31219J31912R6846N6617
33890d01819M0648N2992P1782P4784O1165M1864J6189k6371q1707j25034j33727
33879d09234j03087l7706N2833J39817J77814J43718O7663Q857K741M0494Q9611
$$ y = [-1234600, -1150609, -1080834, -1009084, -916878, -806369, -693828, -583532, -459373, -305653, -129933, 37920, 165970, 238862, 262789, 256897, 236358, 197471, 118928, -16658, -198854, -389236, -548390, -662308, -741030, -797141, -834308, -854827, -863716, -855497, -804728, -683869, -494038, -273042, -72200, 72933, 155772, 194879, 219193, 248840, 286039, 326274, 373800, 436254, 504772, 552516, 558902, 526534, 467842, 382880, 258913, 88098, -120424, -341701, -542887, -696792, -797774, -862972, -909897, -932628, -906597, -818413, -687194, -555282, -458436, -401819, -361171, -308179, -236397, -161613, -100448, -58584, -42395, -68766, -150473, -275507, -409234, -512321, -550027, -497194, -357377, -179563, -35845, 31818, 40675, 43416, 83910, 173521]
33868A73521J17619J03812N2471r31j5269J4836N2718N9651L1952n009k7918l3363
33856E24090l3694m4371p1204j03180j19387j06174o6265j3058L6480O4026N8673
33845A25936L2120J6765L7034Q3088J18414J11770N9347j7083q5109j18365j09094
33834B54823o7797r488N5004J09941J27030Q4674j152p7963r8907o2011n615K8669
33822C37208K4822o015m0799o2353p1188q2205j04446j23364j09820n0382L5288
33811b53254J09493J44233J32838Q5187K4156j7124j2163L5068R0675J23554J32384
33800E95047J33144J29101J10024Q0047O5108P9495R6533P0331j3067j17237j88857
33789A039669k00323j59407r1755k5921J0430l053o4271j40168j83078j67109
$$ y = [173521, 291140, 394952, 447423, 446492, 431223, 446059, 498777, 558428, 590380, 585371, 557453, 524090, 490396, 446025, 374821, 271641, 152254, 46080, -20185, -33243, 3237, 67263, 125936, 158056, 174821, 211855, 294943, 413357, 525127, 584474, 567391, 482282, 363917, 254823, 187026, 177538, 232542, 342483, 469513, 554187, 553035, 475072, 376165, 314154, 308539, 337208, 362030, 356015, 315216, 252863, 181675, 99470, -4976, -128340, -238160, -288542, -253254, -143761, 472, 133310, 218497, 242653, 225529, 213366, 248434, 339109, 462663, 595047, 728191, 857292, 967316, 1047363, 1112471, 1191966, 1288499, 1358830, 1345763, 1228526, 1039669, 839346, 679939, 588184, 562263, 572693, 569640, 505369, 365201, 182123, 15014]
33779A5014j12623o8910o5980q5604q5293m7508K980K8425J3901k6375o4817p6404
33767e73194n1473m765L4237N0594N8942P8783J00026Q8615K8280n6263j22825
33756c69043j49382j43955j26648j10309r4415o9855k8521K9495R6594J61087
33746h04952K05307K06388J53191O6691p237l3010q664M7000J17338J87996K35395
33735C65443K34417J82148J05210L9174K678j0196j8252l5560o2078q9218j11536
33724F02230j27972j33120j18237q6358n6980m6771n1501n4563m5857k3482J2846
33713a29765N4543P7405O1918K0384j3864k5945l0410l9708m3730l2614k1442
33702a23228l2604o2219q2243p3009l8464R424O4043J15569J42007J23054O4268
$$ y = [15014, -97609, -166519, -232499, -318103, -403396, -450904, -447924, -419499, -405598, -431973, -496790, -573194, -624667, -629432, -595195, -544601, -485659, -406876, -306850, -218235, -189955, -246218, -369043, -518425, -662380, -789028, -899337, -993752, -1063607, -1092128, -1062633, -966039, -804952, -599645, -393257, -240066, -173375, -180612, -213622, -222286, -175286, -57948, 130048, 365443, 599860, 782008, 887218, 926392, 929070, 918874, 900622, 865062, 802984, 713766, 602230, 474258, 341138, 222901, 136543, 79563, 32792, -18709, -73272, -119129, -142611, -129765, -75222, 2183, 64101, 84485, 70621, 44676, 14266, -25442, -69172, -101786, -123228, -155832, -218051, -300294, -373303, -411767, -402343, -338300, -222731, -80724, 42330, 106598]
33691A06598M00l1329k2882P31R142n061k6480l7746l1890p997L2732Q2937J28529
33678A97684J55038J50382J06010K9388m3812o8357l1894L0839P4645Q4613P2813
33667G57349N0222K0096r829l0366m6539p3112j11423j44946j62634j74434j96161
33656a21777k25968k41916k20508j57628p6598j3868J2409K0889M5860R5848J42503
33645g40754J53742J28320R2211O9692O6282P3397P8045O8000L7258p375m6789
33634b7971o0997m3818q211K3973L9440M0528L4739K1937k847l7139p0515r8315
33622a89196j27845j64629j96223j97705j56774r1493l8710k1032k5463j8929
33612a227999J4091N5024P5056O8203N3236M7901N1539N2001M0303J8531K222
$$ y = [106598, 106998, 75669, 52787, 53518, 62660, 57599, 31119, -6627, -38517, -46514, -13782, 69155, 197684, 352722, 503104, 609114, 638502, 594690, 526333, 494439, 525278, 599923, 684536, 757349, 807571, 827667, 817838, 787472, 740933, 667821, 556398, 411452, 248818, 74384, -121777, -347745, -589661, -810169, -967797, -1044395, -1058263, -1045854, -1024965, -979105, -883257, -740754, -587012, -458692, -366481, -296789, -230507, -157110, -79065, -11065, 26193, 18818, -27971, -88968, -132786, -140997, -117024, -77584, -37056, -2317, 19620, 16773, -20366, -90881, -189196, -317041, -481670, -677893, -875598, -1032372, -1123865, -1162575, -1183607, -1209070, -1227999, -1213908, -1158884, -1083828, -1015625, -962389, -914488, -862949, -810948, -770645, -752114, -749892]
33601g49892J4698O7030J38946J89052J91031J54470J06148N9060P936n0255j02925
33590B5299j32086j33551j22222j16128j14575r6472m6432K0115O7698P8222O7606
33579e02526O1242O4312O5498O0929N9708O6549P1087N8964K8091q597l3211l5598
33567d3552k0304k251O947Q023P825P694M254N06P461K9753N3506N4125J7623
33554A31610m5840j07683j39365j28695q3741k4382K9434O3653P0068M7338N538
33543a82065l3895n1118m6120m1489o0546j00492j30465j18600o0178J9710Q6212
33532g19046J16923J12686R3958Q3753Q7789R1757Q0453N5362K9784J4485J7476
33521F5380M9818J12784J76074J86430J12322k2942j58671k43752k63906k33228
$$ y = [-749892, -735194, -668164, -529218, -340166, -149135, 5335, 111483, 170543, 178479, 128224, 25299, -106787, -240338, -362560, -478688, -593263, -689735, -736167, -716052, -648354, -570132, -502526, -441284, -376972, -311474, -250545, -190837, -124288, -53201, 5763, 33854, 25257, -7954, -43552, -63856, -66107, -59160, -51137, -43312, -35618, -31364, -30858, -23397, 6356, 59862, 113987, 131610, 85770, -21913, -161278, -289973, -373714, -398096, -368662, -305009, -234941, -187603, -182065, -215960, -267078, -313198, -354687, -415233, -515725, -646190, -764790, -824968, -805258, -719046, -602123, -489437, -395479, -311726, -223937, -132180, -51727, 3635, 33419, 47904, 65380, 115198, 227982, 404056, 590486, 702808, 679866, 521195, 277443, 13537, -219691]
33511b19691j73419j04192m5051j4851k1282m9596o9975o4757m4902l0237j7830
33500h55783J3807O6873J08974J07061O4746J3205k5488n0854o6428o8559n5558
33489g48004l4466j2537J0763L8955P0407R7384J09768J00067P0543L7319K2288
33478b37513L6208O7847Q8614P0203P090p0961j13950r1115j9500N0603P9217
33467a33257O3378K5065j6760n7716r7583j26266j25190q5795k5738K0326L1614
33456e27922J9715J2290K3292M5269O4614P2098N9546K0186m0632j01967j41284
33445d94795j49981j33390j00287n6748p928L8531P3541R3590J07616J31196J66706
33434c31949J91386J74346J08326J9115n7597j02557j16132j06906q5777o5260
$$ y = [-219691, -393110, -497302, -542353, -557204, -578486, -628082, -698057, -762814, -807716, -837953, -855783, -841976, -775103, -666129, -559068, -494322, -481117, -506605, -557459, -623887, -692446, -748004, -782470, -795007, -784244, -745289, -674882, -577498, -467730, -367663, -297120, -259801, -237513, -201305, -133458, -44844, 25359, 32449, -38512, -152462, -243577, -263077, -212474, -133257, -69879, -44814, -61574, -119290, -216873, -343139, -468329, -554124, -579862, -559536, -527922, -508207, -495917, -472625, -427356, -362742, -290644, -231098, -210912, -251544, -353511, -494795, -644776, -778166, -878453, -935201, -943129, -904598, -831057, -737467, -629851, -498655, -331949, -140563, 33783, 142109, 161224, 103627, 1070, -115062, -221968, -307745, -373005]
33424c73005n2993m4326k8274l916J3800R517j2267k6901j1908L1517P9862J07042
33412c11852J00883O6100K0958q837m757K7575O0750P1421O0436M3351K9188J8202
33400A73418J3718K0111K6973Q834n1077j40808k25783k70241k53977j80158p6002
33389i54992J7955O8978O9298L6336k989l2911n9681j00096j54594j95567j90178
33378a498441j32287m4233M7402J23406J62641J44429P3409j0326o0759o2983
33368a257742l5052j776K3255L6689M0614L9249L3335K0087N121Q028M3117R5443
33356i49632J28660J20525Q2047L9007M656k2893m3992m8643k5405K3875P7604
33345f14191J04002Q5767M2111J9922M9982J09040J35315Q9423l920q0164r6183
$$ y = [-373005, -425998, -470324, -498598, -502514, -488714, -479197, -491464, -518365, -530273, -498756, -418894, -311852, -210969, -144869, -123911, -132748, -137505, -109930, -49180, 22241, 82677, 126028, 155216, 173418, 187136, 207247, 234220, 243054, 191977, 51169, -174614, -444855, -698832, -878990, -954992, -937037, -868059, -798761, -762425, -765414, -798325, -858006, -958102, -1112696, -1308263, -1498441, -1630728, -1674961, -1627559, -1504153, -1341512, -1197083, -1123674, -1134000, -1194759, -1257742, -1292794, -1294570, -1271315, -1234626, -1194012, -1154763, -1121428, -1101341, -1096220, -1088192, -1045075, -949632, -820972, -700447, -618400, -579393, -574737, -597630, -641622, -690265, -715670, -691795, -614191, -510189, -424422, -382311, -362389, -312407, -203367, -68052, 21371, 17451, -62713, -158896]
33334a58896o0915j1826K3866M2386N4199P3766J10185J54436J78075J56170R2315
33323F53761J3650n5864j06335j29391j13800o3006m908K9815L6732L6835M8759
33312C46248O9290Q0976P2538M9378K6760J4648R269j164k4325n8403r5113j23598
33300C66504j33913j22998r7129o4694l0294k536m95l6480r1775j26185j18264
33289d58259q3391m6802j5876R710J8530N73k7348l1691O24N0628R3236J18654
33277c71412J25615J11572P9836M4556J7130n252k7347l8058j8456L1164Q2377
33266C1725J02648Q4870M9834K2579J0476K566j5642m8529q6529j12122j12896
33255g1020r2575o6451m3140j7017J4799L5752K4496j4687n0400n6359l3488J534
$$ y = [-158896, -219811, -231637, -207771, -165385, -111186, -37420, 72765, 227201, 405276, 561446, 653761, 667411, 611547, 505212, 375821, 262021, 199015, 194107, 223922, 260654, 297489, 346248, 415538, 496514, 569052, 618430, 645190, 659838, 669107, 667943, 643618, 585215, 490102, 366504, 232591, 109593, 12464, -52230, -82524, -85060, -85555, -122035, -213810, -339995, -458259, -541650, -588452, -604328, -594618, -576088, -575515, -602863, -634554, -633930, -583302, -490066, -371412, -245797, -134225, -54389, -9833, 7297, 2045, -25302, -63360, -81816, -50652, 31725, 134373, 219243, 269077, 291656, 302132, 304698, 289056, 240527, 153998, 41876, -71020, -163595, -230046, -273186, -290203, -275404, -239652, -215156, -229843, -280243, -336602, -370090, -368556]
33243c68556L4221N3310N1823L9764M2988P5625J23264J64508J94895K13008J98452
33232H23302J31228K8972o1403j11915j32406j40119j35270j14549q5407n2703
33222A49730q794M7145R3028J03743P9546M1622P184j8352l2636l6090l6925m1978
33210C47223m4045l1853j2518j0175l8578q5891j30486j61285j76401j71940j43743
33199f59692r7349m6491q71L7645O6158P6799O6787M6155K7813J3529j383j1731
33187d82631l138K8328O9349J07682J43737J72884J69878J12226J6870o6280j02470
33176A66435j00194q7671p7176o2142l8489j5723q967k5612n6754p9639p4961
33165d60893m5593j2478J0243K7989N0617P4645Q7797Q4243O8202M7359K7488
$$ y = [-368556, -334335, -281025, -229202, -189438, -146450, -70825, 52439, 216947, 411842, 624850, 823302, 954530, 983502, 922099, 810184, 677778, 537659, 402389, 287840, 202433, 149730, 140936, 188081, 281109, 384852, 464398, 506020, 513204, 494852, 462216, 426126, 389201, 347223, 303178, 271325, 258807, 248632, 210054, 124163, -6323, -167608, -344009, -515949, -659692, -757041, -803532, -804403, -766758, -700600, -623801, -557014, -510859, -483046, -469517, -470900, -482631, -485769, -457441, -388092, -280410, -136673, 36211, 206089, 318315, 335185, 268905, 166435, 66241, -21430, -98606, -160748, -199237, -214960, -223927, -249539, -306293, -385932, -460893, -506486, -518964, -508721, -480732, -430115, -355470, -267673, -183430, -115228, -67869, -40381]
33154d0381P684k2916p5100j40018j87660j92277j53354q7332j0327O1485J06418
33143g33778J09025P5128K5391k1465n1130n1153k3447O445J2937M142J4186N8250
33131e75469J11359J37864J27479R4401N4322J4959j7485l4425k8299J775M3049
33120g0470O7842N1273j337n2289o6090m2837j1014O226P056k469k2927n6795
33108a93831r7229j29070j39988j27913r9914o8140m6537m5785o5099q7765r0101
33097a191372o1132j3866K7266N1118O7525Q8578J08847J11952R4563P3347O2808
33086e80366N3894K5690k1948n9265n7504k2777R875J3838n537k2048j2376L0911
33074f47613R5509J51091J66028J34737Q5280N2327M5778N0957N1595M2112K3329
$$ y = [-40381, -32697, -55613, -130713, -270731, -458391, -650668, -804022, -891354, -901681, -840196, -733778, -624753, -549625, -524234, -545699, -596829, -647982, -671429, -664984, -652047, -647905, -633719, -575469, -464110, -326246, -198767, -104366, -50044, -35085, -52570, -86995, -115294, -113519, -70470, -2628, 48645, 47308, -4981, -71071, -113908, -124922, -118696, -111640, -114109, -137036, -193831, -291060, -420130, -560118, -688031, -787945, -856085, -902622, -948407, -1013506, -1101271, -1191372, -1252504, -1266370, -1239104, -1187986, -1120461, -1031883, -923036, -811084, -716521, -643174, -580366, -526472, -500782, -522730, -581995, -639499, -662276, -652401, -638563, -644100, -666148, -678524, -647613, -552104, -401013, -234985, -100248, -14968, 37359, 83137, 134094, 185689, 227801, 251130]
33063B51130N33j4142r314J3284M2228P2013J05136J37874J55796J48237J18805
33052A021580P7544L1290j2721m1138m0097n183N4556J16935J51795J37919Q1973
33041A574453J4101m0143p6762r9946j05807r1436p1007o6480q3376j07832j26392
33030G19373j35156j27828r0522j9210O4947J27679J47458J24914P2906P937n0110
33019H42388q3336q9788q6910r2782j05277j06410q5878n1848j7886J0204K9601
33008A62078L2732J4044k1290o4001j09188j46792j51865j04716k2523M8167P8060
32997b85294P9294P5409O5451L4779j0578m2702m3599k0934R699M2822P8579J12980
32985I5906J40338J56823J54297J18752M7170l4556q2112p0358k0325J7012P478
$$ y = [251130, 251663, 237521, 228207, 241491, 283719, 355732, 460868, 598742, 754538, 902775, 1021580, 1099124, 1130414, 1117693, 1076555, 1036458, 1031275, 1085831, 1202766, 1354561, 1492480, 1574453, 1588554, 1548411, 1471649, 1371703, 1265896, 1174460, 1103453, 1036973, 953597, 845765, 719373, 584217, 456389, 365867, 346657, 411604, 539283, 686741, 811655, 884561, 892498, 842388, 759052, 669264, 582354, 489572, 384295, 277885, 192007, 140159, 122273, 132477, 162078, 194810, 208854, 187564, 123563, 14375, -132417, -284282, -388998, -411521, -363354, -285294, -206000, -130591, -65140, -30361, -40939, -83641, -127240, -148174, -138475, -95653, -17074, 95906, 236244, 393067, 547364, 666116, 713286, 678730, 596618, 526260, 505935, 522947, 530425]
32974E30425l8011q3701j10582j27073j41520j43104j21283r0763p8103q5876
32964d89591q6843n6589P05O1876J06877J24679J09229O1826m803p0685j14559
32953c57878j15580o1646L2619J22486J62482J42793R1225M1521Q982m502K831
32942F5333L1008P0763J07011J26130J13153N0430o3056j88723k63506k53462
$$ y = [530425, 492414, 408713, 298131, 171058, 29538, -113566, -234849, -325612, -403715, -489591, -576434, -633023, -632318, -570442, -463565, -338886, -229657, -167831, -172634, -243319, -357878, -473458, -535104, -502485, -379999, -217517, -74724, 16501, 58022, 67004, 62502, 65333, 96341, 167104, 274115, 400245, 513398, 563828, 500772, 312049, 48543, -204919]
$$ [...]
##END NTUPLES=NMR SPECTRUM
##END=
