##TITLE=31Pdec_50-2022
 CDCl3, 124 sc
 26.7.2022
##JCAMPDX= 6.0         $$ Bruker NMR JCAMP-DX V2.0
##DATA TYPE= NMR SPECTRUM
##DATA CLASS= NTUPLES
##ORIGIN= UXNMR, Bruker Analytische Messtechnik GmbH
##OWNER= root
$$ XWIN-NMR		Version 3.5
$$ Tue Jul 26 15:46:22 2022 Russian Standard Time (UT+4h)  she@DPX200
##.OBSERVE FREQUENCY= 81.013821
##.OBSERVE NUCLEUS= ^31P
##.ACQUISITION MODE= SIMULTANEOUS
##.ACQUISITION SCHEME= undefined
##.AVERAGES= 124
##.DIGITISER RES= 16
##SPECTROMETER/DATA SYSTEM= spect
##.PULSE SEQUENCE= zgpg30
##.SOLVENT NAME= CDCl3
##.SHIFT REFERENCE= (INTERNAL, CDCl3, 0, 248.564)
##AUDIT TRAIL= $$ (NUMBER, WHEN, WHO, WHERE, WHAT)
$$ ##TITLE= Audit trail, XWIN-NMR		Version 3.5
$$ ##JCAMPDX= 5.01
$$ ##ORIGIN= Bruker BioSpin GmbH
$$ ##OWNER= she
$$ F:/spectra/data/she/nmr/P31/1/pdata/1/auditp.txt
$$ ##AUDIT TRAIL=  $$ (NUMBER, WHEN, WHO, WHERE, WHAT)
(   1,<2022-07-26 15:45:18.93 +0400>,<she>,<DPX200>,
      <created by zg, POWCHK disabled, PULCHK disabled
       configuration hash MD5:
       00 E9 B6 7A A2 85 ED C7 34 08 36 98 17 FE 4E 26
       data hash MD5: 32K
       98 92 8F D4 C1 4D AF 5A A8 15 85 63 9F 9E 59 D0>)
(   2,<2022-07-26 15:45:22.46 +0400>,<she>,<DPX200>,
      <Start of raw data processing
       efp BC_mod = 2 LB = 1 FT_mod = 6 PKNL = 1 PHC0 = -10291.27 PHC1 = 98.25687 SI = 64K 
       data hash MD5: 64K
       BD 28 E8 FA 75 38 F4 82 CC 85 CD 34 DC 2D C9 60>)
(   3,<2022-07-26 15:45:49.42 +0400>,<she>,<DPX200>,
      <pk PHC0 = -42.99785 PHC1 = -76.8 
       data hash MD5: 64K
       CA 34 FE 8D FF 54 94 2F 79 7C 17 10 6E E5 15 C9>)
(   4,<2022-07-26 15:45:52.51 +0400>,<she>,<DPX200>,
      <abs ABSG = 5 
       data hash MD5: 64K
       E8 43 1F 30 22 21 41 D5 16 27 56 CE B5 A0 B7 31>)
$$ ##END=
$$ 
$$ hash MD5
$$ B1 4A 4A C1 23 21 AB F8 A3 38 58 99 C8 66 A2 83
##$RELAX= 
##$RELAX= 
##$RELAX= 
##$RELAX= 
##$RELAX= 
##$RELAX= 
##$RELAX= 
##$RELAX= 
$$ Bruker specific parameters
$$ --------------------------
##$DU= <F:/spectra>
##$EXPNO= 1
##$NAME= <P31>
##$PROCNO= 1
##$TYPE= <nmr>
##$USER= <she>
##$AMP= (0..31)
100 100 100 100 100 100 100 100 100 100 100 100 100 100 100 100 100 100 
100 100 100 100 100 100 100 100 100 100 100 100 100 100 
##$AQSEQ= 0
##$AQ_mod= 1
##$AUNM= <au_zg>
##$AUTOPOS= <>
##$BF1= 81.014009
##$BF2= 200.13
##$BF3= 200.13
##$BF4= 200.13
##$BF5= 200.13
##$BF6= 200.13
##$BF7= 200.13
##$BF8= 200.13
##$BYTORDA= 1
##$CFDGTYP= 0
##$CFRGTYP= 5
##$CHEMSTR= <none>
##$CNST= (0..31)
1 1 145 1 1 1 1 1 1 1 1 1 1 1 1 1 1 1 1 1 1 1 1 1 1 1 1 1 1 1 1 1 
##$CPDPRG= <waltz16>
##$CPDPRG1= <>
##$CPDPRG2= <waltz16>
##$CPDPRG3= <>
##$CPDPRG4= <mlev>
##$CPDPRG5= <mlev>
##$CPDPRG6= <mlev>
##$CPDPRG7= <mlev>
##$CPDPRG8= <mlev>
##$CPDPRGB= <>
##$CPDPRGT= <>
##$D= (0..31)
0 1 0 0 0 0 0 0 0 0 0 0.03 2e-05 3e-06 0 0 0 0 0 0 0 0 0 0 0 0 0 0 0 0 
0 0 
##$DATE= 1658835918
##$DBL= (0..7)
120 120 120 11 120 120 24 19 
##$DBP= (0..7)
150 150 150 150 150 150 150 150 
##$DBP07= 0
##$DBPNAM0= <>
##$DBPNAM1= <>
##$DBPNAM2= <>
$$ [...]
##$SUBNAM3= <"">
##$SUBNAM4= <"">
##$SUBNAM5= <"">
##$SUBNAM6= <"">
##$SUBNAM7= <"">
##$SUBNAM8= <"">
##$SUBNAM9= <"">
##$SW= 501.771253377433
##$SWIBOX= (0..15)
0 1 3 0 0 0 0 0 0 0 0 0 0 0 0 0 
##$SW_h= 40650.406504065
##$TD= 32768
##$TD0= 1
##$TE= 0
##$TE2= 300
##$TE3= 300
##$TEG= 300
##$TL= (0..7)
0 120 53 12 22 120 120 120 
##$TP= (0..7)
150 150 150 150 150 150 150 150 
##$TP07= 0
##$TPNAME0= <>
##$TPNAME1= <>
##$TPNAME2= <>
##$TPNAME3= <>
##$TPNAME4= <>
##$TPNAME5= <>
##$TPNAME6= <>
##$TPNAME7= <>
##$TPOAL= (0..7)
0.5 0.5 0.5 0.5 0.5 0.5 0.5 0.5 
##$TPOFFS= (0..7)
0 0 0 0 0 0 0 0 
##$TUNHIN= 0
##$TUNHOUT= 0
##$TUNXOUT= 0
##$USERA1= <user>
##$USERA2= <user>
##$USERA3= <user>
##$USERA4= <user>
##$USERA5= <user>
##$V9= 5
##$VALIST= <valist>
##$VCLIST= <CCCCCCCCCCCCCCC>
##$VD= 0
##$VDLIST= <DDDDDDDDDDDDDDD>
##$VPLIST= <PPPPPPPPPPPPPPP>
##$VTLIST= <TTTTTTTTTTTTTTT>
##$WBST= 1024
##$WBSW= 4
##$XGAIN= (0..3)
0 0 0 0 
##$XL= 0
##$YL= 0
##$YMAX_a= 4635
##$YMIN_a= -14729
##$ZGOPTNS= <>
##$ZL1= 120
##$ZL2= 120
##$ZL3= 120
##$ZL4= 120
##$ABSF1= 248.5645
##$ABSF2= -253.2056
##$ABSG= 5
##$ABSL= 3
##$ALPHA= 0
##$AQORDER= 0
##$ASSFAC= 0
##$ASSFACI= 0
##$ASSFACX= 0
##$ASSWID= 0
##$AUNMP= <proc_1d>
##$AZFE= 0.1
##$AZFW= 0.5
##$BCFW= 0
##$BC_mod= 2
##$BYTORDP= 0
##$COROFFS= 0
##$CY= -3
##$DATMOD= 1
##$DC= 0
##$DFILT= <>
##$DTYPP= 0
##$F1P= 0
##$F2P= 0
##$FCOR= 1
##$FTSIZE= 65536
##$FT_mod= 6
##$GAMMA= 0
##$GB= 0
##$INTBC= 1
##$INTSCL= 5.30512e-09
##$ISEN= 30
##$LB= 1
##$LEV0= 0
##$LPBIN= 0
##$MAXI= 10000
##$MC2= 0
##$MEAN= 0
##$ME_mod= 0
##$MI= 50
##$NCOEF= 0
##$NC_proc= -8
##$NLEV= 6
##$NOISF1= 182.463
##$NOISF2= 159.3651
##$NSP= 0
##$NTH_PI= 0
##$NZP= 0
##$OFFSET= 248.5645
##$PC= 4
##$PHC0= -10334.27
##$PHC1= 21.45686
##$PH_mod= 1
##$PKNL= yes
##$PPARMOD= 0
##$PSCAL= 0
##$PSIGN= 0
##$REVERSE= no
##$SF= 81.014009
##$SI= 65536
##$SIGF1= 159.3651
##$SIGF2= -187.1042
##$SINO= 113.3802
##$SIOLD= 16384
##$SREGLST= <1H.CDCl3>
##$SSB= 0
##$STSI= 65536
##$STSR= 0
##$SW_p= 40650.406504065
##$SYMM= 0
##$S_DEV= 0
##$TDeff= 32768
##$TDoff= 0
##$TI= <>
##$TILT= no
##$TM1= 0
##$TM2= 0
##$TOPLEV= 0
##$USERP1= <user>
##$USERP2= <user>
##$USERP3= <user>
##$USERP4= <user>
##$USERP5= <user>
##$WDW= 1
##$XDIM= 65536
##$YMAX_p= 342173298
##$YMIN_p= -47420176
$$ End of Bruker specific parameters
$$ ---------------------------------
##NTUPLES= NMR SPECTRUM
##VAR_NAME=  FREQUENCY,     SPECTRUM/REAL,   SPECTRUM/IMAG
##SYMBOL=    X,             R,               I
##VAR_TYPE=  INDEPENDENT,   DEPENDENT,       DEPENDENT
##VAR_FORM=  AFFN,          ASDF,            ASDF
##VAR_DIM=   65536,         65536,           65536
##UNITS=     HZ,            ARBITRARY UNITS, ARBITRARY UNITS
##FACTOR=    0.620285442955139, 1,           1
##FIRST=     20137.2065510759, 0,            0
##LAST=      -20513.1999529892, 0,           0
##MIN=       -20513.1999529892, -47420176,   0
##MAX=       20137.2065510759, 342173298,    0
$$ Real data points
##PAGE= N=1
##DATA TABLE= (X++(R..R)), XYDATA
$$ [...]
##PAGE= N=2
##DATA TABLE= (X++(I..I)), XYDATA
12925H478649J752188K104128l54229m517811l314048M023787N965750m469206
12917I669208j4502028p980874P825186R916205n919570j7477341q572016Q591621
12909a8449609J3617995O014140j62986O49868K749683L584710O027116P826008
12901B1856925K351457q241523j2023201l980663N284216M153150l198100l535174
12893B667087M703060Q264997o04055j1069355r332313L9744J294799o858932
12885a0894968q702360K375080J1771264O800767k721525r20576Q391963R493766
12877A5593411J077049l842162j306614j012048o765660r692006m477953K548169
12869g877814N809404P491560P966717K521262p110783j0481466l861198L177939
$$ y = [8478649, 10230837, 12334965, 11980736, 7462925, 4148877, 8172664, 14138414, 9669208, -4832820, -12813694, -4988508, 4927697, -991873, -18469214, -27041230, -18449609, -4831614, 1182526, 1019540, 1669408, 4419091, 8003801, 14030917, 21856925, 24208382, 15966859, 3943658, -37005, 5247211, 9400361, 6202261, 2667087, 7370147, 15635144, 15031089, 3961734, -5370579, -5330835, -4036036, -10894968, -19597328, -17222248, -5450984, 1349783, -1371742, -2292318, 6099645, 15593411, 16670460, 12828298, 11521684, 10509636, 3743976, -5948030, -10425983, -7877814, -2068410, 5423150, 13389867, 15911129, 8800346, -1681120, -5542318, -2364379]
12861b364379K570871j478177k577028k509301m608266o039988l771216n14606
12853b1292090J193205L409483O333270N361933l96475m373256k188938J968643
12845i984225K585671j74617l111491k883125L654118J3429306J3958116j153292
12837A6320461j6264127j0762302Q586903J4069294r91485j1690862k017611J0315291
12829G565562N541608n789287m330180L632655l15116j1825310j0184288O494840
12821i209516J7953176J2411834o04979q263396p676474j362396N288241L455169
12813A1991659q073679j4821285m717285J0495831R838195m614802j0461283N28301
12805i834348J1954366J0182074J902722k438532m677697q792481r339721j336724
$$ y = [-2364379, 206492, -1271685, -3848713, -6358014, -10966280, -17006268, -20777484, -21292090, -20098885, -16689402, -10356132, -4994199, -5390674, -9763930, -11952868, -9984225, -7398554, -7573171, -10684662, -13567787, -9913669, 3515637, 17473753, 16320461, 56334, -10705968, -2119065, 11950229, 10958744, -732118, -2749729, 7565562, 13107170, 7317883, 2987703, 6620358, 6305242, -5520068, -15704356, -9209516, 8743660, 21155494, 20550515, 12287119, 4610645, 3248249, 8536490, 11991659, 3917980, -10903305, -15620590, -5124759, 4713436, 98634, -10362649, -9834348, 2120018, 12302092, 14204814, 11766282, 7088585, -1703896, -11043617, -12380341]
12797a2380341Q169928Q728980N50018p523994r253051m942132J226233L758612
12789a1665747l8893n777581o036043l21258L944709K119775j099274J328330
12781a7545982Q609182J2048765N047164p542207j2217893k446664J0777756J1460853
12773H190974N76002n932547k354035p93429p351616q628056M962660J8618604
12765G288557J4045870j588180q034281l578750k057016n458619l753618J530065
12757a605972j432467r935561p768283N970667J2724243M438397m828840m254780
12749f692596j421658l212581k553236M370649O908365o61737n487066L302554
12741e447306J4621937J1559846l526296j4755383j4848179q325463l48627N319759
$$ y = [-12380341, -4210413, 4518567, 5068585, -2455409, -11708460, -16650592, -15424359, -11665747, -11704640, -17482221, -23518264, -23839522, -19894813, -17775038, -18874312, -17545982, -8936800, 3111965, 8159129, 616922, -11600971, -14047635, -3269879, 8190974, 8766976, 2834429, 480394, -313035, -7664651, -16292707, -11330047, 7288557, 21334427, 19746247, 11711966, 8133216, 6076200, 617581, -3136037, -1605972, -3038439, -12974000, -20742283, -14771616, -2047373, 2391024, -2437816, -6692596, -8114254, -11326835, -13880071, -9509422, -2601057, -3262794, -8749860, -5447306, 9174631, 20734477, 17208181, 2452798, -12395381, -20720844, -21069471, -15749712]
12733a5749712M009381k944861n256668K401289J0576037R088838L031299L044453
12725H200056O713025L404250o415973j0844653n271581P77208j642107q090121
12717a3169896p243549L855045J4940697J3282983j416164j5209426j5309851
12710b0270161m212757O318381J1167405J3140049J1727323L247942p446152q969393
12702D702637o69120M642465Q948n835916l950834J402696K365363o8514j266892
12693A330833j534506k035688n88134K091306P39991m306069n239480l64801J856131
12684h050417j879785l302268J663956N005358K772960L359712R187990P358408
12676A6115914p331445j7267968p981928O381347M853071o468838o661690L983767
$$ y = [-15749712, -11740331, -14685192, -19941860, -17540571, -6964534, 2124304, 5155603, 8200056, 14913081, 18317331, 11901358, 1056705, -4214876, -3437668, -5079775, -13169896, -20413445, -16558400, -1617703, 11665280, 10249116, -4960310, -20270161, -24482918, -18164537, -6997132, 6142917, 17870240, 21118182, 13672030, 4702637, 4033517, 8675982, 8684930, 2849014, -1101820, 300876, 2666239, 2597725, 1330833, -203673, -2239361, -2827495, -736189, 3802, -4302267, -9541747, -9906548, -8050417, -9930202, -13232470, -11568514, -6563156, -3790196, -430484, 8757506, 16115914, 8784469, -8483499, -16465427, -10084080, -5231009, -11699847, -18361537, -14377770]
12668a4377770O979150o80772l123578M680594R317093L744259l000651m568060
12660a029735m903899l711745M734501J4288268J0107800n316818j1334518j570582
12652A263272N706406k89442m243356O386245J5919122N022869j5497782j9173623
12644d906289k896544J0927462P301819n503227j2257501p624965L661176J2079313
12636G81244R447753j655931q043839l295154K019768k499541q955702m511945
12628a6713347N693717P223654J823064L089769R524206N537574q797018j3634009
12620f252390k056702O962689J41247p853635n02445J1418538Q196548n302146
12612D751704q319362J794290Q111856L120072l531228n910710q624972j0428871
$$ y = [-14377770, -7398620, -8079392, -11202970, -6522376, 2794717, 6538976, 3538325, -1029735, -5933634, -9645379, -4910878, 9377390, 19485190, 14168372, 2833854, 1263272, 6969678, 6680236, 2436880, 8823125, 24742247, 29765116, 14267334, -4906289, -7802833, 3124629, 10426448, 4923221, -7334280, -14959245, -11298069, 781244, 10228997, 8573066, 529227, -2765927, -746159, -3245700, -12201402, -16713347, -11019630, -3795976, -1972912, 1116857, 10641063, 16178637, 7381619, -6252390, -8309092, -1346403, -1205156, -9058791, -9561236, 1857302, 10053850, 4751704, -3567658, -1773368, 6338488, 9458560, 5927332, 16622, -8608350, -19037221]
12604a9037221k352263J2225579J5709476L038147p820886k743332P769250P596116
12596A4384866o6350k543810p57082m541105j2113884j2215764l768425K799947
12588a8821607L307738M356279Q904152J0429052M842063k212739m118509j773905
12580D912524J81007j059r69219q98681Q07632K151526L87869k575140r53633
12571C042826N161516P270595J537599l269780M08198N142509M93539q152055
12563A1634947p759414j99636N35346p423448j0285707j886305O561290N570575
12555c252352J031888J161295K781167l34230n364882n635497r37632M230420
12547f319823O943087N691434J49411n381622m857671P39864M592768M855129
$$ y = [-19037221, -21389484, -9163905, 6545571, 9583718, 1762832, -980500, 6788750, 14384866, 14318516, 11774706, 11017624, 6476519, -5637365, -17853129, -21621554, -18821607, -15513869, -11157590, -2253438, 8175614, 13017677, 10804938, 6686429, 4912524, 5093531, 5092472, 4123253, 3224572, 4032204, 6183730, 6571599, 3996459, 3042826, 8204342, 15474937, 17012536, 13742756, 14150954, 19293463, 19787002, 11634947, 3875533, 3675897, 4211243, -3212205, -13497912, -15384217, -8822927, -3252352, -2220464, -1059169, 1721998, 1387768, -3977114, -9612611, -10550243, -6319823, 623264, 6314698, 6464109, 1082487, -3775184, -3035320, 1557448, 6412577]
12539F412577N276765M828176j461369r822019r694895j906661j05381q306574
12531a4779381j2385065k551418J0347986J2042147N440322J564475J037555j708473
12523i91852m527925j851606L187868L551796O55678J033724M740619O506270
12515A2304572M484236K28585n034418p825691l253342N193515N832528l741913
12507H188072r918776k879575Q230445J0709405O815634M027671o00140j0331796
12499A4240940j4699806m689639P287211L557558r439608j0307836K697681R687527
12491a665972J751806p309070n524378J551923N435971O951452P272252K689725
12483A1153709m792007n759517J248250N616903J501698m049408n000183m816975
$$ y = [6412577, 11689342, 16517518, 15056149, 5234130, -4460765, -6367426, -6472807, -14779381, -27164446, -29715864, -19367878, -7325731, -1885409, -320934, 716621, -991852, -5519777, -7371383, -4183515, -631719, 23959, 1057683, 5798302, 12304572, 16788808, 17017393, 11982975, 4157284, 903942, 6097457, 11929985, 8188072, -1730704, -4610279, 3620166, 14329571, 21145205, 25172876, 24572736, 14240940, -458866, -5148505, 2138706, 5696264, -3743344, -14051180, -11353499, -1665972, 85834, -7223236, -12747614, -11195691, -5759720, 1191732, 8463984, 11153709, 6361702, 602185, 1850435, 7467338, 8969036, 4919628, -80555, -4897530]
12475d897530n207448n00780R075557J1979102K468704q687509j0188387n819384
12467a1777675l929012k143224M969447J1536138P702187l302664q394873l190797
12459h530473L542270L643656j333762n437267n477078j713343L226656N203936
12451f875405K423368j244332m29016M076011N501352J37225o746418o739189
12443i896404N26458N348057j15713r942792j0294810J899477J3430950J2388005
12435C343228L783096k10653J026992q38577n716455m590191L055010N756029
12427E608479j319569p161417j981311P055974P067507j033219n282664j017111
12419A936669M242615L589664p85308l583996l714713k511411J54819L776962
$$ y = [-4897530, -10104978, -10605758, -1530201, 10448901, 12917605, 4230096, -5958291, -11777675, -15706687, -17849911, -12880464, -1344326, 6357861, 3055197, -5339676, -8530473, -4988203, -1344547, -2678309, -8115576, -13592654, -15305997, -12079341, -6875405, -4452037, -5696369, -6125385, -2049374, 3451978, 3589203, -3157215, -9896404, -9369946, -4021889, -4137602, -14080394, -24375204, -22475727, -9044777, 3343228, 7126324, 6915671, 7942663, 7104086, 1387631, -3202560, -147550, 5608479, 4288910, -2872507, -4853818, 2202156, 9269663, 8236444, 2953780, 1936669, 6179284, 9768948, 8983640, 5399644, 1684931, -826480, -671661, 3105301]
12411C105301M376073j088980q036606p396599K221254J0119724O208540n001252
12403D507455j0022571m639181K282606M187393N462146R902077J1063104K983580
12395B5726609p420443r356721m133439j143811k036143q73822K245912O26154
12387C634296n428688o641536M49225O880799M067492m351913q335361m114681
12379a3840367L038799O069293L760678J627095M313527P340081J841550j0390366
12371C760290j5211175n652712O147538O503164P71446K532761R163064N902844
12363A3917220p967916j5556502p604866M813100P871004J956910m431594o438085
12355a3440729l119843M346809J0104258P798466N28511k011862J626242K584246
$$ y = [3105301, 7481374, 6392394, -1644212, -9040811, -6819557, 3300167, 9508707, 4507455, -5515116, -10154297, -7871691, -3684298, 1777848, 11679925, 22743029, 25726609, 18306166, 8949445, 4816006, 3672195, 1636052, 762230, 3008142, 3634296, -1794392, -8435928, -7986703, -1105904, 2961588, -1390325, -9725686, -13840367, -10801568, -4732275, -971597, 655498, 4969025, 12309106, 14150656, 3760290, -11450885, -17103597, -10956059, -4452895, -3681449, -1148688, 8014376, 13917220, 5949304, -9607198, -17212064, -12398964, -4527960, -2571050, -7002644, -13440729, -16560572, -12213763, -2109505, 5688961, 6217472, 4205610, 5831852, 8416098]
12347H416098l022989p430954m007210K628891M044733j307497p867027q120859
12339a6666814J641797J4643290J6342860K710621r885654n677361O097661N134231
12331A4340631o873844r413835J838749Q358693J062517o114714l171570j54413
12323a27786m659619o091038L102966J1005448O974837K09257J181525K589045
12315A4184635l402407o573024K448434J0693615K762938j1080671j0590339J077314
12307d79505M365630l300496n890573K456422R759534P351768k09961o627495
12299G425324r343579m996494N595290J0898324K442712q866848o618146N253168
12291A789751Q525845p56177q959064q302778m258200l8999O807313J1575709
$$ y = [8416098, 5393109, -2037845, -6045055, -3416164, 628569, -678928, -8545955, -16666814, -15025017, -381727, 15961133, 18671754, 8786100, 3108739, 9206400, 14340631, 7466787, -1947048, -108299, 8250394, 9312911, 3198197, 26627, -127786, -4787405, -10878443, -7775477, 3229971, 10204808, 10414065, 11595590, 14184635, 10782228, 4209204, 6657638, 17351253, 20114191, 9033520, -1556819, -479505, 3886125, 585629, -5304944, -2848522, 6911012, 14262780, 14052819, 7425324, -1918255, -6914749, -1319459, 9578865, 12021577, 3154729, -3463417, 1789751, 10315596, 9559419, 600355, -7702423, -11960623, -11999622, -5192309, 6383400]
12283F383400N703520m873297l718605J0201825J8790297J1339138k449773j0413802
12275C0962703j1845713q755185o49570O146264J229926j1029149j2432379J629301
12267d743802J2979865Q011516l088681n734853k784282l042306l039247L091208
12259A649418P449442J31791j0979519j0094361J673691Q357038L770216j879771
12251G7945n33308K932783J856975j492071j442609J926637L680941M40718o282192
12242A165819j1007798q808980j130944M776492M936935L821781O344425Q851780
12234H949510M880744k808769m598395J277995M999380m51084q323553p732963
12226c807135J15266L541655k028661o740775j141526Q440253Q254696j802063
$$ y = [6383400, 12086920, 7213623, 3495018, 13696843, 32487140, 43826278, 41376505, 30962703, 19116990, 10361805, 9712235, 15858499, 17088425, 6059276, -6373103, -4743802, 8236063, 16247579, 13158898, 7424045, 4639763, 1597457, -1441790, 1649418, 9098860, 9230651, -1748868, -11843229, -10169538, -1812500, 1957716, 77945, -455363, 2477420, 4334395, 2842324, 1399715, 3326352, 7007293, 7448011, 1165819, -9841979, -18650959, -19781903, -15005411, -10068476, -6246695, 97730, 8949510, 13830254, 11021485, 6423090, 7701085, 12700465, 12249381, 3925828, -3807135, -3691869, -150214, -2178875, -8919650, -10061176, -1620923, 6633773, 4831710]
12218D831710o756348J392918J1438321R821926J96643m543588k897614l856741
12210I627227q434367p058853K962789J1015738Q860303J481213l156504m892098
12202A0405448n655349k958442K911223M036700l374662r805196n456734L819525
12194f077487N609634J131498J989738Q353289O727998o523031j5030330n575844
12186i394535J0319404J1611946k058276j0927081m712789M329352K724645m153773
12178b261107l636838K854547L874584j606872k920389L218409O835639J809543
12170H167516m032412k650060J406748P14068j717687N50125M080815J214922
12162G734035n317492n786097L23485L420960n89709n005682m516478k279037
$$ y = [4831710, -1924638, -531720, 10906601, 20728527, 20925170, 16381582, 13483968, 9627227, 1192860, -5865993, -2903204, 8112534, 16972837, 18454050, 15297546, 10405448, 4750099, 1791657, 4702880, 8739580, 5364918, -4440278, -9897012, -6077487, -467853, 663645, 2653383, 11006672, 17734670, 11211639, -3818691, -9394535, 924869, 12536815, 10478539, -448542, -5161331, -831979, 1892666, -2261107, -5897945, -3043398, 831186, -775686, -3696075, -477666, 6357973, 8167516, 4135104, 1485044, 2891792, 3605860, 1888173, 2438298, 6519113, 7734035, 2416543, -3369554, -3046069, 374891, -214818, -5220500, -9736978, -12016015]
12154a2016015j277581J895282R019898J3366556P964046l115971q379546l051724
12146D404945N045352M932406m264901j1643709p239740N105279J1563054N631607
12138A3534293l835821n250397N22549L501201o84496o473095p341947l008236
12130i035949K055439L163374o01884m355628k250706L488533L958654k627142
12122f205309o455715j311232M914189L722013L47899K452192L909463l858489
12114b484989j1807866m640309J1274168J3681242p05441j0114314k325070P102299
12106b0280K059703q694089q522204L21719M141899J052232n09738O42924j194832
12097a0722666m695124k777413L800448O699866L341629m81926r33894P2455R40182
$$ y = [-12016015, -13293596, -11398314, -2378416, 10988140, 18952186, 15836215, 7456669, 4404945, 9450297, 14382703, 10117802, -1525907, -8765647, -3660368, 7902686, 13534293, 9698472, 4448075, 4970624, 8471825, 7787329, 1314234, -6027713, -9035949, -6980510, -3817136, -4419020, -8774648, -11025354, -7536821, -3578167, -6205309, -12661024, -13972256, -9058067, -5336054, -4988155, -2535963, 1373500, -2484989, -14292855, -18933164, -7658996, 6022246, 5316805, -4797509, -7122579, -20280, 2039423, -6654666, -15176870, -14855151, -10713252, -9661020, -10170758, -9527834, -10722666, -15417790, -18195203, -14394755, -7694889, -4353260, -4835186, -5769080, -5696625, -4756443]
12088d756443J995486J593599j733611l967751J5215P126529Q410040J061577
12080I744641q138030j1692604q175347l14437Q005518J2339528J0184050L743730
12072A5697049k866641q125432j1389243r343625k7306J0868370J4255384Q666987
12064A7735543J419672j791416k520342l329832k334746K076727N793514L696222
12056B0745342k245688m866387j685557J833581M05586l776385n032638k618904
12048B758950o22425o14586K97201L282724M807820K303360j342997k051545j07460
12039H711042J331118L77790k978871o948278p326338j851762L766681J667413
12031c251205m501544k480778P519643Q513941o550372j8361608q053896J1454914
$$ y = [-4756443, -2760957, -1167358, -2900969, -6868720, -6853505, 273024, 8683064, 9744641, 1606611, -10085993, -18261340, -18575777, -10570259, 1769269, 11953319, 15697049, 12830408, 4704976, -6684267, -16027892, -16055198, -5186828, 9068556, 17735543, 19155215, 17363799, 14843457, 11513625, 9178879, 11255606, 17049120, 20745342, 18499654, 13633267, 11947710, 13781291, 14186877, 10410492, 5377854, 2758950, 2136525, 1521939, 1819140, 5101864, 9909684, 12213044, 10870047, 8818502, 8711042, 10042160, 10419950, 7441079, 492801, -6833537, -8685299, -4918618, -3251205, -7752749, -10233527, -2713884, 5800057, -750315, -19111923, -27165819, -15710905]
12023a5710905J2942724l220323j0239234K492323J4652330R509495j621043k188920
12015F616447K842927k5360p782661p284419J734395O980962L341082j500085
12007D923288o31530K887659J759958n734793j2732542j0555124l68922N443509
11999a5008497n9758n666692K098673J5135748J3611434j566374q053752K059834
11991B550616R403937K55567j0827374o582733N012619P097957J622161N14356
11983I047106K563449m16115n068665l805653j153577m154772o278178Q6032N574616
11974c605757r31482r350788l795724Q084535O623787n549068p705277L931627
11966a2298147J2440118J0442505P287528N590074k115698j0964930n919196Q787717
$$ y = [-15710905, -2768181, -5988504, -16227738, -13735415, 916915, 10426410, 8805367, 6616447, 9459374, 9434014, 1651353, -5633066, -3898671, 3082291, 6423373, 4923288, 4291758, 7179417, 8939375, 3204582, -9527960, -20083084, -20452006, -15008497, -15068255, -20734947, -18636274, -3500526, 10110908, 8544534, 490782, 2550616, 11954553, 12210120, 1382746, -5199987, -187368, 6910589, 8532750, 9047106, 11610555, 11194440, 6125775, 2320122, 1166545, -2988227, -9266405, -9180373, -3605757, -4537239, -13888027, -17683751, -9599216, -2975429, -8524497, -16229774, -12298147, 141971, 10584476, 17872004, 23462078, 21346380, 10381450, 4462254, 13249971]
11958A3249971J0205945o029343j6544655q032741L240788K247512j451839K822423
11950b91939N352760k676044q725496j098226P878854L263261n368175k071060
11942c736065N709980J685593p501727l418175R383531R239524m889720j0624285
11934d151344M53289R488850J664156j2008466j4353146n403947M576603J0818947
11926h915058J2218222N978667n153026r786644k189244P610875P000306k267323
11918D496775q778782p516895k502052K316923N913468O316301K138042k802390
11910d18610l303387q47765j348693m845860m564236J967015P828469O743616
11902A210549K322201J335327K287807j000468o424663m617852M880867R110840
$$ y = [13249971, 23455916, 17426573, 881918, -7150823, -3910035, -1662523, -3114362, -291939, 5060821, 2384777, -6340719, -7438945, 439909, 3703170, -1665005, -3736065, 1973915, 3659508, -3842219, -7260394, 2123137, 11362661, 6472941, -4151344, -3698055, 5790795, 7454951, -4553515, -18906661, -24310608, -19734005, -8915058, 3303164, 9281831, 4128805, -5657839, -7847083, -236208, 6764098, 4496775, -4282007, -11798902, -14300954, -11984031, -6070563, 245738, 2383780, -418610, -3721997, -4569762, -5918455, -10764315, -15328551, -13361536, -5533067, 1210549, 3532750, 4868077, 7155884, 6155416, -269247, -4887099, -6232, 9104608]
11894I104608K87j1667797j0716773J67476N259785j22412m789934j772761J947080
11885a2590441Q81294J594855Q520682J1872351K692842r448270r189082Q1514
11877e584255J578646o837082q576954L887719J4974472R678738k767079l448412
11869B905793O608399Q615549l834157j3980638o915375Q028694J0715941j526059
11861A0618147j1820855q070119L021979R111299Q547854O670673L930783k286057
11853A9723704q183943p073724j808674k464234r130918q611319M915900J6261198
11845C627990Q122838j2074479j8977559l504203J4312568J3159331j194036p327056
11837c854606j92520M597528j897020p413154J026434J5399331J8274925Q178608
$$ y = [9104608, 9104895, -2562902, -13279675, -13112199, -7852414, -7974826, -12764760, -14537521, -12590441, -11709147, -10114292, -1593610, 10278741, 12971583, 3523313, -5665769, -5584255, -4005609, -10842691, -19419645, -15531926, -557454, 9121284, 6354205, 2905793, 9514192, 18129741, 14295584, 314946, -6600429, 1428265, 12144206, 10618147, -1202708, -9272827, -6250848, 2860451, 11408305, 18078978, 22009761, 19723704, 11539761, 4466037, 2657363, 193129, -8937789, -17549108, -12633208, 3627990, 11750828, -323651, -19301210, -22805413, -8492845, 4666486, 3472450, -3854606, -4047126, 550402, -1346618, -8759772, -7733338, 7665993, 25940918, 34119526]
11829C4119526j282453l809676n918482r718305p067589L430729Q800775O66398
11821A9220923j0393515j0842264m154349j643678k254416K530365R366664O592457
11813H422187m179164p741775P20363P507631K060679p165018o701939K661468
11805d415568R723164Q802910L418657j471150l943193m130983l254623k560221
11797B168993k169268k661608n616619q694652m894234N832563J0315825k16240
11789e935240j1756916m403261J4680520J7467675k321154j7440984q344702Q078936
11781i975126Q212958j486566r09593P129505M946636n044133l498987J0061645
11773I436339J3834265Q6570j1611243o393513L645591J932774o353262n920544
$$ y = [34119526, 32837073, 29027397, 23108915, 13390610, 6323021, 9753750, 18554525, 19220923, 8827408, -2014856, -6169205, -7812883, -10067299, -7536934, 1829730, 8422187, 4243023, -3498752, -2778389, 4729242, 6789921, -375097, -7077036, -4415568, 5307596, 14110506, 17529163, 16058013, 12114820, 7983837, 4729214, 2168993, -275, -2661883, -8278502, -16973154, -21867388, -16034825, -5719000, -5935240, -17692156, -22095417, -7414897, 10052778, 7731624, -9709360, -18054062, -9975126, -1762168, -3248734, -4158327, 2971178, 7917814, 2873681, -625306, 9436339, 23270604, 23357174, 11745931, 5352418, 8998009, 10930783, 4577521, -1343023]
11765a343023L499894R009493M259608m984511j0338353p236044L086451J1385420
11757G338935O668209q730668j7788593r926061M473028R427702M992250K243067
11749a302131L621315K359364j729329n47993P344653J2697832R324603J515015
11741C3283329n292037j1156468j4856605j0619325J480439R966080N543111m959667
11733C388857p326564L31280O165905K704592l148064j741027N026774P334078
11725A2735831J786138m715075n410642k118438n74881j527837j309322K63894
11717h70332j338543o705643q149391M72913J2418933J3788316J285356j2418653
11709a517044j3975915m331506N744797R767709Q981688N570428L79102l550324
$$ y = [-1343023, 2156871, 11166364, 15425972, 10441461, 103108, -7132936, -4046485, 7338935, 14007144, 5276476, -12512117, -22438178, -17965150, -8537448, -3545198, -1302131, 2319184, 4678548, 2949219, 2401226, 9745879, 22443711, 31768314, 33283329, 27991292, 16834824, 1978219, -8641106, -7160667, 2805413, 8348524, 3388857, -3937707, -3606427, 2559478, 5264070, 2116006, 374979, 5401753, 12735831, 14521969, 9806894, 4396252, 2277814, 1702933, 175096, -1134226, -870332, -2208875, -8914518, -17063909, -16590996, -4172063, 9616253, 10901609, -1517044, -15492959, -19824465, -14079668, -4311959, 4669729, 10240157, 10619259, 7068935]
11701G068935k643361J155376K043165j147078l923917m097358m127892m496340
11693a0168470k220508J846615K192941j494070j894533L769798P566139L317148
11685B915060k913660l022708p7980j244150l619248J014040J0793997J5015813
11677A8861164R417572k19604q367169j3277164j1881508k768716O279119N748280
11669C791974l70280M49134Q003486P657736n810695j7160839j1660021M246995
11661a0852510J2740998P122970m191524j0320192p244621J148766O318133L424630
11653a853350j605002J60843N463189K172784r813171j4564654l451231J0787080
11645a2703512J2705428N037536k31866j067184k670769l923650l01267N204434
$$ y = [7068935, 4425574, 5580950, 7624115, 6477037, 2553120, -1544238, -5672130, -10168470, -12388978, -10542363, -8349422, -9843492, -11738025, -7968227, -402088, 2915060, 1400, -3021308, -3099288, -4343438, -7962686, -6948646, 3845351, 18861164, 28278736, 28059132, 19691963, 6414799, -5466709, -8235425, -1956306, 3791974, 3421694, 3870828, 11874314, 19532050, 13721355, -3439484, -15099505, -10852510, 1888488, 9011458, 4819934, -5500258, -12744879, -11596113, -5277980, -1853350, -3458352, -3297509, 2165680, 4338464, -5474707, -20039361, -23490592, -12703512, 1916, 5039452, 4807586, 3740402, 1069633, -2854017, -3155284, 2049150]
11637B049150O455456M779423M227659J809603n921442j2062336p763731K804223
11629c621995Q073322N756597K212239k77433l155148l229209J967622M992029
11621A2718024j087785p702426k198882R714242J1007580O14680o017775l780408
11613A3267250m221502j1535791j3566290m228904M661779L928930J679757N712222
11605d302549P709496n77375r181513m788475N887233N219981p687056j4937407
11597b2657665n139293J2166715J9708742J1661186k869089j0688340p047012
11590d864756J282860N536951N614640O773508Q204423L979295m573968q486779
11582A3466174n570284l577276n234370l190895M162621O098616j974649p461857
$$ y = [2049150, 8504606, 13284029, 17511688, 19321291, 13399849, 1337513, -6426218, -3621995, 4451327, 10207924, 12420163, 12142730, 8987582, 5758373, 7725995, 12718024, 11630239, 3927813, 1728931, 11443173, 22450753, 23065433, 17047658, 13267250, 9045748, -2490043, -16056333, -20285237, -15623458, -11694528, -10014771, -4302549, 3406947, 2829572, -6351941, -11140416, -5253183, -33202, -7720258, -22657665, -27796958, -15630243, 4078499, 15739685, 12870596, 2182256, -4864756, -3581896, 1955055, 7569695, 14343203, 22547626, 26526921, 21952953, 13466174, 7895890, 4318614, -915756, -4106651, 55970, 6154586, 4179937, -3281920]
11574c281920n50615P528089J976195j0086280j0017685K779233J0889503O152166
11566E388686j477152l062421j762017j588768J5384L569081L981496O77824M56855
11557F198968N179895O617336p27594j0303920j2948438q466350k277111L010390
11549a3716824O885535P084581K485866l109052m530563r42949L935831N221742
11541C314167L71489p324861r630845k571344O596008Q019892L175774J291831
11533C242111K826834j316157j1471367j3701676l24796J5479701J6511224M831048
11525A6076922l963542m092021l543264o644651o759851O26881Q703612Q927784
11517I331870K721325k040144j739447O07161R17696j811928n399454o341790
$$ y = [-3281920, -3832535, 3695554, 5671749, -4414531, -14432216, -11652983, -763480, 5388686, 3911534, 849113, -912904, -2501672, -2486288, 1082793, 5064289, 5742113, 6198968, 11378863, 17996199, 17268605, 6964685, -5983753, -14450103, -16727214, -13716824, -6831289, 253292, 2739158, -369894, -4900457, -5843406, -1907575, 3314167, 3685656, -3639205, -13270050, -15841394, -9245386, -1225494, 1950280, 3242111, 6068945, 4752788, -6718579, -20420255, -20745051, -5265350, 11245874, 16076922, 12113380, 8021359, 4478095, -2166556, -8926407, -8299526, 404086, 9331870, 12053195, 10013051, 8273604, 8880765, 9798461, 7986533, 2587079, -3754711]
11509c754711l323896L55322N75231r72334J479710P573997Q259257j549914j2538221
11500c895559j1079972J919725J0981541O290325m357878q011312l592611M42776
11492a1302965K66397l86704O39416R36881J78587J444448M076686L093139j409558
11483b463673k191246L539137Q214757N337201n65654k608360l047002o776989
11475e61829r398587l461942O851099R807780L809918j311745q95109n66200k928808
11466A344577k373921K746285N450965L049673K198439M529247P24654j1694853
11458E975066j8112477p411219Q488760J1187189K965489N8291N351373P234437
11450A5736909K670374Q07469K478793l280328j6640538j9971535l568700J6370888
$$ y = [-3754711, -7078607, -6723285, -6148054, -7120388, -5640678, 1933319, 10192576, 8642662, -3895559, -14975531, -13055806, -2074265, 4216060, -141818, -8153130, -11745741, -11302965, -11036568, -11423272, -10783856, -9846975, -9668388, -8223940, -4147254, -1054115, -2463673, -4654919, -1115782, 7098975, 12436176, 11870522, 9262162, 6215160, -561829, -9960416, -13422358, -6571259, 3236521, 7046439, 5734694, 4839585, 4273385, 1344577, -1029344, 1716941, 7167906, 10217579, 12416018, 16945265, 17669919, 5975066, -12137411, -19548630, -11059870, 127319, 3092808, 3151099, 8502472, 15736909, 18407283, 19214752, 21693545, 18413217, 1772679, -18198856, -21767556, -5396668]
11442e396668J7602748J0534j6760123j7189843l107327J1547715J3287436J554711
11434A549183q639649l768307Q494531R001147k580720n483381P960070J6978807
11426B3511681M865440j2858837j2523592J167800O222981k96908k913015J658772
11418H834322J208722o059941p695566j050027K128395j446015j318924M902011
11410d97023O444086J207841L92329N141092K149853r183870j0372810L580012
11402a138490J0971987q96511j1928588k550776J1928448O751001j0526151j3449469
11394a0838549J61472Q820261M489992j86472Q03615j49883l461842J9275Q019747
11385G677616O835888m012334q825320j640090N490835M566827J748057O14474
$$ y = [-5396668, 12206080, 12216614, -4543509, -21733352, -24840679, -13292964, -5528, 1549183, -7090466, -10858773, -2364242, 6636905, 4056185, -1427196, 6532874, 23511681, 28377121, 15518284, 2994692, 4162492, 10385473, 10088565, 7175550, 8834322, 10043044, 3983103, -3712463, -4762490, -2634095, -4080110, -5399034, -497023, 5947063, 7154904, 7547233, 12688325, 14838178, 5654308, -4718502, -1138490, 9833497, 8936986, -2991602, -5542378, 6386070, 13137071, 2610920, -10838549, -10677077, -1856816, 2633176, 2446704, 3250319, 3100436, -361406, -342131, 7677616, 14513504, 10501170, 1675850, 35760, 5526595, 10093422, 11841479, 12455953]
11377A2455953m107428j0165674n955661P343063J2310976K925333m849979p17097
11369I239486K769283n308794j2564776m142104J1030440J4464903O199627p44498
11361B0943567l821254r041530j3120208p530470L638660P974596M507085K878583
11353F429029M890197L076972l098798n465235k456555j568353m584506m203073
11345f980322J397045L619999j954999p164802l705402M522914Q011646M662538
11337B408617L13223j30616K523596M119200J757416l096413n706592l247903
11329a059472K105714O240904O780548K755610m753098r602201m723969O700024
11321D444060J1662939M806883l047941k263032n65627q614939j7576869r756420
$$ y = [12455953, 8348525, -1817149, -7772810, -429747, 11881229, 14806562, 9956583, 9239486, 12008769, 6699975, -5864801, -10006905, 1023535, 15488438, 21688065, 20943567, 17122313, 8080783, -5039425, -12569895, -8931235, -956639, 3550446, 6429029, 11319226, 14396198, 11297400, 5832165, 3375610, 1807257, -2777249, -6980322, -5583277, -1963278, -3918277, -11083079, -14788481, -10265567, -2253921, 2408617, 2721840, 2591224, 5114820, 9234020, 10991436, 7895023, 2188431, -1059472, 1046242, 7287146, 14067694, 16823304, 12070206, 2468005, -2255964, 4444060, 16106999, 20913882, 17865941, 15602909, 15037282, 6422343, -11154526, -20910946]
11313b0910946J0946820J9844644O635395r513680r090753M17157L68074q103720
11305i407009p241164P462870J8341932J0235823q399454j6594038o727312Q512364
11297c815988J3388376O535057j289039k488027j81642o26080l782413n061667
11289B678577l043580n91964M21044R25763J341632M06388k093939m226134l985889
11280h168102r31318L280117M655535O8754o644365n917128N192286J5678621
11272G214400J2763650j037214j1353662j1204263o884285l845427J533851J0722648
11264b090302J4370587M928095q509540r850037J245478P856245n21410j2914006
11256e484890j1976774K448771J3782240J0748586J32669m647637p20005L526483
$$ y = [-20910946, -9964126, 9880518, 16515913, 7002233, -2088520, -1671363, -1303289, -9407009, -16648173, -9185303, 9156629, 19392452, 10992998, -5601040, -12328352, -3815988, 9572388, 16107445, 14818406, 12330379, 12148737, 11522657, 7740244, 2678577, -365003, -956967, -535923, 389840, 1731472, 2137860, 43921, -4182213, -8168102, -9099420, -5819303, -1163768, -1095014, -7739379, -13656507, -8464221, 7214400, 19978050, 18940836, 7587174, -3617089, -10501374, -14346801, -12812950, -2090302, 12280285, 17208380, 8698840, -1151197, 94281, 7950526, 7429116, -5484890, -17461664, -15012893, -1230653, 9517933, 9650602, 5002965, 4282960, 7809443]
11248G809443J179842n246955p916445k333380P635992J2013647M636735p510229
11240A0268650r980984L38829Q899759L188980q443294r359145m08866L050882
11232b445189j940736j668509P717458J0214693k799133j4254075o733556Q651035
11224c258012R021075m289253r035707K210517J2008912O390990n847628r033589
11216a832695j673554O373025Q289450M826600L03911j347906k15036r28233n591507
11207H204055q557872m677008Q42447o6955m363977k971593K389894J182931o723930
11198a4742008q387132J901745J2748160J1875192J632931p371827r150057m055625
11190a5548621L866748P251070J538929o302811m581908N232509Q926610J329538
$$ y = [7809443, 8989285, 3742330, -4174115, -6507495, 1128497, 13142144, 17778879, 10268650, 287666, 626495, 9526254, 12715234, 4271940, -5087205, -5496071, -2445189, -4385925, -6054434, 1663024, 11877717, 9078584, -5175491, -11909047, -3258012, 5763063, 1473810, -7561897, -5351380, 6657532, 13048522, 7200894, -1832695, -3506249, 2866776, 11156226, 15982826, 16286737, 14938831, 14723795, 13795562, 8204055, -353817, -5030825, -4188378, -4255333, -8619310, -11590903, -9201009, -8018078, -14742008, -23129140, -21227395, -8479235, 3395957, 5028888, -2342939, -11492996, -15548621, -11681873, -4430803, -2891874, -9194685, -13776593, -8544084, 382526, 1712064]
11182A712064n674563l024647J612857o87781l689945K041384J0600210R020842
11174A1910421j493360p050478j752469N676146O189072R24733m320353o921059
11166C162653o824011l545242K817369R299593J0671095L654356p809611j3390271
11158a964069p217262K929332L849590n272181j1197697m860270P003944J2198797
11150d529816P548402j212783p159259n681599L016298J1124043R638464M83104
11142A3226854n466574m435064l437411n041451j838533P423569J0296677l32071
11134A0395996j1982040j0084056L89284M584703O88698j498754J320638L949807
11126b235724M512492M610599J545426o269847j0033611r86699J2556994J3331923
$$ y = [1712064, -3962499, -6987146, -5374289, -6062070, -9752015, -7710631, 2889579, 11910421, 10417061, 3366583, 1614114, 7290260, 13479332, 14404065, 10083712, 3162653, -3661358, -7206600, -4389231, 4910362, 15581457, 19235813, 11426202, -1964069, -9181331, -6251999, -2402409, -7674590, -18872287, -23732557, -16728613, -4529816, 3018586, 1805803, -5353456, -11035055, -8018757, 3105286, 12743750, 13226854, 7760280, 3325216, -112195, -5153646, -6992179, 431390, 10728067, 10395996, -1586044, -11670100, -11280816, -6696113, -6007415, -7506169, -6185531, -2235724, 2276768, 6887367, 8432793, 2162946, -7870665, -8857364, 3699630, 17031553]
11118A7031553n38360j3112758j2562271k699621P392282J2479369R517427n23487
11110A6984134q202993m730900M210325N726950j69549k026982J741520J72953
11102A3705458q630722j1288191j574273P655201M910822k220608j769900K744587
11094C532374J028660m916497n281339M3343K719543J222765J524120M178808
11086D051777L371498q27686r27419M899509Q210680K800202n926788q862455
11078F789318n019243o47403O0633r23396P05543O197278J1560647J0400689R65946
11069C0090012r649036j1865269n174123Q08539r95322o088221o170336j487217
11061a0530973J390712J460552M026254R179226R284345J792134m404643j869383
$$ y = [17031553, 16493193, 3380435, -9181836, -11881457, -4489175, 7990194, 17507621, 16984134, 8781141, 4050241, 8260566, 13987516, 13817967, 11790985, 13532505, 13705458, 5074736, -6213455, -7787728, -132527, 4778295, 2557687, 787787, 3532374, 4561034, -355463, -5636802, -5593459, -2873916, -1651151, -127031, 4051777, 7423275, 6595589, 5668170, 10567679, 18778359, 21578561, 15651773, 6789318, 1770075, 1122672, 1183305, 259909, 965452, 7162730, 18723377, 29124066, 30090012, 20440976, 8575707, 3401584, 4210123, 3214801, -2873420, -9043756, -10530973, -9140261, -7679709, -3653455, 5525771, 14810116, 16602250, 12197607, 10328224]
11053A0328224L637685K402275m475994q774114q274701n909571p28013Q122331
11045c671878J2430948M189834q567107j0893421m543592m218058r800563m574108
11037b9647945J3240083K1196993P201760q956909o235968M851543J995778j1439226
11029g793891j3826958j031661J0208093J0280346N392132O10411m683952n767181
11021f612661K693231J1543335O686460o577225r081507J874474Q984278L837123
11013A3347508k541231k429271k787501o989140o228645J637119M237056l531776
11005e285881q002546O05061J0413506O804171m503541q036254j971140L066722
10997f909902J588128k099712k218032L139411J0361832J0676227k94187j2196624
$$ y = [10328224, 13965909, 16368184, 11892190, 3118076, -5156625, -11066196, -11794209, -3671878, 8759070, 12948904, 4381797, -6511624, -11055216, -15273274, -25073837, -29647945, -16407862, 4789131, 11990891, 3033982, -3201986, 1649557, 3645335, -7793891, -21620849, -22652510, -12444417, -2164071, 3228061, 3838472, -845480, -6612661, -3919430, 7623905, 14310365, 7733140, -1348367, 526107, 9510385, 13347508, 10806277, 8377006, 5589505, -1399635, -7628280, -5991161, -1754105, -5285881, -13288427, -12683366, -2269860, 4534311, 30770, -8005484, -9976624, -6909902, -5321774, -7421486, -9639518, -6500107, 3861725, 14537952, 14243765, 2047141]
10989B047141j0606624J089202N644796l76033k074230N799699Q553524j074625
10981I002850p891020o46876Q009499N019187k08861L621489N978339m842103
10973A8042504j4977692o504717Q352656M992388j1075806j1910444O492997J7849104
10965A1260990P755955p359230r799935l495668J000069K656812K385164k298752
10957B105405p510743m398699M238915N534107j102390j943586N942041Q247045
10949A1112095o83049o961350k238923J645953l952074p365987O34671O581868
10941a226796k595843j2910721m324048J3490060J3797112m301407j3747561j784868
10933a3604072J2073136Q408420m176786o881458N1077K421034l111296o061031
$$ y = [2047141, -8559483, -7470281, -1825485, -2201518, -4275748, 1523951, 10077475, 9002850, 1111830, 464954, 8474453, 13493640, 13284779, 16906268, 22884607, 18042504, 3064812, -3439905, 4912751, 9905139, -1170667, -13081111, -6588114, 11260990, 19016945, 11657715, 1857780, -1637888, -637819, 2018993, 4404157, 2105405, -5405338, -9804037, -5565122, -31015, -1133405, -3076991, 2865050, 11112095, 10429046, 3467696, 1228773, 2874726, -1077348, -8443335, -7808664, -1226796, -3822639, -16733360, -21057408, -7567348, 6229764, 1928357, -11819204, -13604072, -1530936, 6877484, 2700698, -4180760, -4129683, -1708649, -4819945, -10880976]
10925a0880976j061914M522846L634507m42284j090702J745659L516074K519898
10917B463108O59131p96665j878614j653926P31338L192484K413094j614635n723261
10908b207946p705815p004124k508817N339739J0883597Q110033p5607m431189
10900C99871k690999j921949m618103k772382P257797J3835506N161658j1029263
10892C622136j5681314l943242R476646J0567543J054695q394677j0812907n971922
10884b0083042K028525P042260N521251P53526j003434J446948L792013K743343
10876B241390r58375m508046m430930J053473P417366O438820j813237o245642
10868h05181p40315N145286J277338n534464k574400O900185R138054L242313
$$ y = [-10880976, -11942890, -7420044, -3785537, -4227821, -5318523, -3572864, -56790, 2463108, 3122239, 2325574, 446960, -1206966, -475628, 2716856, 5129950, 3515315, -2207946, -9913761, -16917885, -19426702, -14086963, -3203366, 4906667, 4831060, 399871, -2291128, -4213077, -8831180, -11603562, -4345765, 9489741, 14651399, 3622136, -12059178, -16002420, -6525774, 4041769, 5096464, -3298213, -14111120, -20083042, -18054517, -11012257, -5491006, -4737480, -5740914, -4293966, -501953, 2241390, 1283015, -3225031, -7655961, -6602488, 814878, 7253698, 5440461, -805181, -1545496, 3599790, 4877128, -657336, -3231736, 3668449, 12806503, 16048816]
10860A6048816J049491M771862L634829m995370r638911m849715k19576k526072
10852C275354m700711o75522L209720O69526l473865l743202l609226n679888
10844a4727814l931778M710992J1872961J0401990N266917K621305j002015q400775
10836F811783j1779761m929989M524893P067958O003571P876472Q094321N04081
10828B4173329p479748n435458J165884m58625p834981p047152L172562R142374
10820I398185M844569l3591J767225L863147q76158q030907r331269m541069P14641
10811b225227L616962N458420P136844O653721R27882r070588j5065345q714518
10803a1281849N249643J0902097K109326p127365k725339P904487P852466k578426
$$ y = [16048816, 17098307, 21870169, 25504998, 20509628, 10870717, 6021002, 5801426, 3275354, -1425357, -2100879, 1108841, 1778367, -1695498, -5438700, -9047926, -14727814, -18659592, -13948600, -2075639, 8326351, 13593268, 16214573, 15212558, 6811783, -4967978, -9897967, -5373074, 1694884, 7698455, 15574927, 23669248, 24173329, 16693581, 11258123, 12424007, 11965382, 4130401, -2916751, 255811, 9398185, 14242754, 14209163, 15976388, 19839535, 18963377, 10932470, 1601201, -2939868, -2225227, 1391735, 6850155, 13986999, 20640720, 21568602, 12498014, -2567331, -11281849, -6032206, 4869891, 6979217, -148148, -2873487, 5031000, 12883466, 10305040]
10795A0305040q106289m222874j980477n918842o112951K120276P733784K279481
10787c902852n462709m187964J976232K463825j356011k5346O827634J0017471
10779F350280N833888N34903n05005Q44063J140436n7215k871490p815795j1778650
10770h324585r324322j036968M588774J649313m673106m848951K423743R686073
10762i860029J1305824Q592634M278989j348866o434254o219331l80383L625580
10754C560164L71463m854523l930709J618380M234987L046466L078242L838221
10746A0962691J95631n387158l956164M325026Q143831K719389k846526j571931
10738A2584789N61673k380517m470050N00273N793517K094482o488800q846247
$$ y = [10305040, 2198751, -2024123, -4004600, -9923442, -16036393, -13916117, -6182333, -3902852, -9365561, -13553525, -11577293, -9113468, -10469479, -10494825, -3667191, 6350280, 12184168, 12719071, 12214066, 13058129, 14198565, 14141350, 11269860, 3454065, -8324585, -17648907, -18685875, -14097101, -12447788, -17120894, -21969845, -19546102, -9860029, 1445795, 10038429, 14317418, 12968552, 6534298, 314967, -65416, 3560164, 3931627, -922896, -4853605, -3235225, 999762, 4046228, 7124470, 10962691, 11158322, 5771164, 1815000, 6140026, 14283857, 17003246, 14156720, 12584789, 13146462, 10765945, 6295895, 6796168, 12589685, 14684167, 8195367, -650880]
10730f50880l727115J092751K078186J942966K036645J901126K812270M081205
10722A1567154R22497o570186r361264l022043K952972k6286m337050J056428
10714f817778J0411698R590437o90350o412124k241306L591771M763506K590895
10706A4786749k337868j0019972j3716917o840071L942788O313578J299459K438
10698f569816L307159J430545o528043r802132m534222J097541K774332N301143
10690a3523493R075693O921789j595146p076970n360999k362628j273439J363303
10682a3831890M885321M227698J778957M208194O919874o38202j2992087j2176334
10674a7618469L255887J3900325R777972L310182M414832M785410k398474q112462
$$ y = [-650880, -4377995, -3285244, -1207058, 735908, 2772553, 4673679, 7485949, 11567154, 12489651, 5919465, -3441799, -6463842, -3510870, -3537156, -7874206, -6817778, 3593920, 13184357, 12494007, 6081883, 3840577, 7432348, 12195854, 14786749, 12448881, 2428909, -11288008, -18128079, -14185291, -7871713, -6572254, -6569816, -3262657, -1832112, -8360155, -18162287, -22696509, -21598968, -18824636, -13523493, -4447800, 2473989, 878843, -6198127, -11559126, -13921754, -15195193, -13831890, -8946569, -4718871, -2939914, 1268280, 8188154, 7549952, -5442135, -17618469, -14362582, -462257, 9315715, 12625897, 17040729, 21826139, 19427665, 11315203]
10666A1315203n449154k789539o102898o544774J035709N727763P04023l137343
10658e241010J108356P86948j1988782j9914280o489108J4127609J7637778O857467
10650c115022K948464R106291R385543j035334r141528p037380j166489J934082
10642A878627K458918K19438n028035p589118k626815M160849M948942K482244
10634I05050K999220L912051R48348j163849J408963J177477o236391q932707
10626d981838K114286J2777672O038756q227709q118078M045921O970420l236428
10618G383002r495229m805253J04589O46316L679015P155159O66870j0301781
10610d967312p122788R489170J6133965L821792p589134k967673M954637N39864
$$ y = [11315203, 5866049, 3076510, -3026388, -9571162, -8535453, -2807690, -2103667, -5241010, -4132654, -3345706, -15334488, -35248768, -41737876, -27610267, -9972489, -3115022, -166558, 8939733, 18325276, 17289942, 8148414, 1111034, -55455, 1878627, 4337545, 4556983, -471052, -8060170, -10686985, -6526136, -1577194, 905050, 3904270, 7816321, 8764669, 7600820, 9009783, 10187260, 3950869, -4981838, -2867552, 9910120, 15948876, 7721167, -396911, 3649010, 10619430, 7383002, -2112227, -6917480, -6812891, -6166575, -2487560, 4667599, 5334469, -4967312, -12090100, -2600930, 13533035, 17354827, 9765693, 6798020, 11752657, 12292521]
10602A2292521q469223o876023K579986O894110L526775j154343m045857m181520
10594E66426O98203O829362M535824n576781q921658J021602J0284992N600594
10586A5038564m880024n979929K66697O39500o111072q125293L7372R840940J1147917
10577A1874672L558733m979862o054635J188629P193244J464740j2436022j7962134
10569a6152635o245453J0934979J5284365M283770p552094p399929J928292P455896
10561B537191K517699m970980l141662O554855J0302813K633385m350459k64546
10553A1818296N992635J033583r590996r658078J402302Q740684O376496K931201
10545A9046123L139373J516768l660338o393243n176999m497384l605749J190727
$$ y = [12292521, 3823298, -3052725, -472739, 6421371, 9948146, 8793803, 4747946, 566426, 1264629, 8093991, 12629815, 7053034, -1868624, -847022, 9437970, 15038564, 10158540, 4178611, 4445308, 5084808, -1026264, -9151557, -9114185, 726755, 11874672, 15433405, 10453543, 4398908, 5587537, 12780781, 14245521, 1809499, -16152635, -22398088, -11463109, 3821256, 8105026, 552932, -6846997, -4918705, 2537191, 5054890, 83910, -3057752, 3497103, 13799916, 16433301, 12082842, 11818296, 17810931, 18844514, 9253518, -404560, 997742, 9738426, 16114922, 19046123, 22185496, 23702264, 20041926, 13648683, 8471684, 3974300, 368551, 1559278]
10537A559278M266890k180966j0453391o414814N023420N835622l516093l730556
10529i610610Q574566J2854170k59704j1907189n539472Q244380J1613015N009109
10521A8978265j337021m929483o956683m701273J074430L244393N3280k265714
10513C160194j559695m42523M046347J3441457J4478086l359636k1466631j3303442
10505e005843J1304505J8333731M323819k117873N535096L588271j0179242r229790
10497A6552674O704334O446614q450894P07160L0015249K5771827j0412615k53217
10489F7081132O9316984P9911515m6487286j89926644j74271989j9801613Q5506902
10482a28670999N2335029j5774589j2430730K7040519K6669417K61106P48441
$$ y = [1559278, 5826168, 3645202, -6808189, -13223003, -8199583, -2363961, -5880054, -9610610, -1036044, 11818126, 11558422, -348767, -5888239, 2356141, 13969156, 18978265, 17641244, 12711761, 5755078, 1053805, 2128235, 5372628, 5425908, 3160194, 1600499, 1157976, 5204323, 18645780, 33123866, 29764230, 8297599, -5005843, 6298662, 24632393, 28956212, 26838339, 32373435, 35961706, 25782464, 16552674, 23257008, 29703622, 21252728, 21959888, 51975137, 77746964, 67334349, 67081132, 136398116, 216309631, 169822345, -20104299, -194376288, -214177901, -128670999, -76335970, -92110559, -104541289, -77500770, -50831353, -50570247, -49821806]
10475d9821806J8670389J3133132p414413p723436O649922O015475o298905o236674
10467c3026316M011084O660541N330564J1490025J4382317J237589j2648180q396576
10459a0958952K217737k86441p090868r30672Q959771N311982l313846n34483
10451f625772M613339l900476j4788947p676935R432183J4046621O941204M373019
10443F414236N973553J495128l577148K17765K422944q830899j8646646p743546
10435b2274613J1008266J2211757R59733N86539R006939N190408q891406j1190940
10427c393317l1828M975423l63915k213967J4969n228600j1864889l451574J1589314
10418i968384R390551n260005m037796J3337175J5135234o661967j9531755m393532
$$ y = [-49821806, -31151417, -18018285, -25432698, -33156134, -26506212, -20490737, -26789642, -33026316, -29015232, -22354691, -17024127, -5534102, 8848215, 10085804, -2562376, -10958952, -8741215, -9027656, -16118524, -17049196, -8089425, -2777443, -6091289, -6625772, -2012433, -5912909, -20701856, -28378791, -18946608, -4899987, 2041217, 6414236, 12387789, 13882917, 10305769, 10523534, 12946478, 4115579, -14531067, -22274613, -11266347, 945410, 1905143, 2491682, 11498621, 16689029, 7797623, -3393317, -3425145, 1550278, 1186363, -1027604, -1012635, -6241235, -18106124, -21557698, -9968384, -577833, -5837838, -9875634, 3461541, 18596775, 11934808, -7596947, -11990479]
10410a1990479J3323606P270421r774143j3485185o594371m106037l258558N397266
10402b3217480J4112668R848137j744223n148323J026995N831732M126135p35521
10394D100120n228176o072915p8776Q217640P911233k158166q977743l730579
10386f017362O419903J1140813R694113M775433l699610j1819606j1183966k196735
10378b887017L917785K208351N59132L878574N677443J652159k355094k548159
10370A0103174l486913o145835m315756R78850p51079j0368607j4085810n151891
10362c3223867N926675J0433175J2885355J5181494R147275m296248q978356J93087
10354G268590N152968n495472j5233833p267962O177225N109439m325209k924897
$$ y = [-11990479, 1333127, 8603548, -1170595, -14655780, -21250151, -25356188, -28614746, -23217480, -9104812, 743325, -1000898, -6149221, -5122226, 709506, 4835641, 4100120, -1128056, -7200971, -7279747, 937893, 8849126, 6690960, -2286783, -6017362, 402541, 11543354, 21237467, 26012900, 22313290, 10493684, -690282, -2887017, 1030768, 3239119, 3798251, 7676825, 13354268, 15006427, 12651333, 10103174, 6616261, 470426, -3845330, -2866480, -3617559, -13986166, -28071976, -33223867, -27297192, -16864017, -3978662, 11202832, 20350107, 16053859, 7075503, 7268590, 12421558, 6926086, -8307747, -15575709, -9398484, -4289045, -8614254, -11539151]
10346a1539151P174632Q409507J32934j987005M571121N621705l594768j0880931
10338b091956q074142j213385K644649L247303N86095n344045q080957j381553
10330a9707991Q468797J0022543M164849O40320L80341l161559p782410m929955
10322a1905065K590551L074015l106122k781516P099523J3175812O948932l271739
10314A1824391p115250m842709k15055N757721Q721361K026914j0300362j4382382
10306h525371o120729K727758M006610M628520J0362563J2334136J905301j1710478
10298I608310j2615376q85895Q486605O203438k209226o682180m017995J221176
10290h91143K801448p3202j165416L957844Q732120L227768q718963j1462471
$$ y = [-11539151, -4364519, 4044988, 4177922, 2190917, 6762038, 12383743, 8788975, -2091956, -10166098, -11379483, -8734834, -5487531, -4901436, -10245481, -18326438, -19707991, -11239194, -1216651, 2948198, 3588518, 3968859, 807300, -6975110, -11905065, -9314514, -6240499, -9346621, -12128137, -5028614, 8147198, 15096130, 11824391, 4709141, -133568, -348623, 5409098, 14130459, 16157373, 5857011, -8525371, -14646100, -11918342, -7911732, -3283212, 7079351, 19413487, 21318788, 9608310, -3007066, -3892961, 4593644, 10797082, 8587856, 1905676, -2112319, -891143, 1910305, 1837103, 671687, 4629531, 13361651, 16589419, 7870456, -3592015]
10282c592015n90195Q543538L115573q266897j0131310l371054K47950n43267
10274a4587677K934760J0501562J1611943L913375j721872J063227M125294j114099
10266A6726513r755621j1174485l833769M646244P605571M058318k674016o548416
10258i49661l139487L642055M077717l649082q221249m29705J1748369J2878213
10250A5957170K131550n638028k016773L184706j821859j1678934j1032121K591500
10242h322789J3743742R233861m655044j1090065m713792L143492J940273l205569
10234c925891k64924J0295714J4383610M185570r685218j2142399l611396K553102
10226A788168m64012n888749n951191j934551J299798K689243K640800K75303
$$ y = [-3592015, -4182210, 4361328, 7476901, -789996, -10921306, -14292360, -14044410, -14587677, -11652917, -1151355, 10460588, 14373963, 12652091, 13715318, 17840612, 16726513, 6970892, -4203593, -8037362, -3391118, 4214453, 8272771, 5598755, -949661, -4089148, -447093, 3630624, -18458, -8239707, -8669412, 3078957, 15957170, 18088720, 12450692, 10433919, 13618625, 11796766, 117832, -10914289, -8322789, 5420953, 14654814, 9999770, -1090295, -5804087, -2660595, -720322, -3925891, -4190815, 6104899, 20488509, 24674079, 14988861, 2846462, -764934, 1788168, 1324156, -4564593, -10515784, -12450335, -11150537, -8461294, -5820494, -5545191]
10218e545191k249391P40370Q871324J1939316K978788r761317j2133773k336875
10210g496749Q173778J0008826M239134l278356q021301p251543j608198K994161
10202b240248J255061l269761j941817O305302J2267137Q100223l116737j0993761
10194F365399p958866L909654J3407747R877041m079132j3463717r155035N31886
10186e65023L494390J363196K172667L069395l413585j0417141m025100J0673881
10178B352680J2478882k524727j2710246n003443M979355R33430o870046j928584
10170h292699Q087802N287377n950259o727308K514619L127858p618464j0619259
10162b0190333J894421J2300952O769502l068916j465420N945512M678325l228627
$$ y = [-5545191, -7794582, -7054212, 1817112, 13756428, 16735216, 6973899, -5159874, -7496749, 677029, 10685855, 14924989, 11646633, 3625332, -3626211, -5234409, -2240248, -985187, -4254948, -6196765, 108537, 12375674, 20475897, 17359160, 6365399, -1593467, 2316187, 15723934, 25600975, 21521843, 8058126, -1096909, -565023, 2929367, 4292563, 6465230, 9534625, 6121040, -4296101, -8321201, 2352680, 14831562, 12306835, -403411, -5406854, -427499, 505931, -6364115, -8292699, -204897, 5082480, -867779, -7595087, -5080468, -1952610, -9571074, -20190333, -18295912, -5994960, 774542, -2294374, -3759794, 2185718, 6864043, 3635416]
10154C635416m470234K296891N933162K272025j677687k295136l486754m806637
10146b598954L93599J0480185J2269964J23151j2348805j0227113Q59347L726270
10138B677644l862479o789963K528649J2169338R855012R98861k545666j591047
10130A3440349m423121r213668o646880K286661O045438J079297l070856j80627
10122f83407L793454K660240p70343k592949m162697n183353j407589M862387
10114c484257L734814n481510q868470J078110J1327349P558210l673408o858798
10106d667960k223117j243843m082364o12307Q434809J0413346K474190k837940
10098E654814J952479P975409N412441j815144l995171L10901M735179M062965
$$ y = [3635416, -834818, 1462073, 7395235, 9667260, 7989573, 5694437, 2207683, -2598954, -2205355, 8274830, 20544794, 20667945, 8319140, -1907973, -1048626, 2677644, -1184835, -7974798, -5446149, 6723189, 16578201, 17577062, 15031396, 13440349, 9017228, -196440, -6843320, -4556659, 1488779, 2568076, -502780, -683407, 3110047, 5770287, 4999944, 2406995, -1755702, -6939055, -8346644, -3484257, 250557, -5230953, -14099423, -13021313, -1693964, 5864246, 2190838, -4667960, -6891077, -8134920, -12217284, -12829591, -4394782, 6018564, 8492754, 5654814, 7607293, 15582702, 20995143, 19179999, 15184828, 15495729, 20230908, 24293873]
10090B4293873j552897p210537o769099l10533L129465k986221j0802120p385816
10082i593885N188019J1098722L767873m900178k975120M889787O295723j644765
10074A2126176j1142062j4394261r697966j138887L774444L18048o800418p645300
10066c4600226K4617P597141P658643L110501J009997K735639M118995J831839
10058f512854k893870m741791Q94448J0253787J1622069N4656j2009815q937725
10050a2271095N572689J2722267N314546m094861m597940j194944j020269J25068
10042E55461O914336J1643110M884335q247461j4325427r615546j931074J932864
10034h189402J951472R39184J957197O671902J1027055P523923k775956p607521
$$ y = [24293873, 22740976, 15530439, 8761340, 8450807, 11580272, 8594051, -2208069, -9593885, -4405866, 6692856, 10460729, 5560551, 2585431, 7475218, 13770941, 12126176, 984114, -13410147, -23108113, -24247000, -20472556, -20154508, -26954926, -34600226, -34575609, -26978468, -19319825, -16209324, -15199327, -12463688, -8344693, -6512854, -9406724, -14148515, -13254067, -3000280, 8621789, 8676445, -3333370, -12271095, -6698406, 6023861, 11338407, 7243546, 2645606, 1450662, 430393, 555461, 7469797, 19112907, 23997242, 15749781, 1424354, -8191192, -10122266, -8189402, -6237930, -5298746, -3341549, 3330353, 14357408, 21881331, 19105375, 11497854]
10026A1497854m37438P550938K816995r492203j2664161l094540O013214N494378
10018G685037J267361J286905L197813J103578l836219o597848o565848n900830
10010h360051l364207L228876R922759R203126J167220m111561K59413O919913
10002A4865488L442345q961974j5217896p579577K764764K634864l159070n66924
9994a1777980J0205055J4635210O709785l146696n963125n725834p118268n239948
9986g421801L331310J0159337O509913k474955n670676j958055J712625K928978
9978G116676M123391M273178P41785k949197j026577L940179L352217m456328
9970A5115324j1376023j0548435m017157J745091L151735J160167j251525k266899
$$ y = [11497854, 11060416, 18611354, 21428349, 11936146, -728015, -3822555, 2190659, 7685037, 8952398, 10239303, 13437116, 14540694, 10704475, 4106627, -2459221, -8360051, -11724258, -8495382, 1427377, 10630503, 11797723, 7686162, 7945575, 14865488, 18307833, 9345859, -5872037, -13451614, -10686850, -8051986, -11211056, -11777980, -1572925, 13062285, 19772070, 16625374, 10662249, 4936415, -2181853, -7421801, -4090491, 6068846, 12578759, 10103804, 4433128, 2475073, 4187698, 7116676, 11240067, 15513245, 16255030, 13305833, 12279256, 16219435, 19571652, 15115324, 3739301, -6809134, -10826291, -9081200, -5929465, -4769298, -6020823, -8287722]
9962h287722k555433k575306K71824P562130J3638083J0416801m27405p915287
9954A0127685o596655k262370l6024K726455O763628N607631k425918p668692
9946F235740l648193J811702k9769m474076l711947j285953k913905k644928N972216
9937d689113J3084467N113089j0943292j4750844k460702Q703208O272674l374696
9929c045209q676758o323753J065899Q343285Q038135j372096q606872l163702
9921a3741071P445302Q599339K521342K970714R018838O339012m810124p325017
9913A1018335K060941M672717q118411j8609275j1819188Q67425L440079J208042
9905a5279335N857389J1075792M875224n850640n541341L292163N355479m61228
$$ y = [-8287722, -10843155, -13418461, -13146637, -5584507, 8053576, 18470377, 18042972, 10127685, 3531030, 1268660, 1232636, 3959091, 10722719, 16330350, 13904432, 6235740, 2587547, 4399249, 4369480, -104596, -3816543, -5102496, -8016401, -10661329, -4689113, 8395354, 13508443, 2565151, -12185693, -14646395, -5943187, 329487, -3045209, -11721967, -18045720, -16979821, -8636536, -598401, -1970497, -10577369, -13741071, -6295769, 2303570, 4824912, 7795626, 16814464, 23153476, 18343352, 11018335, 13079276, 17751993, 9633582, -8975693, -20794881, -19927456, -16487377, -15279335, -9421946, 1653846, 6529070, 678430, -4862911, -1570748, 3784731, 3323503]
9897C323503q74380O659484R000251k31102j0566944j1624078o580378l522654
9889a4416298l453945j932843L770933J1950530J6760669J1980800j015267j1859556
9881A1785023j2891526p814844l113193J741295O950602M506483q622018j6949970
9873b4408148m252095J8388531K2568218K468191j5428550r388467R227522J6110703
9865A5285905P575400j177436j966964j176735m076468o031762k045190M276948
9857A0663698N683925P20007n194376o569572l736442j474839k137316k209416
9849d254331K078389P739749Q047817K054435l798642m173205l70500L355789
9841A0679501M380483J772291l402643o881103n102922q20932N16921l62825J293201
$$ y = [3323503, 2449123, 9108607, 18108858, 17877756, 7310812, -4313266, -10893644, -14416298, -17870243, -19803086, -16032153, -4081623, 12679046, 24659846, 23644579, 11785023, -1106503, -8921347, -12034540, -10293245, -3342643, 1163840, -7458178, -24408148, -28660243, -10271712, 12296506, 14764697, -663853, -10052320, -824798, 15285905, 22861305, 21683869, 19716905, 18540170, 14463702, 8431940, 6386750, 10663698, 16347623, 17067630, 11873254, 5303682, 1567240, 92401, -2044915, -4254331, -2175942, 5563807, 13611624, 15666059, 11867417, 7694212, 7323712, 10679501, 15059984, 16832275, 13429632, 6548529, 1445607, 624675, 1141596, 778771, 2071972]
9832B071972L362598j399110j0120928r002395N078580J4607707N094172j1374368
9824a681772j2205265K330702J0800071M524501j073379N239993J0849439J109040
9816A9893330j4159651j4046401J382894J1424064N660491l310221j895777M979643
9808I928372M657397l413588q556356m361421M774804R976770N496682o976415
9800A1526245j7435179j5057387j168101R835135P690060q35940l006366J474553
9792f976980K856443j337523l251181P52035L989173J384926k177349p72780K785712
9783b747524K345767j546810l186134l15933L799187N185471K592918k383531
9775C743411o310404o505500l707095m47024K577881N090038L765574l577003
$$ y = [2071972, 5434570, 4035460, -6085468, -15087863, -10009283, 4598424, 9692596, -1681772, -13887037, -11556335, -756264, 3768237, 2694858, 7934851, 18784290, 19893330, 5733679, -8312722, -6929828, 4494236, 10154727, 6844506, 4948729, 9928372, 14585769, 11172181, 2615825, -1745596, 3029208, 13005978, 18502660, 11526245, -5908934, -20966321, -22134422, -12299287, -4609227, -5445167, -8451533, -6976980, -4120537, -5458060, -8709241, -7957206, -3968033, -2583107, -4760456, -5533236, -2747524, -401757, -1948567, -5134701, -5450634, -1651447, 3534024, 6126942, 3743411, -2566993, -9072493, -12779588, -13226612, -10648731, -5558693, -1793119, -5370122]
9767e370122j0670216p814327L827379J1389230P595741N75096P27410N602964
9759E863155N804105K15866l734271k213930P43633K88848l891804q670440r787445
9750a5382283m651562L721502P987751M723746j739439n901675o467412k914827
9742b0624199N608212J3778063J1819940N92348n030142K566052R535190J057828
9734A9303292j3541861j3985508r77111O109434J483156k35363P212209R769249
9726A5137497o12145r373184l798832M194451j436078j1647617o111758J1908361
9718a739305J8680351O564374n939282n058086j086568o701978j3860091p840381
9710a6980966O923909J2360343L516407n983336m920944K809120Q710771J0590991
$$ y = [-5370122, -16040338, -23854665, -20027286, -8638056, -1042315, -467219, 260191, 5863155, 11667260, 11883126, 8148855, 5934925, 6678558, 6967406, 3075602, -5594838, -15382283, -20033845, -16312343, -8324592, -3600846, -5340285, -11241960, -17709372, -20624199, -15015987, -1237924, 10582016, 11174364, 6144222, 8710274, 18245464, 19303292, 5761431, -8224077, -9201188, -3091754, -1608598, -1843961, 5368248, 15137497, 14525352, 5152168, 1353336, 5547787, 4111709, -7535908, -13647666, -1739305, 16941046, 23505420, 17566138, 12508052, 11421484, 4719506, -9140585, -16980966, -10057057, 2303286, 5819693, -163643, -5084587, -2275467, 6435304, 17026295]
9702A7026295Q499742Q31845q833990j0456573j453176O131251K130225n408174
9694H467445k730155O536517O437156n120449j2540929p387471J37551O70102
9686e530233q1264L688714M371091l925185r873392j225569J2987743J4516109
9678A4928014L637383l609020j799588n77304m126240n530941l171424m297898
9670d547018q689406o290859L840633R166614M453204J75134K555185K516129
9662C179616m920612p212118N022495J8018616J3457334k481070p691119K865234
9654B0238376J1337135M592025q466848j2130714n219376Q9696m097908j1300117
9646d957731r445934K312629J0509911N196948m452716k595518Q056209Q672662
$$ y = [17026295, 25526037, 26357882, 17523892, 7067319, 5614143, 11745394, 13875619, 8467445, 5737290, 12273807, 18710963, 13590514, 1049585, -6337886, -6200335, -5530233, -5611497, -1922783, 2448308, -1476877, -11350269, -12575838, 411905, 14928014, 18565397, 14956377, 13156789, 12579485, 8453245, 2922304, -249120, -4547018, -13236424, -19527283, -15686650, -6520036, -2066832, -1891698, 663487, 3179616, -1740996, -8953114, -3930619, 14087997, 27545331, 25064261, 17373142, 20238376, 31575511, 36167536, 27700688, 15569974, 10350598, 10440294, 6342386, -4957731, -14403665, -12091036, -1581125, 3615823, -836893, -3432411, 4623798, 13296460]
9638A3296460n821033j6770865r758229M047020O967195P95511j786252K87808
9630h742385L42577J139530Q940081J6416789J0872122l872481j2253182j0975177
9622A867874r524127q960675j291212R351918P468335o734186j2714668j098490
9614b1635231J0078826L409839j0483897r906104N152176J4665839P495083o637456
9606g860925j2868907p247389L828533J2146534J3716302J0312185O172553K854120
9598B1053006o73342l545595l466218j843518k637544n394449n706931l118860
9590e333451j360347l17967L554224P842635N323034l113173p412083l847995
9582d665123l60241j648177j053063N576406R878551M592584l038826k680912
$$ y = [13296460, 7475427, -9295438, -19053667, -15006647, -8039452, -7243941, -9030193, -8742385, -8399808, -7260278, 1679803, 18096592, 28968714, 25096233, 12843051, 1867874, -7656253, -16616928, -17908140, -8556222, -1087887, -7822073, -20536741, -21635231, -11556405, -8146566, -18630463, -28536567, -23384391, -8718552, -1223469, -7860925, -20729832, -27977221, -24148688, -12002154, 1714148, 12026333, 18198886, 21053006, 20379664, 16834069, 13367851, 11524333, 8886789, 3492340, -2214591, -5333451, -6693798, -7011765, -3457541, 4385094, 9708128, 6594955, -817128, -4665123, -5025364, -6673541, -7726604, -2150198, 7728353, 12320937, 9282111, 6601199]
9574F601199K512582K485920l047281o380852n319214l442743r34544L531728
9566c993205N090680j459697j0080378r254680J148747R344400Q268981K852970
9558A917818l71206j420292k062984p61692L923870R609592J1918975P373975
9550C0128056m230521j6341614j7705475m746373J0321835J1938851Q31853p624854
9542B571758m908926Q04886n86898o079511o040248M53913M983272K608393j844295
9533h037656j736073K051088L320389M2465l046461k340732j088917l152435m898856
9524a8887188k05874Q186824J0851616N801957J289720J931399J758407l898067
9516F828794q913339o097352J077253M441579K770416o4396k663398m322647j865647
$$ y = [6601199, 9113781, 11599701, 8552420, 2171568, -3147646, -6590389, -7524933, -3993205, 1097475, -362222, -10442600, -19697280, -18548533, -9204133, -935152, 1917818, 1546612, 126320, -1936664, -2698356, 1225514, 10835106, 22754081, 30128056, 25897535, 9555921, -8149554, -12895927, -2574092, 9364759, 10196612, 2571758, -2337168, -1532282, -2119180, -8198691, -14238939, -13785026, -8801754, -6193361, -8037656, -9773729, -7722641, -4402252, -4359787, -7406248, -9746980, -10835897, -13988332, -18887188, -19093062, -10906238, -54622, 5747335, 7037055, 8968454, 10726861, 6828794, -2084545, -8181897, -7104644, -2663065, 107351, 42955, -2620443, -6943090, -8808737]
9507h808737L817017M477837l659863j1346632q777796K56335O493014R451887
9499h096938J1846654Q619848l173914j1132843k582933J1919191J0441073o646781
9491A1193357j6193516p253357M991760N814207R10595O65788K477941M86034
9483C092809j412848J623311M717706K252861k055569l276000l909705o060921
9475e028356n189457j57388J441479k796361k634738P295135J4505612O978512
9467A4414438n915882o810940L178511Q534955M786495J879238L686715J911152
9459B5664682o833512j2891362q047830K718282R507131R497185N813890P75877
9451B6204343m705140q600006q545346m329163J126943K970723j188665o770397
$$ y = [-8808737, -4991720, -513883, -4173746, -15520378, -24298174, -24041839, -17548825, -8096938, 3749716, 12369564, 9195650, -1937193, -4520126, 7399065, 17840138, 11193357, -5000159, -12253516, -7261756, -1447549, -536954, 128834, 2606775, 3092809, 1679961, 3303272, 8020978, 10273839, 8218270, 4942270, 1032565, -5028356, -10217813, -10375201, -8933722, -11730083, -14364821, -7069686, 7435926, 14414438, 8498556, 1687616, 4866127, 13401082, 18187577, 20066815, 23753530, 25664682, 18831170, 5939808, -2108022, 610260, 10117391, 19614576, 25428466, 26204343, 21499203, 12899197, 4353851, 24688, 1151631, 4122354, 2933689, -3836708]
9443c836708o018492J273994O182081L681281N96911M025394Q505662M376557
9435A8786680n611059r384958l771041J574896l79074m635475l542814K055400
9427d907445N376058K847809k602405n066984j464941M343713M695611j666889
9419A554527n637324M64569R880528Q368794n725944j6994340j2054692L534611
9411a6609271J3003647R153600P45125j629850O56920p58597o167793o153458
9403g759677K961471J0768987P096232k114155l991508P51057M58416n703255
9395B467568n287491M793773J0397170K962930n628292k590964N024108L322978
9387A5461780n416485q181416k127432M719512P734502P008847M16588j0802390
$$ y = [-3836708, -9855200, -8581206, -2399125, 1282156, 1879067, 5904461, 14410123, 18786680, 13175621, 3790663, 19622, 1594518, 1215444, -3420031, -6962845, -4907445, 468613, 3316422, 714017, -4352967, -5817908, -1474195, 3221416, 1554527, -4082797, -3618228, 6262300, 14631094, 8905150, -8089190, -20143882, -16609271, -3605624, 5547976, 6293101, 4663251, 5320171, 4561574, -1606219, -7759677, -4798206, 5970781, 13067013, 10952858, 6961350, 7712407, 8170823, 2467568, -2819923, 1973850, 12371020, 15333950, 9705658, 7114694, 12138802, 15461780, 10045295, 1863879, -263553, 4455959, 12190461, 19199308, 19615896, 8813506]
9379H813506j5581428o716479M775771M299069l268985k371871O500628Q460758
9371D910969J37003o424916n926723n692023p272730k312535Q783398J3264390
9363e33167P265887K610722N411187N752172k390414q157086k277000O131152
9355A3813453M186299m792273q777132n718650k712321k767974k827657r35241
9347a0531496K060735M626527M394912M73306k731616q14274J826485j733394
9339b428815o856840k996696O435913O540393l988196q804878p05716O773577
9331f031258L032325l593822m137925l860008o077752j313238J1451066J3102802
9323B572190n502296k0584656p792283J7477238K0691768p42368j7134445j2672050
$$ y = [8813506, -6767922, -13484401, -8708630, -4409561, -7678546, -10050417, -3549789, 4910969, 5047972, -1376944, -7303667, -12995690, -20268420, -22580955, -13797557, -533167, 6732720, 9343442, 14754629, 20506801, 18116387, 9959301, 7682301, 13813453, 17999752, 13207479, 4430347, -1288303, -4000624, -6768598, -9596255, -10531496, -8470761, -3844234, 550678, 1023984, -1707632, -2521906, -695421, -2428815, -9285655, -12282351, -5846438, 693955, -3294241, -12099119, -12804835, -6031258, -2998933, -6592755, -10730680, -14590688, -20668440, -21981678, -10530612, 2572190, -2930106, -23514762, -31307045, -13829807, 6861961, 6119593, -11014852, -23686902]
9315b3686902j582581K841015O227999J3197046J4425854M651484n182340m830915
9307F060660M07182J112276j940421l221450k259171q68857J314463L294397J974262
9298E873341j708870l073804j632056q96781k87057L242397N919307J006939p527976
9289I15440p830387J393605Q098093N579314Q15863p2792j192663n360180o024008
9280c677715O67113O271280K199612o427523q423399k247624M382171O300700
9272i55385M755448K227051l47029k311538k986738j909938J320096N261013N761086
9263A0814066J057232l788638l034703J163654L007697K998258M677044M323026
9255B1217636m236144j5454570j6060952m667532N780789P431990N554386M057024
$$ y = [-23686902, -25269483, -22428468, -16200469, -3003423, 11422431, 16073915, 10891575, 6060660, 6467842, 7580118, 5639697, 2418247, 159076, -709781, 604682, 3899079, 5873341, 4164471, 1090667, -541389, -1438170, -1725227, 1517170, 7436477, 8443416, 915440, -6914947, -5521342, 2576751, 8156065, 8971928, 8899136, 7706473, 2346293, -3677715, -3010602, 3260678, 5460290, -967233, -9390632, -11638256, -7256085, -955385, 3800063, 6027114, 5680085, 3368547, 381809, -1528129, -208033, 5052980, 10814066, 11871298, 8082660, 5047957, 6211611, 9219308, 12217566, 16894610, 21217636, 16981492, 1526922, -14534030, -19201562, -13420773, -5988783, -434397, 3622627]
9247C622627j256164q850051p036363O722557J6272617Q632637o323432j0938037
9239H46391m454466J160351J712582K175759L168425Q08926k749268j792711J587143
9230B463132M26669m066119l804938K160187N726392K698816j842279k571711
9222A190149j81521K763964N011466M415349p84980p031278p563082r61816O914991
9213C773242J0123276P751368K308817k549117l231495L24704K866676k99192
9205B1068279o477119q842232n389388j43642L355028M858063M457239J823939
9197A4710167j518327l184370l141340k791465j886109L06713K309664K651845
9189G456778L036532N179454O335689K763455l690517p469856p003118n619002
$$ y = [3622627, 2366463, -6483588, -13519951, -6797394, 9475223, 18107860, 11784428, 846391, -3608075, -2447724, -735142, 1440617, 4609042, 5417968, 2668700, 875989, 2463132, 2889801, -1176318, -4981256, -2821069, 2905323, 5604139, 3761860, 1190149, 1008628, 3772592, 8784058, 13199407, 12414427, 5383149, -2179933, -3141749, 3773242, 13896518, 21647886, 23956703, 21407586, 18176091, 18500795, 21367471, 21068279, 14591160, 5748928, 359540, 215898, 3570926, 8428989, 12886228, 14710167, 13191840, 10007470, 6866130, 4074665, 2188556, 2495269, 4804933, 7456778, 10493310, 15672764, 22008453, 24771908, 21081391, 13611535, 6608417, 989415]
9181I89415n136088l495094O02428M813579O056746L670300o85719m212377m460941
9172a857751j657331J169763J936221J754449J781593N32028k716954m322465
9164c380447k34935P140408R653825K182395j0168905j4780580m039457J3246652
9156c81044J7568194J594210j7184265j6508574J020210J2194682O838143p24763
9148D416793J007904K192935o767921j3773457m762582R067139P447280m486598
9140e658507m253096R082439J2467296j637000j1614365k711378Q878920M229283
9132H783592o942597m165120Q965770J1458353m25485q170594q24635R781975
9124A8461259Q877265q65703o819681m995398k380882m588392q404802p263432
$$ y = [989415, -4146673, -7641767, -7039339, -2225760, 3830986, 7501286, 6815567, 2603190, -1857751, -3515082, -2345319, -409098, 1345351, 3126944, 3658972, 942018, -3380447, -3615382, 3525026, 13178851, 15361246, 5192341, -9588239, -13627696, -381044, 17187150, 18781360, 1597095, -14911479, -13891269, -1696587, 5141556, 4416793, 5424697, 7617632, 849711, -12923746, -17686328, -8619189, -1171909, -5658507, -9911603, -829164, 11638132, 10001132, -1613233, -4324611, 4554309, 8783592, 1840995, -2324125, 6641645, 18099998, 17674513, 9503919, 8679284, 18461259, 27338524, 26472821, 19653140, 14657742, 12276860, 7688468, -716334, -7979766]
9116g979766n84461M962151L995990j93322m68357L008444K585059m342708r628283
9107h645253n806481K739520O473923M173017K271859L439721L745838P77100
9099I169244k513970l184907k111306j117693n46480o90445j973017k927141j331263
9090g226978J991307L530960J786404r99544j962188j68375L390404N801374L490971
9081I634335l043123p155174l367426M044979N523996k52189l769285J831851
9073C447964J0554472J1449787K882389o246438p794927k541377K417794J284276
9065A5453940n258528j0587693q526399k39850O977388Q577966P032207N509640
9057A8938671K258123m349103r678443q272450k550050R98988J963290M091412
$$ y = [-7979766, -8564227, -3602076, 393914, 200592, -267765, 2740679, 5325738, 983030, -8645253, -14451734, -11712214, -5238291, -1065274, 1206585, 4646306, 8392144, 9169244, 6655274, 3470367, 1359061, 241368, -305112, -995557, -2968574, -5895715, -7226978, -5235671, -1704711, 81693, -917851, -2880039, -3048414, 341990, 6143364, 9634335, 6591212, -563962, -3931388, 113591, 5637587, 5385398, 1616113, 3447964, 14002436, 25452223, 28334612, 22088174, 14293247, 11751870, 14169664, 15453940, 10195412, -392281, -8918680, -9158530, -2181142, 6396824, 13429031, 18938671, 21196794, 16847691, 7169248, -1103202, -3653252, -2654264, -690974, 3400438]
9049C400438N134757o32659r233214q730636J851029P944656J215748o052609
9041e102490M15899J3622952J5048553J878616j0646176j1605612m660271L140438
9033B091909Q267282N900370o610994j8740047j4514648L688637J4065785N432826
9025d18880o354343k576358J0817531J3885417K115792r777820r496536J43680
9017a661517Q778900R163896J170530q008550r375417k459307L725084L430628
9009D764247P72179m71791l246671o748008k134207J0771926J5504816K108174
9001B1320665j3823933j2898183j624742R38583l227508K909101J6706248J6716809
8993B7017040J43400j0197920l824717J054358q334061j5723481m559547J2239290
$$ y = [3400438, 8535195, 7902536, -1330678, -10061314, -8210285, -265629, 950119, -5102490, -4686591, 8936361, 23984914, 25863530, 15217354, 3611742, -1048529, 2091909, 10359191, 16259561, 9648567, -9091480, -23606128, -19917491, -5851706, -418880, -6773223, -9349581, 1467950, 15353367, 17469159, 7691339, -1805197, -1661517, 7117383, 16281279, 17451809, 9443259, 67842, -2391465, 1333619, 4764247, 5536426, 5064635, 1817964, -4930044, -7064251, 3707675, 19212491, 21320665, 7496732, -5401451, -7026193, -6087610, -9315118, -6406017, 10300231, 27017040, 27160440, 16962520, 13137803, 14192161, 5858100, -9865381, -14424928, -2185638]
8985b185638J3298880K335790k601929l79448k928491q924053o166976L537876
8977d013989N464552j963948l841159N303880J1948045O134343l371468n011609
8969A0648647j721624k172596n218012m346312j044132k289137p237750o809544
8961b0190460K069041R940430P217747j567921k854610O873186J4594876P848784
8953B3931073p493415j4550137p597260K779853O364921M521152K516039J333442
8945A1805668J506991N103609Q574545L757336p672424j1631888j897976P988829
8937A7534690L963767p404282j0070730k531751L914642M534323L258585K7507
8929A3226751p655205j3098834p028323M677306O311490l352641q357189l06297
$$ y = [-2185638, 11113242, 13449032, 10847103, 10467655, 7539164, -1384889, -7551865, -4013989, 1450563, -513385, -4354544, 949336, 12897381, 19031724, 15660256, 10648647, 8927023, 6754427, 1536415, -2809897, -3854029, -6143166, -13380916, -20190460, -18121419, -8180989, -963242, -2531163, -5385773, 1487413, 16082289, 23931073, 16437658, 1887521, -5709739, -2929886, 3435035, 7956187, 10472226, 11805668, 13312659, 18416268, 26990813, 30748149, 23075725, 11443837, 9545861, 17534690, 21498457, 14094175, 4023445, 1491694, 5406336, 9940659, 13199244, 13226751, 5571546, -7527288, -14555611, -9878305, -3566815, -6919456, -15276645, -15582942]
8921a5582942R928155J0483957M179246p34245k938843l912289k270798O77710
8913a70049n29429n048810l735574N800975J2427429P527917k020060n681511
8905H570888m734615n717990o690903j990652M998455O153256K552230K473828
8897E614497O679026O638562j472023j0132882j0550664l119099M673299O555234
8889D885950K067140m042988o027699k649940J747606K893652J306582m38386
8881b58083j950709l323511k468221J334333L753362O32944m513897m071822K474889
8872h390715O675253K539439m900700o433560j411048J713857j882979n690295
8864a7780748j412985P341231Q755363L89409o161675k507894L770614J905574
$$ y = [-15582942, -5654787, 4829170, 9008416, 8274171, 5335328, 1423039, -847759, -170049, -699478, -5748288, -9483862, -3682887, 8744542, 16272459, 14252399, 8570888, 3836273, -1881717, -8572620, -10563272, -5564817, 588439, 3140669, 5614497, 12293523, 18932085, 17460062, 7327180, -3223484, -6342583, -1669284, 4885950, 6953090, 2910102, -3117597, -5767537, -4019931, -1126279, 180303, -258083, -2208792, -5532303, -8000524, -6666191, -2912829, -2279885, -6793782, -10865604, -8390715, -1715462, 823977, -4076723, -10510283, -11921331, -10207474, -12090453, -17780748, -19193733, -11852502, -3097139, -2707730, -8869405, -11377299, -7606685, -5701111]
8856e701111m200362k858345N219970P605051J92940p319714p613435m059426
8848a8734432k1238O417559J2475401R547738j122757n422491K283922Q329820
8840A3753522J188309r382578q437890M05449L649514J285991L168299P912297
8832A3542913M868059m936356q728109l633852n49126l574317k924092N986670
8824E1790J2131144N946494n585014r977939n901248m62590K310441K441865j16430
8815H38513l538426l344707P57654K592545j068253m803321l285342O66917K480258
8806h704162L796430P085886P866418N22621j1155218j6572641j0302489L116137
8798b4347018J4087111J4234652K170082j2176504j3762301O09091J5472496J4125021
$$ y = [-5701111, -9901473, -12759818, -7539848, 65203, 258143, -7061571, -14675006, -18734432, -18755670, -12338111, 137290, 9685028, 8562271, 3139780, 5423702, 13753522, 14941831, 5559253, -2878637, -2473188, 1176326, 2462317, 5630616, 13542913, 18410972, 13474616, 4746507, 1112655, 563529, -3010788, -5934880, 51790, 12182934, 18129428, 12544414, 2566475, -3334773, -3797363, -1486922, 954943, 838513, -2699913, -6044620, -5286966, -2694421, -3762674, -8565995, -11851337, -11184420, -8704162, -4907732, 2178154, 10044572, 10567193, -588025, -17160666, -27463155, -24347018, -10259907, 3974745, 6144827, -6031677, -19793978, -19184887, -3712391, 10412630]
8790A0412630k19085r057131k997441P624559Q265577j524337r815225p944719
8782e255172M57280N316107J873863m823020o896816l164199R17082K065877L174162
8773f334836O570243Q188919L093836n926480j0382628o035861K936143R314540
8765A423876R325443M189414j927577n160604m582029j712506K143862O004582
8757I704461P176708L281232k876462n276765l036777j178157j122366J939349
8749H611223Q006206P646067l467528j3379942q726369M513204Q575102q7631
8741A1690332o997658l033298L117163R88432o024023q795242o155205j984919
8733a7194418L082742Q244313Q013057O26548n135857j695213M104666J014736
$$ y = [10412630, 10193545, 1136414, -1861027, 5763532, 14029109, 12504772, 2689547, -5255172, -4797892, 518215, 2392078, -2430942, -9327758, -12491957, -11574875, -9508998, -6334836, 235407, 8424326, 11518162, 5591682, -4790946, -10826807, -7890664, 1423876, 10749319, 14938733, 13011156, 7850552, 3268523, 1556017, 3699879, 9704461, 16881169, 20162401, 17285939, 12009174, 8972397, 7794240, 6671874, 8611223, 16617429, 24263496, 20795968, 7416026, -1310343, 3202861, 11777963, 11690332, 4692674, 1659376, 4776539, 5764971, -259052, -9054294, -15209499, -17194418, -14111676, -5867363, 2145694, 2772242, -2363615, -4058828, 45838, 1060574]
8725A060574p498324p697355K105433Q379137M129713n11234M020384J0915673
8717A4904001Q764765o2644m448769k216042p86210l041029m316036k972146k731817
8708C094073l327624K38855O492063O668712l13033l452118K386222N317156n349236
8699A1755070j8757726j5659822K514854J4426767Q787692k915928p436487p259702
8691a4545282q832133p634359K318719J3766719J4918227P372813K435340L207156
8683A3007200L039922k49751j492844M54849M27214k611697l795357k575526l687510
8674B516500n968726k203633O407786Q254169n33098q293211n848295k39731n89491
8665f497730j951140L519999R084148L578046p024710o492511M866535Q899474
$$ y = [1060574, -6437750, -14135105, -12029672, -3650535, 479178, -32056, 3988328, 14904001, 23668766, 23606122, 19157353, 16941311, 16155101, 13114072, 8798036, 5825890, 3094073, -233551, 5304, 6497367, 13166079, 12853046, 9400928, 11787150, 17104306, 11755070, -7002656, -22662478, -20147624, -5720857, 3066835, 150907, -7285580, -14545282, -23377415, -31011774, -28693055, -14926336, -8109, 7364704, 9800044, 13007200, 16047122, 15797371, 14304527, 14759376, 15186590, 12574893, 8779536, 6204010, 2516500, -3452226, -5655859, 751927, 9006096, 8472998, 179787, -5668508, -5908239, -6497730, -8448870, -4928871, 4155277, 7733323, 708613, -5783898, -917363, 7982111]
8657G982111j880054j1901172o214677P707735J2506334N184343l095837n531869
8649D756914n927577p844570p790344j920697O268444Q725513K266086o572613
8641h038844p723735L60494P567123M878904k599334k565931N739490R711575
8633G329742K589823o193072n819370L70066K859266J667173L054107N533870
8625A1391605J493466q406777j3627486p986235L009398J0480119J0654843M410477
8617A1419410m185108p891797k316876O622988Q235604J094416n968600p716431
8609g06394p980831q746739m375300P185761J6433022J3917312L756505k753625
8601A6729711k592812j835479m066720o311129n683533l273127j131184j37542
$$ y = [7982111, 6102057, -5799115, -12013792, -4306057, 8200277, 13384620, 10288783, 4756914, -1170663, -9015233, -16805577, -18726274, -12457830, -3732317, -1466231, -8038844, -15762579, -15402085, -7834962, -2956058, -5555392, -8121323, -2381833, 7329742, 9919565, 3726493, -2092877, -1722811, 1136455, 2803628, 5857735, 11391605, 12885071, 4478294, -9149192, -17135427, -14126029, -3645910, 7008933, 11419410, 7234302, -657495, -2974371, 3648617, 11884221, 12978637, 7010037, -706394, -8687225, -17433964, -21809264, -14623503, 1809519, 15726831, 19483336, 16729711, 14136899, 12301420, 8234700, 1923571, -3759962, -7033089, -8164273, -8301815]
8593h301815o52729j759032r97967K152138M769278N351791O521856Q963466P322083
8584B3369069j791881j1558399j2170792m244588K284816J666668k077178k767105
8576g289390P86810N351517O381936J505931n335450o292707n30618K603055k120370
8567d939286n484517J680383J0660740O627485n991402q376560K519426Q849203
8559E545472J409595o246100k479018L247060k69994m672108J863237J0686522
8551I084666N830592p479380r574023K057666R438976K945273o358308p041718
8543a096256k415680Q19058L859986P773953O492487l102528j2843372j3248558
8535a3760910n697980J495814L682754J700109j567686k406046J047401M791827
$$ y = [-8301815, -8954544, -10713576, -11711543, -9559405, -4790127, 561664, 7083520, 16046986, 23369069, 21577188, 10018789, -2152003, -6396591, -4111775, -2445107, -4522285, -7289390, -6502580, -1151063, 5230873, 6736804, 1401354, -4891353, -5421971, -2818916, -4939286, -10423803, -8743420, 1917320, 8544805, 2553403, -5823157, -3303731, 5545472, 6955067, 708967, -1770051, 1477009, 1207015, -3465093, -1601856, 9084666, 14915258, 7435878, -2138145, -80479, 9358497, 12303770, 5945462, -1096256, -3511936, -2692878, 1167108, 8941061, 15433548, 12331020, -512352, -13760910, -19458890, -17963076, -14280322, -12580213, -14147899, -16553945, -15506544, -10714717]
8527a0714717L263158r90628M25671P801909J0738541L371261o719307r795329
8519b619441n905518l79447M224743N906345J502589o137296p528576k26745N448628
8510e714718K281964j785997K142720P027156J073247j0772823j2493589j707515
8502a9949555O886862L703252l939163n309054P898N970314Q553370O586486J348707
8493C859117k306695q93116J405540r07780l207733L304754J4092722J3654137
8485B9000946o63118j1638791o822613L147795K306661n796344o152341J771438
8477E153633L587642n334155j1249437l095497J0283839J2310732R85823r640400
8469C002180p939680K327065Q575640M855777k388001l888801K02728J672180
$$ y = [-10714717, -7451559, -8442187, -8016516, -214607, 10523934, 13895195, 7175888, -2619441, -8524959, -8904406, -4679663, 1226682, 2729271, -3408025, -10936601, -11163346, -5714718, -3432754, -5218751, -3076031, 3951125, 5024372, -5748451, -18242040, -19949555, -13062693, -9359441, -13298604, -18607658, -18599760, -12629446, -4076076, 2510410, 3859117, 1552422, 659306, 2064846, 1157066, -2050667, 1254087, 15346809, 29000946, 28337828, 16699037, 9876424, 13024219, 15330880, 9534536, 3382195, 5153633, 8741275, 3407120, -7842317, -10937814, -653975, 11656757, 12642580, 3002180, -4937500, -2610435, 5965205, 10820982, 8432981, 4544180, 4746908, 6419088]
8461F419088k498277m722758J084627P935164M816419n453324q406309L93467
8453d31903P265555N02697j1098848j0671611J483878Q741685L714576j446254
8445a940225M349634J2886056R681616k886445r078770l636063J726119k376354
8437H725568r591019r329707k007844M564446O907189O221232K649643k596351
8429E543157l823442J764347O751207K844206n109422m930830L952000Q825714
8421A5816937K770652n689408o402780j408340J183526n39763k966829m110063
8413a346068l460270O22287P057655R684694N015118j246387j723985J845490
8405A6448534K025564k678105o599174n977949k735373J28444J132738q71291
$$ y = [6419088, 3920811, -801947, 282680, 8217844, 13034263, 7580939, -825370, -431903, 6833652, 7336349, -3762499, -14434110, -12950232, -4208547, -493971, -1940225, 2409409, 15295465, 24977081, 22090636, 13011866, 9375803, 11101922, 8725568, -865451, -10195158, -12203002, -7638556, -731367, 5489865, 8139508, 5543157, 1719715, 3484062, 10235269, 13079475, 7970053, 3039223, 6991223, 15816937, 18587589, 12898181, 6495401, 5087061, 6270587, 5730824, 2763995, -1346068, -4806338, -4184051, 2873604, 12558298, 17573416, 16327029, 14603044, 16448534, 18474098, 15795993, 9196819, 3218870, 483497, 611941, 1744679, 873388]
8397H73388m838207n531595M33449P354641O165474k499590q258254n289518N97610
8388a0992602J816565r01345k257961p05518J563255K897259K431777l34568k722657
8379i205795J19558P306162J0131960L724452l625256q61390Q593073R991537
8371B6174301j192789j1081097o331881O475010R317622k667226j4769427j2357366
8363f432853J023702J0074988P385014l9812k807077j081042j677160p106324
8355f60564j1953962r870810j278459O788399P493256P89117o058423n267600
8347b0019046K932387R798519Q204248J690197n47639L070682M323975j817215
8339G636108q756585q067952k085156J153946J616476N598723J1532579R741635
$$ y = [873388, -3964819, -9496414, -9062965, -1708324, 4457150, 1957560, -6300694, -11590212, -10992602, -9176037, -10077382, -12335343, -13040861, -11477606, -8580347, -6148570, -6483138, -9205795, -9086237, -1780075, 8351885, 12076337, 8451081, 7589691, 16182764, 26174301, 24981512, 13900415, 7568534, 14043544, 23361166, 20693940, 5924513, -6432853, -5409151, 4665837, 12050851, 12011039, 9203962, 8122920, 6445760, -660564, -12614526, -22485336, -23763795, -16975396, -9482140, -8693023, -14751446, -20019046, -17086659, -7288140, 916108, 2606305, 2058666, 5129348, 9453323, 7636108, -1120477, -9188429, -11273585, -10119639, -8503163, -2904440, 8628139, 18369774]
8331A8369774o90152p073043j813834N134717K153722n514735n777768l66303
8323D422378K10256k474141K753777J3903360J4942639J774323r500877p714066
8315A8317649k220591l032624k949469N775943J2489173M610405q616699r534951
8307A4838836r51881L16189o606910o659076K763873P381381K210960j295431
8299A1997941O81802l195604j4196246j4259432M310867K0611643J4109157m748800
8291A5311328j1996359m973724O93080q72149k054106n10605j490148l667021
8283i559704o33245M409873J916615o426279r143840m098969m53024o55646L042920
8274b1601299J1024530J1711377P64361r448916p639784Q68663M961393M111423
$$ y = [18369774, 17679622, 10606579, 8792745, 13927462, 16081184, 10566449, 4788681, 4422378, 4632634, 2158493, 4912270, 18815630, 33758269, 35532592, 26031715, 18317649, 16097058, 13064434, 10114965, 15890908, 28380081, 32990486, 24373787, 14838836, 13886955, 14203144, 7596234, 937158, 3701031, 11082412, 13293372, 11997941, 12679743, 9484139, -4712107, -18971539, -14660672, 5950971, 20060128, 15311328, 3314969, -1658755, -965675, -1837824, -3891930, -4402535, -5892683, -9559704, -10192949, -5783076, -3866461, -10292740, -19436580, -23535549, -23988573, -24644219, -21601299, -10576769, 1134608, 1898969, -7549947, -15189731, -14321068, -9359675, -5248252]
8266e248252M443011O053151M431490K59993j334471K55990J37406l749565o378784
8257a130031j909466P460925J1621458L951163q431763j1308775k003999N957293
8249D206805J867949o700338o362203J575003N479652L137745K464441M756810
8241A0425864K912130l017761l966084J705951M504786K03023m356450n843405
8233B568054r464485j3958461q265704Q069524J7327087Q305612n502274n954191
8225f874838L844059Q590559N140511J362947j268176o642015j0627304n556335
8217a2030592M351235P206046J651173k966512k996366l012631l072733J692454
8209i177926Q101046O347531k970522p184166r79937N518691L558701j333245
$$ y = [-5248252, -805241, 5247910, 9679400, 9939393, 8604922, 8860912, 8998318, 5248753, -1130031, -3039497, 4421428, 16042886, 19994049, 11562286, 253511, -1750488, 4206805, 6074754, -625584, -6987787, -5412784, 66868, 3204613, 5669054, 10425864, 13337994, 10320233, 6354149, 8060100, 12564886, 12767909, 8411459, 2568054, -6896431, -20854892, -29120596, -21051072, -3723985, 4581627, -920647, -6874838, -3030779, 5559780, 10700291, 12063238, 10795062, 4153047, -6474257, -12030592, -7679357, -473311, 1177862, -1788650, -4785016, -7797647, -10870380, -9177926, -1076880, 5270651, 2300129, -4884037, -5863974, -345283, 3213418, 1880173]
8201A880173m19325M246575N122262J218277k967510n287255o011243m331962
8193f550008o07611J578534N29482j92495J797000K230494k850881q178408m879264
8184a7123157N785750J1839124N913722m767830q046989k535649K572057K228871
8176d134101K083631O954492J0424360M265813o253226p817161O32077N479107
8168A1634992l60902o566485l079702L082901J1924q856506j0321706k213953
8160a6669437N237813O583161O304604O964126M987845J42666k207502j261631
8152A0081645k997324q681213j0630484m185034L980033M961865n81017m687904
8144a2739433k475473L372967O375369L060101k470827k109045N577317J1644980
$$ y = [1880173, 1460848, 5707423, 10829685, 12047962, 9080452, 3793197, -2218046, -6550008, -7157619, -5579085, -5049603, -5242098, -3445098, -1214604, -4065485, -12243893, -17123157, -11337407, 501717, 6415439, 1647609, -6399380, -8935029, -6362972, -4134101, -2050470, 4904022, 15328382, 19594195, 13340969, 5523808, 6155885, 11634992, 11274090, 4707605, 1627903, 4710804, 4722728, -4133778, -14455484, -16669437, -11431624, -4848463, 1456141, 8420267, 13408112, 13550778, 11343276, 10081645, 7084321, -1596892, -12227376, -16412410, -12432377, -7470512, -8051529, -12739433, -15214906, -11841939, -5466570, -2406469, -4877296, -6986341, -1409024, 10235956]
8136A0235956Q335135M4840l775481k146935o75180o20852P524j647283q554835
8127A202889j3956342r175775Q99642M073780P72418J889947P394210N357717
8119a541514n308127j0250889l231484M238695M121304M193271R500212R720699
8111A1442167j968932j3204810j0172855J771607Q988406R157797O801542J414323
8103A4229245o074588p018186N20248L502258n008956j0517903o84830J0194950
8095h57762K680435j3821268j4480750J195079J0326824M053907l165255k028327
8087a6097117m7711j161102K001353R476276R411031q54059q575806o864329l452122
8078a6163586k513808K584572J1528542J2161950K021368m556459l09660L224706
$$ y = [10235956, 18571091, 18615931, 14840450, 12693515, 12018335, 11397483, 11405007, 9757724, 1202889, -12753453, -21929228, -21029586, -16955806, -16183388, -14293441, -6899231, -1541514, -6849641, -17100530, -20332014, -16093319, -11972015, -7778744, 1721468, 11442167, 9473235, -3731575, -13904430, -12132823, -3144417, 6013380, 12814922, 14229245, 8154657, 1136471, 1656719, 5158977, 150021, -10367882, -11052712, -857762, 1822673, -11998595, -26479345, -25284266, -14957442, -10903535, -14068790, -16097117, -16144828, -17305930, -15304577, -5828301, 3582730, 2728671, -5847135, -12711464, -16163586, -18677394, -16092822, -4564280, 7597670, 9619038, 5062579, 4752919, 7977625]
8070G977625j717997m747792J645361O172770n57367p294424j730856P046448
8062F793768M913948k231984m58177O247768L663046o724342j0664916n316098
8054c776987q44726q86687M92433M159178M698751K499911K430535K643434j335489
8045A0080353m786674p04364N491628L877838j583967J4384N068745P56494j0059125
8036H155312j0794771O03832P099401O16244o252036l366353J826298J109027
8028a003046n88226J718353K344542j842293k505942M512726Q824675K833573
8020A4294362m030116j509391L686294P92014n491929m271729J578147J065125
8012F112777n534837q451873n102317q90384K549059O444115O419804j220159
$$ y = [7977625, 6259628, 1511836, 3157197, 9329967, 8772600, 1478176, -252680, 6793768, 11707716, 9475732, 9017555, 15265323, 18928369, 12204027, 1539111, -3776987, -4621713, -5508400, -5015967, -856789, 3841962, 6341873, 8772408, 11415842, 10080353, 5293679, 4589315, 10080943, 13958781, 12374814, 12389198, 17457943, 18214437, 8155312, -2639459, -2035627, 5063774, 5680018, -572018, -3938371, -2112073, -1003046, -1591272, 127081, 2471623, 629330, -1876612, 2636114, 11460789, 14294362, 10264246, 8754855, 12441149, 13233163, 7741234, 3469505, 5047652, 6112777, 577940, -7873933, -12976250, -13866634, -11317575, -4873460, 1546344, 326185]
$$ [...]
##END NTUPLES=NMR SPECTRUM
##END=
