##TITLE=31Pdec_50-2021
 DMSO-d6, 124 sc
 5.07.2021
##JCAMPDX= 6.0         $$ Bruker NMR JCAMP-DX V2.0
##DATA TYPE= NMR SPECTRUM
##DATA CLASS= NTUPLES
##ORIGIN= UXNMR, Bruker Analytische Messtechnik GmbH
##OWNER= root
$$ XWIN-NMR		Version 3.5
$$ Mon Jul  5 10:26:39 2021 Russian Standard Time (UT+4h)  she@DPX200
##.OBSERVE FREQUENCY= 81.013821
##.OBSERVE NUCLEUS= ^31P
##.ACQUISITION MODE= SIMULTANEOUS
##.ACQUISITION SCHEME= undefined
##.AVERAGES= 124
##.DIGITISER RES= 16
##SPECTROMETER/DATA SYSTEM= spect
##.PULSE SEQUENCE= zgpg30
##.SOLVENT NAME= DMSO
##.SHIFT REFERENCE= (INTERNAL, DMSO, 0, 248.564)
##AUDIT TRAIL= $$ (NUMBER, WHEN, WHO, WHERE, WHAT)
$$ ##TITLE= Audit trail, XWIN-NMR		Version 3.5
$$ ##JCAMPDX= 5.01
$$ ##ORIGIN= Bruker BioSpin GmbH
$$ ##OWNER= she
$$ F:/spectra/data/she/nmr/P31/1/pdata/1/auditp.txt
$$ ##AUDIT TRAIL=  $$ (NUMBER, WHEN, WHO, WHERE, WHAT)
(   1,<2021-07-05 10:25:30.70 +0400>,<she>,<DPX200>,
      <continue with go, POWCHK disabled, PULCHK disabled
       configuration hash MD5:
       00 E9 B6 7A A2 85 ED C7 34 08 36 98 17 FE 4E 26
       data hash MD5: 32K
       42 37 30 B1 58 5C DB BB 7F 5D F4 F6 7D DC C0 7E>)
(   2,<2021-07-05 10:25:32.62 +0400>,<she>,<DPX200>,
      <Start of raw data processing
       efp BC_mod = 2 LB = 1 FT_mod = 6 PKNL = 1 PHC0 = -7003.678 PHC1 = -865.3141 SI = 64K 
       data hash MD5: 64K
       5E 0A B9 40 B9 E3 BC C6 26 D4 1D 26 DB 34 B4 B3>)
(   3,<2021-07-05 10:26:02.48 +0400>,<she>,<DPX200>,
      <pk PHC0 = -64.73022 PHC1 = 75.60004 
       data hash MD5: 64K
       A2 81 06 67 D4 32 CE 54 64 5C 6A 05 74 70 19 D4>)
(   4,<2021-07-05 10:26:05.07 +0400>,<she>,<DPX200>,
      <abs ABSG = 5 
       data hash MD5: 64K
       F8 A9 5F C2 31 5D 42 18 0C 86 0E EB 54 F2 F8 FB>)
$$ ##END=
$$ 
$$ hash MD5
$$ F6 F5 59 BF FD B8 B0 FB E8 2B A4 B1 CB 72 B9 17
##$RELAX= 
##$RELAX= 
##$RELAX= 
##$RELAX= 
##$RELAX= 
##$RELAX= 
##$RELAX= 
##$RELAX= 
$$ Bruker specific parameters
$$ --------------------------
##$DU= <F:/spectra>
##$EXPNO= 1
##$NAME= <P31>
##$PROCNO= 1
##$TYPE= <nmr>
##$USER= <she>
##$AMP= (0..31)
100 100 100 100 100 100 100 100 100 100 100 100 100 100 100 100 100 100 
100 100 100 100 100 100 100 100 100 100 100 100 100 100 
##$AQSEQ= 0
##$AQ_mod= 1
##$AUNM= <au_zg>
##$AUTOPOS= <>
##$BF1= 81.014009
##$BF2= 200.13
##$BF3= 200.13
##$BF4= 200.13
##$BF5= 200.13
##$BF6= 200.13
##$BF7= 200.13
##$BF8= 200.13
##$BYTORDA= 1
##$CFDGTYP= 0
##$CFRGTYP= 5
##$CHEMSTR= <none>
##$CNST= (0..31)
1 1 145 1 1 1 1 1 1 1 1 1 1 1 1 1 1 1 1 1 1 1 1 1 1 1 1 1 1 1 1 1 
##$CPDPRG= <waltz16>
##$CPDPRG1= <>
##$CPDPRG2= <waltz16>
##$CPDPRG3= <>
##$CPDPRG4= <mlev>
##$CPDPRG5= <mlev>
##$CPDPRG6= <mlev>
##$CPDPRG7= <mlev>
##$CPDPRG8= <mlev>
##$CPDPRGB= <>
##$CPDPRGT= <>
##$D= (0..31)
0 1 0 0 0 0 0 0 0 0 0 0.03 2e-05 3e-06 0 0 0 0 0 0 0 0 0 0 0 0 0 0 0 0 
0 0 
##$DATE= 1625466162
##$DBL= (0..7)
120 120 120 11 120 120 24 19 
##$DBP= (0..7)
150 150 150 150 150 150 150 150 
##$DBP07= 0
##$DBPNAM0= <>
##$DBPNAM1= <>
$$ [...]
##$SUBNAM3= <"">
##$SUBNAM4= <"">
##$SUBNAM5= <"">
##$SUBNAM6= <"">
##$SUBNAM7= <"">
##$SUBNAM8= <"">
##$SUBNAM9= <"">
##$SW= 501.771253377433
##$SWIBOX= (0..15)
0 1 3 0 0 0 0 0 0 0 0 0 0 0 0 0 
##$SW_h= 40650.406504065
##$TD= 32768
##$TD0= 1
##$TE= 0
##$TE2= 300
##$TE3= 300
##$TEG= 300
##$TL= (0..7)
0 120 53 12 22 120 120 120 
##$TP= (0..7)
150 150 150 150 150 150 150 150 
##$TP07= 0
##$TPNAME0= <>
##$TPNAME1= <>
##$TPNAME2= <>
##$TPNAME3= <>
##$TPNAME4= <>
##$TPNAME5= <>
##$TPNAME6= <>
##$TPNAME7= <>
##$TPOAL= (0..7)
0.5 0.5 0.5 0.5 0.5 0.5 0.5 0.5 
##$TPOFFS= (0..7)
0 0 0 0 0 0 0 0 
##$TUNHIN= 0
##$TUNHOUT= 0
##$TUNXOUT= 0
##$USERA1= <user>
##$USERA2= <user>
##$USERA3= <user>
##$USERA4= <user>
##$USERA5= <user>
##$V9= 5
##$VALIST= <valist>
##$VCLIST= <CCCCCCCCCCCCCCC>
##$VD= 0
##$VDLIST= <DDDDDDDDDDDDDDD>
##$VPLIST= <PPPPPPPPPPPPPPP>
##$VTLIST= <TTTTTTTTTTTTTTT>
##$WBST= 1024
##$WBSW= 4
##$XGAIN= (0..3)
0 0 0 0 
##$XL= 0
##$YL= 0
##$YMAX_a= 2646
##$YMIN_a= -2499
##$ZGOPTNS= <>
##$ZL1= 120
##$ZL2= 120
##$ZL3= 120
##$ZL4= 120
##$ABSF1= 248.5645
##$ABSF2= -253.2056
##$ABSG= 5
##$ABSL= 3
##$ALPHA= 0
##$AQORDER= 0
##$ASSFAC= 0
##$ASSFACI= 0
##$ASSFACX= 0
##$ASSWID= 0
##$AUNMP= <proc_1d>
##$AZFE= 0.1
##$AZFW= 0.5
##$BCFW= 0
##$BC_mod= 2
##$BYTORDP= 0
##$COROFFS= 0
##$CY= -3
##$DATMOD= 1
##$DC= 0
##$DFILT= <>
##$DTYPP= 0
##$F1P= 0
##$F2P= 0
##$FCOR= 1
##$FTSIZE= 65536
##$FT_mod= 6
##$GAMMA= 0
##$GB= 0
##$INTBC= 1
##$INTSCL= 5.30512e-09
##$ISEN= 30
##$LB= 1
##$LEV0= 0
##$LPBIN= 0
##$MAXI= 10000
##$MC2= 0
##$MEAN= 0
##$ME_mod= 0
##$MI= 50
##$NCOEF= 0
##$NC_proc= -6
##$NLEV= 6
##$NOISF1= 182.463
##$NOISF2= 159.3651
##$NSP= 0
##$NTH_PI= 0
##$NZP= 0
##$OFFSET= 248.5645
##$PC= 4
##$PHC0= -7068.408
##$PHC1= -789.7141
##$PH_mod= 1
##$PKNL= yes
##$PPARMOD= 0
##$PSCAL= 0
##$PSIGN= 0
##$REVERSE= no
##$SF= 81.014009
##$SI= 65536
##$SIGF1= 159.3651
##$SIGF2= -187.1042
##$SINO= 113.3802
##$SIOLD= 16384
##$SREGLST= <1H.CDCl3>
##$SSB= 0
##$STSI= 65536
##$STSR= 0
##$SW_p= 40650.406504065
##$SYMM= 0
##$S_DEV= 0
##$TDeff= 32768
##$TDoff= 0
##$TI= <>
##$TILT= no
##$TM1= 0
##$TM2= 0
##$TOPLEV= 0
##$USERP1= <user>
##$USERP2= <user>
##$USERP3= <user>
##$USERP4= <user>
##$USERP5= <user>
##$WDW= 1
##$XDIM= 65536
##$YMAX_p= 312552496
##$YMIN_p= -12238836
$$ End of Bruker specific parameters
$$ ---------------------------------
##NTUPLES= NMR SPECTRUM
##VAR_NAME=  FREQUENCY,     SPECTRUM/REAL,   SPECTRUM/IMAG
##SYMBOL=    X,             R,               I
##VAR_TYPE=  INDEPENDENT,   DEPENDENT,       DEPENDENT
##VAR_FORM=  AFFN,          ASDF,            ASDF
##VAR_DIM=   65536,         65536,           65536
##UNITS=     HZ,            ARBITRARY UNITS, ARBITRARY UNITS
##FACTOR=    0.620285442955139, 1,           1
##FIRST=     20137.2065510759, 0,            0
##LAST=      -20513.1999529892, 0,           0
##MIN=       -20513.1999529892, -12238836,   0
##MAX=       20137.2065510759, 312552496,    0
$$ Real data points
##PAGE= N=1
##DATA TABLE= (X++(R..R)), XYDATA
$$ [...]
##PAGE= N=2
##DATA TABLE= (X++(I..I)), XYDATA
15260 -1918729 -2994574 -3402811 -1948849 312485 796535 -1446322 -4330031 -5235397 -3986846
15251 -3986846 -2429166 -1800209 -1643160 -1033271 60721 717533 -10731 -1965446 -3551912
15242 -3551912 -3083602 -735698 1495296 2156268 1868845 1932270 2338441 2240957 1733976
15233 1733976 1723635 2080375 1318111 -1321512 -4392108 -5653014 -4559099 -2638386 -1514729
15224 -1514729 -1249474 -892884 -147126 183182 -573959 -1842159 -2326027 -1463333 -1037
15215 -1037 826824 475064 -483818 -956967 -516829 -92332 -1096134 -3564951 -5618172
15206 -5618172 -5349161 -3020234 -798232 -475484 -2028418 -4226759 -5852288 -6189349 -5052209
15197 -5052209 -2836780 -399535 1341251 1841347 1318187 822527 1394843 2780771 3514199
15188 3514199 2718367 1165723 -43427 -1023771 -2405186 -3912366 -4870998 -5424967 -5808915
15179 -5808915 -5085581 -2440723 679620 1870584 1210500 1160426 2676676 3776176 2779299
15170 2779299 670628 -1000130 -2402675 -4015293 -4900730 -4359587 -3693259 -4174506 -4616218
15161 -4616218 -3311896 -1309188 -1101199 -2609012 -3133870 -1272646 1518754 3373266
15153 3373266 3683884 2135867 -1343619 -4912226 -5540817 -2713175 538377 1598578
15145 1598578 1415823 2150274 3486110 3432005 1631170 -442963 -2060434 -3752668 -5241904
15136 -5241904 -4953434 -2300959 964126 2551616 2002491 678970 -24814 31050 -97637
15127 -97637 -1262145 -3076439 -4093369 -3450447 -1991852 -1136368 -990669 -498664 718832
15118 718832 1770077 1852059 1169910 216482 -923985 -2178873 -3218651 -3919782 -4308192
15109 -4308192 -3885578 -2130527 1599 491914 -1018179 -2249307 -1206350 1045713
15101 1045713 1935871 808309 -789486 -1544298 -1375527 -463645 850125 1358951 94944
15092 94944 -1754068 -1932235 -432002 268511 -1040304 -2305120 -1191360 1543900 3161106
15083 3161106 2327472 -28882 -2417020 -3917659 -4147226 -3377751 -2478200 -1874071 -928745
15074 -928745 909818 2904343 3829360 3493792 2637212 1782634 1009841 418654 37813
15065 37813 -294142 -329072 619244 2307478 2976224 1285569 -1687870 -3561380 -3413824
15056 -3413824 -2336938 -1495572 -832283 221444 1690482 3022248 3696574 3768565 3853477
15047 3853477 4276903 4326584 3083097 1000913 -360506 -285342 635700 1960338 3464845
15038 3464845 3522269 -1536 -6005061 -9829280 -8635887 -5021730 -3176300 -3573387 -4007097
15029 -4007097 -3756581 -3458538 -2481692 -92282 1819358 929933 -1253757 -1140934 1277916
15020 1277916 2494304 1282350 311819 1282907 2407680 1934037 672986 -203258 -556928
15011 -556928 556972 4412512 8880858 9157722 4424018 127975 938900 4700391 6441699
15002 6441699 5467240 4861848 6027146 7373391 7382097 6055820 4087227 2680584 3042566
14993 3042566 4271744 3456999 -188400 -3353729 -3056156 -739886 824629 2294574
14985 2294574 5668713 9253623 9097683 4895314 508749 -1383074 -1620318 -1404911 -367031
14976 -367031 1364328 2154147 1239459 102047 422466 2056199 3589539 3768869 2288959
14967 2288959 216967 -687530 -102119 239934 -732745 -1499154 -567962 552863 -437742
14958 -437742 -2786833 -4037823 -4185617 -5119803 -6575205 -6293481 -4100571 -2153536 -904395
14949 -904395 1409648 4615751 5836995 4169904 2489317 2792821 3084808 1177580 -1304071
14940 -1304071 -1457453 481482 1997686 2070493 1513082 633590 -901090 -2334292 -2163068
14931 -2163068 -297991 1651226 2409027 2273645 2142893 2067542 1213197 -749101 -2483064
14922 -2483064 -2018725 551167 2468141 1705238 40884 776163 3897978 5925599 4700733
14913 4700733 1893131 89786 -362558 -579944 -1086704 -1733095 -2309615 -2348071 -1487630
14904 -1487630 -547537 -872423 -2226531 -2868384 -2041404 -688979 582411 2278393 4342778
14895 4342778 5790831 6508719 7270682 7576659 6033902 3474243 2726016 4228734 4985330
14886 4985330 3351025 1607077 1754151 2058970 538032 -1140162 -599068 883000 643872
14877 643872 -734028 -1014288 -930070 -2849811 -5686351 -5727779 -2636344 -260664 -669499
14868 -669499 -1452720 -449117 557091 -813813 -3333376 -4085354 -2847628 -1893271 -2322362
14859 -2322362 -2966636 -2719874 -2003373 -1592537 -1339338 -668432 343477 944834 587356
14850 587356 -475773 -1509674 -2116885 -2617367 -3551784 -4848070 -5537890 -4455460 -1608657
14841 -1608657 1030874 860148 -2458912 -6031627 -6818947 -5223068 -4000885 -3921081 -2862446
14832 -2862446 176937 2725094 2203394 -218374 -1313238 -237636 887972 262756
14824 262756 -1759731 -3972128 -5673066 -6500204 -6190675 -4861072 -2911149 -756879 934106
14815 934106 1388159 770267 318642 688767 1080590 835507 692098 1280142 1658320 929319
14805 929319 148750 746764 2009724 2252028 1768193 2222383 3384469 3011061 374235
14796 374235 -2271899 -2568438 -830366 829684 1007977 25933 -709441 8627 1894949
14787 1894949 3157000 2446090 572670 -515695 -45648 1211153 2315827 2795563 2436755
14778 2436755 1585769 1073255 830465 -372851 -2533198 -3315266 -1455408 260806 -1602136
14769 -1602136 -5729982 -7521373 -5566319 -2873589 -1444428 103268 2230748 2145927
14761 2145927 -1539334 -5242706 -4921388 -1839103 -329082 -1403633 -2261909 -1372351 -314697
14752 -314697 -321058 -292640 651427 1197011 -34608 -2045113 -2784293 -2044526 -1634414 -2987381
14742 -2987381 -5599219 -7748433 -8089723 -6640624 -4811158 -4377790 -5678219 -6677067 -4739253
14733 -4739253 2396 3880877 3594754 489566 -868879 1267473 3341926 1451768
14725 1451768 -3012070 -5045941 -2487920 1809871 4205070 4127644 3099754 2171952 1614544
14716 1614544 1611693 1904456 1654604 600262 -498941 -1217555 -2145257 -3416134 -3816283
14707 -3816283 -2589075 -1154108 -1510683 -3372568 -4377059 -3234708 -1450039 -1302447
14699 -1302447 -2739495 -3191563 -802069 2754146 3766708 973051 -2809201 -4417918
14691 -4417918 -4231411 -4553281 -5396498 -4672051 -2244811 -604961 -775493 -576505 1542119
14682 1542119 3624006 3270602 1449730 792387 1635365 2308370 2272008 2382416 2681269
14673 2681269 2410372 1885074 2005192 2139985 956646 -659609 -241271 2096021 2843635
14664 2843635 -97517 -4003572 -4760994 -2292161 -205537 -571149 -1496664 -531741 1468093
14655 1468093 1588531 -691637 -2254909 -325424 3560949 5111033 2532625 -1358249
14647 -1358249 -2714199 -919074 1615129 2705130 2124234 835601 -13942 404102 1829132
14638 1829132 2747019 2086381 886265 1058508 2600023 3446809 2342801 507448 -128864
14629 -128864 708517 1735418 1813098 869904 -385587 -1081664 -749921 367545 1604737
14620 1604737 2353102 2117749 683984 -1125039 -1573926 -118076 1150336 -156893 -3108697
14611 -3108697 -4224912 -2228974 182639 328406 -859230 -923473 198923 616180 -190394
14602 -190394 -830392 -477467 98789 -44963 -1042866 -2422889 -3034835 -1509599 1631953
14593 1631953 3374948 1887223 -313548 208688 2182889 1403488 -2078605 -3399208
14585 -3399208 -686117 1692173 293385 -1884444 -1028204 726376 -487690 -2609582
14577 -2609582 -701417 4051631 5283825 1308898 -2560387 -2576804 -1178333 -1115965 -941646
14568 -941646 672751 1399166 -300405 -1630630 -203631 1621042 1064652 -179336 389931
14559 389931 1203677 152760 -526839 1643990 3580616 1288145 -2138779 -424400 5206914
14550 5206914 6985614 2435228 -2446534 -3294849 -3058448 -4663556 -5116811 -1531877 2529746
14541 2529746 2091121 -1713443 -4189819 -4200062 -3840050 -3291191 -980523 2257262 3564118
14532 3564118 2237117 196835 -1168585 -1723919 -1005638 1024891 2286917 643254
14524 643254 -2675769 -4395636 -3629146 -2473509 -2519294 -3251174 -3731271 -3570581 -2404722
14515 -2404722 -491029 577683 -126276 -839262 392238 1858495 17100 -4796624
14507 -4796624 -7840979 -6090808 -2049155 -60170 -1125953 -3041504 -3911792 -3631543
14499 -3631543 -2788330 -1777017 -896007 -407236 -341438 -334407 413304 2525149 5199822
14490 5199822 6217486 4288056 947415 -1137566 -1395789 -1505608 -2639978 -4191598
14482 -4191598 -5234742 -5605053 -5247887 -3988753 -2379423 -1487221 -1418018 -1188782 -409934
14473 -409934 58770 -448346 -1322687 -1481190 -475116 1378563 3172953 3691783 2425786
14464 2425786 368939 -966305 -1115525 -437922 987737 2801630 3292154 935166 -2941073
14455 -2941073 -5014392 -3907250 -1526118 -98332 222030 187398 -68356 -285797 451080
14446 451080 2143846 3110025 2094329 35983 -1461238 -2289391 -3180287 -3977832 -4072876
14437 -4072876 -3758934 -3620540 -3144505 -1463470 877043 2357272 2475638 1882877 695547
14428 695547 -1612088 -4266699 -4865710 -2178152 1710617 3489944 2582299 1600501 2524023
14419 2524023 3827516 2738143 -356933 -1797817 433506 3497367 3111700 -787543
14411 -787543 -3999969 -3582095 -1062126 678556 1468165 2850503 4526425 4550632 2954990
14402 2954990 2421704 4208395 5599818 3521159 -625760 -2481523 -869563 619341
14394 619341 -789441 -2862513 -2186513 90805 -2946 -2717611 -3906528 -1391823 1964718
14385 1964718 3089353 2916945 3325533 3118602 529705 -2581254 -2966982 -1101190 -173781
14376 -173781 -769074 -558942 832835 754264 -1967624 -5097769 -6693989 -7415336 -7811427
14367 -7811427 -6653831 -3931133 -2484253 -4022864 -5767072 -3975268 586941 3567975
14359 3567975 2825266 785651 897057 3562826 6149141 6058915 3228692 -291940 -2912561
14350 -2912561 -4860861 -6478183 -6535740 -4114317 -1208445 -734475 -2183618 -2324526 -476994
14341 -476994 426705 -974823 -1952736 -262178 2161636 2545170 1318385 156356 -1101762
14332 -1101762 -2574095 -2251880 688816 3105855 2273369 525968 1212600 2575779 954523
14323 954523 -2044934 -1965519 66224 -1391121 -6036998 -6779367 -1002324 4450459 3465706
14314 3465706 -571712 -1280776 857435 1307153 76353 572908 2228276 1286298 -1833644
14305 -1833644 -2555932 118067 1927398 603025 -727660 572822 2222206 1242989
14297 1242989 -1296910 -2789867 -3181863 -3498398 -2986166 -1037710 174541 -1462411 -3945717
14288 -3945717 -3509664 -332956 1553075 69247 -2330544 -2532034 -627241 1162955
14280 1162955 1486764 491323 -1306964 -3469712 -5305705 -5845173 -4374289 -1281221 1576567
14271 1576567 2240059 954578 48279 684986 1196100 29042 -1425294 -1284889 -826340
14262 -826340 -2340794 -4309936 -2873631 1736971 4628123 3333549 1207161 1615667
14254 1615667 2850763 1985901 252829 542864 2181452 2588136 2255653 3438265 5142339
14245 5142339 4376558 1903565 1601275 3747945 4190445 1512337 -157303 2034881 4698688
14236 4698688 3582518 250559 -794061 851475 1704203 275977 -1433256 -1901056
14228 -1901056 -1875677 -1986367 -1579278 -462365 536207 1158631 1886559 2416252 2017617
14219 2017617 1434341 2105222 3248006 2277407 -1117363 -3848857 -3697338 -2426489 -2822612
14210 -2822612 -4497309 -4959458 -3687120 -2560659 -2583017 -2631934 -1880939 -1324490 -1832556
14201 -1832556 -2242438 -870714 1852803 3707056 3408784 1784234 164011 -1199719
14193 -1199719 -2646711 -3988607 -4680784 -4675646 -4425382 -4236982 -4070565 -3724380 -2860991
14184 -2860991 -1220893 826662 2441125 3379940 4143885 4550975 3389001 665680 -1080493
14175 -1080493 252753 2817755 2794936 -218044 -2549153 -1742619 346424 1035565 601782
14166 601782 452791 -75891 -2108571 -3944269 -2807637 539533 2195449 528945 -1680817
14157 -1680817 -1487658 335884 1216530 702207 462682 1331259 2311156 2443654 2193291
14148 2193291 2557501 3609936 4424600 4187477 3113641 2278156 2562429 3747596 4682062
14139 4682062 4341186 2677482 520274 -1151914 -1774191 -1261020 74110 1402206 1539636
14130 1539636 58372 -1595168 -1155594 1491112 3419920 2154000 -761913 -1667044
14122 -1667044 129032 1755685 1638085 1922982 4447068 6975946 6177707 2717106 422527
14113 422527 1119552 3065970 4250143 4555472 4420885 3784428 2966937 2626540 2280660
14104 2280660 747005 -1407025 -1865141 139072 2451763 3069446 2754398 3020932 3082211
14095 3082211 1006941 -2697726 -4853505 -3368890 194188 2553472 2440625 1531426
14087 1531426 1767413 2666474 2139158 -258556 -2241983 -1748197 140704 689662 -649371
14078 -649371 -1651923 -571738 1756188 3476680 3830327 3084310 1755141 708058 838759
14069 838759 1819623 2203991 1484510 843822 1050939 1072831 91995 -467828 1144211 3854572
14059 3854572 4709699 2946652 1130640 1671829 3798195 4943039 4068444 2477773 1818430
14050 1818430 2325378 3055633 3122987 2401374 1365762 602244 448285 862646 1480265
14041 1480265 1816844 1508807 430136 -1239321 -2829642 -3234537 -1755256 892236 3009370
14032 3009370 3753441 3887633 4093140 3416270 730039 -2666909 -3647098 -918767 3181408
14023 3181408 5255393 4311009 2066027 652744 774430 1563725 1606868 459699 -585276
14014 -585276 122743 2237812 3449440 2406109 502570 -170907 327926 288743 -930291
14005 -930291 -2108476 -1962965 -554467 1171375 2307526 2382179 1645140 1033657 1211970
13996 1211970 1751124 1923010 1955436 2465893 2918200 2091580 283654 -527319 488845
13987 488845 1362915 -224998 -3681201 -6132942 -6016293 -4667465 -4280694 -5487402 -7262132
13978 -7262132 -8180212 -7319790 -4891857 -2617221 -2586480 -4847222 -6795239 -5995221 -3117750
13969 -3117750 -947665 -887904 -1855441 -2479302 -2639129 -2393477 -1150688 1011521 2564429
13960 2564429 2426064 1660788 1862572 2649115 2389116 906066 -317864 -501018 -369131
13951 -369131 -415432 -38455 1044435 1943081 1827800 842959 -786242 -3230031 -5742769
13942 -5742769 -6166007 -3243538 1083615 3118112 1325784 -1961010 -2997861 -432489
13934 -432489 3494865 5453069 4535010 2848109 2464823 2761681 1896254 193158 121321
13925 121321 2671725 5585547 6007819 3553510 19493 -2521551 -2551740 200265 3486819
13916 3486819 3545652 -687007 -5450649 -6321121 -3737003 -2115743 -3845894 -6680517 -7464025
13907 -7464025 -6093137 -4683715 -4515585 -5201401 -5928468 -6241984 -5906303 -4780989 -2851308
13898 -2851308 -329423 2008513 2976527 2329277 1649223 2642223 4637117 5267100 3781929
13889 3781929 1948991 1158353 567351 -807266 -2046485 -2080535 -1976060 -3319698 -5207837
13880 -5207837 -5092351 -2280350 1439397 4426505 6333215 6691350 4790596 1590194
13872 1590194 -410023 -188618 679258 779690 775167 1424315 1803512 1237272 1097739 2473570
13862 2473570 3641649 2502902 369362 303300 2265094 3165432 1863260 838445 2007292
13853 2007292 3820960 3998615 2794440 1904866 1957148 2560053 3222418 2973215 840272
13844 840272 -2042521 -2807099 -788487 1081057 548583 -733447 -576215 -243999 -1750606
13835 -1750606 -3306984 -1680085 1998101 3224871 795485 -1794065 -2108930 -1773560
13827 -1773560 -2512392 -3065894 -1958101 -173197 989608 2065551 3448525 3793246 2485650
13818 2485650 1330410 1549555 1438815 -435667 -1971718 -652773 1755650 1301661 -2045531
13809 -2045531 -3959768 -1678305 2665803 5428732 5749899 5259467 5153669 4965224 3678193
13800 3678193 1248648 -1012553 -1650232 -750718 140793 35219 -513212 -866190 -1334049
13791 -1334049 -1815681 -1081983 900534 1427238 -1782792 -6708574 -8864768 -6802119 -3398188
13782 -3398188 -1667619 -1804534 -2864770 -4768689 -7221422 -8559624 -7546408 -5398376
13774 -5398376 -4410050 -4929173 -5062328 -3464542 -1298995 -765701 -2206232 -3677233 -3652550
13765 -3652550 -3077453 -3621920 -4686951 -4126311 -1920741 -692108 -1627867 -2344113 -625553
13756 -625553 1826806 1906887 -162329 -1513732 -1184381 -925745 -1661999 -2054298 -1020645
13747 -1020645 674844 1846569 1985055 770875 -1544234 -3266086 -2867095 -1349280
13739 -1349280 -684176 -257959 2041116 5191789 5333256 1731691 -1375135 -805294 1237277
13730 1237277 1421695 600709 1421845 3130025 2825288 627719 -404122 737439 1572217
13721 1572217 107987 -2452148 -3596489 -2126310 1393753 5020044 6218041 4146662
13713 4146662 1261387 821073 2758215 3953359 2640276 271450 -1401108 -2640760
13705 -2640760 -4010369 -4456999 -2798572 123038 2249034 2485451 1107125 -1010620
13697 -1010620 -2484543 -1785390 1091999 3961455 4767817 4078554 3911880 4490307 3847159
13688 3847159 903592 -2587561 -4009931 -2887481 -1010053 -57527 -36218 -858 500483
13679 500483 1038994 928787 -109698 -1662670 -2686874 -2119563 37798 2231209 2517745
13670 2517745 562006 -1814671 -2381797 -592964 2265191 4594875 5620442 5252987
13662 5252987 3651631 1268349 -1091668 -2687654 -3277197 -3005735 -2041942 -555855 1010096
13653 1010096 1933080 1697170 551910 -518437 -601255 256532 1122466 1306892 1220313
13644 1220313 1742002 2828377 3335944 2488151 973717 22148 -217174 -528196 -1018818
13635 -1018818 -823747 212050 778313 2611 -887154 -266031 1147531 1140051 -461966
13626 -461966 -1237072 148433 1706519 954144 -1571271 -3334815 -3260329 -2358358 -1673808
13617 -1673808 -1505882 -2209901 -3823051 -4997011 -4129005 -1691229 121883 119838 -1003557
13608 -1003557 -2368226 -3700046 -4409254 -3770990 -2239838 -860574 523021 2401933
13600 2401933 3345895 1651273 -703397 312629 4071271 4616649 -699131 -6135852
13592 -6135852 -5223403 -168228 1650033 -1397390 -3688044 -1464499 2391574 3953870
13584 3953870 3507754 2919892 1948998 141324 -747171 621589 2393351 2380127 1848582
13575 1848582 3320101 5879514 6014395 2829450 -488017 -825918 1338245 3145187
13567 3145187 2617921 262541 -1623019 -1074567 1402423 3023155 1728726 -1461791
13559 -1461791 -3803759 -3761439 -1732639 1009146 2664853 1335504 -2823118 -6469963
13551 -6469963 -6340820 -3453800 -1802580 -2844496 -3883998 -2584277 -360839 372604
13543 372604 201873 1561456 4577211 6442788 5076351 1765340 -414499 32741 1824113
13534 1824113 2795994 2458508 2178529 2854770 3454330 2797663 1831939 2292227 3498966
13525 3498966 2896731 210512 -1488178 -105822 2424144 3245523 2675706 2854388 3977009
13516 3977009 4693657 5146048 6510575 8017028 7585980 5485806 4265071 4588713 4209015
13507 4209015 1971994 -161196 -451571 90605 241465 894832 2611820 3330933 1402663
13498 1402663 -966891 -521121 1993727 2882483 1038385 -819006 -467921 1228708 2479072
13489 2479072 2669687 1740384 -141952 -1657737 -1381067 -338959 -1068299 -3434878 -4270418
13480 -4270418 -2446238 -1195310 -3120008 -5663101 -4763089 -1142936 753386 -689045
13472 -689045 -2468548 -1920441 -97108 831303 863580 1333137 2593208 3957821 4765677
13463 4765677 4549582 3287936 2120670 2370113 3198242 2101655 -1173189 -3313810 -1860251
13454 -1860251 1009981 1671699 492923 768590 2919064 3638541 1435264 -740523 -161558
13445 -161558 1584985 1743926 1063593 1970960 3678652 2973717 -406878 -2879881 -2237693
13436 -2237693 -596914 -705367 -1943529 -2043211 -910627 -343848 -863340 -1067854 -13126
13427 -13126 1487513 2177521 1834339 1188779 1106304 1944187 3180585 3733012 3127929 2229343
13417 2229343 2327444 3591612 4847526 4913562 3944238 3326451 4023238 5006258 4130632
13408 4130632 1207221 -880517 317069 3013501 3207041 274020 -2255266 -1961684
13400 -1961684 -446019 306489 1199623 3302082 4668656 3093758 164121 -745788 699771
13391 699771 2029865 1899542 728049 -1434224 -4277548 -5430587 -3013525 602898
13383 602898 1444676 -105483 -208949 1758150 2262015 -56780 -2178437 -2324828 -2752882
13374 -2752882 -4561295 -4531436 -551464 3837311 4266147 1820343 550402 1228915 1570718
13365 1570718 729578 -282750 -1200666 -2028314 -1321857 1724903 4788085 5203067 3860082
13356 3860082 3145672 2664494 652307 -1879340 -2486046 -1673831 -1777672 -2328891 -896164
13347 -896164 2007966 3372480 2802084 2572393 2617319 495655 -3103706 -4199428 -2338776
13338 -2338776 -2308793 -6597056 -10940822 -10624488 -7155253 -4912756 -4388594 -2939003 -221366
13329 -221366 1168401 -272976 -3239466 -5530503 -5838448 -4409779 -3166687 -3822108 -4980074
13320 -4980074 -3383968 713673 2503722 -733429 -4910104 -4333122 642871 4760061
13312 4760061 4964093 2591684 -388146 -3332795 -5383788 -5539210 -4610662 -4374121 -4689586
13303 -4689586 -3999893 -2525928 -2165054 -3102230 -3326994 -2004006 -799242 -1168669 -2462745
13294 -2462745 -3366338 -3380846 -2419168 -661913 841233 1012732 284886 -223119 -712634
13285 -712634 -1994397 -3269407 -2984277 -1571397 -720327 -167357 1797363 4641280 5778738
13276 5778738 4825706 4048402 3832783 1802542 -1999768 -3398267 -305583 3202277 2676480
13267 2676480 21779 141353 3148675 4779014 3526994 2488847 3803345 5481671
13259 5481671 4958901 2632614 504068 -404504 -192284 496796 428354 -1190872 -3206308
13250 -3206308 -3701999 -2780111 -2137460 -1848199 -167047 2912093 4662837 3381144 730915
13241 730915 -969625 -1451635 -1046764 832393 3584167 4176274 922327 -3123221 -3615562
13232 -3615562 -678543 1940839 2743713 3915796 6685885 8816468 8118527 5828660
13224 5828660 4697376 5400339 6377736 6022923 3897411 970982 -424725 1657319 5929328
13215 5929328 8267822 6443786 3116083 2381877 4536653 6361853 5784339 3794841
13207 3794841 1904645 185625 -1551869 -2655131 -2740043 -2561550 -2844480 -3203386 -2888259
13198 -2888259 -1730006 79245 2102977 3196281 2290836 292874 -294035 1317149
13190 1317149 2696028 1450698 -1234219 -2134140 -265372 2346392 3798343 4159717
13182 4159717 4077812 3463876 2202648 817146 -141381 -381415 544027 2616258 4221596
13173 4221596 3355907 460546 -1642002 -1335692 46720 936002 1854725 3462464 4341362
13164 4341362 3158009 1614679 2378585 4706162 5068971 2220399 -1089999 -2037487 -927187
13155 -927187 404327 1196729 1549330 1376421 922562 989893 1544210 1361539 25962
13146 25962 -1118041 -1021233 -420368 -138301 395822 1418161 1364084 -822352 -3285086
13137 -3285086 -3459972 -1728681 -600390 -1027055 -1863002 -2340843 -2608089 -2253891 -891532
13128 -891532 52019 -1180340 -3494246 -4051657 -2581098 -1498373 -1506044 -676712 1174072
13119 1174072 1066484 -2304852 -5766430 -6097040 -4201339 -2290479 -100992 2736483
13111 2736483 3561577 283802 -3926348 -4285534 -1541465 -586113 -2502611 -3299419 -1100590
13102 -1100590 777154 -230901 -1717141 -856658 753699 290677 -1204725 -707404 1764391
13093 1764391 3686328 4360861 5120931 5763864 4285825 559642 -2526146 -2504705 -107322
13084 -107322 2021604 2054410 151490 -1901890 -2141595 -487949 991198 911319 646337
13075 646337 1767916 2618024 475018 -3231729 -3649965 552830 4629481 4270795 1476634
13066 1476634 778813 2137167 1843232 -621682 -1399326 1358659 4127505 3157454 -60767
13057 -60767 -1249315 614668 2605938 2305024 252922 -1872091 -3197285 -3455808 -2704214
13048 -2704214 -1760374 -1549917 -1737036 -1393850 -1157646 -2868895 -6389807 -8626223 -7017952
13039 -7017952 -2740720 829003 1764499 494733 -1702564 -3397633 -3051528 -380129
13031 -380129 2498345 3022023 1370229 181041 992630 2553963 3054021 2471052 1902524
13022 1902524 1769646 1740847 1768039 2226066 3189817 4109386 4193933 3084137 1401990 507673
13012 507673 1240416 3003761 4535600 5235262 5112917 4072534 2434337 1664053 2888329
13003 2888329 4694406 4232372 945876 -2538755 -3909545 -3733949 -3481691 -2862488 -950734
12994 -950734 1288303 1740452 29082 -2067951 -2969682 -2632644 -1615365 -176482 1507156
12985 1507156 3233100 4964411 6321648 6177217 3945435 1122845 67098 972506
12977 972506 1522266 186006 -1541565 -1347486 499080 1585317 900027 208371 1286834
12968 1286834 3108055 3079806 623924 -1866481 -1911727 279692 2494299 3099594 2108969
12959 2108969 332063 -1421592 -2525966 -2904799 -3108365 -3284992 -2574913 -656122 737002
12950 737002 -321600 -2713627 -3115189 -586847 1892989 1539627 -690084 -2164257 -2240364
12941 -2240364 -1867391 -1154593 234741 1355406 1185589 843551 2008129 3638639 3173865
12932 3173865 949198 228758 2127754 3684776 2590665 1075353 2661700 6849526
12924 6849526 9679870 8782403 5606765 2997288 2477975 3833701 5689356 6353531 5374655
12915 5374655 4314170 4863056 6391259 6772805 5581508 4734392 5456313 6268309 5115948
12906 5115948 2350365 216876 -40399 764783 1397278 1622122 1747855 1741042 1335958
12897 1335958 512776 -513326 -1383461 -1458726 -203020 1821250 2907250 1930359 -144229
12888 -144229 -1290749 -856050 -62622 19779 -40289 865211 2637776 4166642 4774592
12879 4774592 4619699 3986103 3083626 2413063 2426435 2823271 3046369 3439749 4772380
12870 4772380 6378454 6196505 3595437 1001285 1256404 4008306 6393018 7039660 7330890
12861 7330890 8156106 7611406 3705259 -1953417 -5453499 -5297061 -3714313 -3025725 -2838180
12852 -2838180 -1870738 -687634 -767918 -1814334 -1960529 -540552 924382 768149 -903247
12843 -903247 -2610904 -2966185 -1524086 1085632 3600709 5048579 5146249 3652432 275479
12834 275479 -3856142 -5741391 -3419083 1028927 3414488 2492279 1079136 1796238 3885243
12825 3885243 5128553 4838076 3578286 1676301 -389850 -1503964 -1411010 -1524490 -2735320
12816 -2735320 -3674567 -2843492 -1218161 -740182 -1289311 -1402768 -1139039 -1635298 -2234400
12807 -2234400 -881258 2326040 4603948 4310540 3073461 3016170 3785548 3731998 2595137
12798 2595137 1468165 961512 824434 995569 1851573 3348715 4581503 4484167 2998061
12789 2998061 1450632 1227237 1762838 789963 -2469528 -5361920 -4722927 -1145223 1729594
12780 1729594 2003002 1250764 1142395 960731 -280601 -1543413 -1485371 -874418 -1211121
12771 -1211121 -1953224 -1182930 1413507 4014767 4933329 3984435 1849342 -465429 -1687522
12762 -1687522 -1309319 -618939 -1252441 -2583193 -2215723 377942 2524412 2000291 589771
12753 589771 1835108 5695252 7976553 5917162 2145416 1154203 3219772 4465472
12745 4465472 2639742 -117195 -1086684 -763243 -970740 -1386589 -545023 1038445 1567349
12736 1567349 1112998 1252541 1839033 1090112 -844461 -1406006 391617 2239576 2098236
12727 2098236 1033345 869429 1185963 638881 -376686 -449572 545347 1568027 1912602
12718 1912602 1298796 -310298 -1708543 -829507 2246417 4277734 2822531 -308443
12710 -308443 -1782442 -1378535 -1120095 -1056825 649986 3828499 5963358 6134458 6130266
12701 6130266 6850341 6601811 4316158 1855383 1324156 2051263 2115940 1391321 1156869
12692 1156869 1659407 1890628 1379890 778796 774257 1372721 2187494 2848598 3237574 3530964
12682 3530964 3718269 3211283 1670075 36408 -411280 11172 -102496 -667369 32724
12673 32724 2170357 3161226 1186940 -1739727 -2265427 -159254 1895436 2308800 1978617
12664 1978617 1676372 487351 -2154452 -4613370 -4722941 -2602619 -595981 -533181 -1844517
12655 -1844517 -2509533 -1441264 315283 681855 -1324851 -4647294 -7177238 -7373073 -5088688
12646 -5088688 -1573296 1033007 953804 -1638202 -4423390 -4911760 -2732854 166583 1451190
12637 1451190 503984 -1009800 -680234 1979603 4489164 4024884 1181939 -397514 1133498
12628 1133498 3072063 1845440 -1908935 -4252989 -3384013 -1591380 -1407879 -2163981 -1608460
12619 -1608460 624510 2677678 2857787 1198631 -954506 -2057771 -1333611 667059
12611 667059 2437707 2664756 993839 -1976059 -4798308 -5557735 -3268310 862418 4391760
12602 4391760 5946742 5721833 3997483 842835 -2444213 -3580602 -2093941 -391807
12594 -391807 -750112 -2422620 -3080890 -2059122 -666168 -81297 -463879 -1577156 -2840038
12585 -2840038 -3148564 -1934038 -97183 1098712 1513573 1594709 1282646 655175 622344
12576 622344 1491907 1882943 741325 -714514 -1022593 -1095214 -2198481 -2603544 209109
12567 209109 4530028 5645962 2578812 -374038 -93442 1217091 413752 -1553507 -1943714
12558 -1943714 -995390 -1097315 -2713692 -4175442 -4709824 -5114926 -5878304 -6655158 -7218826
12549 -7218826 -7372336 -6538823 -4789083 -3404952 -3131175 -2960814 -1941813 -798502 -292246
12540 -292246 394830 1825417 2548138 1358994 -223617 -162337 793418 540253 -904062
12531 -904062 -1967164 -2295868 -2212102 -772315 2461459 4948673 4026657 1308072 465858
12522 465858 1422056 947539 -1365039 -2406212 -1153721 -260317 -1088475 -1747639 -1475046
12513 -1475046 -2370533 -4772753 -5375504 -2605941 178704 -55546 -1241871 -146549 2166252
12504 2166252 2660500 1515810 1013981 1258118 917076 632726 1783544 3026236 1862856
12495 1862856 -1129917 -3157122 -3565065 -3828651 -3812941 -1844659 1549259 3656207 3711422
12486 3711422 3615107 3971869 2888071 -135961 -2332475 -1500008 720028 1350434 101240
12477 101240 -980537 -638213 571707 1688003 2339373 2581905 2644874 2725165 2674508 2218601
12467 2218601 1604907 1417255 1540676 997829 -776292 -2939501 -3931692 -3080098 -1424671
12458 -1424671 -884064 -2342078 -4585933 -5630972 -5056988 -4223398 -4120086 -4153200 -3386620
12449 -3386620 -1716038 656086 3448838 5390776 4864271 2496658 1224971 2330045
12441 2330045 3289460 1413759 -2230383 -4775431 -5638667 -5831750 -4672140 -716807 4505282
12432 4505282 7184795 6080990 3939384 3604957 5101602 6897122 7660611 6342423
12424 6342423 2909380 -395047 -791611 1338231 2610343 1125319 -1420114 -2885459
12416 -2885459 -3565653 -4582853 -5429780 -4854891 -2945676 -866325 638936 1441261 1517854
12407 1517854 1059587 400885 -591254 -2155246 -3382246 -2614102 220106 2746608 2528267
12398 2528267 -215625 -2801552 -2708347 37724 2788193 2916360 875547 -292376 844165
12389 844165 1944469 469076 -2193285 -2642334 -450137 1645056 1993753 1465886 766362
12380 766362 -553256 -2082380 -2527100 -2209152 -2735596 -3726767 -3026135 -875801 -384381
12371 -384381 -2451911 -3657365 -1299603 2362609 3361056 1262255 -1240258 -2188789 -1562580
12362 -1562580 -45603 1374445 1659709 1115122 1427945 3203877 4864214 4979062 4030343
12353 4030343 2876085 1367804 -374232 -1220306 -701660 374576 1684310 3541969
12345 3541969 4830780 3767961 1508652 1449730 3757690 4626007 2673986 1432076 2817329
12336 2817329 3179873 -130693 -3047010 -991280 3087124 3102498 -532700 -2334043 -1064189
12327 -1064189 -662825 -2366106 -2746383 -392865 1546202 976854 -186771 -276845 -413094
12318 -413094 -1149938 -884354 668489 1282700 42609 -1318412 -2128743 -3891879 -6371715
12309 -6371715 -6737599 -4306002 -2044624 -1549869 -791741 1057134 1160106 -1712215 -3870218
12300 -3870218 -2337517 64578 -598321 -2889188 -2729709 -74627 1818630 2031639 2369013
12291 2369013 3244746 3404507 3038573 3355807 3672568 2540140 1107715 1598902 2913176
12282 2913176 1752399 -1810348 -3868303 -2445362 -118159 113015 -1643826 -3859848
12274 -3859848 -5743659 -6393899 -4676243 -1576186 -143007 -1342874 -2319081 -741309
12266 -741309 1368208 686997 -2200020 -3576446 -1851392 763225 1872301 1704580 1594597
12257 1594597 1671771 1383658 1125983 1803136 3049706 3152591 1075119 -2119843 -4232377
12248 -4232377 -3932892 -1630853 1098390 2558058 2018308 516502 195641 2028983 4521251
12239 4521251 5533911 4886168 3877691 2820160 1068631 -583388 -104852 2397123
12231 2397123 4030581 3253450 2238345 3169536 4560966 4019733 2732659 3672643 6336175
12222 6336175 7005332 4209685 539058 -1371494 -1510435 -533147 1671272 4282526 5259941
12213 5259941 4226464 3234364 3301109 2720107 498444 -1078426 366585 3494856 5048775
12204 5048775 4034508 1928800 48708 -1072787 -863859 498600 1420735 989293 604304
12195 604304 1529583 2349961 1429390 305450 1244727 2553101 474316 -4353397 -6712299
12186 -6712299 -4099731 -205060 733878 -482808 -638147 495955 508766 -1532482 -4240011
12177 -4240011 -6302994 -7272746 -6563737 -3965080 -982511 213388 -725516 -2159219 -2593576
12168 -2593576 -1848764 -470307 810692 1281820 946312 719152 1128728 1460138 1088759
12159 1088759 742479 1181178 1569055 796622 -333135 -150688 1088747 1496169 521906
12150 521906 -436644 -612078 -940326 -1879801 -2123536 -735534 827981 345645 -2149229
12141 -2149229 -4252629 -4018215 -2105097 -919868 -1894820 -3846227 -4296428 -2416404 14393
12132 14393 965755 591117 413477 890141 1144212 690622 -41220 -787662 -1656821 -2229076
12122 -2229076 -1785187 -586672 252257 308741 217526 517383 1192348 2156584 2988275 2536566
12112 2536566 298987 -2127768 -2703217 -1785265 -1381959 -1852001 -1751898 -962992 -1129706
12103 -1129706 -2384708 -2573914 -931248 291799 -453974 -1258078 134976 2577024 3251950
12094 3251950 1567829 -888791 -2838645 -3571326 -2149580 1213267 4024986 4123025 2595574
12085 2595574 1923628 2139397 1294273 -870936 -2309713 -1667836 217778 1816602 2145179
12076 2145179 717733 -2050529 -4637621 -6026131 -6810239 -7235645 -5639121 -1372416
12068 -1372416 2078463 514403 -4706668 -7570359 -5181880 -1093588 354445 -414142
12060 -414142 -425053 876896 1671453 1139484 76911 -1117371 -2758963 -4380459 -4758454
12051 -4758454 -3625319 -2108302 -1249697 -967588 -672234 -217223 114502 234956 426664
12042 426664 774975 800183 267661 200590 1924670 4701356 5733408 3619702 502412
12033 502412 -771313 -412455 -561400 -1418420 -1235415 126365 619292 -460372 -1096534
12024 -1096534 186801 2003668 2434360 1761522 1361523 1425265 1345979 1146631 1025248
12015 1025248 469754 -795324 -1847085 -1861433 -1578238 -2100276 -2826139 -2028903 661743
12006 661743 3554210 4821168 4327597 3247381 2293658 846856 -1820664 -4695209 -5468800
11997 -5468800 -3460087 -972725 -456067 -1260061 -998230 587075 1428516 608572 -433281
11988 -433281 -460982 153933 1074803 2639145 4143414 3942101 2239918 1394328 2361775
11979 2361775 3349397 3183137 3099473 3467531 1963053 -2240822 -5363153 -3776063 131047
11970 131047 909250 -2266671 -5057666 -4783792 -3572044 -3977570 -5241428 -5519231 -4958348
11961 -4958348 -4595176 -4173168 -2954264 -1368205 -190426 959207 2769748 4548390
11953 4548390 4883343 3810840 2942823 3060583 2677485 98148 -3392653 -3986624 -54344
11944 -54344 4744333 5131755 846272 -2843926 -2023388 1085756 2076986 767858 600030
11935 600030 2796729 4607222 3632093 946101 -1126918 -2093672 -2693780 -2770698 -1480740
11926 -1480740 866254 2524289 2126768 230766 -1366320 -1836345 -2234049 -3488008 -4134564
11917 -4134564 -1910948 2200125 3967397 1335757 -2403529 -3034673 -1008576 297727
11909 297727 283533 1236353 3304842 3596159 1078728 -1361852 -1294199 -3335 480853
11900 480853 763128 2113773 3425905 2920630 1399970 1076693 2061984 2555119 2016174
11891 2016174 1713038 2159777 2200364 1032921 -538896 -1348319 -1066251 186303 2208293
11882 2208293 4243695 5152154 4592403 3352329 2196807 1123565 82606 -381137 161888
11873 161888 1132241 1383577 433801 -1060124 -1948326 -1566269 -320531 495709 -256745
11864 -256745 -2392115 -4411950 -4917466 -3778143 -1635711 1198058 4421076 6567542
11856 6567542 5746287 2387689 -66793 1211005 4842480 7061362 6643726 5692440 5447230
11847 5447230 4304169 1359837 -884257 96272 2661502 3167745 1178258 -561393
11839 -561393 -701417 -553006 -870819 -816758 -719202 -2451084 -5792042 -7566615 -6141499
11830 -6141499 -3869946 -2986654 -2021146 835014 3405994 2398202 -933295 -2032174
11822 -2032174 539868 3711219 4971903 5124244 5293666 4748818 3106047 1715974 1198629
11813 1198629 224485 -1518415 -1812753 418596 2440999 1528849 -616016 -577874 1220385
11804 1220385 1520703 -71655 -697227 279016 -136577 -3106343 -5254191 -3916899 -1635702
11795 -1635702 -2062942 -3976387 -3355395 39052 2358611 1632617 84801 -111943 142552
11786 142552 -528705 -1225674 -476183 1249029 2427856 2454257 1357907 -999390 -4028211
11777 -4028211 -5972272 -5782802 -4436447 -3287992 -2335151 -1258631 -712087 -1065381 -1232107
11768 -1232107 -455392 33374 -959863 -2176421 -1763577 -487890 -511425 -1671897 -1833037
11759 -1833037 -725024 -483865 -2029518 -3717702 -4317358 -4652195 -5196896 -4599948 -2211491
11750 -2211491 2907 -51076 -1670078 -2600895 -1969178 -386922 1658249 3753058 4733734
11741 4733734 3632320 1070702 -1458582 -3135097 -3714879 -2931084 -1256713 -202437
11733 -202437 -329233 23694 2268005 4794448 4813591 2291753 -322281 -1864685 -3185059
11724 -3185059 -4037154 -2423573 1746688 5077946 4732866 2190273 957366 1969439
11716 1969439 3361061 3737959 3428028 3010927 2678369 2835260 3521514 3489565 1722605
11707 1722605 -392989 -572709 734691 736175 -1241994 -2471925 -1232815 249528 -605142
11698 -605142 -2491493 -2437688 -748437 -403182 -2042853 -2915330 -1265063 1157026 1987307
11689 1987307 1210077 -77249 -1710739 -3529670 -4001432 -1837222 1698131 3737773
11681 3737773 2864975 243394 -1869374 -1913554 77888 2456889 3249963 2153158 740067
11672 740067 242808 88271 -625786 -1343678 -949074 424831 1817208 2965899 3941722
11663 3941722 3771190 1153207 -3293941 -6810562 -6981467 -3895542 103764 2285530
11655 2285530 1528827 -776745 -2091818 -1541849 -787510 -1469009 -2820128 -3056406 -2193374
11646 -2193374 -1724677 -1986596 -1801235 -749647 117957 277981 710209 2089717 3433079
11637 3433079 3616037 3214148 3591596 4665573 4795063 2954848 135721 -1796023 -2079476
11628 -2079476 -1337412 -253846 1003748 1880278 1326646 -333680 -651563 1952755 5164227
11619 5164227 5158623 1862839 -949983 -1248121 -1266353 -3151427 -5266873 -5104986 -3271012
11610 -3271012 -1905157 -1246043 -455470 110428 214562 1228755 3270513 3210459 -650143
11601 -650143 -4217870 -2772787 1157530 775510 -4705738 -8814575 -7446583 -3713437
11593 -3713437 -1517916 -85389 2287646 4065200 3614815 2583778 2621099 2110934 -350866
11584 -350866 -2342230 -1187803 1442923 2175433 951685 -112962 -753659 -1738200 -1916908
11575 -1916908 1110 2149237 1831831 7892 -377450 445888 -323473 -2771021 -3820796
11566 -3820796 -2421318 -1305458 -2581828 -4743506 -5294936 -3894341 -1800074 -198177
11558 -198177 87462 -1017090 -2120729 -1593728 228885 1663573 2424709 3751601 5725229
11549 5725229 6722851 6022876 4809797 3897443 2488957 133615 -1925879 -2551068 -2404102
11540 -2404102 -2596795 -2715687 -1468317 1263665 4055556 5475934 5374102 4580080 3600814
11531 3600814 2001008 -497792 -2688649 -2906687 -1561382 -998879 -2108830 -2944483 -2024321
11522 -2024321 -964860 -1743745 -3167294 -2788411 -935709 343503 1365300 4114188
11514 4114188 7663283 8269855 4967106 1549408 1389759 3182704 3785117 2881166 2434020
11505 2434020 3009482 3052845 1387464 -1201050 -2877052 -2544143 -924596 -4373 -865617
11496 -865617 -2275202 -2398940 -1532016 -1582600 -3029955 -4309635 -4389999 -3924303 -3368941
11487 -3368941 -2046775 55528 1440618 1148181 187163 24571 956357 2536547 4062018
11478 4062018 4180003 1982459 -823481 -1053818 1589762 3559707 2239979 -631927
11470 -631927 -2126993 -2414511 -3396127 -4822054 -4733230 -2935256 -1270043 -611413 157548
11461 157548 2078203 4695290 6658464 6492408 3328976 -1619215 -4978446 -4452721 -1776132
11452 -1776132 -656223 -2141310 -3944883 -4062518 -2808542 -1125991 806548 2615901
11444 2615901 3439825 3535521 4357786 5892653 5680514 2163938 -2320945 -4004342 -2590851
11435 -2590851 -1559769 -3309181 -5939805 -5995184 -3171160 -643022 -891566 -2764066 -3399976
11426 -3399976 -2042116 -638805 -900572 -2170908 -2768454 -2324347 -1639660 -766456 1263615
11417 1263615 4452371 6821283 6424245 3849415 1586549 964533 902567 99614 -786129
11408 -786129 -286761 1301927 2017957 828538 -1204875 -2469017 -2256440 -643220 1515096
11399 1515096 2222926 -86735 -3902653 -5582479 -4031885 -2255130 -2754630 -3909076
11391 -3909076 -3278041 -1982917 -2379768 -3359330 -2230099 -114893 -605838 -3187294 -3157479
11382 -3157479 900080 4592642 4568078 3090015 2980388 2507904 -750863 -4555356 -5153110
11373 -5153110 -3382515 -2899092 -3822950 -2926001 385394 2773582 2018798 -371884 -2268631
11364 -2268631 -3436281 -4112002 -3809534 -2564279 -1326915 -442407 518287 1193361 607254
11355 607254 -929851 -2012169 -2300211 -2613877 -3048562 -3095844 -3294078 -4278885 -4577069
11346 -4577069 -2397208 498605 351562 -2625125 -3786925 -942512 2283414 2244704 688757
11337 688757 1150370 3037864 3371985 2387129 2947844 5155994 5806976 3536975 874382
11328 874382 218602 776247 820563 545017 975332 1752647 1762228 993192 293600 -144194
11318 -144194 -796119 -1565779 -1565458 -236175 1861952 3450610 3480009 1808615 -738158
11309 -738158 -2957187 -4073633 -4085416 -3487073 -2820616 -2381104 -2064041 -1409163 49111
11300 49111 2301063 4613224 5783189 4971736 2630224 420728 -234210 581806 1871318
11291 1871318 3196563 4662375 5667118 5077513 3042949 1284012 792835 495928 -699445
11282 -699445 -1733534 -906926 1189016 2213697 1446897 704710 1458527 2766458 2990502
11273 2990502 2204223 1629962 1592774 1484366 1323775 1800706 2662970 2583001 1330135 762952
11263 762952 2320486 4350379 3827599 733511 -1374290 -90233 2461712 2737532 753997
11254 753997 -558532 -156459 110750 -517443 -142561 1951401 2980771 679089 -2676349
11245 -2676349 -3326285 -1595669 -944420 -2128092 -2026473 1172548 4906603 5780246 3822228
11236 3822228 1624078 883979 1274554 1598842 911987 -653325 -1566012 -496278 1448959
11227 1448959 1742520 189961 -466432 1259202 3175390 3031197 2345217 3911368 6968993
11218 6968993 8047284 6121159 3844162 3415979 4005321 4063992 3785869 3944897 4014670
11209 4014670 2937544 840674 -1109282 -1988273 -1640869 -563266 329891 495277 533244
11200 533244 1383206 2714159 3191521 2393095 1122768 -269942 -2105695 -3470731 -2283746
11191 -2283746 1447402 4401682 3892272 1561711 927628 2388127 3336785 2708435 2361383
11182 2361383 3468385 4406886 3613617 2231420 1950616 1854760 -179668 -3683850 -5648186
11173 -5648186 -4525003 -2139430 -970800 -1223664 -1609001 -1620948 -1535411 -993292 615976
11164 615976 2454876 2641284 913052 -492831 345678 2255833 2320596 -306362 -3232202
11155 -3232202 -3690215 -1568993 910240 1820357 1172398 351959 661717 2376358 4591821
11146 4591821 5774784 4947822 2795500 1345984 1944701 3550852 3794677 2021098 361012
11137 361012 914641 2691117 2884591 920932 -694585 -48924 1582940 1978730 1141710
11128 1141710 528872 376939 -57854 -274529 1101134 3672816 5104370 4084981 1801386
11119 1801386 -30271 -1026052 -1439927 -1132116 -115017 945751 1481465 1427839 613677
11110 613677 -1101577 -2835334 -3243749 -2451790 -1864444 -1620941 -155018 2859738 5183975
11101 5183975 5032259 3587454 2803946 2397418 1129063 -291832 -112762 1338349 1870799
11092 1870799 640242 -902642 -1289378 -491640 902535 2293082 2794507 1949222 824407
11083 824407 954468 2196122 3119963 3406877 4039598 4991740 4777571 2997699 1526063
11074 1526063 2071720 3867599 4883344 4357931 3093797 1992690 1339546 1154230 1438824
11065 1438824 2168960 3380005 5037411 6685235 7600142 7424933 6358376 4833402 3413728
11056 3413728 2698210 2677702 2515035 1756460 1353529 2412815 4255414 5033230 4186233
11047 4186233 2934912 2312149 2165479 2295978 3011911 4055441 4429008 3914729 3423401
11038 3423401 3225371 2346413 593590 -426845 313263 1248346 434834 -1060862 -177817
11029 -177817 3671925 7106107 6641463 2912975 -90786 420027 3283604 5283035 4845985
11020 4845985 3081633 1631836 791956 91030 -553470 -1286810 -2977476 -5977124 -8668871
11011 -8668871 -8794672 -6205272 -2961788 -759502 295771 367108 -792835 -2587097 -3277840
11002 -3277840 -1961020 232509 1660703 1853342 1071356 -516322 -2291062 -2973508 -2059903
10993 -2059903 -633406 189338 771204 1986880 3573575 4414112 3787225 1619795 -1574394
10984 -1574394 -4230431 -4380234 -1869935 1114781 2816936 3922983 5475665 6373311
10976 6373311 5168604 3235541 3355941 5405503 6175700 3854136 214902 -2342862
10968 -2342862 -3587236 -4199646 -3908795 -2483227 -953046 -112952 949453 3099709 5018306
10959 5018306 4780302 2834033 1275971 504964 -1075054 -3764719 -5342818 -4216053
10951 -4216053 -1966533 -1204226 -2060487 -2519230 -1610837 -527008 -553045 -1377318 -1916618
10942 -1916618 -1789520 -1360110 -964853 -729182 -864950 -1615934 -2854278 -3969747 -4363627
10933 -4363627 -4132659 -4037654 -4428460 -4442480 -3062237 -925769 118660 -372564 -764520
10924 -764520 -190165 -345954 -2648096 -5049409 -4346099 -1067349 797848 -879265 -3974354
10915 -3974354 -5511424 -4827533 -2562364 792008 3981259 5032150 3822519 2602912
10907 2602912 2548463 2023020 -106230 -1885784 -1198476 929109 2365641 3149832 4072155
10898 4072155 4066392 2212640 595779 1547833 3292852 2213730 -1246473 -2950216 -1252668
10889 -1252668 1042048 1350853 338998 -551931 -1333695 -2070891 -1984607 -1088147 -431003
10880 -431003 33723 1445346 3289252 3341333 1334324 73413 1533837 4022295 4658571
10871 4658571 2970601 772311 -175137 554732 2038022 2834382 2699724 3003407 4188009
10862 4188009 4120762 1303049 -1721115 -1566734 454822 231308 -2193167 -2500917 555084
10853 555084 2887361 1713222 -477627 -881689 -751238 -1962377 -3254070 -3043397 -2526547
10844 -2526547 -2918921 -2881785 -1667269 -1391044 -2884150 -2753055 1521890 6543922 7234133
10835 7234133 3750663 234358 -1114152 -761676 1113919 4036455 5487473 3958099
10827 3958099 2189991 3353923 5761261 5762778 4176245 4752266 7294001 7713054 4861838
10818 4861838 2165553 1798549 1897411 736875 -388384 -1479 1018776 1181859 356130
10809 356130 -763816 -1212385 75779 2400085 2428669 -1719209 -6386392 -6242987 -1784553
10800 -1784553 1434084 1111796 722867 2576399 3533418 420451 -4311738 -5835787 -3348680
10791 -3348680 -117597 1205349 699379 -267192 -537628 53088 246068 -1239095 -3221147
10782 -3221147 -2753965 736956 4020550 4139528 2060211 631243 608162 677076 198626
10773 198626 -196576 -241053 -534257 -1515624 -3056822 -4901093 -6631903 -7400047 -6462751
10764 -6462751 -4049095 -1362556 271367 330065 -515316 -1013335 -635777 -927 267226
10755 267226 400253 624583 389558 -495356 -847600 365920 2165515 2716989 1810676
10746 1810676 683560 -12029 -330792 292309 2397901 4700997 5066933 3552231 2611692
10737 2611692 3818379 5910017 6541525 4726394 1292139 -1877115 -2877464 -1240293
10729 -1240293 1415960 2993486 2984888 2155341 903385 -666090 -1609769 -795359 1417130
10720 1417130 3501259 4573274 4679142 3800488 2095252 752803 971073 2140026 2412244
10711 2412244 1068949 -765801 -1651584 -1233212 -382428 -438145 -1689769 -2462067 -1018219
10702 -1018219 1515829 2279993 1186334 1332949 3680853 4826394 2487697 -191478
10694 -191478 753010 3992637 5343538 4157266 3143776 3454073 4066262 4777991 5773369
10685 5773369 5371559 2268264 -986239 -760268 2343326 4763571 5273152 4928446 3432828
10676 3432828 444197 -972209 2177962 6769905 6948943 3191400 1683212 4434550
10668 4434550 6695487 5414211 3585077 3886398 4114168 2024866 -494140 -1363182 -1940954
10659 -1940954 -3554069 -4425494 -3169247 -1739566 -1961092 -2451405 -1734002 -1181317 -2157275
10650 -2157275 -3272791 -3089321 -2673440 -3007248 -2708725 -796686 947722 767504 -358313
10641 -358313 -870308 -1059358 -1478268 -1448504 -915109 -1230893 -2473765 -2662609 -1143721
10632 -1143721 163821 429414 1592354 4502030 6591390 5709717 3501060 2624843 2990112
10623 2990112 2947830 2207695 1657019 1903221 3241441 5454981 7076142 6730779 5234940
10614 5234940 4135006 2872963 480171 -1020802 804986 3624945 2890379 -685162
10606 -685162 -1906957 391618 1875066 674219 168328 1962488 2763310 954789 -62942
10597 -62942 1674141 2903645 1343195 -34632 1222901 2437124 1118808 -89143
10589 -89143 1901648 5386715 7330091 7971997 8436883 7977852 6935382 7982180 11154202
10580 11154202 12304759 9691787 7084244 7076043 6850505 4291577 2495376 3872687 5414972
10571 5414972 4464290 3623173 5051533 5532464 2611063 207349 2242584 5618941 5604589
10562 5604589 3747978 4296850 6594976 6974951 5064288 3134810 2215780 2856886 6000005
10553 6000005 9611838 9126904 4640356 2135652 4110371 5565400 3276168 1450394
10545 1450394 3112189 3948886 1035355 -341904 4053212 8871784 7952038 4677989
10537 4677989 5212877 7860521 7772845 6381754 7647795 10212487 11010831 11245111 11893798
10528 11893798 9784795 4897832 3899699 9203673 13087727 10400281 7478078 9851522
10520 9851522 11769736 7986657 4893739 8602365 13017951 11763093 10398891 14099898
10512 14099898 15802077 10637355 8521399 16576928 23446856 18807515 13235633 18706534
10504 18706534 25503482 21324462 16483373 24026831 32190634 26396797 20558748 32174382
10496 32174382 45254425 38640838 31586005 51586746 76050702 69184948 62831227 117556802
10488 117556802 196926516 176308027 17469540 -150583112 -188599622 -118288978 -62287344
10481 -62287344 -67045582 -76587681 -54148141 -32149058 -36489753 -43126628 -32132595 -23017397
10473 -23017397 -30881106 -36332376 -24289132 -12607961 -17831328 -26182751 -21655092 -13882070
10465 -13882070 -16059688 -20340966 -16226941 -11675043 -16158586 -21612420 -18330631 -12904158
10457 -12904158 -13850125 -15233967 -10091339 -5190554 -7585842 -10545975 -7037090 -3656619
10449 -3656619 -7304292 -11131991 -7665920 -3364036 -6025469 -9547705 -5647223 44516
10441 44516 -1809275 -7529432 -8287307 -6146478 -8062472 -11383908 -9356609 -4831603 -5134764
10432 -5134764 -8597698 -8618560 -6085553 -5867649 -5962546 -2112860 1387354 -2275950 -9279134
10423 -9279134 -10069370 -4709667 -1720618 -3547232 -4506706 -2409830 -1584828 -3885719 -5794024
10414 -5794024 -5347152 -4495751 -4139139 -3270141 -2911022 -5026224 -8136157 -9371612 -9576060
10405 -9576060 -11074777 -12293301 -10308532 -6860790 -5962591 -7238941 -7374812 -6403342 -6744204
10396 -6744204 -7677319 -6654398 -4682405 -4672776 -5719771 -4622605 -1988149 -1404684 -3418052
10387 -3418052 -5256847 -5556426 -4868705 -2970211 -183603 508649 -2520663 -5452663 -4051885
10378 -4051885 -684004 -754473 -4036564 -5549364 -3745059 -1755306 -1303209 -1264696 -1761406
10369 -1761406 -3919050 -5804508 -4222216 -584104 346912 -2341199 -4934497 -5551173
10361 -5551173 -6012742 -6852346 -5833390 -2537035 324227 1382884 2187906 3278419 2748836
10352 2748836 -107831 -3279975 -5053640 -5383026 -4058828 -1074256 1151162 -72740
10344 -72740 -3066669 -3442992 -766473 858281 -559757 -2467375 -3160042 -4552981 -7433119
10335 -7433119 -8719710 -6533910 -4019389 -4553543 -6330577 -5563375 -2704228 -1375255
10327 -1375255 -2422548 -3025340 -1497801 458832 863043 110435 -529145 -1083584 -2117055
10318 -2117055 -2993639 -2521179 -986759 -70432 -473195 -994067 -768180 -1073536 -3230448
10309 -3230448 -5548251 -4799248 -943744 2034065 1023229 -2469177 -4772630 -4523143
10301 -4523143 -3124301 -2158164 -2076315 -2582948 -2853904 -2028250 -528122 -89450 -1619086
10292 -1619086 -3950353 -5403000 -5452345 -4386918 -2854937 -2225452 -3443859 -4924965 -3956679
10283 -3956679 -1046291 -21466 -2416179 -4890554 -4362538 -2593013 -2763422 -4236305
10275 -4236305 -4265931 -2878818 -2256632 -2566331 -2079207 -670120 195274 463511 1280294
10266 1280294 2038378 724782 -2592500 -5225015 -5201959 -3223852 -1203078 -499725 -1397313
10257 -1397313 -2764061 -2580524 -232755 2230669 2395303 269801 -2359836 -4202786
10249 -4202786 -4805841 -3997972 -2462629 -1540206 -1208751 72982 2367749 3427186 2382935
10240 2382935 1546586 2492683 3324187 2480637 2188284 4700988 7812206 7939461 5425856
10231 5425856 2973487 1113290 -655951 -589226 2643221 5871493 5084376 1839112 925364
10222 925364 2724244 3196382 771993 -2161471 -4290443 -6428358 -7637058 -5935974
10214 -5935974 -3197578 -3573719 -6263430 -5725220 -486086 4088370 3857890 1179794 -428690
10205 -428690 -1547233 -3478054 -4366159 -2627198 -600256 -939548 -2233951 -1701713 265596
10196 265596 1534654 1982413 2648510 2998482 2074823 1006110 1686064 3893077 5726546
10187 5726546 5964796 4583054 2221995 344531 389647 1671461 1782659 -6904 -1692696
10178 -1692696 -1697776 -826772 -122314 740368 1762025 1848363 1004010 802631 1452550 1074039
10168 1074039 -805223 -1950501 -1181258 -459556 -1366786 -2377870 -1720619 -277389 443378
10159 443378 685282 867735 277960 -826408 -706602 395916 -422708 -3758021 -5821630
10150 -5821630 -4033582 -1040027 20697 501022 2596269 4284626 2640679 -593602
10142 -593602 -1724294 -1207156 -2034208 -3843835 -3834247 -2252008 -1727533 -1954565 -259122
10133 -259122 2875777 4015979 2654973 1989618 3350951 4514360 4248945 4032407 4282532
10124 4282532 3232811 780834 -648680 -438621 -1039323 -3409032 -5031159 -4208390 -2707491
10115 -2707491 -2245360 -1812483 -552992 17370 -1021679 -1845802 -1119376 -574382 -1830057
10106 -1830057 -3241414 -2655907 -1063115 -680715 -1282404 -1191763 -300170 641256 2289368
10097 2289368 5390795 8185648 7939640 4693334 1275358 -101604 484414 1784713
10089 1784713 2430983 1447913 -658620 -1872039 -1066678 389062 727701 254540 64378
10080 64378 -365309 -2068605 -4004612 -3995282 -1876636 379962 1389476 1271113 261178
10071 261178 -1506820 -3046988 -3372945 -3197917 -3856829 -4739182 -3963837 -1622919 -46150
10062 -46150 -427290 -1351953 -1346533 -913354 -1134730 -1871618 -2205695 -1349075 1363682 5757994
10052 5757994 9505419 9420424 5213060 465025 -1298231 -245617 1054521 1107421 280055
10043 280055 -695208 -1383421 -1439698 -1039045 -1048543 -1836460 -2598468 -2769408 -3154878 -4438527
10033 -4438527 -5448521 -4457367 -1732278 700740 1635895 1716447 1946269 2316016 2033661
10024 2033661 449734 -2088876 -3924286 -3437163 -1407296 -792928 -2844441 -4749114
10016 -4749114 -3166265 906582 3381588 2676670 1060242 275364 -795057 -2894498
10008 -2894498 -4029421 -2588180 -432470 -204953 -1251074 -1104960 132182 115175 -1415463
9999 -1415463 -1916231 -206445 1603387 1594992 932283 1415384 2119314 948789 -1494824
9990 -1494824 -2333188 -743215 630747 -427289 -2397356 -2405926 -761068 -755017 -3842448
9981 -3842448 -7183071 -7098391 -3505594 514807 2456762 1970353 -346824 -3314792 -4525023
9972 -4525023 -2100596 2149981 3915461 1979102 62296 1243078 3290124 2574288
9964 2574288 322662 718147 3804919 5113199 2790461 361389 640318 1195872 -1158618
9955 -1158618 -4674519 -5152669 -2067946 1417435 3318696 4219901 4426162 3092865 395752
9946 395752 -2020193 -3058996 -2769262 -1263361 900822 1861981 429358 -1625347 -1916772
9937 -1916772 -1390324 -2580949 -4424074 -3086255 1477658 4371370 2832034 135252
9929 135252 -41606 943242 287192 -828526 234533 2128405 1400320 -1446411 -2382956
9920 -2382956 -48224 2562069 2833103 1415334 -128982 -1429364 -2292174 -2141945 -1228354
9911 -1228354 -433868 386535 2002746 3862909 4572289 4082700 3393992 2626810 1614700
9902 1614700 1549291 3315923 5030213 4307240 2218320 1669078 2669156 2905607 2104553
9893 2104553 1596503 515452 -2547117 -4874183 -2538059 2225940 3200003 145140 -789365
9884 -789365 2268911 4130355 2680243 2747393 6115779 7201257 3967667 3177134 7767793
9875 7767793 9732721 5226315 5349651 17503786 25573543 8249540 -26693735 -47414515
9867 -47414515 -39214676 -20973317 -14652750 -17458654 -15225317 -7512972 -4044103 -5965824
9859 -5965824 -6163521 -3398056 -2879045 -5254065 -6193008 -5360194 -6031875 -7073366 -4461680
9850 -4461680 93382 833348 -2228314 -3672631 -2665957 -3840658 -7527314 -7973546 -3360888
9841 -3360888 619107 189246 -1014443 406891 1399578 -1311400 -4571878 -3945620 -1240351
9832 -1240351 -1226421 -3812740 -5000768 -3786212 -2889865 -3380893 -3235166 -1397243 535781
9823 535781 1303064 1611763 1978058 1467245 -300312 -1794977 -1550116 -322592 -56894
9814 -56894 -1290674 -2640483 -2712460 -1671858 -685450 -412135 -618408 -1035221 -1793551 -2780207
9804 -2780207 -3264981 -2716440 -1598574 -877418 -996179 -1617718 -2036745 -1727924 -1022981
9795 -1022981 -1215754 -3081655 -5285627 -5605054 -4007929 -2858634 -3427987 -4089690 -3131101
9786 -3131101 -1448635 -774955 -889312 -603950 -188813 -635569 -1497306 -1591467 -1079238 -905193
9776 -905193 -1024789 -1082470 -1725022 -3041722 -2957527 48861 3570519 3744540 644684
9767 644684 -1958518 -2043277 -1217677 -969571 -581169 271600 113066 -1593865 -2942284
9758 -2942284 -2454923 -1269638 -903229 -880836 -258652 323008 -65680 -746984 -633785 -213674
9748 -213674 -662799 -1859236 -2842381 -3568858 -4737903 -6312197 -7484474 -7789075 -7165312
9739 -7165312 -5316895 -2278762 463459 781378 -1562380 -4023270 -3860565 -1416683 193401
9730 193401 -966662 -3057590 -2934838 -477327 1384208 940581 -156740 152354 1268218
9721 1268218 1281980 -150820 -1919192 -3234478 -3737789 -2937962 -1045958 694018 1759076
9712 1759076 2966691 4079453 2998484 -593043 -3154548 -1779729 1331782 2400781
9704 2400781 2151205 3957416 7089576 6980426 2520316 -1771018 -2128553 56852 1845166
9695 1845166 2974196 4281369 4895442 3472912 426159 -2772158 -5026047 -5501929 -3987762
9686 -3987762 -2092384 -1986707 -3294446 -3462054 -1724226 -141154 -114763 -712946 -1208502
9677 -1208502 -2199352 -3170738 -2202771 447953 1659852 34542 -1913262 -1968977 -1428515
9668 -1428515 -1942404 -2362352 -1419547 -678537 -1818211 -3348797 -2999962 -1273280 157698
9659 157698 1339088 2400090 1462946 -2261046 -5376452 -4314266 -938462 38052 -1759489
9650 -1759489 -2214191 428850 2974814 2398535 -151259 -1824529 -1650486 -238576 1725440
9641 1725440 3201048 2789856 365117 -2467402 -4277513 -4941675 -4477787 -2492019 331599
9632 331599 1807167 658642 -1642414 -2653498 -1782896 -130218 1760457 4272039 6789103
9623 6789103 7214374 4608493 1316135 771100 3272969 5586726 5163457 3075722 1802203
9614 1802203 1789876 1845938 1574808 1367805 924334 -59733 -541963 249673 729995 -830286
9604 -830286 -2835695 -2369282 -145725 335671 -1424583 -2233637 -954635 -391952 -1923030
9595 -1923030 -2824890 -1316853 85802 -660510 -1053425 1433091 4212374 3387997 90735
9586 90735 -1513724 -586541 513981 1135949 2397499 3296838 1502155 -2129906 -4111316
9577 -4111316 -3537617 -2771372 -2703142 -1457267 1362195 3069255 2028689 142109 -469644
9568 -469644 -525247 -1504854 -2755146 -2673709 -1360489 -374050 -611447 -1517960 -1890592 -1019350
9558 -1019350 376792 402852 -1902398 -4928140 -6121074 -4979241 -3137238 -1897502 -1294744
9549 -1294744 -1285151 -1974122 -2650096 -2377318 -1650491 -1765078 -2513746 -2352046 -1024045 -122428
9539 -122428 -659792 -1883749 -2931560 -3812671 -4158417 -2934803 -443644 1030623 -72609
9530 -72609 -2328071 -3051972 -1579806 309343 773999 -334723 -1954791 -3168987 -3839809
9521 -3839809 -4337928 -4996787 -5806510 -6401548 -6239001 -5065118 -3430455 -2304188 -1750467
9512 -1750467 -679975 1258886 2465000 1537076 -247844 -779178 -768926 -2635481 -5872103
9503 -5872103 -7121637 -5566118 -4278941 -4643113 -3712376 71186 2690343 265683 -4257669
9494 -4257669 -5083206 -2107019 -319585 -1940756 -4461578 -6073167 -7660494 -8907390
9486 -8907390 -7588486 -4140917 -2417606 -4035938 -5898737 -5307472 -3810753 -3587657 -3468089
9477 -3468089 -1628222 392296 -187953 -2736082 -3806004 -1824651 1236930 2701485
9469 2701485 1958258 459224 79624 1340332 2682577 2056858 -387839 -2184977 -1636486
9460 -1636486 190326 1318007 1442758 1553373 2017951 2402041 2588779 2790301 2677725
9451 2677725 1597346 -257936 -1650331 -1549015 -273623 808503 665739 -457146 -1579071
9442 -1579071 -2221499 -2612182 -2772754 -2292479 -1292987 -703018 -1060160 -1837137 -2344309 -2275301
9432 -2275301 -1031013 1895509 5030810 5291191 1857491 -1797416 -1678984 1971658 5516959
9423 5516959 6501236 5389811 3584483 1934219 932365 532246 -139741 -1606580 -3065796
9414 -3065796 -3672979 -3799924 -3797021 -2931084 -1136219 -153939 -925713 -1620393 -672186 104743
9404 104743 -1512822 -3780103 -3293652 -584462 587956 -908268 -2385916 -2089570 -1378850
9395 -1378850 -1657035 -2464602 -3233308 -3956328 -3739006 -1666928 665488 682793 -879739
9386 -879739 -680702 1741588 2898288 839005 -1801397 -1816118 439016 2523855 3100355
9377 3100355 2271785 836274 215541 1224865 2456729 1988908 701117 1226830 3577771
9368 3577771 4876313 3721060 1731021 504797 228766 1327449 3879346 5390967
9360 5390967 3287938 -206761 -292714 2941083 4498989 2740332 1696832 3366546 4080661
9351 4080661 1659133 1845 2180067 4380916 1972428 -2768592 -4512008 -2982935
9343 -2982935 -1710217 -1506984 -754822 -91009 -1409624 -3533237 -3669006 -2069050 -1018558
9334 -1018558 -505957 974041 2706523 2961353 2506080 2910761 2993482 1143684 -698977
9325 -698977 -86607 785828 -1673304 -5527424 -5558444 -1694585 932312 261466 -579238
9316 -579238 103809 265871 -251956 1721706 6118582 7666423 3796500 -799946 -1345263
9307 -1345263 58374 -904615 -3206222 -2845535 -37596 1417474 631233 466446 2120519
9298 2120519 3229659 2006090 -107005 -897002 -111575 1120082 1859810 1752904 1118991
9289 1118991 902553 1560637 2265399 2266911 2328719 3260721 3801097 2132263 -782136 -1806940
9279 -1806940 74717 2369929 2728831 1870224 1750361 2728219 4000440 5222317 6008041
9270 6008041 5199774 2575552 254516 356779 1999847 2627413 1564175 -15863 -1865155
9261 -1865155 -4468610 -6379841 -5194594 -1728991 208413 -672532 -1292381 560600 2723733
9252 2723733 2698637 1696544 1614513 1240814 -785484 -2119502 -182678 2831680 3090052
9243 3090052 1251468 447036 52966 -2594790 -5599165 -4463818 -473381 178832 -3324246
9234 -3324246 -4479484 -140298 4188703 3388757 273859 -651553 -918657 -3820528 -7375707
9225 -7375707 -7864293 -6576414 -6688753 -6561486 -2784096 2441407 3836289 1620947 826042
9216 826042 2627949 3086513 854993 -422877 1111900 2239336 463413 -1784767 -1505256
9207 -1505256 204836 696053 -49262 -519801 -648999 -1137385 -1463488 -788838 255686
9198 255686 380210 -615448 -2094218 -3684557 -5055042 -5327113 -3758886 -829335 1833037
9189 1833037 2657822 1539886 194203 390602 1544075 1353883 -467383 -957220 2001156
9180 2001156 6077450 7322469 5406679 3422685 3125223 3081142 1603170 -728560 -1920576
9171 -1920576 -621508 2611402 5218414 4683866 1747397 150710 1778411 3978046
9163 3978046 3731002 2239799 2452760 4118838 5002176 5330234 6645861 7273488 3937161
9154 3937161 -2009498 -4958122 -2795887 165731 -264429 -2701216 -3604760 -2772083 -2497360
9145 -2497360 -3493541 -4454258 -4447786 -3635977 -2458066 -1557118 -1619392 -2145353 -1423433 1064795
9135 1064795 3087372 1848200 -2464731 -6195636 -5639145 -1021755 3204447 2886969 -1018057
9126 -1018057 -3670753 -2683029 -796788 -989326 -1956657 -1235615 -70270 -1100323 -2986732
9117 -2986732 -2076855 1252840 2778558 1204400 35177 1591371 3499877 2977893 996715
9108 996715 47321 614783 1891706 3602299 5204997 5237027 3193196 677956 -396333
9099 -396333 457189 2603535 4592348 4272729 956834 -2523917 -2572336 307055 2277060
9090 2277060 1743494 668376 110698 -1372892 -3794797 -4410993 -2214954 -35433 -9682
9081 -9682 -405894 736263 2110023 1903737 1082710 1162580 1366180 763214 740364 2416391
9071 2416391 3797079 2523251 -289379 -1732059 -1097031 283471 1626011 2725806
9063 2725806 2885667 2034105 1439334 1446273 449153 -1937024 -3172577 -1818175 -657913
9054 -657913 -2499041 -5168125 -4689822 -1806666 -871301 -2906315 -4261105 -2604478 -236142
9045 -236142 -58363 -1293374 -1105047 1253576 3620744 3693159 1722437 322358 1358671
9036 1358671 3201590 2356889 -1784995 -5684067 -6208869 -4432759 -3192685 -2913353 -2251516
9027 -2251516 -1208253 -758964 -536842 197765 138731 -2410022 -5906520 -6838766 -4763395
9018 -4763395 -2970598 -3489878 -4392428 -3325045 -1176778 -314813 -858176 -891749 268224
9009 268224 1081260 474248 86619 2442765 7043026 9861661 7905185 3257111 694985
9000 694985 1699062 3253733 2904737 2192172 3650047 6795852 9150666 9578852 8665283
8991 8665283 7183747 6008858 6145454 7061141 6508362 3847050 1739261 2271413 3275282
8982 3275282 1405934 -2646868 -5300169 -5346496 -4608772 -3999764 -2634194 -874126 -664750
8973 -664750 -2209755 -3395181 -3219932 -2913679 -2931950 -1872454 422454 1490824 -346650
8964 -346650 -3331134 -4588764 -3436797 -1168302 732428 1002757 -958423 -3704939 -4398272
8955 -4398272 -2209506 373506 870734 -120991 -564223 -68334 431075 789948 1486426
8946 1486426 2111850 1778644 523132 -1025063 -2579779 -3471550 -2173746 1496901 4699783
8937 4699783 4546936 2256318 1614228 3350244 4171861 2191429 9082 388942 1703403
8928 1703403 762830 -1677126 -1987979 349489 1717272 6086 -2166483 -1551530 1110973
8919 1110973 2727983 2163873 623498 -855084 -1939914 -2011983 -960510 -378603 -1786314
8910 -1786314 -4041408 -4522670 -2506263 576322 3627342 6286438 7365600 5731549
8902 5731549 2829897 1485643 1759930 839722 -2266154 -4910069 -4844488 -3172062 -1682934
8893 -1682934 -62359 2122681 3145917 1486390 -1283254 -2571102 -2396744 -2490399 -2985640
8884 -2985640 -2711373 -2041890 -2688874 -4694595 -5973816 -5201243 -3384484 -2154704 -1802537
8875 -1802537 -1365203 176157 2823776 5108737 5140403 2797372 202977 -807219 -833136
8866 -833136 -1456209 -2579417 -2735444 -1505547 -21071 898079 1779707 3390697 5365586
8857 5365586 6257436 4898100 1941003 -183008 260520 2032441 2509589 1528974 1589308
8848 1589308 3648648 5164723 3801959 901831 -781388 -980409 -1136621 -1180429 60679
8839 60679 1933886 2279564 738487 -607854 -274218 859285 1314359 986335 682844
8830 682844 741710 737406 96989 -1231055 -2569225 -3182858 -3169460 -3002281 -2237546 -10959
8820 -10959 2813186 3671037 1463303 -1759919 -3394218 -3189936 -2448657 -1853062 -1518441
8811 -1518441 -1797092 -2497060 -2538160 -1739976 -1502524 -2335387 -2529709 -1053211 208290
8802 208290 -603627 -1977174 -1391943 503758 1179659 570607 773577 1949825 1943430 98553
8792 98553 -1626192 -1834848 -1295560 -759074 354931 2218079 3569155 3382934 2085400
8783 2085400 488127 -1126432 -2392307 -2666183 -2004577 -1360519 -1430102 -1995410 -2463620
8774 -2463620 -2456170 -2034993 -1780480 -2156107 -2559730 -2070951 -1413271 -2395702 -4664775 -5270621
8764 -5270621 -2903100 -215339 60764 -1038691 -1235156 -997398 -1803525 -2513038 -1381161
8755 -1381161 -241931 -2313020 -6356149 -7356129 -3353352 2170154 5295943 5602739 4379841
8746 4379841 2295006 146497 -738586 -257596 155964 -261477 -827968 -1229036 -2228977
8737 -2228977 -4134512 -6103687 -7121936 -6413056 -3490796 626089 3296370 3327696 2860183
8728 2860183 3911491 4876996 3568828 1699588 2108155 3161626 1147793 -2549818 -2586509
8719 -2586509 1636175 4455737 2737593 399513 1473990 3805104 3319126 622122
8711 622122 -614735 810758 3123868 4568556 4155883 1359245 -2488867 -4339216 -3130265
8702 -3130265 -1520329 -2062098 -3776966 -4511411 -4421993 -4737246 -4978102 -3898772 -1808795
8693 -1808795 119197 1583542 2504079 2097756 252381 -1579768 -2296182 -2481814 -2679444
8684 -2679444 -2191525 -914166 -336462 -1184110 -2039091 -1881836 -1994229 -3588292 -5439685
8675 -5439685 -5728119 -4587914 -3150443 -1658408 -116274 741609 608461 330793 455118
8666 455118 665431 1260195 2911674 4312857 2983270 -479225 -2144869 -299804 2000256
8657 2000256 1763825 68780 -968860 -1713873 -2750739 -2512783 -432368 606711 -1528522
8648 -1528522 -4359314 -4718861 -3728017 -3943026 -4376322 -2978191 -1653868 -3510389 -6669190
8639 -6669190 -6397892 -2814816 -995768 -3112350 -5585671 -5144776 -3189618 -2432387 -2887211
8630 -2887211 -3172726 -3040822 -2771121 -2054917 -930918 -349097 -887041 -2121518 -3553749
8621 -3553749 -4747493 -4579538 -2128623 1473756 3655795 3107939 761662 -1591911 -2452457
8612 -2452457 -1177553 967578 1169325 -1626606 -4559121 -4040201 -324891 3221074 4515641
8603 4515641 4004808 2411860 130881 -1533601 -1383891 -521074 -949716 -2194820 -1989675
8594 -1989675 -137146 1231519 1276232 1294737 1680950 1180318 -150637 -328381 1147389
8585 1147389 2127647 1387841 676482 1488855 2183243 522575 -2519809 -3808396 -2241277
8576 -2241277 -74072 -76219 -2455247 -4872985 -5222734 -4099173 -3882529 -5196532 -5680842
8567 -5680842 -3486641 -498295 148445 -1225707 -1459382 384536 1701866 726214 -742157
8558 -742157 -420126 1032173 1559556 1017241 877124 1535972 1845540 1173514 476110 957919
8548 957919 2437644 3542150 3322365 2198579 1075109 67919 -1040890 -1511002 -383922
8539 -383922 1368580 1436290 -335067 -1225980 226634 1682373 671815 -1321476 -1259695
8530 -1259695 630643 1703993 1451959 1639942 2327663 1443537 -1257260 -3096642 -2298863
8521 -2298863 -341550 477486 -253974 -1555930 -2484068 -2533111 -2064192 -2278758 -3218004
8512 -3218004 -2507804 1545412 6247151 6939378 3099200 -1086687 -2564432 -2665802 -3746318
8503 -3746318 -5569294 -6324825 -5060842 -2226922 374125 184806 -3159872 -5885944 -4330711
8494 -4330711 -784357 -846117 -4743163 -6509719 -3314934 19643 -1053771 -3599336 -2581539
8485 -2581539 622748 825029 -2258693 -3812529 -1649445 1261858 2269641 2279429 2471608
8476 2471608 1888550 106469 -802668 871829 3709691 5189578 5051046 4798584 4778648
8467 4778648 3667613 871046 -2038892 -3037810 -2188632 -1502461 -2163148 -2915549 -2047117
8458 -2047117 -128121 736497 51295 -560974 -247601 -310382 -1792884 -3442792 -3453045
8449 -3453045 -2026837 -870497 -966958 -1901693 -2623740 -2108523 -236863 1358357 681521
8440 681521 -1590897 -2180147 362202 3007150 1957494 -2299266 -5889481 -6701085 -6189830
8431 -6189830 -6120229 -5835457 -3677473 157254 3208511 3062258 -82623 -3188650 -3182256
8422 -3182256 -106861 3241459 4872323 5459628 6169864 6380630 4954546 2532438 867377
8413 867377 544127 771039 809290 268467 -1325195 -3733734 -5294668 -4585606 -2540179
8404 -2540179 -1439782 -1971222 -2739146 -2673060 -2430803 -3041639 -4278232 -4905105 -3967533
8395 -3967533 -1641514 751168 1674498 909566 64474 940130 3362293 5133482 4297020
8386 4297020 1308090 -1106594 -510175 2493911 4520325 3188622 126737 -1135539
8378 -1135539 158662 1426287 918486 -22000 234250 1028904 1267559 1666682 3040969
8369 3040969 4140840 3631072 2807080 3632443 5053585 4202863 903315 -1884889 -2256185
8360 -2256185 -1392256 -933005 -676605 273353 1928213 3767586 5153344 4923254 2288091
8351 2288091 -1259080 -2705768 -1097552 1182835 1631699 586214 -131679 -13538 210030
8342 210030 278674 266825 -580277 -3012277 -5884378 -6800185 -5018054 -2398326 -917566
8333 -917566 -419089 313201 1234031 1159503 -98487 -1158477 -989157 -271787 -177334 -683870
8323 -683870 -1007312 -1022767 -1183905 -1458443 -1432414 -1155856 -818057 -11466 1399366 2204641
8313 2204641 1379436 264696 911321 2262269 887355 -3612274 -7016583 -6192034 -3611328
8304 -3611328 -3402214 -5077846 -4800871 -1766477 637744 250955 -843906 57081 2349801
8295 2349801 3524700 2715411 1116524 -116368 -876382 -1429438 -1752650 -1476114 -171221
8286 -171221 1926529 3389267 2564763 -487505 -3588644 -4460103 -2909310 -799234 -110902
8277 -110902 -1167829 -2581043 -2860479 -1992530 -1105511 -712449 -175694 837698 1576426
8268 1576426 1676644 2190654 3796814 4933796 3481039 -121248 -3166491 -3962762 -3156003
8259 -3156003 -1808978 -55208 1819971 2687785 2043591 1150207 1722284 3968254 6498765
8250 6498765 7686696 6741600 4034299 905521 -1100256 -1196811 282342 2129897 2714738
8241 2714738 960600 -2289589 -4386127 -3407202 -425566 1628211 1153017 -925099 -2778502
8232 -2778502 -3376758 -2689107 -1291583 87425 1240368 2444437 3298287 2608168 546325
8223 546325 -301604 2005910 5472233 6303905 4014260 1776933 1554113 1739516 579547
8214 579547 -729864 -57589 2410671 4641221 5193305 3853503 1098044 -1778787 -3174073
8205 -3174073 -3031342 -3033045 -3885268 -3929861 -1911538 437162 591783 -1091936 -2124079
8196 -2124079 -1673447 -1355203 -2327604 -3673508 -4065250 -3469232 -2671574 -2194553 -2068686
8187 -2068686 -1942212 -1357266 -532696 -498486 -1593664 -2455382 -1833261 -868019 -1737242 -4105692
8177 -4105692 -4980222 -2706665 691257 2169016 1202589 -503548 -1588639 -1809145 -1086785
8168 -1086785 475721 1821818 1734599 628192 300792 1510763 2909895 3005911 2208227
8159 2208227 1976003 2584542 2922019 2335496 1516419 1313451 1628457 1910746 1883979 1210552
8149 1210552 -670941 -3387800 -4924612 -3376834 575440 3956610 4426560 2200297
8141 2200297 -861234 -3038755 -3510965 -2516533 -1339348 -1294758 -2213712 -2707669 -2335668
8132 -2335668 -2408540 -3819008 -5130662 -4180012 -1110488 1519417 1629309 -387720 -2572733
8123 -2572733 -3376074 -2583096 -1075326 -5656 191329 85939 342541 837844 1175209
8114 1175209 1614485 2575611 3447255 3038798 1397691 114595 366691 1512138 2160005
8105 2160005 1869192 1140196 439731 151324 1026286 3475109 6239181 6801752 3909652
8096 3909652 -628904 -3422563 -2951730 -1000717 -197562 -659443 -227377 1838551 2993206
8087 2993206 672349 -3484136 -4912557 -1961919 1673785 1652156 -1501107 -3521541 -2164018
8078 -2164018 509669 1657139 1178577 699143 731079 465337 -394885 -1166703 -1420530
8069 -1420530 -1433431 -1246256 -300368 1510765 3115654 3250798 1953826 521381 -87759
8060 -87759 -348652 -1273029 -2644479 -2909085 -1186215 1314431 2711374 2790344 2699159 2501710
8050 2501710 761409 -2817032 -5979888 -6507987 -5122415 -4289613 -4872933 -5615971 -5488443
8041 -5488443 -4753261 -3780774 -2554306 -1563385 -1541970 -1953964 -1369143 123136 570810
8032 570810 -918713 -2563940 -2493157 -1553674 -1877506 -3537259 -4505154 -3742332 -2604315
8023 -2604315 -2682674 -3413568 -2780166 -169033 2290852 1923801 -1037871 -3273016 -2407696
8014 -2407696 -125937 336798 -1082130 -1551385 -190501 512004 -834439 -1756438 190600
8005 190600 3236365 3962184 2392248 1424109 2117220 2670908 1835520 454643 -618691
7996 -618691 -1623965 -2386894 -1775918 684498 4056492 6963504 8042415 5979709 1036491
7987 1036491 -3868980 -5787095 -5187303 -4613987 -4530373 -3440823 -1791070 -2025766 -4174781
7978 -4174781 -5156200 -3790287 -2845510 -4128273 -5004886 -2546877 1667394 3954696 3598970
7969 3598970 2515970 1638714 712324 278526 770316 666412 -1469555 -3936254 -3839308
7960 -3839308 -1503773 -25528 -731690 -1894510 -1873397 -871460 516425 2022970 2811750
7951 2811750 2134122 993502 1037516 1935083 2142827 1948532 2918657 4308985 3242536
7942 3242536 -758419 -4317729 -4402102 -1534448 2093010 5069043 6152627 4011914 -474436
7933 -474436 -3686733 -2976689 417821 3343747 3971704 2136825 -1300294 -3986606 -3214072
7924 -3214072 640923 3716221 3358837 1114903 -664559 -2495164 -5435750 -7687108
7916 -7687108 -7046460 -4968304 -4408384 -4901865 -3828227 -1812971 -2408200 -6122497 -9025968
7907 -9025968 -8404117 -6069977 -4546033 -3401868 -1487481 100899 -82055 -927576 -344686
7898 -344686 1437998 2334505 1420007 -324400 -1783634 -2703682 -3099825 -2682726 -902491
7889 -902491 2483347 6241944 7484140 4436594 -473592 -2592687 -843476 976570
7881 976570 39524 -1246639 594451 4023354 4282572 399795 -3315501 -3133229 -200574
7872 -200574 2015781 2167362 1411388 893988 492887 -348310 -1577565 -2531669 -2802927
7863 -2802927 -2827494 -3037502 -2553568 -62858 3534379 5159287 3529884 1309764 1358980
7854 1358980 2611413 2408318 1423377 2538391 5348221 5987658 3151866 342652 514554
7845 514554 1963431 1744049 169964 -804964 -1261017 -2269391 -2882479 -1425794 1074155
7836 1074155 1749936 -114841 -2471825 -3714684 -4156662 -4295926 -3879847 -3150825 -3208397
7827 -3208397 -4474345 -5933351 -6215044 -4660762 -1603313 1450136 2479994 1029325
7819 1029325 -973383 -1679573 -1614874 -1928437 -1765259 41584 1756875 668642 -2010144
7810 -2010144 -2007915 1462032 3842916 1710218 -2240863 -3242333 -907069 1297106 1274462
7801 1274462 78847 -513227 305963 2391547 4334856 4057422 1567055 -217968 507951
7792 507951 1381487 -283336 -2477636 -1415795 1699680 1893320 -1499520 -3475720 -1658568
7783 -1658568 -396190 -3298497 -6581429 -4757262 453617 2655683 458516 -1334085
7775 -1334085 36078 1668961 877023 -482530 19342 1142736 728784 -325596 -19962
7766 -19962 1006920 819907 -291712 -649810 -411280 -1003179 -2064407 -1866905 -552628
7757 -552628 -267245 -1923536 -4109023 -5394421 -5670929 -5108793 -3909044 -3259977 -4353125
7748 -4353125 -6107503 -6056402 -3955761 -2241218 -2242220 -2365982 -1140905 312389 468785
7739 468785 56325 609469 1880577 2648374 2953481 3586336 4162675 3555930 1772243
7730 1772243 -127496 -1529787 -2365987 -2246023 -874761 1002688 2190067 2212845 1152226
7721 1152226 -795883 -2611843 -2518190 -288841 1523440 473758 -2404444 -3980195 -3144252
7712 -3144252 -1511143 -446297 310340 969947 854405 -155679 -1008364 -984927 -600239
7703 -600239 -593043 -1084080 -1904047 -2695292 -2731605 -1810109 -1126721 -1891642 -3328342 -3673106
7693 -3673106 -2954991 -2863619 -3824603 -4296379 -3344044 -1891860 -897289 -287336 -310187 -1748383
7683 -1748383 -3810265 -3976256 -1361415 1575978 2176256 813498 -514470 -1162355 -1533787
7674 -1533787 -1249934 93156 1181555 346000 -1542220 -1643330 1101550 4485205 5873485
7665 5873485 5257833 4642846 5123665 5624699 4717452 2932544 2174489 2646453 1839019
7656 1839019 -1950119 -6121731 -6203265 -1760159 2629775 3018420 330184 -2159687 -3172477
7647 -3172477 -3415260 -3227491 -2579352 -2196258 -2526821 -2465297 -981113 878611 1436574
7638 1436574 842018 158282 -888123 -2933224 -4682498 -4247383 -2268320 -1007708 -609628
7629 -609628 824858 3303157 4187959 2261069 -212888 -832106 -200473 -204538 -1037619
7620 -1037619 -1610929 -1502091 -903882 245489 1648847 2190196 1496340 1035496 2189779
7611 2189779 4007932 4474551 3514415 3005703 3807838 4412748 3173114 783307 -382523
7602 -382523 949396 3559633 5181064 4845749 3462972 2382028 2063006 2235683 2513320
7593 2513320 2335430 1128040 -623549 -1216012 153480 1679303 896686 -1846762 -3515513
7584 -3515513 -2192774 747162 2657659 2413906 739881 -891051 -1154207 43417 968180
7575 968180 3500 -1497994 -341956 3711014 6651291 5399183 2088244 746954 1446976
7566 1446976 905303 -1936411 -4389479 -4293114 -2693713 -1370734 -399337 508436 627453
7557 627453 -51280 337129 2865838 5432344 5321854 3192777 2103462 3088800 4259276
7548 4259276 4294635 4115558 4312256 3475652 659684 -2466598 -3830620 -3793327 -3705574 -3072862
7538 -3072862 -916530 969029 -334441 -3704246 -4195209 -6313 4128144 3257289 -666442
7529 -666442 -1680713 1600155 4550591 3744510 1425639 1232200 2842733 3487669 2675390
7520 2675390 2452385 3765402 5143277 5016222 3409267 1054541 -1575266 -3759959 -4280545
7511 -4280545 -2620637 26536 1680846 1533442 608885 259400 249955 -941575 -3574346
7502 -3574346 -5378784 -4184823 -1342347 -531435 -2764304 -4700822 -3250047 -39252
7494 -39252 753781 -2045893 -5492963 -6554789 -5073270 -2626414 -516095 518241 276900
7485 276900 -341084 68411 1567988 2641460 2336249 1523394 1362781 1629890 1469633
7476 1469633 951378 930396 1925750 3804993 5936718 7099770 6148330 3544741 1275959
7467 1275959 289184 -886501 -3532309 -5792525 -4546338 -70447 3484889 3028522 91886
7458 91886 -1685774 -1107774 161803 714786 882123 1195277 1293068 1074538 1534457 3299174
7448 3299174 5139801 5240876 3672623 2358387 2505411 3282845 3462297 3128203 2831310
7439 2831310 2104743 334392 -1392225 -1116707 1083100 2705531 2107314 741871 965957
7430 965957 2730547 3938298 3442106 2109507 1102794 540907 -52428 -1154655 -3097835
7421 -3097835 -5282358 -5609116 -2346625 3006485 6360166 5435534 2258425 353961 760100
7412 760100 1990130 2645822 2387822 1178299 -549258 -1339408 -152438 1739180 2057815
7403 2057815 826018 508063 2368734 4539893 4731639 3352792 2537359 3054419 3688785
7394 3688785 3255041 1882897 310033 -1089829 -2302139 -3203162 -3367555 -2437392 -938073
7385 -938073 -475119 -2214787 -5021543 -6211856 -4660928 -2041731 -312804 673459 1930665
7376 1930665 3110039 3285028 2967514 3245561 3532016 2518023 1080127 1498362 3418991
7367 3418991 3527976 457698 -2697736 -2654949 -364843 1264000 1999236 3416687 4722314
7358 4722314 3382104 -7092 -1270870 1682502 5834257 7408364 6609409 5828822 5431224
7349 5431224 4264257 2904879 3044581 4020266 3183210 206550 -1826905 -724947 1818017
7340 1818017 2979381 2520493 1899038 1342910 164882 -918939 -304842 1721045 2883250
7331 2883250 1977472 245926 -791262 -1118973 -1053417 -57953 1839603 2767925 1050947
7322 1050947 -2013771 -3290673 -1791144 130570 35765 -1629209 -2756248 -2611589 -2249904
7313 -2249904 -2403537 -2499731 -2028369 -1657934 -2255877 -3504086 -4316880 -4337435 -4288232 -4893052
7303 -4893052 -6012999 -6857867 -6620059 -4980334 -2510101 -573318 -305708 -1595101 -3394767
7294 -3394767 -4818636 -5350692 -4369178 -1632317 1692818 3713738 3902745 3404321 2950579
7285 2950579 1918139 110169 -1170026 -996550 -261773 159852 1066934 2875279 3580841
7276 3580841 1444023 -1513181 -1897406 -162643 158462 -1661271 -2495191 -981109 140466
7267 140466 -743267 -681073 2876444 6989278 7043700 3408270 218116 -870031 -1396908
7258 -1396908 -1566155 242497 3147920 3426076 -119610 -3983696 -4847240 -3739093 -3468379
7249 -3468379 -4336619 -4520881 -3093904 -796913 1155831 1800641 942177 -305146 -668862
7240 -668862 -704419 -1857744 -3333339 -2530698 527554 2253289 743433 -992875 401290
7231 401290 3504010 4786363 4206465 4221482 4687900 3240089 392275 -378966 1486362
7222 1486362 1954425 -1434922 -5224287 -4668896 -425695 2394670 789061 -3114900 -5281801
7213 -5281801 -3982923 -627260 2204561 3072674 2550123 2013151 1768599 1019100 -418105
7204 -418105 -1556433 -1739444 -1449289 -1114507 -492617 50793 -767432 -3028990 -4708804
7195 -4708804 -4399577 -3551781 -4153244 -5410820 -5006723 -2802566 -779572 218292 947602
7186 947602 1117924 -603996 -3335709 -3886581 -1354720 1014264 529804 -965308 -403682
7177 -403682 1451182 1642068 322426 523037 2826563 4114240 2473820 -23090 -998768
7168 -998768 -1341787 -2952701 -5157286 -5979771 -5618153 -5967385 -7252441 -7575483 -5843584
7159 -5843584 -3165713 -1055882 140977 647193 438638 -407989 -1404420 -2003909 -1739944
7150 -1739944 -288917 1768376 2763530 1827792 548293 1069855 2789148 3069955 1453517
7141 1453517 594133 1907169 2828770 569013 -3254812 -4575926 -2652398 -889738 -1680634
7132 -1680634 -3210986 -2634146 -312293 1065554 550886 -1851 988343 2392487 1931507
7123 1931507 -649186 -3097380 -3331015 -1706976 -198143 36672 -522190 -1042554 -1384294
7114 -1384294 -1576560 -1183448 33950 1240536 1147344 -386803 -1852225 -1498231 753591
7105 753591 2988236 3264172 2037053 1976228 4686841 8229754 9150164 6698295 3410211
7096 3410211 1365757 -89327 -1965537 -3054240 -1709269 1008959 2220791 900693
7088 900693 -1212907 -2236941 -1966809 -1151843 -663407 -1430218 -3390097 -4261042 -1385091
7079 -1385091 4377422 8436398 7503745 3526088 1087904 1805893 3037948 1913644 -1047826
7070 -1047826 -2959234 -2238827 -280520 526650 -314044 -1209191 -959379 -285861 -269387
7061 -269387 -401280 411597 1537286 1140786 -909385 -2407077 -1714781 9997 279869
7052 279869 -1852772 -4865279 -6042897 -3706200 845954 3828129 2784536 -366336
7044 -366336 -1906444 -1467400 -1771320 -3171569 -2401021 1554991 4294530 1995598 -2420594
7035 -2420594 -3257586 -232884 1837827 588699 -1393955 -1700763 -1152976 -744650 290359
7026 290359 1730942 1421367 -869485 -2020927 -429171 886351 -874468 -3159039 -1726351
7017 -1726351 2409894 4210999 2229516 446609 1733265 3670962 3000233 928098
7009 928098 770608 2164179 1416845 -2437800 -5431473 -4033847 -283667 925421 -1530192
7000 -1530192 -3949398 -3287170 -763204 969543 1531451 1793584 1435128 136016 -507820
6991 -507820 675147 1461935 -836692 -4286138 -4316355 -752426 1693302 741994 -535150
6982 -535150 70610 -68687 -2878490 -4798784 -2278127 1547322 1214331 -2381158 -3538164
6973 -3538164 -767760 1719173 1387732 392666 373590 -275249 -2250884 -3375320 -2961269
6964 -2961269 -3672459 -6414912 -7493562 -4076089 945048 3010042 1966707 576899
6956 576899 -476668 -2120346 -3306232 -2145295 218041 681173 -1190378 -2969862 -3550913
6947 -3550913 -4100250 -4651503 -3224144 580439 3899475 4038971 1680618 -653330 -1795031
6938 -1795031 -2251367 -2447511 -2074163 -887055 683905 1775858 1821489 1160673 717661
6929 717661 834664 940530 779956 1126392 2444294 3695971 3650105 2706369 2135561 2090780
6919 2090780 1782642 1160479 905122 1033917 975456 810560 1037252 1385923 1323784 1364212
6909 1364212 2218110 3025127 2418393 1177623 1508868 3371077 3933946 1664630 -1120913
6900 -1120913 -1226306 1313215 3511653 2993532 198102 -2420717 -2737329 -987430 354943
6891 354943 -550830 -2373214 -2247748 209730 2420760 2692976 2438008 3627285 5924380
6882 5924380 7555104 7423968 5214866 1122697 -3090858 -4506990 -2346078 523796
6874 523796 1205678 505777 921491 2250723 2021641 -250559 -2140942 -1925310 -679125
6865 -679125 -138762 -475013 -994807 -1426622 -1635705 -1277522 -437223 341915 1023465 2019178
6855 2019178 2981254 2938184 1900631 946624 404382 -481227 -1671372 -2024670 -1679231
6846 -1679231 -2658794 -5631932 -7979254 -7161081 -4513182 -3191829 -3403753 -2698045 -708551
6837 -708551 -194651 -2373801 -4228359 -2519030 1515233 3842484 2859633 521934 -1189048
6828 -1189048 -2373784 -3461663 -3652964 -2358354 -781383 -589805 -1628942 -2256613 -1795304
6819 -1795304 -1496577 -2729683 -4994648 -6424512 -6055967 -4891623 -4383654 -4392901 -3489708
6810 -3489708 -1263163 705768 765807 -733778 -2175754 -2802907 -2963544 -2768387 -2024401
6801 -2024401 -1355368 -1707526 -2531585 -2211667 -808926 -461027 -2063652 -3516321 -2890357
6792 -2890357 -1588388 -2060353 -3580851 -3129114 -224627 1938804 892319 -1809796 -2868309
6783 -2868309 -1281721 1116111 2164497 1319585 -360791 -1399046 -1317897 -1047288 -1432604
6774 -1432604 -1641184 -313923 1711544 1678106 -1212767 -3866577 -2868803 948775 3348334
6765 3348334 1869270 -1564939 -3660532 -3919148 -4559425 -6816206 -8871449 -8236974 -5284867
6756 -5284867 -2903088 -2639916 -2920637 -1922340 -434119 -56712 22692 1740292 4190067
6747 4190067 4149007 1141808 -1101893 253902 3215191 4177553 2922155 1845035 1750502
6738 1750502 1326382 137613 -603283 -231466 608498 1403453 1989181 1459204 -928496
6729 -928496 -3661841 -4162918 -2515342 -1583754 -2598276 -3182794 -1319845 1065224 832793
6720 832793 -1602789 -2906808 -1559183 632532 1776302 2277172 3302685 4755800 5857690
6711 5857690 6486007 6816273 6449998 4943988 2762900 928731 60486 254101 1301758
6702 1301758 2352060 2038281 -23702 -2259682 -2737454 -1517289 -303357 41219 219464
6693 219464 635930 483865 -534040 -1057466 36805 1562508 1372125 -656117 -2405981
6684 -2405981 -2218621 -588554 900704 1271398 628679 -102246 308210 2295064 4631595
6675 4631595 5351526 3785579 1131027 -1047162 -2191152 -2601818 -2791425 -3259579 -4170699
6666 -4170699 -4910288 -4570991 -3200704 -2030394 -2129403 -3212462 -3989323 -3412944 -1570912
6657 -1570912 339115 1028765 429195 -299962 -349022 -144728 -101854 423005 1718974 2334472
6647 2334472 974238 -921943 -805349 990598 1449835 -576748 -2626185 -2353101 -600258
6638 -600258 551485 614781 26574 -1323995 -3032575 -3389422 -1737190 -198367 -842768
6629 -842768 -2257186 -1289453 2440877 5964045 6550972 4046394 64132 -3255061 -4021606
6620 -4021606 -2088508 227441 485423 -949673 -1753445 -988754 166347 763474 1169911
6611 1169911 1661123 1719855 1128348 367632 -283423 -789867 -561112 942123 2838188
6602 2838188 3583987 3098406 2594179 2408169 1777781 732280 154289 -240295 -1734776
6593 -1734776 -3872398 -4224673 -1947949 560198 921806 -193766 -851246 -880105 -1169195
6584 -1169195 -1307974 -199118 1632002 2390433 1442078 -262412 -1941904 -3528477 -4602713
6575 -4602713 -4507694 -3713444 -3459429 -3631176 -2609826 -88555 1412714 -643196 -5122790
6566 -5122790 -7916807 -6487301 -2599929 -59397 -545011 -2443182 -3394239 -3042600 -2965001
6557 -2965001 -4357045 -6325782 -6680423 -4400198 -1055921 671797 -63851 -1409726 -1158491
6548 -1158491 815073 3060834 4550164 4995379 3998212 1660542 -260933 169114 2232595
6539 2232595 3153223 1868296 90420 -876628 -1786611 -2860525 -2454708 -275672 802099
6530 802099 -1166434 -3619435 -3243159 -1314293 -1412098 -3184454 -2884083 236226 2634538
6521 2634538 2184023 927505 916998 1207717 697776 380307 638721 -472057 -3719191
6512 -3719191 -6239771 -5401094 -2895078 -2140639 -3452882 -4692924 -5145119 -5611860 -5703557
6503 -5703557 -4259046 -2107612 -1474658 -2469117 -2607638 -262340 3305486 5695734 5634833
6494 5634833 3423004 628677 -652924 253406 1397950 491407 -1625040 -1629181 1712884
6485 1712884 5380450 5533999 1979695 -1934219 -3271394 -2240830 -1038497 -969123 -1485320
6476 -1485320 -1824056 -2364037 -3432588 -3623859 -1114374 3261612 6121129 5430756 2653085
6467 2653085 136735 -1768506 -3565523 -4452583 -3561616 -2179307 -2246021 -3162383 -2512770
6458 -2512770 78196 2099815 1584713 -510958 -1961768 -1754569 -271218 1659388 3092731
6449 3092731 3296699 2468964 1568085 1080447 551035 -389800 -1124849 -582639 1477628
6440 1477628 3810402 4464990 2705697 90812 -1237755 -1315608 -1967728 -3446590 -3643865
6431 -3643865 -1728833 -126988 -827049 -1968637 -928464 1123140 1293715 140531 484259
6422 484259 1702090 105306 -4373820 -6768103 -4156642 163023 2022704 1942455 2234101
6413 2234101 2148068 6651 -2345765 -1746885 915533 1768137 -188743 -2217397 -2700510
6404 -2700510 -2983680 -3856093 -3860511 -2372136 -1299176 -2026658 -3018584 -2221794 -59006
6395 -59006 1601754 1942605 1123771 -807941 -3130409 -3717553 -1195272 2641467 4463135
6386 4463135 3359455 1417627 244450 -1064254 -3439937 -5022283 -2986157 2078626
6378 2078626 5759712 4730004 611097 -2428063 -2783609 -2149410 -1837631 -1207391 -332133
6369 -332133 -1275389 -4739563 -7620408 -6580404 -2809990 -449529 -994974 -2220095 -2416946
6360 -2416946 -2427650 -2789105 -1997792 765452 3531711 4029020 2595625 939796 -474817
6351 -474817 -2031044 -3274936 -3559667 -3414202 -3430760 -2622373 144907 3600855 4938886
6342 4938886 3190915 185239 -1785804 -1886801 -558098 1081340 1685003 877447 -56941
6333 -56941 107321 511495 -481000 -2250080 -2306335 -64754 1858244 1094463 -1389566
6324 -1389566 -2891695 -2392702 -981045 257228 1187852 1695507 1237726 -210236 -1588879
6315 -1588879 -1862854 -1501761 -2086942 -4043086 -5468516 -4372850 -1840289 -1204268 -3444111
6306 -3444111 -5304667 -3541527 546487 3021167 2651583 1713853 1917881 2461700 2523916
6297 2523916 2969428 4480152 6009550 6251076 5188169 3428150 1418411 -150480 -658381
6288 -658381 -615661 -841674 -660884 942856 2589897 1959601 227145 1288310 5423839
6279 5423839 7809101 5450766 1566657 76248 -286596 -2262282 -3985629 -1921450
6271 -1921450 2359189 4052013 2702400 2216554 3544072 3236237 223501 -1675244 -209416
6262 -209416 1237138 -897474 -4637870 -5666450 -3546476 -1373481 -1009277 -1751534 -2621368
6253 -2621368 -3238086 -2933760 -1135058 1517180 3722139 4806212 4648109 3174651 811736
6244 811736 -1454519 -3248760 -5115600 -7119013 -8342379 -8329225 -7635172 -6448215 -4361908
6235 -4361908 -2109846 -1395064 -1942106 -1018001 2438587 5303185 4072529 -327555 -3780775
6226 -3780775 -3931840 -1810481 524174 1794260 1584165 614098 542612 1872448 2710265
6217 2710265 1350293 -710344 -545721 1815803 3234644 1994828 267711 1037029 4052487
6208 4052487 6126953 4928793 1541822 -887775 -737600 395738 112586 -1260405 -1151839
6199 -1151839 1083805 2654492 1287526 -1269594 -1855385 -586669 -213158 -1415286 -1800713
6190 -1800713 -41001 1763884 1249382 -638784 -1064982 720702 2653573 2889852 1988461
6181 1988461 1554270 1820272 1715733 1022003 1036433 2421788 3552905 2413290 -444538
6172 -444538 -2539264 -2894717 -2855350 -3172604 -2552122 -233877 2000463 2115585 647671
6163 647671 -566312 -1260946 -2342656 -3530275 -3596773 -2604639 -1891905 -1902905 -1830145 -1473285
6153 -1473285 -1718546 -2808101 -3583514 -3006758 -1453242 -104835 211901 -551827 -1685760
6144 -1685760 -2124851 -1510030 -782602 -1054691 -2040968 -2365861 -1362098 139738 856303
6135 856303 387654 -542940 -963212 -785008 -868707 -1577915 -1837945 -741483 457336 -143449
6125 -143449 -1684654 -1125019 2160993 5034719 5074502 3671303 2872515 2028336 238766
6116 238766 -523062 1694739 4694474 4830515 2626120 1590969 2158028 1286835 -1733249
6107 -1733249 -3630356 -2477713 -632994 -523588 -947729 124830 1833284 2058026 796283
6098 796283 -474334 -1303384 -1925843 -1607937 439421 3106874 4221222 3120892 1120535
6089 1120535 -246162 -313539 1003103 3314129 5428301 5751964 3554331 -44836 -2464601
6080 -2464601 -1700419 1406679 3490152 2189790 -1082659 -2981069 -2258913 -491568 784627
6071 784627 1742605 2991746 4463325 5956031 7257028 7459391 5789388 3432092 2784807
6062 2784807 4315259 5742352 4966561 2401491 -80599 -1047066 21522 2447766 4038062
6053 4038062 2883441 219181 -359318 2492083 5821023 6162495 3757663 1542775 1241700
6044 1241700 2124207 2899789 3280998 3719861 4442936 4890305 4148563 2258840 631660
6035 631660 341940 689014 716551 1186363 2933542 4085576 1940328 -2393011 -4506363
6026 -4506363 -2568438 471073 1632400 1578064 1869442 1804681 446369 -881681 -924618
6017 -924618 -1208404 -3557613 -6597430 -7600437 -6494943 -5279261 -4618833 -3836785 -3319302
6008 -3319302 -3933441 -4497522 -2700642 1358645 4869819 5718960 4338562 2200677 290657
5999 290657 -856755 -1173431 -1221611 -1295905 -767985 682204 2095027 2754039 3461842 4643790
5989 4643790 4597334 1939086 -1335015 -1952686 123554 2041625 2480411 2744640 3443845
5980 3443845 3196564 1372557 -546827 -1347756 -1597937 -1847174 -1441051 -205735 633510
5971 633510 430498 312275 1153428 1905012 1317840 60280 -324167 320787 841990 502030
5961 502030 -418684 -1250621 -1373768 -561191 457047 400197 -914876 -1964454 -1283548
5952 -1283548 744151 2630168 3734356 4455038 4757150 3753536 1186637 -1537165 -2693587
5943 -2693587 -2369816 -2211484 -2780835 -2422890 94456 2888712 3058249 1199306 1039273
5934 1039273 3671327 5119197 1940912 -3088427 -4232392 -534361 3369277 4021638
5926 4021638 2978394 2892450 3204250 1947954 -416388 -1656151 -1334692 -1429512 -3385263
5917 -3385263 -6110217 -7330115 -6152293 -3828985 -2112107 -1172676 299325 2711091
5909 2711091 4270847 3220474 663437 -604877 12615 194443 -1599116 -3677146 -3601190
5900 -3601190 -1611409 83186 599816 1199493 2869972 4548030 4383234 2147921 -298694
5891 -298694 -1046281 -295238 -27251 -1499041 -3734085 -4884313 -4303106 -2533644 -137913
5882 -137913 2162552 2855783 983354 -1854394 -2575181 -241685 2648697 3023509 396225
5873 396225 -3148152 -5138644 -4642138 -2926198 -2274814 -3284846 -3774467 -1722595 1401597
5864 1401597 2431285 1272753 1044681 3104288 5094847 5099258 4514111 4775937 4232898
5855 4232898 1199569 -2160480 -2436676 -80827 1453389 848718 -85812 -95860 199770
5846 199770 704411 2258998 4094005 3909670 1450766 -739398 -1271533 -1957847 -4354184
5837 -4354184 -6646802 -6061738 -2755073 652794 2258053 1961288 544437 -661432 -156074
5828 -156074 2031950 3756543 3265885 1512088 656072 1273566 2503959 3795716 4621677
5819 4621677 3555644 39623 -3494412 -3784664 -948698 1752527 2283578 1479376 258575
5810 258575 -1769621 -3956891 -3828067 -552609 2914719 3249622 851520 -1320591 -1664771
5801 -1664771 -814564 198286 651781 -119935 -1821080 -2815901 -2328785 -1927062 -2855706
5792 -2855706 -3254589 -806698 2777826 3328809 208712 -2697143 -2588936 -975501 -71963
5783 -71963 698074 2482093 4016976 3610420 2318569 2417520 3827427 4573297 4046752
5774 4046752 3429318 3310278 3104138 2677182 2580442 2711199 2517932 2469016 3542418 5228074
5764 5228074 5814001 4847144 3619086 2951194 2213069 959656 -184298 -951646 -2133808
5755 -2133808 -3933590 -4996282 -4164666 -2127449 -290736 1005949 2038250 2374375 1420750
5746 1420750 -102367 -544836 737700 2673331 3788548 3701570 3337475 4006082 6031308
5737 6031308 7997282 7872270 5405568 2795209 2159547 2925799 2906125 1593832 757692
5728 757692 1471261 2277840 1479219 56511 586591 3530492 6209237 5856373 2572798
5719 2572798 -1211888 -3246621 -2880154 -978816 664825 536980 -992062 -1782553 -641242
5710 -641242 694672 -250275 -2814247 -3433046 -307506 3863153 5013040 2449023 -927416
5701 -927416 -2435991 -2087232 -1345099 -935670 -536277 148121 755862 591317 -735011
5692 -735011 -2900774 -4928973 -5740411 -4917185 -3136885 -1799919 -1860565 -2804622 -3130878
5683 -3130878 -2187486 -1048231 -906271 -1124454 -77021 2217919 3808350 3560238 2713350
5674 2713350 2775581 3177905 2450961 879948 243860 1089497 1918893 1458222 370836
5665 370836 -35507 209441 102361 -554235 -1000649 -1140747 -1943918 -3486928 -3777531 -1123061
5655 -1123061 2794596 4275736 2459674 676802 1710501 3822857 3695285 1603762
5647 1603762 537659 1038861 647039 -1265019 -1958323 -11342 1964068 1536352 399815
5638 399815 1165526 2569888 1517573 -1418923 -2431383 -263570 2002344 1724612 285803
$$ [...]
##END NTUPLES=NMR SPECTRUM
##END=
