##TITLE=31Pdec_49-2022
 DMSO-d6, 24 sc
 25.7.2022
##JCAMPDX= 6.0         $$ Bruker NMR JCAMP-DX V2.0
##DATA TYPE= NMR SPECTRUM
##DATA CLASS= NTUPLES
##ORIGIN= UXNMR, Bruker Analytische Messtechnik GmbH
##OWNER= root
$$ XWIN-NMR		Version 3.5
$$ Mon Jul 25 14:32:28 2022 Russian Standard Time (UT+4h)  she@DPX200
##.OBSERVE FREQUENCY= 81.013821
##.OBSERVE NUCLEUS= ^31P
##.ACQUISITION MODE= SIMULTANEOUS
##.ACQUISITION SCHEME= undefined
##.AVERAGES= 24
##.DIGITISER RES= 16
##SPECTROMETER/DATA SYSTEM= spect
##.PULSE SEQUENCE= zgpg30
##.SOLVENT NAME= CDCl3
##.SHIFT REFERENCE= (INTERNAL, CDCl3, 0, 248.564)
##AUDIT TRAIL= $$ (NUMBER, WHEN, WHO, WHERE, WHAT)
$$ ##TITLE= Audit trail, XWIN-NMR		Version 3.5
$$ ##JCAMPDX= 5.01
$$ ##ORIGIN= Bruker BioSpin GmbH
$$ ##OWNER= she
$$ F:/spectra/data/she/nmr/P31/1/pdata/1/auditp.txt
$$ ##AUDIT TRAIL=  $$ (NUMBER, WHEN, WHO, WHERE, WHAT)
(   1,<2022-07-25 14:31:36.32 +0400>,<she>,<DPX200>,
      <created by zg, POWCHK disabled, PULCHK disabled
       configuration hash MD5:
       00 E9 B6 7A A2 85 ED C7 34 08 36 98 17 FE 4E 26
       data hash MD5: 32K
       C0 77 E7 F3 04 2B 3A 71 E5 8A 9D E5 A9 02 E0 48>)
(   2,<2022-07-25 14:31:41.25 +0400>,<she>,<DPX200>,
      <Start of raw data processing
       efp BC_mod = 2 LB = 1 FT_mod = 6 PKNL = 1 PHC0 = -10445.78 PHC1 = 537.4568 SI = 64K 
       data hash MD5: 64K
       BD 1A 9B BC 46 AE CB F3 A6 F9 4B 58 54 2F F6 C7>)
(   3,<2022-07-25 14:31:54.09 +0400>,<she>,<DPX200>,
      <pk PHC0 = -36.61099 PHC1 = 0 
       data hash MD5: 64K
       13 6B DE EF 03 54 6E 37 58 AD F6 FF CE 88 47 58>)
(   4,<2022-07-25 14:32:08.51 +0400>,<she>,<DPX200>,
      <abs ABSG = 5 
       data hash MD5: 64K
       E6 80 E5 1B BA DE 37 99 2F 08 83 2C 55 AC 64 B2>)
$$ ##END=
$$ 
$$ hash MD5
$$ B4 BD 54 00 5B 78 8F 2F 76 22 D1 0B B5 3B 8C A8
##$RELAX= 
##$RELAX= 
##$RELAX= 
##$RELAX= 
##$RELAX= 
##$RELAX= 
##$RELAX= 
##$RELAX= 
$$ Bruker specific parameters
$$ --------------------------
##$DU= <F:/spectra>
##$EXPNO= 1
##$NAME= <P31>
##$PROCNO= 1
##$TYPE= <nmr>
##$USER= <she>
##$AMP= (0..31)
100 100 100 100 100 100 100 100 100 100 100 100 100 100 100 100 100 100 
100 100 100 100 100 100 100 100 100 100 100 100 100 100 
##$AQSEQ= 0
##$AQ_mod= 1
##$AUNM= <au_zg>
##$AUTOPOS= <>
##$BF1= 81.014009
##$BF2= 200.13
##$BF3= 200.13
##$BF4= 200.13
##$BF5= 200.13
##$BF6= 200.13
##$BF7= 200.13
##$BF8= 200.13
##$BYTORDA= 1
##$CFDGTYP= 0
##$CFRGTYP= 5
##$CHEMSTR= <none>
##$CNST= (0..31)
1 1 145 1 1 1 1 1 1 1 1 1 1 1 1 1 1 1 1 1 1 1 1 1 1 1 1 1 1 1 1 1 
##$CPDPRG= <waltz16>
##$CPDPRG1= <>
##$CPDPRG2= <waltz16>
##$CPDPRG3= <>
##$CPDPRG4= <mlev>
##$CPDPRG5= <mlev>
##$CPDPRG6= <mlev>
##$CPDPRG7= <mlev>
##$CPDPRG8= <mlev>
##$CPDPRGB= <>
##$CPDPRGT= <>
##$D= (0..31)
0 1 0 0 0 0 0 0 0 0 0 0.03 2e-05 3e-06 0 0 0 0 0 0 0 0 0 0 0 0 0 0 0 0 
0 0 
##$DATE= 1658745095
##$DBL= (0..7)
120 120 120 11 120 120 24 19 
##$DBP= (0..7)
150 150 150 150 150 150 150 150 
##$DBP07= 0
##$DBPNAM0= <>
##$DBPNAM1= <>
##$DBPNAM2= <>
$$ [...]
##$SUBNAM3= <"">
##$SUBNAM4= <"">
##$SUBNAM5= <"">
##$SUBNAM6= <"">
##$SUBNAM7= <"">
##$SUBNAM8= <"">
##$SUBNAM9= <"">
##$SW= 501.771253377433
##$SWIBOX= (0..15)
0 1 3 0 0 0 0 0 0 0 0 0 0 0 0 0 
##$SW_h= 40650.406504065
##$TD= 32768
##$TD0= 1
##$TE= 0
##$TE2= 300
##$TE3= 300
##$TEG= 300
##$TL= (0..7)
0 120 53 12 22 120 120 120 
##$TP= (0..7)
150 150 150 150 150 150 150 150 
##$TP07= 0
##$TPNAME0= <>
##$TPNAME1= <>
##$TPNAME2= <>
##$TPNAME3= <>
##$TPNAME4= <>
##$TPNAME5= <>
##$TPNAME6= <>
##$TPNAME7= <>
##$TPOAL= (0..7)
0.5 0.5 0.5 0.5 0.5 0.5 0.5 0.5 
##$TPOFFS= (0..7)
0 0 0 0 0 0 0 0 
##$TUNHIN= 0
##$TUNHOUT= 0
##$TUNXOUT= 0
##$USERA1= <user>
##$USERA2= <user>
##$USERA3= <user>
##$USERA4= <user>
##$USERA5= <user>
##$V9= 5
##$VALIST= <valist>
##$VCLIST= <CCCCCCCCCCCCCCC>
##$VD= 0
##$VDLIST= <DDDDDDDDDDDDDDD>
##$VPLIST= <PPPPPPPPPPPPPPP>
##$VTLIST= <TTTTTTTTTTTTTTT>
##$WBST= 1024
##$WBSW= 4
##$XGAIN= (0..3)
0 0 0 0 
##$XL= 0
##$YL= 0
##$YMAX_a= 2892
##$YMIN_a= -2743
##$ZGOPTNS= <>
##$ZL1= 120
##$ZL2= 120
##$ZL3= 120
##$ZL4= 120
##$ABSF1= 248.5645
##$ABSF2= -253.2056
##$ABSG= 5
##$ABSL= 3
##$ALPHA= 0
##$AQORDER= 0
##$ASSFAC= 0
##$ASSFACI= 0
##$ASSFACX= 0
##$ASSWID= 0
##$AUNMP= <proc_1d>
##$AZFE= 0.1
##$AZFW= 0.5
##$BCFW= 0
##$BC_mod= 2
##$BYTORDP= 0
##$COROFFS= 0
##$CY= -3
##$DATMOD= 1
##$DC= 0
##$DFILT= <>
##$DTYPP= 0
##$F1P= 0
##$F2P= 0
##$FCOR= 1
##$FTSIZE= 65536
##$FT_mod= 6
##$GAMMA= 0
##$GB= 0
##$INTBC= 1
##$INTSCL= 5.30512e-09
##$ISEN= 30
##$LB= 1
##$LEV0= 0
##$LPBIN= 0
##$MAXI= 10000
##$MC2= 0
##$MEAN= 0
##$ME_mod= 0
##$MI= 50
##$NCOEF= 0
##$NC_proc= -5
##$NLEV= 6
##$NOISF1= 182.463
##$NOISF2= 159.3651
##$NSP= 0
##$NTH_PI= 0
##$NZP= 0
##$OFFSET= 248.5645
##$PC= 4
##$PHC0= -10482.39
##$PHC1= 537.4568
##$PH_mod= 1
##$PKNL= yes
##$PPARMOD= 0
##$PSCAL= 0
##$PSIGN= 0
##$REVERSE= no
##$SF= 81.014009
##$SI= 65536
##$SIGF1= 159.3651
##$SIGF2= -187.1042
##$SINO= 113.3802
##$SIOLD= 16384
##$SREGLST= <1H.CDCl3>
##$SSB= 0
##$STSI= 65536
##$STSR= 0
##$SW_p= 40650.406504065
##$SYMM= 0
##$S_DEV= 0
##$TDeff= 32768
##$TDoff= 0
##$TI= <>
##$TILT= no
##$TM1= 0
##$TM2= 0
##$TOPLEV= 0
##$USERP1= <user>
##$USERP2= <user>
##$USERP3= <user>
##$USERP4= <user>
##$USERP5= <user>
##$WDW= 1
##$XDIM= 65536
##$YMAX_p= 333164575
##$YMIN_p= -42845743
$$ End of Bruker specific parameters
$$ ---------------------------------
##NTUPLES= NMR SPECTRUM
##VAR_NAME=  FREQUENCY,     SPECTRUM/REAL,   SPECTRUM/IMAG
##SYMBOL=    X,             R,               I
##VAR_TYPE=  INDEPENDENT,   DEPENDENT,       DEPENDENT
##VAR_FORM=  AFFN,          ASDF,            ASDF
##VAR_DIM=   65536,         65536,           65536
##UNITS=     HZ,            ARBITRARY UNITS, ARBITRARY UNITS
##FACTOR=    0.620285442955139, 1,           1
##FIRST=     20137.2065510759, 0,            0
##LAST=      -20513.1999529892, 0,           0
##MIN=       -20513.1999529892, -42845743,   0
##MAX=       20137.2065510759, 333164575,    0
$$ Real data points
##PAGE= N=1
##DATA TABLE= (X++(R..R)), XYDATA
$$ [...]
$$ plain form
39610 235940 420892 444719 82231 -177493 176088 727578 590505 -326300 -1160633 -1200799
39600 -1200799 -606205 16989 279553 132604 -282149 -703541 -867837 -700033 -341189
39591 -341189 -193 162546 100622 -61934 -134627 -110598 -187077 -453944 -732215 -830190
39581 -830190 -771582 -638084 -386239 1704 338333 377069 60815 -433346 -783927 -707504
39571 -707504 -302390 -157047 -727845 -1591469 -1801347 -1117394 -355279 -267491 -607339 -670427
39561 -670427 -279814 234574 642548 887633 846511 506985 178254 128276 253352 441169
39551 441169 879777 1566603 1942057 1600626 994428 764203 712193 226908 -517153 -689535
39541 -689535 -93227 542845 658149 461767 281888 59291 -265823 -506068 -619458 -788088
$$ packed form
39610B35940J84952K3827l62488k59724L53581N51490j37073r16805q34333m0166
39600a200799N94594O23194K62564j46949m14753m21392j64296J67804L58844
39591c41189L40996J62739o1924j62556p2693K4029p6479k66867k78271r7975
39581h30190N8608J33498K51845L87943L36629L8736l16254m94161l50581P6423
39571g07504M05114J45343n70798q63624k09878O83953P62115Q7788l39848o3088
39561f70427L90613N14388M07974K45085m1122l39526l28731m9978J25076J87817
39551D41169M38608O86826L75454l41431o06198k30225n2010m85285p44061j72382
39541f89535N96308O36072J15304j96382j79879k22597l25114k40245j13390j68630
$$ plain form
39531 -788088 -915396 -632851 7649 478078 621919 877277 1378525 1577203 1183257 768089
39521 768089 857641 1044813 679867 -54126 -498702 -594651 -821626 -1247221 -1379360 -963513
39511 -963513 -334492 83290 185269 81681 -44992 5919 238316 387091 323314 302054
39501 302054 456766 377048 -259174 -913977 -782831 -46135 291728 -101042 -385178 141340
39491 141340 987197 1220950 708232 21665 -451498 -671322 -502866 174199 956267 1154527
39481 1154527 685610 244443 390389 850487 997837 724613 479153 552420 694375 527466
39471 527466 90531 -251060 -369239 -587480 -1182770 -1824009 -1800435 -881942 289608 865797
39461 865797 709574 411600 459070 683213 615326 154957 -309154 -362256 914 396335
$$ packed form
39531g88088j27308K82545O40500M70429J43841K55358N01248J98678l93946m15168
39521G68089Q9552J87172l64946p33993m44576r5949k26975m25595j32139M15847
39511i63513O29021M17782J01979j03588j26673N0911K32397J48775o3777k1260
39501C02054J54712p9718o36222o54803J31146P36696L37863l92770k84136N26518
39491A41340Q45857K33753n12718o86567m73163k19824J68456O77065P82068J98260
39481A154527m68917m41167J45946M60098J47350k73224k45460P3267J41955j66909
39471E27466m36935l41591j18179k18241n95290o41239K3574R18493J171550N76189
39461H65797j56223k97974M7470K24143o7887m60369m64111n3102L63170L95421
$$ plain form
39451 396335 439231 121763 -187005 -162667 82401 154828 -72004 -265715 -90086 338705
39441 338705 633070 633897 510277 446842 469903 546381 616649 540093 258198 24178 180324
39430 180324 617024 740426 165175 -759689 -1306914 -1111726 -410113 287068 562435 293372
39420 293372 -248941 -542716 -268022 366386 844975 842587 430430 -73164 -318782 -141582
39410 -141582 242113 363680 24300 -419967 -495940 -195473 141421 380035 652451 906675
39400 906675 820034 292411 -297288 -514229 -333349 -23047 255921 555087 927759 1240172
39390 1240172 1196969 615575 -209524 -540018 108025 1292893 1998362 1748908 1065315
39381 1065315 681565 672514 633574 409190 208302 120387 -35000 -317107 -476794 -322159
$$ packed form
39451C96335M2896l17468l08768K4338K45068P2427k26832j93711J75629M28791
39441C38705K94365Q27j23620o3435K3061P6478P0268p6556k81895k34020J56146
39430A80324M36700J23402n75251r24864n47225J95188P01613O97181K75367k69063
39420B93372n42313k93775K74694O34408M78589k388m12157n03594k45618J77200
39410a41582L83695J21567l39380m44267p5973L00467L36894K38614K72416K54224
39400I06675q6641n27623n89699k16941J80880L10302K78968K99166L72672L12413
39390A240172m3203n81394q25099l30494O48043J184868P05469k49454o83593
39381A065315l83750r051l8940k24384k00888q7915j55387k82107j59687J54635
$$ plain form
39371 -322159 -34831 80649 27806 75222 305719 416700 69160 -675102 -1389145 -1697653
39361 -1697653 -1528010 -1002221 -300023 327374 652595 734944 895955 1254606 1488452 1298600
39351 1298600 909981 768191 878673 850090 529450 160033 -88794 -284611 -370426 -150329
39341 -150329 210506 197467 -278463 -625797 -451514 -195057 -389716 -740378 -604914 -108076
39331 -108076 -3112 -482145 -878929 -686750 -201768 98527 223492 353256 354008 85864
39321 85864 -140866 70122 548014 724936 381648 -185098 -697336 -1168188 -1580143 -1705954
39311 -1705954 -1452867 -1096726 -928868 -849203 -547582 17998 548168 753977 581641 116094
39301 116094 -513411 -1070974 -1246342 -903155 -250122 321598 556970 466441 200488 -120029
$$ packed form
39371c22159K87328J15480n2843M7416K30497J10981l47540p44262p14043l08508
39361a697653J69643N25789P02198O27397L25221Q2349J61011L58651K33846j89852
39351A298600l88619j41790J10482k8583l20640l69417k48827j95817q5815K20097
39341a50329L60835j3039m75930l47334J74283K56457j94659l50662J35464M96838
39331a08076J04964m79033l96784J92179M84982L00295J24965J29764P52k68144
39321H5864k26730K10988M77892J76922l43288n66746n12238m70852m11955j25811
39311a705954K53087L56141J67858P9665L01621N65580N30170K05809j72336m65547
39301A16094o29505n57563j75368L43187O53033N71720K35372r0529k65953l20517
$$ plain form
39291 -120029 -436431 -664322 -650466 -309579 175250 416476 224644 -117403 -161959 136153
39281 136153 367348 223440 -123639 -320424 -297904 -240040 -233218 -186288 -43955 128850
39271 128850 257858 280453 79520 -400527 -926834 -1042778 -494232 432227 1066066 910146
39261 910146 109119 -650090 -803208 -468253 -207040 -267710 -348243 -188203 -26017 -181068
39251 -181068 -453707 -342106 248118 872848 1106418 947243 695953 681031 1055318 1608890
39241 1608890 1839729 1468486 819240 433873 409346 412830 236737 -22305 -257225 -443231
39231 -443231 -487652 -349997 -232131 -263699 -135253 458175 1129466 1180315 652230 310848
39221 310848 487102 653831 380275 -4934 -69042 30767 -50010 -251792 -351870 -363285
$$ packed form
39291a20029l16402k27891J3856L40887M84829K41226j91832l42047m4556K98112
39281A36153K31195j43908l47079j96785K2520N7864O822M6930J42333J72805
39271A28850J29008K2595k00933m80047n26307j15944N48546R26459O33839j55920
39261I10146q01027p59209j53118L34955K61213o0670q0533J60040J62186j55051
39251a81068k72639J11601N90224O24730K33570j59175k51290j4922L74287N53572
39241A608890K30839l71243o49246l85367k4527L484j76093k59042k34920j86006
39231d43231m4421J37655J17866l1568J28446N93428O71291N0849n28085l41382
39221C10848J76254J66729k73556l85209o4108R9809q0777k01782j00078j1415
$$ plain form
39211 -363285 -319122 -101005 168368 55302 -480403 -834011 -626385 -255533 -94807 207795
39201 207795 949504 1496134 1073571 52808 -469075 -163184 308792 427880 326713
39192 326713 199423 8180 -145184 -36348 212774 268603 199035 362637 708082 807272
39182 807272 576472 333471 158517 -127832 -362535 -156399 332134 495765 260561 201969
39172 201969 516841 667188 301603 -218179 -506264 -650694 -720439 -509246 -119322 -57780
39162 -57780 -356235 -360435 140429 390196 -114032 -666993 -415922 277115 439043 -31602
39152 -31602 -430302 -462073 -425035 -343838 123840 866345 1221563 881188 286606 -23181
39142 -23181 37731 288658 548636 631643 488320 402586 667004 1065371 1083007 623173
$$ packed form
39211c63285M4163K18117K69373j13066n35705l53608K07626L70852J60726L02602
39201B07795P41709N46630m22563j020763n21883L05891M71976J19088j01167
39192C26713j27290j91243j53364J08836K49122N5829o9568J63602L45445R9190
39182H07272k30800k43001j74954k86349k34703K06136M88533J63631k35204n8592
39172B01969L14872J50347l65585n19782k88085j44430o9745K11193L89924O1542
39162e7780k98455m200N00864K49767n04228n52961K51071O93037J61928m70645
39152c1602l98700l1771L7038Q1197M67678P42505L55218l40375n94582l09787
39142b3181O0912K50927K59978Q3007j43323q5734K64418L98367J7636m59834
$$ plain form
39132 623173 95015 -201999 -335902 -378505 -271512 -146466 -320102 -805166 -1186729 -1136941
39122 -1136941 -755368 -303126 91500 373600 520727 659936 934985 1176159 1004709
39113 1004709 363647 -336983 -687669 -613499 -195140 477662 1123473 1279191 747361 -143233
39103 -143233 -893273 -1303892 -1487365 -1575784 -1543980 -1241079 -587199 170304 527748 300333
39093 300333 -2510 242480 873842 1096483 583064 -87263 -273782 -60396 111506 161544
39083 161544 297578 522513 669429 769540 973489 1182482 1112812 704448 189943 -202840
39073 -202840 -368238 -221715 208530 598153 550636 97759 -251012 -76625 478326 904556
39063 904556 891143 605903 452990 603670 787380 602228 51142 -355021 -153625 491876
$$ packed form
39132F23173n28158k97014j33903m2603J06993J25046j73636m85064l81563M9788
39122a136941L81573M52242L94626K82100J47127J39209K75049K41174j71450
39113A004709o41062p00630l50686P4170M18359O72802O45811J55718n31830q90594
39103a43233p50040m10619j83473q8419L1804L02901O53880P57503L57444k27415
39093C00333l02843K44990O31362K22641n13419o70327j86519K13386J71902N0038
39083A61544J36034K24935J46916J00111K03949K08993o9670m08364n14505l92783
39073b02840j65398J46523M30245L89623m7517m52877l48771J74387N54951M26230
39063I04556j3413k85240j52913J50680J83710j85152n51086m06163K01396O45501
$$ plain form
39053 491876 940787 786337 254728 -128326 -105069 165602 401394 491383 514393 574400
39043 574400 663134 652601 412540 -20531 -379756 -358006 56394 494762 586519 390122
39033 390122 273003 362897 373164 89488 -234310 -213192 118425 385896 389820 241058
39023 241058 73559 -40396 40639 338127 446934 -98366 -1032776 -1432766 -841676 112133
39013 112133 575724 556009 654093 987940 1000233 345451 -555513 -1021601 -840029 -323825
39003 -323825 105896 216938 15933 -312164 -555921 -645711 -647680 -614513 -541087 -447170 -362411
38992 -362411 -215834 104459 519211 724353 512732 69823 -181316 -52590 189717 171060
38982 171060 -73309 -105512 310263 809492 865289 490323 160276 83392 -3689 -205433
$$ packed form
39053D91876M48911j54450n31609l83054K3257K70671K35792Q9989K3010O0007
39043E74400Q8734j0533k40061m33071l59225K1750M14400M38368R1757j96397
39033C90122j17119Q9894J0267k83676l23798K1118L31617K67471L924j48762
39023B41058j67499j13955Q1035K97488J08807n45300r34410l99990N91090R53809
39013A12133M63591j9715R8084L33847J2293o54782r00964m66088J81572N16204
39003c23825M29721J11042k01005l28097k43757q9790j969L3167P3426R3917Q4759
38992c62411J46577L20293M14752K05142k11621m42909k51139J28726K42307j8657
38982A71060k44369l2203M15775M99229N5797l74966l30047p6884q7081k01744
$$ plain form
38972 -205433 -153636 328787 688825 318234 -463531 -713901 -132094 548907 561408 12696
38962 12696 -426936 -371009 20857 365256 363230 -59131 -688354 -1173452 -1354088 -1335829
38952 -1335829 -1185117 -758246 18807 870922 1359134 1268345 723787 62850 -311366 -146838
38942 -146838 382094 724571 475694 -196599 -779221 -984436 -926955 -796668 -583152 -206416
38932 -206416 213420 383906 191433 -69532 11134 414915 674215 545907 426125 745435
38922 745435 1179088 1020382 303305 -114873 207305 630716 421240 -178482 -448623 -303260
38912 -303260 -165987 -28972 504182 1275656 1528256 1003572 362917 204429 293729 169781
38902 169781 -54218 -30414 96430 -93485 -553971 -794168 -572245 -137155 188383 313683
$$ packed form
38972b05433N1797M82423L60038l70591p81765k50370N81807O81001J2501n48712
38962A2696m39632N5927L91866L44399k026m22361o29223m85098j80636J8259
38952a335829J50712M26871P77053Q52115M88212r0789n44558o60937l74216J64528
38942a46838N28932L42477k48877o72293n82622k05215N7481J30287K13516L76736
38932b06416M19836J70486j92473k60965Q0666M03781K59300j28308j19782L19310
38922G45435M33653j58706p17077m18178L22178M23411k09476n99722k70141J45363
38912c03260J37273J37015N33154P71474K52600n24684o40655j58488Q9300j23948
38902A69781k23999K3804J26844j89915m60486k40197K21923M35090L25538J25300
$$ plain form
38892 313683 303722 295924 435960 641810 574333 153714 -90359 368008 1212547 1583353
38882 1583353 1183231 531020 78718 -278849 -618058 -588349 -40983 465328 342565 -182468
38872 -182468 -448413 -328225 -250605 -425100 -640802 -774772 -917490 -971806 -700129 -269316
38862 -269316 -185287 -504124 -659026 -346657 -45364 -231920 -544229 -301334 406426 775475
38852 775475 405134 -185608 -280463 197014 760097 995964 890284 638869 361253 66710
38842 66710 -169185 -143767 219454 624979 663518 365320 213094 461416 743642 608781
38832 608781 186408 -22196 169982 523194 810140 980331 961033 687303 325521 129878
38822 129878 88390 19765 -52463 -598 10248 -300856 -755112 -825239 -405589 38547 220172
$$ packed form
38892C13683r961p798J40036K05850o7477m20619k44073M58367Q44539L70806
38882A583353m00122o52211m52302l57567l39209K9709N47366N06311j22763n25033
38872a82468k65945J20188P7620j74495k15702j33970j42718n4316K71677M30813
38862b69316Q4029l18837j54902L12369L01293j86556l12309K42895P07760L69049
38852G75475l70341n90742r4855M77477N63083K35867j05680k51415k77616k94543
38842F6710k35895K5418L63221M05525L8539k98198j52226K48322K82226j34861
38832F08781m22373k08604J92178L53212K86946J70191j9298k73730l61782j95643
38822A29878m1488o8625p2228N1865J0846l11104m54256p0127M19650M44136J81625
$$ plain form
38811 220172 379756 662505 722186 336783 -62018 26069 386718 410930 2075 -323217
38801 -323217 -165419 315177 663264 568273 102509 -269042 -37142 781426 1556095 1713194
38791 1713194 1323224 848666 560679 452656 481938 592831 673833 719528 827436 891670
38781 891670 672967 363711 539412 1183936 1395210 655260 -232136 -293412 94113 -78540
38771 -78540 -615630 -371772 693593 1206128 530999 -149587 300766 1188021 1141835 242166
38761 242166 -232856 224984 814262 762139 190336 -451712 -967191 -1208540 -990295 -504266
38751 -504266 -297257 -534245 -697513 -314205 360914 713070 571226 305941 254009 369846
38741 369846 443312 393266 241101 -28849 -402819 -692717 -662304 -350803 -90196 -84262
$$ packed form
38811B20172J59584K82749N9681l85403l98801Q8087L60649K4212m08855l25292
38801c23217J57798M80596L48087r4991m65764l71551K31900Q18568P74669J57099
38791A713194l89970m74558k87987j08023K9282J10893Q1002M5695J07908O4234
38781H91670k18703l09256J75701O44524K11274p39950q87396o1276L87525j72653
38771g8540n37090K43858J065365N12535o75129o80586M50353Q87255m6186q99669
38761B42166m75022M57840N89278n2123n71803o42048n15479k41349K18245M86029
38751e04266K07009k36988j63268L83308O75119L52156j41844k65285n1932J15837
38741C69846P3466n0046j52165k69950l73970k89898L0413L11501K60607N934
$$ plain form
38731 -84262 -147756 -45150 100880 30465 -169506 -190381 -52803 -90241 -344684 -446260
38721 -446260 -232373 -33545 -131204 -356211 -483965 -613125 -838491 -947812 -819430 -753424
38711 -753424 -975999 -1141639 -818090 -212266 98853 -21349 -222621 -278505 -249102 -160821
38701 -160821 -20847 -39545 -329188 -499239 -130830 423610 384972 -266547 -659582 -288861
38691 -288861 268158 249194 -241165 -537913 -357076 68087 515761 930938 1162947 991581
38681 991581 458883 -86951 -322919 -198130 113367 393773 553405 668972 779579 691920
38671 691920 216262 -395615 -578665 -164637 341098 403501 101067 -129647 -120524 -3726
38661 -3726 164647 391238 458703 98313 -516687 -834481 -588745 -90622 255178 417376
$$ packed form
38731h4262o3494J02606J46030p0415j99971k0875J37578l7438k54443j01576
38721d46260K13887J98828r7659k25007j27754j29160k25366j09321J28382O6006
38711g53424k22575j65640L23549O05824L11119j20202k01272n5884K9403Q8281
38701a60821J39974j8698k89643j70051L68409N54440l8638o51519l93035L70721
38691b88861N57019j8964m90359k96748J80837M25163M47674M15177K32009j71366
38681I91581n32698n45834k35968J24789L11497K80406J59632J15567J10607q7659
38671F91920m75658o11877j83050M14028N05735O2403l02434k30714R123J16798
38661c726J68373K26591O7465l60390o15000l17794K45736M98123L45800J62198
$$ plain form
38651 417376 550572 638495 605540 589687 771053 996660 895709 400266 -118991 -317318
38641 -317318 -236994 -87623 92100 342903 536879 505551 353050 374674 651312 938520
38631 938520 976914 721194 267545 -214095 -459636 -291630 104922 332289 275723 185327
38621 185327 205149 176940 50823 75154 307643 346461 -52717 -450371 -334302 5698
38611 5698 -154803 -827242 -1193637 -740471 70638 486485 346826 10942 -220594 -283825
38601 -283825 -196571 -31842 72204 66077 54085 121081 257615 507524 936909 1355300
38591 1355300 1362198 860372 268236 3333 -8463 -55483 -105081 99981 521946 772928
38581 772928 606529 192084 -158672 -315957 -304131 -147333 115764 372057 530711 635390
$$ packed form
38651D17376J33196Q7923l2955j5853J81366K25607j00951m95443n19257j98327
38641c17318Q0324J49371J79723K50803J93976l1328j52501K1624K76638K87208
38631I38520L8394k55720m53649m81640k45541J68006L96552K27367n6566r0396
38621A85327J9822k8209j26117K4331K32489L8818l99178l97654J16069L40000
38611E698j60501o72439l66395M53166Q11109M15847j39659l35884k31536o3231
38601b83825Q7254J64729J04046o127j1992O6996J36534K49909M29385M18391
38591A355300O898n01826n92136k64903j1796m7020m9598K05062M21965K50982
38581G72928j66399m14445l50756j57285J1826J56798K63097K56293J58654J04679
$$ plain form
38571 635390 757231 797515 555302 55313 -343754 -332518 -61558 31899 -231910 -645747
38561 -645747 -1011237 -1322135 -1467030 -1165079 -465252 56096 -18472 -353059 -396405 -249978
38551 -249978 -418615 -847007 -910993 -456250 -176327 -652158 -1494876 -1801737 -1171414 1437
38541 1437 998825 1336526 1068132 693926 597303 573928 217835 -309511 -442207 -194787
38531 -194787 -290336 -1010976 -1608881 -1372506 -686587 -364223 -397434 -189823 251576 286725
38521 286725 -190414 -435759 28377 687267 832723 560105 462726 655499 657411 183607
38511 183607 -406544 -583270 -287105 104626 316350 433637 596900 674117 448159 16767
38501 16767 -276716 -320008 -353288 -531579 -658773 -525691 -250032 -55122 62169 178358
$$ packed form
38571F35390J21841M0284k42213m99989l99067J1236K70960R3457k63809m13837
38561f45747l65490l10898j44895L01951O99827N21348p4568l34587m3346J46427
38551b49978j68637m28392o3986M54743K79923m75831q42718l06861O30323J172851
38541A437R97388L37701k68394l74206r6623k3375l56093n27346j32696K47420
38531a94787r5549p20640n97905K36375O85919L22364l3211K07611M41399L5149
38521B86725m77139k45345M64136O58890J45456k72618r7379J92773J912m73804
38511A83607n90151j76726K96165L91731K11724J17287J63263P7217k25958m31392
38501A6767k93483m3292l3280j78291j27194J33082K75659J94910J17291J16189
$$ plain form
38491 178358 160379 -133223 -478434 -452674 22262 549178 681835 322025 -257083 -613106
38481 -613106 -430283 196180 807361 1031371 881475 508180 -90015 -844575 -1343130 -1194924
38471 -1194924 -600476 -171054 -177996 -324553 -280005 -79376 96745 207466 250513 116553
38461 116553 -267089 -767183 -1129359 -1155675 -790970 -176145 369775 586219 539893 536462
38451 536462 740792 994226 1014699 697053 262252 173658 740380 1635958 2020443 1453335
38441 1453335 533580 226145 627274 897737 489742 -113317 -177771 209198 334993 -76932
38431 -76932 -518813 -457526 -28226 255631 243904 266876 525043 706411 450474 -18716
38421 -18716 -125371 214073 450373 268136 93305 354152 680538 436008 -230082 -571608
$$ packed form
38491A78358j7979k93602l45211K5760M74936N26916J32657l59810n79108l56023
38481f13106J82823O26463O11181K24010j49896l73295n98195p54560m98555J48206
38471a194924N94448M29422o942j46557M4548K00629J76121J10721M3047j33960
38461A16553l83642n00094l62176k6316L64705O14825N45920K16444m6326l431
38451E36462K04330K53434K0473l17646m34801q8594N66722Q95578L84485n67108
38441A453335r19755l07435M01129K70463m07995o03059o4454L86969J25795m11925
38431g6932m41881O1287M29300K83857j1727K2972K58167J81368k55937m69190
38421a8716j06655L39444K36300j82237j74831K60847L26386k44530o66090l41526
$$ plain form
38411 -571608 -384335 -198344 -279946 -241808 106543 308448 104693 19438 483970 955891
38401 955891 672958 -118172 -518296 -326569 -170190 -356208 -480843 -304012 -168131 -256924
38391 -256924 -195564 207056 503594 405415 409608 974993 1580908 1405065 621075 153728
38381 153728 266585 293519 -136418 -496949 -319395 11218 -65037 -358362 -272663 269661
38371 269661 798852 983580 867468 574829 207096 -83870 -271729 -545172 -897693 -905007
38361 -905007 -364384 142431 -39028 -548598 -400752 540666 1284596 1110585 477435 158263
38351 158263 153227 20947 -217779 -183395 99280 159544 -231052 -767085 -1025928 -890125
38341 -890125 -564504 -375178 -512022 -844719 -1084123 -1166253 -1250403 -1291100 -992880 -374550
$$ packed form
38411e71608J87273J85991q1602L8138L48351K01905k03755q5255M64532M71921
38401I55891k82933p91130m00124J91727J56379j86018j24635J76831J35881q8793
38391b56924O1360M02620K96538r8179M193N65385O05915j75843p83990m67347
38381A53728J12857K6934m29937l60531J77554L30613p6255k93325Q5699N42324
38371B69661N29191J84728j16112k92639l67733k90966j87859k73443l52521p314
38361i05007N40623N06815j81459n09570J47846R41418P43930j74011o33150l19172
38351A58263n036j32280k38726L4384K82675O0264l90596n36033k58843J35803
38341h90125L25621J89326j36844l32697k39404q2130q4150m0697K98220O18330
$$ plain form
38331 -374550 32884 -133046 -537588 -656258 -486284 -355094 -333531 -312491 -406093 -741606
38321 -741606 -1002028 -722631 -6613 518824 465384 37106 -336202 -380442 -77619 276561
38311 276561 235042 -242271 -580653 -332922 127245 180367 -24294 168945 765067 1026460
38301 1026460 621065 90680 -56235 -17329 -129328 -245567 -101415 178103 352465 456184
38291 456184 537061 382112 -85533 -457837 -322114 138626 410027 313876 60060 -168922
38281 -168922 -311335 -262942 -6883 190358 86245 -82448 170538 847972 1300663 950812
38271 950812 -14666 -842131 -999090 -603640 -114100 186103 270985 140818 -155279 -287292
38261 -287292 123996 839228 997292 191448 -783445 -811766 103097 889942 833570 299387
$$ packed form
38331c74550M07434j65930m04542j18670J69974J31190K1563K1040r3602l35513
38321g41606k60422K79397P16018N25437n3440m28278l73308m4240L02823L54180
38311B76561m1519m77313l38382K47731M60167N3122k04661J93239N96122K61393
38301A026460m05395n30385j46915L8906j11999j16239J44152K79518J74362J03719
38291D56184Q0877j54949m67645l72304J35723M60740K71401r6151k53816k28982
38281a68922j42413M8393K56059J97241j04113j68693K52986O77434M52691l49851
38271I50812r65478q27465j56959L95450M89540L00203Q4882j30167k96097j32013
38261b87292M11288P15232J58064q05844r74893k8321R14863P86845n6372n34183
$$ plain form
38251 299387 -32858 -13986 119165 200822 168642 24339 -54530 72807 132572 -228437
38241 -228437 -696050 -574201 14012 48408 -848743 -1636488 -1289230 -281772 220880 91587
38231 91587 125395 513755 561419 -45851 -695052 -813108 -571751 -314222 16945 472909
38221 472909 693416 396954 -98854 -288813 -148188 -3446 39511 128425 250295 194539
38211 194539 -43850 -140254 158373 682197 1010746 919319 565626 272543 212743 309344
38201 309344 355744 182014 -207026 -555192 -505038 -5680 476425 400735 -164269 -573785
38191 -573785 -428628 -84365 -134386 -611734 -985866 -845366 -330506 88067 94228 -196169
38181 -196169 -365900 -162654 172484 224269 30668 38152 327618 345700 -266821 -985343
$$ packed form
38251B99387l32245J8872J33151Q1657l2180j44303p8869J27337N9765l61009
38241b28437m67613J21849N88213L4396q97151p87745L47258J007458N02652j29293
38231I1587L3808L88360M7664o07270o49201j18056K41357K57529L31167M55964
38221D72909K20507k96462m95808j89959J40625J44742M2957Q8914J21870n5756
38211A94539k38389r6404K98627N23824L28549r1427l53693k93083n9800R6601
38201C09344M6400j73730l89040l48166N0154M99358M82105p5690n65004m09516
38191e73785J45157L44263n0021m77348l74132J40500N14860M18573O161k90397
38181a96169j69731K03246L35138N1785j93601P484K89466J8082o12521p18522
$$ plain form
38171 -985343 -1034951 -458133 -2080 -69617 -345196 -446623 -382584 -249227 19548 386518
38161 386518 604997 619673 729962 1085363 1311831 967164 187075 -436919 -529437 -211844
38151 -211844 216317 571696 719821 494257 -109375 -755558 -1002648 -776629 -484344 -543251
38141 -543251 -874399 -1014003 -700745 -164568 209474 319266 348859 479178 705294 839567
38131 839567 641859 91337 -436259 -487054 -108066 155427 -33965 -416714 -640026 -759794
38121 -759794 -894938 -763483 -104640 664593 839354 426614 163695 481417 1001887 1192622
38111 1192622 991562 606823 226349 169933 776907 1763113 2196911 1629304 840208 841830
38101 841830 1435940 1511191 695378 -86846 89579 957619 1532200 1293592 479034 -431758
$$ packed form
38171i85343m9608N76818M56053o7537k75579j01427O4039J33357K68775L66970
38161C86518K18479J4676J10289L55401K26468l44667p80089o23994r2518L17593
38151b11844M28161L55379J48125k25564o03632o46183k47090K26019K92285n8907
38141e43251l31148j39604L13258N36177L74042J09792K9593J30319K26116J34273
38131H39567j97708n50522n27596n0795L78988K63493j89392l82749k23312j19768
38121g59794j35144J31455O58843P69233J74761m12740k62919L17722N20470J90735
38111A192622k01060l84739l80474n6416O06974R86206M33798n67607p89096J622
38101H41830N94110P5251q15813p82224J76425Q68040N74581k38608q14558r10792
$$ plain form
38091 -431758 -1042513 -1101305 -738859 -521090 -800363 -1113281 -733762 216409 806519 550771
38081 550771 3261 -164923 -77276 -194481 -465829 -545292 -500340 -636106 -827927 -717038
38071 -717038 -450517 -500984 -769665 -646226 -86150 170633 -235375 -642566 -371417 240993
38061 240993 396227 -16422 -439284 -529201 -438192 -363559 -310581 -237993 -101418 134161
38051 134161 284664 2623 -666297 -1098540 -835897 -205007 197925 280005 235266 -35525
38041 -35525 -634891 -1108902 -932550 -378901 -136623 -178138 147021 888201 1269386 888587
38031 888587 302818 91672 97997 11054 3322 267928 505698 434283 328721 494062 631734
38020 631734 325786 -217816 -546991 -736036 -1074430 -1264087 -777530 63629 266872 -416476
$$ packed form
38091d31758o10755n8792L62446K17769k79273l12918L79519R50171N90110k55748
38081E50771n47510j68184Q7647j17205k71348p9463M4952j35766j91821J10889
38071g17038K66521n0467k68681J23439N60076K56783m06008m07191K71149O12410
38061B40993J55234m12649m22862q9917R1009P4633N2978P2588J36575K35579
38051A34161J50503k82041o68920m32243K62643O30890M02932Q2080m4739k70791
38041c5525n99366m74011J76352N53649K42278m1515L25159P41180L81185l80799
38031H88587n85769k11146O325q6943p732K64606K37770p1415j05562J65341J37672
38020F31734l05948n43602l29175j89045l38394j89657M86557Q41159K03243o83348
$$ plain form
38010 -416476 -1078596 -974544 -494591 -339406 -415543 -252110 -7793 -189698 -610729 -557147
38000 -557147 -11039 207046 -253558 -701453 -574423 -342453 -558643 -751667 -229745 521682
37990 521682 415148 -462156 -887687 -418560 -15642 -365047 -790846 -550183 -152309 -406060
37980 -406060 -949665 -858438 -208677 117895 -83833 -181123 55002 117051 -214913 -448310
37970 -448310 -206394 271281 667166 960525 1091291 892087 534613 442673 606341 571308
37960 571308 223863 -46770 -78895 -139220 -258878 -135205 90297 -215112 -1090443 -1657142
37950 -1657142 -1354141 -754622 -609626 -783768 -772293 -617656 -565373 -357809 293928 922041
37940 922041 831792 184660 -235321 -178296 -79078 -125624 29623 502035 783082 396672
$$ packed form
38010d16476o62120J04052M79953J55185p6137J63433K44317j81905m21031N3582
38000e57147N46108K18085m60604m47895J27030K31970k16190j93024N21922P51427
37990E21682j06534q77304m25531M69127M02918l49405m25799K40663L97874k53751
37980d06060n43605R1227O49761L26572k01728r7290K36125O2049l31964k33397
37970d48310K41916M77675L95885K93359J30766j99204l57474r1940J63668l5033
37960E71308l47445k70633l2125o0325j19658J23673K25502l05409q75331n66699
37950a657142L03001N99519J44996j74142J1475J54637N2283K07564O51737O28113
37940I22041r0249o47132m19981N7025R9218m6546J55247M72412K81047l86410
$$ plain form
37930 396672 -444762 -1055839 -941507 -204753 512732 561684 -22848 -490021 -278757 258127
37920 258127 385229 15557 -275246 -145632 147411 308352 406851 549906 560427 250764
37910 250764 -211254 -457753 -363553 -163612 -100849 -38234 422358 1309868 1941467 1581603
37900 1581603 452171 -370988 -250269 273114 325070 -153336 -537345 -450002 -50047 382280
37890 382280 631399 462379 -147170 -747115 -813828 -379214 74694 249489 217401 116935
37880 116935 48851 156620 430076 551401 300475 -55122 -157678 -115061 -198662 -249512
37870 -249512 29770 406517 415119 174791 177015 354365 203697 -138711 107527 1036557
37860 1036557 1629223 1141797 186114 -158802 254953 734600 788292 464442 -32414 -480294
$$ packed form
37930C96672q41434o11077J14332P36754P17485M8952n84532m67173K11264N36884
37920B58127J27102l69672k90803J29614K93043J60941R8499J43055J0521l09663
37910B50764m62018k46499R4200J99941O2763O2615M60592Q87510O31599l59864
37900A581603j129432q23159J20719N23383N1956m78406l84009Q7343L99955M32327
37890C82280K49119j69020o09549n99945o6713M34614M53908J74795l2088j00466
37880A16935o8084J07769K73456J21325k50926l55597j02556M2617q3601n0850
37870b49512K79282L76747Q602k40328K224J77350j50668l42408K46238R29030
37860A036557N92666m87426r55683l44916M13755M79647N3692l23850m96856m47880
$$ plain form
37850 -480294 -590628 -312561 -33250 -75075 -199648 -34215 235916 128026 -300893 -443897
37840 -443897 -29232 475588 534378 249887 115377 253488 238378 -271081 -955574 -1134214
37830 -1134214 -616544 23788 168917 -123861 -394342 -487644 -523494 -349336 327078 1225155
37820 1225155 1575352 1128828 502606 264590 273423 259246 405484 832706 1094228 857001
37810 857001 609621 920058 1351252 1004252 -33647 -715665 -540439 -134387 -124542 -264464
37800 -264464 -81661 283071 401262 255897 114381 29326 -83266 -120288 32860 195715
37790 195715 153277 66487 232248 540852 578939 266565 18952 171486 514274 563664
37780 563664 169069 -300859 -389717 -117475 -6138 -418582 -956648 -828833 80368 853610
$$ packed form
37850d80294j10334K78067K79311m1825j24573J65433K70131j07890m28919j43004
37840d43897M14665N04820N8790k84491j34510J38111j5110n09459o84493j78640
37830a134214N17670O40332J45129k92778k70481r3302l5850J74158O76414Q98077
37820A225155L50197m46524o26222k38016Q833j4177J46238M27222K61522k37227
37810H57001k47380L10437M31194l47000j037899o82018J75226M06052R845j39922
37800b64464J82803L64732J18191j45365j41516q5055j12592l7022J53148J62855
37790A95715m2438q6790J65761L08604L8087l12374k47613J52534L42788M9390
37780E63664l94595m69928q8858K72242J11337m12444n38066J27815R09201P73242
$$ plain form
37770 853610 560082 -590228 -1497898 -1469990 -839165 -295513 -81611 -42441 -69616 -139281
37760 -139281 -113226 146914 531337 805731 925471 990432 964034 737943 458092 440505
37750 440505 682493 801901 629480 517824 772151 1069037 863149 207551 -313967 -439211
37740 -439211 -502460 -757366 -945000 -813937 -630992 -762662 -1053757 -1086945 -861678 -714060
37730 -714060 -663132 -382328 140685 450047 298623 12008 -76794 -142222 -473733 -900379
37720 -900379 -1022274 -807057 -539859 -315519 -15702 258242 184347 -252983 -598795 -460535
37710 -460535 28240 411429 398661 63081 -270491 -264103 130789 561435 653022 507594
37700 507594 558630 904420 1151078 1041805 829295 768811 648800 220743 -243650 -329919
$$ packed form
37770H53610k93528j150310r07670K7908O30825N43652K13902L9170k7175o9665
37760a39281K6055K60140L84423K74394J19740O4961k6398k26091k79851j7587
37750D40505K41988J19408j72421j11656K54327K96886k05888o55598n21518j25244
37740d39211o3249k54906j87634J31063J82945j31670k91095l3188K25267J47618
37730g14060N0928K80804N23013L09362j51424k86615q8802o5428l31511m26646
37720i00379j21895K15217K67198K24340K99817K73944p3895m37330l45812J38260
37710d60535M88775L83189j2768l35580l33572O388L94892M30646R1587j45428
37700E07594N1036L45790K46658j09273k12510o0484j20011m28057m64393q6269
$$ plain form
37690 -329919 -175960 -212418 -351960 -104536 484037 716926 278853 -269831 -380221 -297599
37680 -297599 -461479 -632979 -284454 447777 912177 917518 862892 889368 613815 -92453
37670 -92453 -692654 -717179 -440005 -401141 -586470 -539205 -103240 373530 519357 292788
37660 292788 -108400 -418010 -416621 -133459 93339 1549 -192072 -64100 342447 471950
37650 471950 24972 -531818 -494245 203034 938021 1193873 1097514 1056025 1118645 1003846
37640 1003846 684316 543501 758137 862023 345825 -467278 -708002 -206526 147423
37631 147423 -356648 -1160093 -1170919 -292710 480051 438742 -58824 -325739 -235066 -56821
37621 -56821 104475 297232 450455 482856 485770 530144 515437 445901 563460 911103 1085416
$$ packed form
37690c29919J53959l6458j39542K47424N88573K32889m38073n48684j10390Q2622
37680b97599j63880j71500L48525P32231M64400N341n4626K6476k75553p06268
37670i2453o00201k4525K77174L8864j85329M7265M35965M76770J45827k26569
37660B92788m01188l09610J389K83162K26798r1790j93621J27972M06547J29503
37650D71950m46978n56790L7573O97279P34987K55852r6359m1489O2620j14799
37640A003846l19530j40815K14636J03886n16198q13103k40724N01476L53949
37631A47423n04071q03445j0826Q78209P72761m1309m97566k66915R0673J78245
37621e6821J61296J92757J53223L2401K914M4374j4707o9536J17559L47643J74313
$$ plain form
37610 1085416 807782 432859 408277 505102 200023 -342004 -401741 131732 479126 131929
37600 131929 -351281 -188659 430854 592760 -64098 -858101 -946934 -350452 135702 -35591
37590 -35591 -448617 -238524 703366 1407688 1010988 -46116 -552865 -126763 419608 395004
37580 395004 134650 218282 488101 459298 200911 97806 78568 -165667 -409762 -152546
37570 -152546 415109 539769 122080 -24463 548158 1141776 942914 256971 39620 536954
37560 536954 1100897 1237185 1145608 1120835 1027074 683415 352960 410434 701354 673430
37550 673430 175869 -245183 -46006 561911 850432 479975 -136776 -410338 -234298 60302
37540 60302 189023 165827 205962 525534 1101656 1512679 1237462 327041 -447549 -433177
$$ packed form
37610A085416k77634l74923k4582R6825l05079n42027n9737N33473L47394l47197
37600A31929m83210J62622O19513J61906o56858p94003q8833N96482M86154j71293
37590c5591m13026K10093R41890P04322l96700j057104n06749M26102N46371k4604
37580C95004k60354Q3632K69819k8803k58387j03105j9238k44235k44095K57216
37570a52546N67655J24660m17689j46543N72621N93618j98862o85943k17351M97334
37560E36954N63943J36288r1577k4773r3761l43659l30455N7474K90920k7924
37550F73430m97561m21052J99177O07917K88521l70457o16751k73562J76040K94600
37540F0302J28721k3196M0135L19572N76122M11023k75217r10421p74590J4372
$$ plain form
37530 -433177 91757 321019 11943 -308914 -239540 -69252 -236090 -645935 -870004 -748393
37520 -748393 -442150 -47179 476001 1011886 1240055 970846 370838 -216389 -570087 -667776
37510 -667776 -573761 -367450 -163089 -86204 -162594 -291807 -414776 -633123 -1001178 -1256787
37500 -1256787 -1035330 -408640 101176 205081 215325 460849 672943 404602 -152738 -330590
37490 -330590 57196 436740 266322 -318416 -803516 -892434 -644726 -303867 -124906 -155661
37480 -155661 -143965 104883 341352 207681 -102835 -29753 475576 830321 724416 541618
37470 541618 629366 766194 721073 734407 950377 932447 358883 -269463 -311203 3118
37460 3118 -6082 -331469 -407120 -198332 -248112 -629267 -770616 -509720 -433679 -821223 -1061529
$$ packed form
37530d33177N24934K29262l09076l20857O9374J70288j66838m09845k24069J21611
37520g48393L06243L94971N23180N35885K28169k69209o00008n87227l53698r7689
37510f67776R4015K06311K04361P6885p6390j29213j22969k18347l68055k55609
37500a256787K21457O26690N09816J03905J0244K45524K12094k68341n57340j77852
37490c30590L87786L79544j70418n84738m85100q8918K47708L40859J78961l0755
37480a55661J1696K48848K36469j33671l10516P3082N05329L54745j05905j82798
37470E41618Q7748J36828m5121J3334K15970j7930n73564o28346m1740L14321
37460C118r200l25387p5651K08788m9780l81155j41349K60896P6041l87544k40306
$$ plain form
37449 -1061529 -649287 -77747 -87195 -522936 -657420 -336670 -79647 -163352 -283894 -160461
37439 -160461 85233 267608 408860 536384 570013 534094 562122 592709 402202 60662
37429 60662 -26107 252397 397844 -49605 -807804 -1172447 -894187 -378124 -94352 -138365
37419 -138365 -338573 -453286 -246525 301248 799407 759824 174546 -477396 -818678 -852254
37409 -852254 -644197 -170843 377903 592955 394755 202825 304797 467822 461387 469179
37399 469179 564801 321117 -434770 -964052 -546545 255308 239679 -637292 -1158991 -670414
37389 -670414 62168 205974 91730 427506 1035555 1181139 717612 161179 -112594 -120445
37379 -120445 77447 410738 614988 485849 201033 26862 -82871 -224409 -183401 179140
$$ packed form
37449a061529M12242N71540r448m35741j34484L20750K57023q3705j20542J23433
37439a60461K45694J82375J41252J27524L3629l5919K8028L0587j90507l41540
37429F0662q6769K78504J45447m47449p58199l64643K78260N16063K83772m4013
37419a38365k00208j14713K06761N47773M98159l9583n85278o51942l41282l3576
37409h52254K08057M73354N48746K15052j98200j91930J01972J63025o435P792
37399D69179R5622k43684p55887n29282M17507Q01853j5629q76971n21699M88577
37389f70414P32582J43806j14244L35776O08049J45584m63527n56433k73773p851
37379a20445J97892L33291K04250j29139k84816j74171j09733j41538M1008L62541
$$ plain form
37369 179140 461021 219798 -248693 -237743 370350 1013921 1274844 1190116 815600 174927
37359 174927 -308660 -62014 736150 1149941 683149 -94407 -455558 -472104 -588981 -748135
37349 -748135 -576756 -165987 -6785 -231429 -483026 -547356 -605038 -776502 -889854 -861973
37339 -861973 -886375 -1011538 -914759 -412200 126103 272374 210973 415994 781381 670353
37329 670353 -64566 -680491 -472997 308768 846258 739621 220897 -357357 -790313 -931332
37319 -931332 -779342 -584846 -511246 -330259 148818 546823 356175 -210690 -444947 -189734
37309 -189734 5226 -160947 -346048 -301851 -272664 -349685 -129690 551808 1162666 1225474
37299 1225474 967711 735859 355737 -307974 -705668 -291917 503023 779107 426491
$$ packed form
37369A79140K81881k41223m68491J0950O08093O43571K60923q4728l74516o40673
37359A74927m83587K46646P98164M13791m66792p77556l61151j6546j16877j59154
37349g48135J71379M10769J59202k24644k51597o4330n7682j71464j13352K7881
37339h61973k4402j25163R6779N02559N38303J46271o1401K05021L65387j11028
37329F70353p34919o15925K07494P81765N37490j06637n18724n78254m32956j41019
37319i31332J51990J94496P3600J80987M79077L98005j90648n66865k34257K55213
37309a89734J94960j66173j85101M4197K9187p7021K19995O81498O10858O2808
37299A225474k57763k31852l80122o63711l97694M13751P94940K76084l52616
$$ plain form
37290 426491 133356 261923 438647 261575 -193265 -608741 -696359 -280395 428007 759304
37280 759304 306569 -387002 -406728 352948 1143063 1403875 1236177 876596 388664 -36350
37270 -36350 -112136 40987 -24158 -351925 -474559 -188759 119613 146471 121237 299003
37260 299003 496162 483572 423011 518930 568566 286093 -139705 -240191 45911 242042
37250 242042 -26480 -475174 -424698 359474 1237476 1326380 553711 -247021 -420436 -250612
37240 -250612 -319530 -541551 -401291 122886 532498 595997 532454 455458 253506 13512
37230 13512 -54670 -101665 -386833 -585107 -159547 527258 457519 -410438 -804859 -4001
37220 -4001 947603 746866 -228912 -570080 62238 649410 479358 -17900 -229041 -193783
$$ packed form
37290D26491k93135J28567J76724j77072m54840m15476q7618M15964P08402L31297
37280G59304m52735o93571j9726P59676P90115K60812j67698l59581m87932m25014
37270c6350p5786J53123o5145l27767j22634K85800L08372K6858k5234J77766
37260B99003J97159j2590o0561R5919M9636k82473m25798j00486K86102J96131
37250B42042k68522m48694N0476P84172Q78002Q8904p72669q00732j73415J69824
37240b50612o8918k22021J40260N24177M09612O3499o3543p6996k01952k39994
37230A3512o8182m6995k85168j98274M25560O86805o9739q67957l94421Q00858
37220d001R51604k00737r75778l41168O32318N87172j70052m97258k11141L5258
$$ plain form
37210 -193783 -168733 -115452 -8486 -54338 -221114 -87948 418769 657653 185506 -387390
37200 -387390 -148049 742280 1192436 716121 65701 78872 553234 736035 456656 181285
37190 181285 197091 336051 423653 469138 406610 118933 -241561 -380141 -323074 -311898 -248322
37179 -248322 198096 856502 1060863 604334 74786 -70731 -168016 -671105 -1360258 -1716776
37169 -1716776 -1643030 -1326424 -806447 -163836 274569 411997 626882 1049329 1135583 595522
37159 595522 160395 580782 1347262 1411502 836187 600318 912285 921304 227232 -460651
37149 -460651 -508699 -229510 -136300 -159252 -89869 -93977 -261629 -239353 166546 519231 398372
37138 398372 89034 96264 324918 317210 92839 152481 635859 980767 644314 -113240
$$ packed form
37210a93783K5050N3281J06966m5852j66776J33166N06717K38884m72147n72896
37200c87390K39341Q90329M50156m76315o50420J3171M74362J82801k79379k75371
37190A81285J5806J38960Q7602M5485o2528k87677l60494j38580N7067J1176O3576
37179b48322M46418O58406K04361m56529n29548j45517r7285n03089o89153l56518
37169a716776P3746L16606N19977O42611M38405J37428K14885M22447Q6254n40061
37159E95522m35127M20387P66480O4240n75315k35869L11967R019o94072o87883
37149d60651m8048K79189R3210k2952O9383m108j67652K2276M05899L52685j20859
37138C98372l09338P230K28654p708k24371N9642M83378L44908l36453p57554
$$ plain form
37128 -113240 -484752 -133277 357285 247025 -390878 -849359 -776043 -427277 13679 622726
37118 622726 1092633 794022 -101927 -459616 225884 946231 709948 74372 81774 472164
37108 472164 296846 -284424 -332993 88805 42747 -495045 -536013 153744 699906 731232
37098 731232 879281 1379482 1608139 1382152 1305143 1397207 837356 -381118 -1003444 -429107
37088 -429107 303171 227313 -193488 -285633 -405277 -926322 -1203649 -690136 -47141 -17551
37078 -17551 -165445 144396 483919 267225 -15175 261563 549664 118914 -438995 -155250
37068 -155250 532823 480824 -191053 -405150 -49350 21449 -265353 -66866 714267 1168113
37058 1168113 978884 849021 1007405 703251 -285090 -930142 -496942 244214 220987 -324553
$$ packed form
37128a13240l71512L51475M90562j10260o37903m58481P3316L48766M40956O09047
37118F22726M69907k98611q95949l57689O85500P20347k36283o35576P402L90390
37108D72164j75318n81270m8569M21798m6058n37792m0968O89757N46162L1326
37098G31232J48049N00201K28657k25987p7009R2064n59851j218474o22326N74337
37088d29107P32278p5858m20801r2145j19644n21045k77327N13513O42995K9590
37078a7551j47894L09841L39523k16694k82400K76738K88101m30750n57909K83745
37068a55250O88073n1999o71877k14097L55800P0799k86802J98487P81133M53846
37058A168113j89229j29863J58384l04154r88341o45052M33200P41156k3227n45540
$$ plain form
37048 -324553 -385208 155097 420067 -38124 -599779 -554078 -79205 159709 29687 -7520
37038 -7520 196289 131984 -475197 -960002 -538757 469604 1018361 798801 474277 459295
37028 459295 445588 316661 470774 841932 662368 -216214 -780813 -368577 241549 121487
37018 121487 -321370 -190116 339964 481395 295697 480229 1033009 1265983 964602 548436
37008 548436 244280 -7648 -27293 340451 629303 287920 -362418 -534542 -145026 241938
36998 241938 415309 596380 708076 454078 21910 -100347 100700 287958 442086 656044
36988 656044 596665 54890 -306740 216377 1054900 1001744 13707 -803481 -971337 -1140904
36978 -1140904 -1657924 -1889486 -1424719 -875905 -881849 -1127227 -980389 -514591 -286362 -450933
$$ packed form
37048c24553o0655N40305K64970m58191n61655M5701M74873K38914j30022l7207
37038g520K03809o4305o07181m84805M21245J008361N48757k19560l24524j4982
37028D59295j3707j28927J54113L71158j79564q78582n64599M12236O10126j20062
37018A21487m42857J31254N30080J41431j85698J84532N52780K32974l01381m16166
37008E48436l04156k51928j9645L67744K88852l41383o50338j72124L89516L86964
36998B41938J73371J81071J11696k53998m32168j22257K01047J87258J54128K13958
36988F56044n9379n41775l61630N23117Q38523n3156r88037q17188j67856j69567
36978a140904n17020k31562M64767N48814n944k45378J46838M65798K28229j64571
$$ plain form
36968 -450933 -600632 -361964 115088 271301 -212316 -846062 -740291 198721 958859 736388
36958 736388 20798 -274602 -220609 -507285 -1057551 -1085057 -440624 136983 228688 291429
36948 291429 769226 1364919 1488609 967793 148724 -400469 -330138 71758 125977 -302061
36938 -302061 -575793 -382802 -366357 -997345 -1567259 -1272720 -648868 -745845 -1386960 -1563307
36928 -1563307 -1202550 -1102965 -1270917 -856686 141808 601104 62404 -521248 -338481 117685
36918 117685 38877 -480591 -841029 -857378 -750907 -731654 -929597 -1296759 -1440028 -1051813
36908 -1051813 -506301 -411528 -626832 -472068 116121 475863 325417 142912 322996 726468
36898 726468 1160573 1544056 1549242 902885 110522 21591 557064 734090 125934 -549549
$$ packed form
36968d50933j49699K38668M77052J56213m83617o33746J05771R39012P60138k22471
36958G36388p15590k95400N3993k86676n50266k7506O44433N77607R1705O2741
36948B91429M77797N95693J23690n20816q19069n49193P0331M01896N4219m28038
36938c02061k73732J92991J6445o30988n69914K94539O23852r6977o41115j76347
36928a563307L60757R9585j67952M14231R98494M59296n38700n83652J82767M56166
36918A17685p8808n19468l60438j6349J06471J9253j97943l67162j43269L88215
36908a051813N45512R4773k15304J54764N88189L59742j50446j82505J80084M03472
36898G26468M34105L83483N186o46357p92363q8931N35473J77026o08156o75483
$$ plain form
36888 -549549 -531634 58445 637761 839347 572237 -3687 -437030 -429897 -289560 -416911
36878 -416911 -572727 -338942 -21262 -225833 -759140 -883606 -491898 -76520 258112 709913
36868 709913 923290 404912 -315053 -186710 684793 1112247 659069 159264 242420 545792
36858 545792 623055 502430 130580 -610367 -1130173 -539085 902650 1851402 1661060 1031464
36848 1031464 676097 485064 284574 290475 451261 352549 57529 77887 351697 285072
36838 285072 -89077 -117406 231584 347229 276585 704014 1475981 1574873 845113 303255
36828 303255 359681 198869 -577897 -1146438 -940253 -613633 -811628 -1134034 -1008472 -580164
36818 -580164 -165940 222471 399996 59104 -397966 -178880 503156 582803 -58377 -310750
$$ packed form
36888e49549J7915N90079N79316K01586k67110n75924m33343P133J40337j27351
36878d16911j55816K33785L17680k04571n33307j24466L91708M15378L34632M51801
36868G09913K13377n18378p19965J28343Q71503M27454m53178m99805Q3156L03372
36858E45792P7263j20625l71850p40947n19806N91088J441735R48752j90342o29596
36848A031464l55367j91033k00490N901J60786r8712k95020K0358K73810o6625
36838B85072l74149k8329L48990J15645p0644M27429P71967R8892p29760n41858
36828C03255N6426j60812p76766n68541K06185L26620j97995l22406J25562M28308
36818e80164M14224L88411J77525l40892m57070K19086O82036P9647o41180k52373
$$ plain form
36808 -310750 298300 875232 744681 360915 143880 -191447 -607397 -447569 250686 513761
36798 513761 69864 -149637 295839 607967 314807 100800 356714 371426 -212458 -546126
36788 -546126 -76177 393995 70190 -546747 -603835 -114273 469700 913264 886201 59276
36778 59276 -1011562 -1200979 -412370 267206 254948 36148 -132007 -602181 -1176702 -1102936
36768 -1102936 -495797 -232662 -292304 120314 756605 579378 -84913 181279 1274884
36759 1274884 1563628 766289 343087 641758 383286 -449789 -167921 1311882 1749099
36750 1749099 377223 -591218 274190 1298485 865519 105011 476150 1219355 1212632
36741 1212632 1039130 1314349 1220989 486530 483972 1639582 2233743 1551487 1524909 3224495
$$ packed form
36808c10750O09050N76932j30551l83766k17035l35327m15950J59828O98255K63075
36798E13761m43897k19501M45476L12128k93160k14007K55914J4712n83884l33668
36788e46126M69949M70172l23805o16937n7088M89562N83973M43564k7063q26925
36778E9276j070838j89417P88609O79576j2258k18800j68155m70174n74521P3766
36768a102936O07139K63135n9642M12618O36291j77227o64291K66192J093605
36759A274884K88744p97339m23202K98671k58472q33075K81868J479803M37217
36750A749099j371876r68441Q65408J024295m32966p60508L71139P43205o723
36741A212632j73502K75219r3360p34459k558J155610N94161o82256k6578J699586
$$ plain form
36731 3224495 4489453 3391460 1449716 916514 1306869 1141181 777244 950117 757308
36722 757308 -365559 -872476 234795 1248871 680691 -60335 596974 1494047 1241915
36713 1241915 1041761 2167224 3143592 2400158 1311439 1620828 2260124 1729101 1156359
36704 1156359 1915778 2702727 2105438 1531977 2426345 3241553 2421244 1602195 2479401
36695 2479401 3362483 2343594 939156 1023862 1260519 235020 -225291 1272718 2290010
36686 2290010 945176 -92031 1617608 3518970 2791659 1626242 2715230 3915640
36678 3915640 2869085 2255808 4522374 6318456 4603720 3029981 5235870 7450896
36670 7450896 5546964 3397693 5547698 8038980 6274156 5048952 9720755 14960489
$$ packed form
36731C224495J264958j097993j941744n33202L90355j65688l63937J72873j92809
36722G57308j122867n06917J107271J014076n68180p41026O57309Q97073k52132
36713A241915k00154J125463R76368p43434j088719L09389O39296n31023n72742
36704A156359P59419P86949n97289n73461Q94368Q15208q20309q19049Q77206
36695B479401Q83082j018889j404438Q4706K36657j025499m60311J498009J017292
36686B290010j344834j037207J709639J901362p27311j165417J088988J200410
36678C915640j046555o13277K266566J796082j714736j573739K205889K215026
36670G450896j903932k149271K150005K491282j764824j225204M671803N239734
$$ plain form
36662 14960489 14996007 16631024 26842934 36560959 35598738 34411865 47639168 65661265
36654 65661265 74320485 96791759 171604782 278736644 333164575 280970516 169363799
36647 169363799 87754421 64691183 61250570 46693863 32360612 32097743 34002869
36640 34002869 25403513 14879384 13238825 14370786 9583907 3915043 4685501 7411577
36632 7411577 5347806 1960236 2895356 4960828 3168117 613939 2039227 4574421
36624 4574421 3480294 949649 1274330 2746672 1769184 97701 1014448 2642023 1598133
36615 1598133 -524001 -336612 1165430 1131544 317035 883055 1774778 1092042 218591
36606 218591 1129588 2333594 1656042 346869 500950 1147482 680533 343463 1507439
$$ packed form
36662A4960489L5518J635017J0211910R718025r62221j186873J3227303J8022097
36654F5661265Q659220K2471274P4813023J07131862N4427931n2194059j11606717
36647A69363799q1609378k3063238l440613j4556707j4333251k62869J905126
36640C4002869q599356j0524129j640559J131961m786879n668864P70458K726076
36632G411577k063771l387570R35120K065472j792711k554178J425288K535194
36624D574421j094127k530645L24681J472342r77488j671483R16747J627575j043890
36615A598133k122134J87389J502042l3886q14509N66020Q91723o82736q73451
36606B18591R10997J204006o77552j309173J54081O46532m66949l37070J163976
$$ plain form
36597 1507439 2316234 915364 -686340 95874 1816505 1628587 181749 -79205 556044
36588 556044 186848 -765785 -535696 470489 570342 -43153 -129595 -31204 -563856 -725916
36578 -725916 597282 2066177 1857623 805101 811190 1552301 1566776 1259201 1942715 3024375
36568 3024375 2905357 1738975 819734 237188 -541880 -898073 -195782 468194 -53934
36559 -53934 -742363 -171519 791651 477381 -611022 -819306 -264185 -225260 -573915 -292765
36549 -292765 274387 104424 -333926 77543 818534 571431 -331228 -549005 -189213 -402919
36539 -402919 -1095446 -1219474 -872476 -1005925 -1467913 -1339300 -821068 -857639 -1249470 -988678
36529 -988678 -141427 324327 232581 134145 14538 -387315 -524404 137684 832400 557186
$$ packed form
36597A507439Q08795j400870j601704P82214J720631j87918j446838k60954O35249
36588E56044l69196r52633K30089J006185R9853o13495q6442R8391n32652j62060
36578g25916J323198J468895k08554j052522O089P41111J4475l07575O83514J081660
36568C024375j19018j166382r19241n82546p79068l56193P02291O63976n22128
36559e3934o88429N70844R63170l14270j088403k08284N55121L8925l48655K81150
36549b92765N67152j69963m38350M11469P40991k47103r02659k17777L59792k13706
36539d02919o92527j24028L46998j33449m61988J28613N18232l6571l91831K60792
36529i88678Q47251M65754r1746r8436j19607m01853j37089O62088O94716k75214
$$ plain form
36519 557186 -212426 -383145 -85576 -105335 -271067 -34138 149806 -321933 -794249 -483409
36509 -483409 -89428 -514769 -996840 -494960 92209 -652393 -1902371 -1704046 -243679
36500 -243679 522554 130348 -45324 427271 439159 -294462 -618601 -79139 379895 262045
36490 262045 191786 389186 255840 -165484 -26126 671630 863629 213792 -405771 -505938
36480 -505938 -551516 -690684 -426638 149217 251750 -178792 -341534 -85218 -138821 -610759
36470 -610759 -709826 -251301 -24322 -337921 -567711 -459381 -526756 -841666 -789336 -359456
36460 -359456 -315658 -722147 -685942 10591 405169 1860 -406110 -166981 201195 73658
36450 73658 -277461 -388679 -349223 -272534 63222 552965 645647 320119 251012 601586
$$ packed form
36519E57186p69612j70719K97569j9759j65732K36929J83944m71739m72316L10840
36509d83409L93981m25341m82071N01880N87169p44602j249978J98325J460367
36500b43679P66233l92206j75672M72595J1888p33621l24139N39462M59034j17850
36490B62045p0259J97400j33346m21324J39358O97756J91999o49837o19563j00167
36480e05938m5578j39168K64046N75855J02533m30542j62742K56316n3603m71938
36470f10759r9067M58525K26979l13599k29790J08330o7375l14910N2330M29880
36460c59456M3798m06489L6205O96533L94578m03309m07970K39129L68176j27537
36450G3658l51119j11218L9456P6689L35756M89743R2682l25528o9107L50574
$$ plain form
36440 601586 652689 91091 -359352 -141690 274088 329220 250216 349366 323664 -50344
36430 -50344 -288276 21191 454779 444459 151754 20239 -15258 -245253 -556551 -672856
36420 -672856 -663362 -705008 -666332 -391280 -118509 -193533 -542005 -731089 -438586 248864
36410 248864 834851 756245 26511 -582613 -419731 160357 350497 119899 96543 318686
36400 318686 97702 -688353 -1159084 -732401 -21757 130524 -171868 -305130 -189309 -238169
36390 -238169 -564511 -856279 -900618 -764821 -541434 -254612 47856 338658 655607 957723
36380 957723 1090685 1029076 972817 1057842 1138316 1003827 684089 411991 365941 520009
36370 520009 689369 706273 592018 507700 501572 434855 225497 -15683 -194427 -363570
$$ packed form
36440F01586N1103n61598m50443K17662M15778N5132p9004R9150k5702l74008
36430e0344k37932L09467M33588j0320k92705j31515l5497k29995l11298j16305
36420f72856R494m1646L8676K75052K72771p5024l48472j89084K92503O87450
36410B48864N85987p8606p29734o09124J62882N80088J90140k30598k3356K22143
36400C18686k20984p86055m70731M26683P10644J52281l02392j33262J15821m8860
36390b38169l26342k91768m4339J35797K23387K86822L02468K90802L16949L02116
36380I57723J32962o1609n6259Q5025Q0474j34489l19738k72098m6050J54068
36370E20009J69360J6904j14255q4318o128o6717k09358k41180j78744j69143
$$ plain form
36360 -363570 -517338 -505857 -314374 -157413 -120461 -10207 250220 432311 438726 528391
36350 528391 801356 865839 406848 -256842 -580444 -470406 -215559 -42148 -31662 -146234
36340 -146234 -100379 358056 835389 573710 -351900 -854107 -315391 529162 801053 753276
36330 753276 1013703 1310240 1000924 355698 218819 695776 1149844 1248416 1102653 642256
36320 642256 -200256 -888881 -793481 -158833 258771 316870 423904 615403 595357 476958
36310 476958 571095 650383 343565 23422 312031 910253 958236 396711 -91107 -332097
36300 -332097 -711252 -1068585 -789489 -63706 158620 -341767 -735619 -549021 -289432 -369139
36290 -369139 -438715 -176643 139631 194025 7609 -423489 -1075566 -1425065 -952947 -169462
$$ packed form
36360c63570j53768J1481J91483J56961L6952J10254K60427J82091O415Q9665
36350E28391K72965O4483m58991o63690l23602J10038K54847J73411J0486j14572
36340a46234M5855M58435M77333k61679r25610n02207N38716Q44553K71891m7777
36330G53276K60427K96537l09316o45226j36879M76957M54068R8572j45763m60397
36320F42256q42512o88625R5400O34648M17604N8099J07034J91499k0046j18399
36310D76958R4137P9288l06818l20143K88609N98222M7983n61525m87818k40990
36300c32097l79155l57333K79096P25783K22326n00387l93852J86598K59589p9707
36290c69139o9576K62072L16274N4394j86416m31098o52077l49499M72118P83485
$$ plain form
36280 -169462 -87518 -591051 -523299 392473 1036697 729811 276683 509445 968630 876311
36270 876311 446313 321655 471812 509894 492853 637464 774409 749748 836946 1145228
36260 1145228 1193003 697907 220191 350132 775564 839153 550263 351738 301747 190389
36250 190389 123384 303752 510359 440332 329570 597097 1057150 1117638 682901 292477
36240 292477 353173 692053 926773 929812 836437 797716 793345 638661 224662 -265438 -541482
36229 -541482 -586062 -613296 -672490 -599937 -367379 -131236 92453 439502 850607 1084943
36219 1084943 1101705 1041416 850273 389608 -102484 -223545 -119158 -346565 -888535 -985357
36209 -985357 -255469 621465 763370 184540 -380101 -428500 -94117 199351 200979 47507
$$ packed form
36280a69462Q1944n03533O7752R15772O44224l06886m53128K32762M59185r2319
36270H76311m29998j24658J50157L8082j7041J44611J36945k4661Q7198L08282
36260A145228M7775m95096m77716J29941M25432O3589k88890j98525m9991j11358
36250A90389o7005J80368K06607p0027j10762K67527M60053O0488m34737l90424
36240B92477O0696L38880K34720L039r3375l8721m371j54684m13999m90100k76044
36229e41482m4580k7234n9194P2553K32558K36143K23689L47049M11105K34336
36219A084943J6762o0289j91143m60665m92092j21061J04387k27407n41970r6822
36209i85357P29888Q76934J41905n78830n64641m8399L34383K93468J628j53472
$$ plain form
36199 47507 104815 478067 785099 685335 442723 515025 763169 668587 230884 -52387
36189 -52387 -90741 -318811 -800094 -990275 -631460 -174343 -28792 -50960 -64370 -238556
36179 -238556 -613810 -858299 -853048 -959134 -1360832 -1675862 -1546478 -1117258 -660002 -260509
36169 -260509 -100861 -418599 -914471 -890307 -311827 -9752 -415192 -859658 -666402 -186047
36159 -186047 -71694 -197097 -89218 108361 -26900 -281379 -108891 376096 543649 277247
36149 277247 75639 146126 148521 -54160 -91521 211112 402493 68969 -458526 -525995
36139 -525995 -119724 70048 -374600 -973119 -1009695 -561609 -364239 -688533 -961723 -723816
36129 -723816 -339941 -297559 -350902 -43059 337067 149649 -465692 -723028 -400267 -82006
$$ packed form
36199D7507N7308L73252L07032r9764k42612P2302K48144r4582m37703k83271
36189e2387l8354k28070m81283j90181L58815M57117J45551k2168j3410j74186
36179b38556l75254k44489N251j06086m01698l15030J29384M29220M57256L99493
36169b60509J59648l17738m95872K4164N78480L02075m05440m44466J93256M80355
36159a86047J14353j25403J07879J97579j35261k54479J72488M84987J67553k66402
36149B77247k01608P0487K395k02681l7361L02633J91381l33524n27495o7469
36139e25995M06271J89772m44648n98519l6576M48086J97370l24294k73190K37907
36129g23816L83875M2382n3343L07843L80126j87418o15341k57336L22761L18261
$$ plain form
36119 -82006 -150031 -333406 -377100 -386436 -341747 -15915 413942 380140 -207412 -748456 -816204
36108 -816204 -604769 -355516 -36796 204017 2647 -528448 -749227 -418837 -31473 12465
36098 12465 -102485 -170295 -292966 -391472 -140967 316765 362996 -96537 -427949 -382459
36088 -382459 -505322 -997171 -1129564 -443182 324561 281791 -329726 -674710 -604133 -611738
36078 -611738 -896436 -1168097 -1163053 -874430 -491185 -361501 -649086 -899789 -533194 116042
36068 116042 54140 -832365 -1432972 -1026402 -263436 22991 -3266 80779 2367 -503861
36058 -503861 -838214 -385771 386505 636275 418738 330651 370062 99434 -415954 -712099
36048 -712099 -699522 -609816 -481308 -327610 -417659 -780918 -911148 -556639 -218946 -241673
$$ packed form
36119h2006o8025j83375m3694r336M4689L25832M29857l3802n87552n41044o7748
36108h16204K11435K49253L18720K40813k01370n31095k20779L30390L87364M3938
36098A2465j14950o7810j22671r8506K50505M57732M6231m59533l31412M5490
36088c82459j22863m91849j32393O86382P67743m2770o11517l44984P0577p605
36078f11738k84698k71661N044K88623L83245J29684k87585k50703L66595O49236
36068A16042o1902q86505o00607M06570P62966K86427k6257Q4045p8412n06228
36058e03861l34353M52443P72276K49770k17537q8087L9411k70628n15388k96145
36048g12099J2577Q9706J28508J53698r0049l63259j30230L54509L37693k2727
$$ plain form
36038 -241673 -139693 392370 636605 37250 -545504 -16663 1102387 1363870 563197
36029 563197 -160843 -202618 -89435 -200808 -204291 15169 -107 -383885 -614401 -386253
36019 -386253 -47531 81846 146909 292955 341967 109263 -381116 -988434 -1373690 -1072142
36009 -1072142 -197659 258247 -425459 -1534063 -1752188 -946543 -173549 -43565 -123862
36000 -123862 -16891 24946 -172073 -265833 -59029 113458 -3715 -179121 -178390 -126956 -159040
35989 -159040 -188744 -213485 -381312 -605363 -562290 -213129 92455 145255 123121 222688 394126
35978 394126 498890 445820 205642 -39159 98203 725932 1377391 1540687 1265046 910733
35968 910733 632500 516598 802678 1419130 1711814 1274062 661320 598104 877793 821954
$$ packed form
36038b41673J01980N32063K44235n99355n82754N28841J119050K61483q00673
36029E63197p24040m1775J13183j11373l483K19460j5276l83778k30516K28148
36019c86253L38722J29377O5063J46046M9012k32704m90379o07318l85256L01548
36009a072142Q74483M55906o83706j108604k18125Q05645P72994J29984q0297
36000a23862J06971M1837j97019r3760K06804J72487j17173j75406P31N1434l2084
35989a59040k9704k4741j67827k24051M3073L49161L05584N2800k2134R9567J71438
35978C94126J04764n3070k40178k44801J37362O27729O51459J63296k75641l54313
35968I10733k78233j15902K86080O16452K92684m37752o12742o3216K79689n5839
$$ plain form
35958 821954 438029 238413 235073 61691 -156036 -29329 201931 18954 -303730 -55379
35948 -55379 571641 634256 -39226 -609044 -629022 -575129 -763465 -850779 -733601 -877620
35938 -877620 -1311796 -1262845 -325735 797207 1230106 920279 290765 -425306 -1068085 -1355907
35928 -1355907 -1217739 -890467 -499833 -40487 202094 -93557 -555712 -454804 126748
35919 126748 346498 -26406 -279704 -45312 158296 71608 259507 923060 1221089 589736
35909 589736 -197084 -228301 76497 -225528 -906554 -858306 167761 1185155 1353804 874858
35899 874858 371213 71702 -122767 -221981 -132522 77067 119064 -199458 -609829 -552194
35889 -552194 67506 548054 257697 -387126 -435574 212842 701119 529487 142243 20005
$$ packed form
35958H21954l83925j99616l340j73382k17727J26707K31260j82977l22684K48351
35948e5379O27020O2615o73482n69818j9978N3893j88336q7314J17178j44019
35938h77620m34176M8951R37110J122942M32899l09827o29514p16071o42779k87822
35928a355907J38168L27272L90634M59346K42581k95651m62155J00908N81552
35919A26748K19750l72904k53298K34392K03608q6688J87899O63553K98029o31353
35909E89736p86820l1217L04798l02025o81026M8248J026067J017394J68649m78946
35899H74858n03645k99511j94469r9214Q9459K09589M1997l18522m10371N7635
35889e52194O19700M80548k90357o44823m8448O48416M88277j71632l87244j22238
$$ plain form
35879 20005 52377 134907 513256 1055643 1016151 145048 -691314 -689825 -263118 -262290 -635198
35868 -635198 -732162 -515197 -510620 -758971 -717564 -216624 239515 244261 -10241 -137257 -25017
35857 -25017 223083 501798 751901 962645 1122542 1091157 700855 113434 -206853 -99501
35847 -99501 11178 -265370 -672941 -674041 -199430 349940 683586 824653 827903 637745
35837 637745 225716 -318999 -785448 -860083 -375864 321384 547438 61550 -568488 -636130
35827 -636130 -111438 461666 656995 469834 116107 -161633 -174249 89937 444750 694801
35817 694801 752294 577204 224945 -55587 -85147 -111484 -480576 -911047 -661709 360756
35807 360756 1238981 1174852 498679 92317 222881 485989 584352 554409 383506 -7984
$$ packed form
35879B0005L2372Q2530L78349N42387l9492q71103q36362J489M26707Q28l72908
35868f35198r6964K16965M577k48351M1407N00940M56139M746k54502j27016J12240
35857b5017K48100K78715K50103K10744J59897l1385l90302n87421l20287J07352
35847i9501J10679k76548m07571j100M74611N49370L33646J41067L250j90158
35837F37745m12029n44715m66449p4635M84219O97248K26054m85888o30038o7642
35827f36130N24692N73104J95329j87161l53727k77740j2616K64186L54813K50051
35817F94801N7493j75090l52259k80532k9560k6337l69092m30471K49338J022465
35807C60756Q78225o4129o76173m06362J30564K63108R8363k9943j70903l91490
$$ plain form
35797 -7984 -415976 -465760 -130522 217966 303347 179716 -29075 -298020 -550628 -634053
35787 -634053 -563572 -571018 -756545 -839231 -456334 294855 789988 494065 -401968 -1133034
35777 -1133034 -1176032 -722646 -276467 -62444 -36667 -187495 -463050 -576955 -285844 219796
35767 219796 547617 630723 672869 686085 490503 102609 -272453 -571711 -834754 -958854
35757 -958854 -881278 -824622 -927145 -885596 -501024 -252584 -601165 -1023464 -674464 158569
35747 158569 357771 -242273 -556007 -9896 564247 331554 -277769 -404122 -43718 245365
35737 245365 291101 267755 213280 172420 346171 613933 450720 -204444 -611567 -286100
35727 -286100 254247 382111 308408 430353 417688 -158160 -817185 -775752 -222828 -39431
$$ packed form
35797g984m07992m9784L35238L48488Q5381j23631k08791k68945k52608q3425
35787f34053P0481p446j85527q2686L82897P51189M95133k95923q96033p31066
35777a133034m2998M53386M46179K14023K5777j50828k75555j13905K91111N05640
35767B19796L27821Q3106M2146J3216j95582l87894l75062k99258k63043j24100
35757i58854P7576N6656j02523M1549L84572K48440l48581m22299L49000Q33033
35747A58569J99202o00044l13734N46111N74143k32693o09323j26353L60404K89083
35737B45365M5736k3346n4475m0860J73751K67762j63213o55164m07123L25467
35727b86100N40347J27864p3703J21945j2665n75848o59025M1433N52924J83397
$$ plain form
35717 -39431 -441458 -800210 -720478 -454540 -237154 29755 334120 432197 303823 238036
35707 238036 364205 486608 428709 220966 -29773 -179448 -60613 260057 392020 79302
35697 79302 -436648 -789714 -963426 -1066416 -946813 -468597 75306 292618 251978 274786
35687 274786 338309 143827 -323812 -727228 -827341 -681471 -443782 -224349 -85887 -7900
35677 -7900 54911 23258 -185153 -382649 -318111 -170675 -356077 -790863 -948985 -757455
35667 -757455 -710158 -883960 -689112 22049 496274 292785 72144 440302 849320 579991
35657 579991 97711 320504 1022232 1131255 404734 -262223 -172965 404690 847771 857186
35647 857186 496968 71491 -98270 -128831 -508380 -1222754 -1487205 -890402 -185437 -218119
$$ packed form
35717c9431m02027l58752P9732K65938K17386K66909L04365R8077j28374o5787
35707B38036J26169J22403n7899k07743k50739j49675J18835L20670J31963l12718
35697G9302n15950l53066j73712j02990J19603M78216N43903K17312m0640K2808
35687B74786O3523j94482m67639m03416j00113J45870K37689K19433J38462P7987
35677g900O2811l1653k08411j97496O4538J47436j85402m34786j58122J91530
35667g57455M7297j73802J94848P11161M74225k03489k20641L68158M09018k69329
35657E79991m82280K22793P01728J09023p26521o66957Q9258N77655M43081R415
35647H57186l60218m25477j69761l0561l79549p14374k64451N96803P04965l2682
$$ plain form
35637 -218119 -673948 -741209 -435523 -288766 -253024 -5531 98845 -446010 -1148860 -1094683
35627 -1094683 -429087 -93299 -296104 -457759 -461128 -647435 -716191 -56276 840810 794940
35617 794940 -93013 -416284 279903 771351 230372 -473033 -348701 150647 134115 -202072
35607 -202072 -109734 393141 709569 652731 464209 276913 177924 368919 750984 816730
35597 816730 397194 1931 16391 143858 59423 -14027 143851 243216 36227 -192586
35587 -192586 -180861 -177860 -401497 -561823 -400654 -156719 -42623 159619 530785 677159
35577 677159 460182 406496 822011 1138909 775615 55895 -368987 -437672 -370010 -44834
35567 -44834 584494 1010792 882824 687813 946003 1246263 957148 420610 446155 948698
$$ packed form
35637b18119m55829o7261L05686J46757L5742K47493J04376n44855p02850N4177
35627a094683O65596L35788k02805j61655l369j86307o8756O59915Q97086m5870
35617G94940q87953l23271O96187M91448n40979p03405J24332M99348j6532l36187
35607b02072R2338N02875L16428n6838j88522j87296r8989J90995L82065O5746
35597H16730m19536l95263J4460J27467q4435p3450J57878R9365k06989k28813
35587a92586J1725L001k23637j60326J61169K43935J14096K02242L71166J46374
35577F77159k16977n3686M15515L16898l63294p19720m24882o8685O7662L25176
35567d4834O29328M26298j27968j95011K58190L00260k89115n36538K5545N02543
$$ plain form
35557 948698 1111835 724153 370412 373596 476289 558337 774838 930082 586214 -61706
35547 -61706 -227855 324207 891262 839479 390030 126888 256723 635322 1066326 1288586
35537 1288586 1043468 433346 -47613 -40201 310320 594523 549630 207581 -160248 -257168
35527 -257168 -83745 75478 151284 466905 1085072 1380440 858272 87877 34749 607943
35517 607943 778410 201461 -264127 5546 386040 75399 -544631 -469816 388004 1078669
35507 1078669 938026 305950 -156918 -263558 -198689 -86084 14413 -69904 -464030 -951452
35497 -951452 -1080075 -637454 78902 545625 533585 264147 62285 4503 212 55467
35487 55467 223239 366989 278647 72209 137946 549983 822778 531906 -57495 -357079
$$ packed form
35557I48698J63137l87682l53741L184J02693Q2048K16501J55244l43868o47920
35547f1706j66149N52062N67055n1783m49449k63142J29835L78599M31004K22260
35537A288586k45118o10122m80959P412L50521K84203m4893l42049l67829r6920
35527b57168J73423J59223P5806L15621O18167K95368n22168p70395n3128N73194
35517F07943J70467n76949m65588K69673L80494l10641o20030P4815Q57820O90665
35507A078669j40643o32076m62868j06640O4869J12605J00497q4317l94126m87422
35497i51452j28623M42621P16356M66723j2040k69438k01862n7782m291N5255
35487E5467J67772J43750q8342k06438O5737M12037K72795k90872n89401k99584
$$ plain form
35477 -357079 -318405 -456984 -951093 -1197773 -582726 597591 1386821 1260917 627131 222640
35467 222640 323798 652151 819990 695672 439822 298710 313396 234510 -148369 -629288
35457 -629288 -780998 -557849 -392775 -557620 -755553 -604154 -233894 -50461 -106666 -124268
35447 -124268 -35790 -68927 -280309 -399565 -238303 41378 170444 64003 -185837 -404129
35437 -404129 -407751 -200652 -70971 -246398 -509791 -479457 -218727 -140579 -281328 -181610
35427 -181610 321598 678996 358239 -365331 -750393 -499660 46185 460201 596807 493971
35417 493971 269506 126661 202333 403735 589855 830487 1200082 1381383 896655 -134513
35407 -134513 -864975 -673243 -3026 169054 -385805 -890885 -696443 -160375 -28610 -330016
$$ packed form
35477c57079L8674j38579m94109k46680O15047J180317P89230j25904o33786m04491
35467B22640J01158L28353J67839j24318k55850j41112J4686p8886l82879m80919
35457f29288j51710K23149J65074j64845j97933J51399L70260J83433n6205j7602
35447a24268Q8478l3137k11382j19256J61262K79681J29066j06441k49840k18292
35437d04129l622K07099J29681j75427k63393L0334K60730P8148j40749R9718
35427a81610N03208L57398l20757p23570l85062K50733N45845M14016J36606j02836
35417D93971k24465j42845P5672K01402J86120K40632L69595J81301m84728j031168
35407a34513p30462J91732O70217J72080n54859n05080J94442N36068J31765l01406
$$ plain form
35397 -330016 -476074 -293635 -259987 -601777 -827612 -498442 66898 311184 262208 317845
35387 317845 488184 411404 1365 -415320 -563653 -427786 -68055 397616 716556 760093
35377 760093 744243 854120 855295 508724 129003 152062 320824 -6638 -765581 -1124094
35367 -1124094 -659626 30968 129776 -482240 -1297527 -1739331 -1492798 -697529 50462 250505
35357 250505 85269 64695 181477 16087 -365357 -381051 70722 363305 145317 -161420
35347 -161420 -205344 -280879 -585208 -622531 1860 739367 754938 84208 -489735 -473322
35337 -473322 -34062 466686 805909 859573 615348 192986 -308372 -825747 -1156391 -1129398
35327 -1129398 -1029517 -1356351 -2008389 -2275947 -1864493 -1278977 -894245 -399090 351134 701727
$$ packed form
35397c30016j46058J82439L3648l41790k25835L29170N65340K44286m8976N5637
35387C17845J70339p6780m10039m16685j48333J35867L59731M65671L18940M3537
35377G60093j5850J09877J175l46571l79721K3059J68762l27462p58943l58513
35367a124094M64468O90594R8808o12016q15287m41804K46533P95269P47991K00043
35357B50505j65236k0574J16782j65390l81444j5694M51773K92583k17988l06737
35347a61420m3924p5535l04329l7323O24391P37507J5571o70730n73943J6413
35337d73322M39260N00748L39223N3664k44225m22362n01358n17375l30644K6993
35327a129398R9881l26834o52038k67558M11454N85516L84732M95155P50224L50593
$$ plain form
35317 701727 142147 -716392 -906532 -416665 23907 95418 52139 38618 -2873 26254
35307 26254 150227 -3458 -616330 -1089450 -801073 -138644 73385 -113782 -7577 380962
35297 380962 353702 -86261 -28242 855899 1651610 1525345 855138 453153 355132 66811
35287 66811 -451367 -737371 -556487 -144526 181919 277513 107830 -248801 -553641 -572597
35277 -572597 -312594 -14263 76070 -81681 -287037 -298717 -102092 119449 299900 543719
35267 543719 768821 645956 147749 -200970 -5840 380019 381090 49064 -160355 -207394
35257 -207394 -407856 -694632 -651049 -281793 -70077 -174989 -202834 76110 369168 409728
35247 409728 343616 367777 437972 495119 543191 397248 -149346 -791437 -895615 -384519
$$ packed form
35317G01727n59580q58539j90140M89867M40572P1511m3279j3521m1491K9127
35307B6254J23973j53685o12872m73120K88377O62429K12029j87167J06205L88539
35297C80962k7260m39963N8019Q84141P95711j26265o70207m01985r8021k88321
35287F6811n18178k86004J80884M11961L26445R5594j69683l56631l04840j8956
35277e72597K60003K98331R0333j57751k05356j1680J96625K21541J80451K43819
35267E43719K25102j22865m98207l48719J95130L85859J071l32026k09419m7039
35257b07394k00462k86776M3583L69256K11716j04912k7845K78944K93058M0560
35247D09728o6112K4161P0195N7147M8072j45943n46594o42091j04178N11096
$$ plain form
35237 -384519 129658 301067 516259 1078602 1546767 1391332 853208 588756 735222 828271
35227 828271 493165 -171911 -786645 -981461 -643973 -101625 108121 -167413 -533344 -613278
35217 -613278 -478540 -335411 -144871 168319 444166 525009 478376 310022 -191020 -959151
35207 -959151 -1362748 -903694 21693 562233 466135 213979 211831 370418 475204 474769 315349
35196 315349 -82959 -551456 -724774 -502648 -167071 54202 216338 330675 171924 -356788
35186 -356788 -952147 -1266509 -1306779 -1220669 -942063 -420997 -15158 -158088 -650976 -784031
35176 -784031 -301602 210660 154598 -278804 -510095 -428192 -344084 -311364 -99443 194600
35166 194600 131561 -337388 -690736 -633643 -553195 -823903 -1124122 -936960 -421324 -239932
$$ packed form
35237c84519N14177J71409K15192N62343M68165j55435n38124k64452J46466R3049
35227H28271l35106o65076o14734j94816L37488N42348K09746k75534l65931p9934
35217f13278J34738J43129J90540L13190K75847Q0843m6633j68354n01042p68131
35207i59151m03597M59054R25387N40540r6098k52156k148J58587J04786m35j59420
35196C15349l98308m68497j73318K22126L35577K21273J62136J14337j58751n28712
35186c56788n95359l14362m0270Q6110K78606N21066M05839j42930m92888j33055
35176g84031M82429N12262n6062m33402k31291Q1903Q4108L2720K11921K94043
35166A94600o3039m68949l53348N7093Q0448k70708l00219J87162N15636J81392
$$ plain form
35156 -239932 -645227 -1202383 -1385200 -1079625 -529122 -108689 -131677 -589163 -1082043 -1218109
35146 -1218109 -1008998 -699833 -390310 -96591 5499 -231568 -600657 -742873 -595601
35137 -595601 -346595 -87738 150199 192957 -37292 -226001 -59329 219784 149995 -160624
35127 -160624 -161311 253024 594316 588541 501360 484368 217064 -478582 -1171211 -1351603 -1064358
35116 -1064358 -660293 -244939 243930 642658 649434 250638 -195381 -292993 67142 633008
35106 633008 985230 924700 676400 551676 464230 67068 -617909 -1050417 -797238 -74228
35096 -74228 477467 419491 -121905 -584226 -486816 34627 337464 112863 -139268 135410
35086 135410 580509 339391 -652691 -1487745 -1504538 -1024136 -646035 -454835 -298289 -303220
$$ packed form
35156b39932m05295n57156j82817L05575N50503M20433k2988m57486m92880j36066
35146a218109K09111L09165L09523K93719J02090k37067l69089j42216J47272
35137e95601K49006K58857K37937M2758k30249j88709J66672K79113o9789l10619
35127a60624o87M14335L41292n775q7181j6992k67304o95646o92629j80392K87245
35116a064358M04065M15354M88869L98728O776l98796m46019r7612L60135N65866
35106F33008L52222o0530k48300j24724q7446l97162o84977m32508K53179P23010
35096g4228N51695n7976n41396m62321R7410N21443L02837k24601k52131K74678
35086A35410M45099k41118r92082q35054j6793M80402L78101J91200J56546m931
$$ plain form
35076 -303220 -602617 -881657 -693169 -95932 371211 304650 -166915 -559076 -544886 -337885
35066 -337885 -445667 -906810 -1086799 -612025 -111579 -321210 -748143 -251426 1062134
35057 1062134 1714457 985766 -1761 -23349 457454 232945 -665466 -1112147 -659107 -21444
35047 -21444 176708 177791 431410 869092 1100806 912051 403459 -103169 -284859 -146946
35037 -146946 -13283 -6485 167247 624734 890859 552115 -14007 -148095 99730 127137
35027 127137 -224061 -502909 -455446 -352950 -426442 -528290 -510735 -496446 -601032 -706752
35017 -706752 -630781 -297187 247849 763063 869465 488212 82526 101067 339256 293334
35007 293334 -549 -27651 348765 663957 568717 268089 100086 90836 83843 -11415 -205912
$$ packed form
35076c03220k99397k79040J88488N97237M67143o6561m71565l92161J4190K07001
35066c37885j07782m61143j79989M74774N00446k09631m26933M96717J313560
35057A062134O52323p28691r87527k1588M80803k24509q98411m46681M53040O37663
35047b1444J98152J083K53619M37682K31714j88755n08592n06628j81690J37913
35037a46946J33663O798J73732M57487K66125l38744n66122j34088K47825K7407
35027A27137l51198k78848M7463J02496p3492j01848J7555J4289j04586j05720
35017g06752P5971L33594N45036N15214J06402l81253m05686J8541K38189m5922
35007B93334k93883k7102L76416L15192r5240l00628j68003r250o993r5258j94497
$$ plain form
34996 -205912 -404105 -392200 -140806 -20722 -317607 -648977 -405816 258383 510747 15029
34986 15029 -613862 -760208 -603662 -613734 -776357 -777305 -576962 -355938 -170827 -64718
34976 -64718 -251910 -769321 -1170463 -1025507 -579114 -448987 -755001 -1033751 -1023112 -1008117
34966 -1008117 -1206613 -1284074 -862394 -229918 -66177 -508535 -947468 -878603 -554325 -491590
34956 -491590 -644209 -529464 -54677 317129 307602 224307 380838 539286 288569 -307810
34946 -307810 -802650 -900770 -598834 -21264 548954 717734 454298 306494 707707 1260049
34936 1260049 1202211 456587 -310212 -577492 -377889 104860 712786 1060163 766964 112928
34926 112928 -134841 248797 662716 646024 495944 564020 557685 87172 -551301 -747967
$$ packed form
34996b05912j98193J1905K51394J20084k96885l31370K43161O64199K52364m95718
34986A5029o28891j46346J56546j0072j62623r48K00343K21024J85111J06109
34976f4718j87192n17411m01142J44956M46393J30127l06014k78750J0639J4995
34966a008117j98496p7461M21680O32476J63741m42358m38933O8865L24278O2735
34956d91590j52619J14745M74787L71806r527q3295J56531J58448k50717n96379
34946c07810m94840r8120L01936N77570N70218J68780k63436j47804M01213N52342
34936A260049n7838p45624p66799k67280J99603M82749O07926L47377k93199o54036
34926A12928k47769L83638M13919j6692j50080O8076o335m70513o38473j96666
$$ plain form
34916 -747967 -448354 -86944 133372 335251 473348 316290 -66845 -272116 -91773 261234
34906 261234 495291 497371 238692 -244628 -708735 -820030 -514319 -59321 260978 352931
34896 352931 256170 114934 161345 462484 722822 627479 328107 226553 313671 196870
34886 196870 -151039 -225447 199004 643713 697247 692176 1060380 1457108 1268856 721439
34876 721439 610585 985904 1043391 504137 132535 431652 730914 305970 -328929 -201825
34866 -201825 527562 832311 455806 167231 327133 301850 -331468 -940266 -782987 -133544
34856 -133544 166634 -153393 -657480 -898052 -777227 -434822 -146371 -151041 -342790 -367754
34846 -367754 -167038 -51626 -105453 -35213 165201 29371 -534721 -874122 -590257 -267500
$$ packed form
34916g47967K99613L61410K20316K01879J38097j57058l83135k05271J80343L53007
34906B61234K34057K080k58679m83320m64107j11295L05711M54998L20299R1953
34896C52931r6761j41236M6411L01139K60338r5343k99372j01554Q7118j16801
34886A96870l47909p4408M24451M44709N3534n071L68204L96728j88252n47417
34876G21439j10854L75319N7487n39254l71602K99117K99262m24944o34899J27104
34866b01825P29387L04749l76505k88575J59902k5283o33318o08798J57279O49443
34856a33544L00178l20027n04087k40572J20825L42405K88451m670j91749k4964
34846c67754K00716J15412n3827P0240K00414j35830n64092l39401K83865L22757
$$ plain form
34836 -267500 -533557 -977877 -830546 -262422 -80946 -410359 -615380 -413653 -169272 -97386
34826 -97386 -3245 143817 130994 53586 240201 575275 581521 222774 -57775 -132893 -313622
34815 -313622 -625587 -693809 -439674 -187466 -16883 248438 379272 -69087 -799984 -940036
34805 -940036 -373968 26669 -206761 -497385 -349328 -111775 -105348 22664 423684 478362
34795 478362 -114424 -542514 -80278 646879 575185 -205860 -772758 -817005 -767883 -795991
34785 -795991 -676321 -461029 -418650 -429968 -189994 155055 259850 231524 337414 367042
34775 367042 48337 -227574 42825 500049 438271 34597 18574 304783 127788 -481880
34765 -481880 -591917 75586 669914 625414 415611 444114 291965 -292618 -653278 -274278
$$ packed form
34836b67500k66057m44320J47331N68124J81476l29413k05021K01727K44381P1886
34826i7386R4141J47062j2823p7408J86615L35074O246l58747k80549p5118j80729
34815c13622l11965o8222K54135K52208J70583K65321J30834m48359p30897j40052
34805i40036N66068M00637k33430k90624J48057K37553O427J28012M01020N4678
34795D78362n92786m28090M62236P27157p1694p81045n66898m4247M9122k8108
34785g95991J19670K15292M2379j1318K39974L45049J04795k8326J05890K9628
34775C67042l18705k75911K70399M57224o1778m03674j6023K86209j76995o09668
34765d81880j10037O67503N94328m4500k09803K8503j52149n84583l60660L79000
$$ plain form
34755 -274278 231344 37759 -617319 -929035 -789421 -670961 -614646 -242298 385682 750382
34745 750382 699703 615872 723722 808848 686769 454036 196007 -115549 -343426 -202415
34735 -202415 308536 797630 933576 777225 566970 385724 163583 -117284 -331663 -311561
34725 -311561 -42475 245360 294090 170673 236494 657648 1120934 1201436 866244 432324
34715 432324 154292 55482 75578 184395 375838 658018 989152 1186154 1069670 767555
34705 767555 624337 680097 549589 46443 -415719 -417678 -237175 -452058 -1007602 -1257886
34695 -1257886 -929054 -458545 -234795 -51547 375933 789167 708338 140197 -434851 -672023
34685 -672023 -624271 -465483 -286434 -191080 -309695 -601777 -810008 -706962 -298371 244647
$$ packed form
34755b74278N05622j93585o55078l11716J39614J18460N6315L72348O27980L64700
34745G50382n0679q3831J07850Q5126j22079k32733k58029l11556k27877J41011
34735b02415N10951M89094J35946j56351k10255j81246k22141k80867k14379K0102
34725c11561K69086K87835M8730j23417O5821M21154M63286Q0502l35192m33920
34715D32324k78032r8810K0096J08817J91443K82180L31134J97002j16484l02115
34705G67555j43218N5760j30508n03146m62162j959J80503k14883n55544k50284
34695a257886L28832M70509K23750J83248M27480M13234q0829n68141n75048k37172
34685f72023M7752J58788J79049R5354j18615k92082k08231J03046M08591N43018
$$ plain form
34675 244647 734644 1015078 1001930 775988 555559 493460 547112 593505 587668 524945 325930
34664 325930 -98247 -653841 -1039121 -976864 -477815 119888 392911 197239 -171343 -269731
34654 -269731 -17362 207339 83316 -200127 -222236 52728 245794 137213 -66235 -126043
34644 -126043 -106831 -133945 -97961 139745 438122 541588 432541 283929 164214 10388
34634 10388 -200927 -463521 -815255 -1186813 -1297672 -952961 -349549 159331 499681 807760
34624 807760 1035667 956222 532628 -1743 -411648 -578349 -451486 -157834 -24076 -167034
34614 -167034 -226225 107773 516677 536608 404037 694818 1211826 1126506 357942 -153224
34604 -153224 81676 309327 -166117 -776072 -651505 -96693 -41345 -466282 -528780 -78807
$$ packed form
34675B44647M89997K80434j3148k25942k20429o2099N3652M6393n837o2723j99015
34664C25930m24177n55594l85280O2257M99049N97703K73023j95672l68582r8388
34654b69731K52369K24701j24023k83443k2109K74964J93066j08581k03448n9808
34644a26043J9212k7114L5984K37706K98377J03466j09047j48612j19715j53826
34634A0388k11315k62594l51734l71558j10859L44711O03412N08880L40350L08079
34624H07760K27907p9445m23594n34371m09905j66701J26863K93652J33758j42958
34614a67034n9191L33998M08904J9931j32571K90781N17008q5320p68564n11166
34604a53224K34900K27651m75444o09955J24567N54812N5348m24937o2498M49973
$$ plain form
34594 -78807 125905 -181344 -266810 350904 1052362 1048680 497159 140903 297823 685092
34584 685092 903022 718358 191624 -183430 141035 939363 1221578 485626 -483460 -596240
34574 -596240 128225 748915 734806 414099 196678 55916 -124989 -280379 -401358 -575105
34564 -575105 -644053 -289071 381908 795330 682479 435219 420579 410257 89926 -279776
34554 -279776 -238542 112543 290856 217579 248724 485299 651759 712849 999337 1522789
34544 1522789 1737531 1322807 725499 493651 447853 32680 -744013 -1273972 -1177700 -688399
34534 -688399 -203851 113661 234325 154649 22109 65958 282385 415095 308943 59977
34524 59977 -190312 -340415 -229655 195508 600308 556821 198744 133856 550758 887421
$$ packed form
34594g8807K04712l07249q5466O17714P01458l682n51521l56256J56920L87269
34584F85092K17930j84664n26734l75054L24465P98328K82215p35952r69086j12780
34574e96240P24465O20690j4109l20707k17421j40762j80905j55390j20979j73747
34564e75105o8948L54982O70979M13422j12851k47260j4640j0322l20331l69702
34554b79776M1234L51085J78313p3277L1145K36575J66460O1090K86488N23452
34544A522789K14742m14724n97308k31848m5798m15173p76693n29959R6272M89301
34534f88399M84548L17512J20664p9676j32540M3849K16427J32710j06152k48966
34524E9977k50289j50103J10760M25163M04800m3487l58077o4888M16902L36663
$$ plain form
34514 887421 640898 45667 -389165 -573675 -639350 -460698 64241 538186 488655 137047
34504 137047 152497 670192 1110656 1026057 621939 325403 269749 350574 431273 352524 32913
34493 32913 -340302 -474446 -345442 -138460 111626 426849 506123 -16031 -867967 -1278043
34483 -1278043 -995634 -611890 -610961 -699821 -475379 -173186 -167530 -178986 297701 1018844 1199265
34472 1199265 665377 112058 82654 292964 225358 -88144 -237664 -81197 159889 299005
34462 299005 333021 225860 -145744 -716226 -1096515 -926100 -338961 110598 73206 -200536
34452 -200536 -251821 -55556 12709 -211898 -479053 -587774 -639145 -639982 -298102 419906 907506
34441 907506 634260 26505 11968 721470 1285715 1073395 520510 380651 643628 715915
$$ packed form
34514H87421k46523n95231m34832j84510o5675J78652N24939M73945m9531l51608
34504A37047J5450N17695M40464q4599m04118k96536n5654Q0825Q0699p8749l19611
34493C2913l73215j34144J29004K06982K50086L15223P9274n22154q51936m10076
34483a278043K82409L83744R29q8860K24442L02193N656j1456M76687P21143J80421
34472A199265n33888n53319k9404K10310o7606l13502j49520J56467K41086J39116
34462B99005L4016j07161l71604n70482l80289J70415N87139M49559l7392k73742
34452b00536n1285J96265O8265k24607k67155j08721n1371q37L41880P18008M87600
34441I07506k73246o07755j4537P09502N64245k12320n52885j39859K62977P2287
$$ plain form
34431 715915 401424 133662 270121 645668 937827 1092435 1189942 1177062 1001937 852675
34421 852675 966411 1236058 1268572 892371 407656 224442 384677 562067 452220 55906
34411 55906 -365516 -521711 -326118 23739 231017 196178 63860 -12329 10182 181268
34401 181268 524026 790150 599196 47556 -202681 175044 544672 136547 -764923 -1158659
34391 -1158659 -731051 -148918 72198 147728 266558 117158 -404823 -779665 -701143 -660384
34381 -660384 -1072232 -1442650 -1148209 -523612 -347373 -646008 -862752 -882613 -983129 -1033978
34371 -1033978 -734892 -472431 -848662 -1396301 -969522 381444 1157654 521070 -472836
34362 -472836 -479142 267769 624636 346061 130478 258558 277821 -21671 -250752 -174810
$$ packed form
34431G15915l14491k67762J36459L75547K92159J54608R7507j2880j75125j49262
34421H52675J13736K69647L2514l76201m84715j83214J60235J77390j09847l96314
34411E5906m21422j56195J95593L49857K07278l4839j32318p6189K2511J71086
34401A81268L42758K66124j90954n51640k50237L77725L69628m08125r01470l93736
34391a158659M27608N82133K21116P5530J18830j49400n21981l74842P8522M0759
34381f60384m11848l70418K94441O24597J76239k98635k16744j9861j00516n0849
34371a033978K99086K62461l76231n47639M26779J350966P76210o36584r93906
34362d72836o306P46911L56867k78575k15583J28080J9263k99492k29081P5942
$$ plain form
34352 -174810 -90233 -217928 -283883 -146 407954 449055 -38171 -721733 -1125672 -1067512
34342 -1067512 -798259 -702162 -832352 -846996 -460961 197571 766285 990654 790773 254996
34332 254996 -257448 -297598 126091 438746 233963 -147539 -148708 140702 147433 -275275
34322 -275275 -634484 -538982 -192917 -10479 -91207 -241928 -269515 -124390 62691 46734
34312 46734 -222061 -379696 -45286 554850 752350 345162 -69029 85097 571723 746951
34302 746951 486390 248465 316937 461951 422919 312539 346239 468834 490010 394178
34292 394178 287940 195258 130863 227693 522918 737151 580586 207124 27967 129868
34282 129868 274013 430332 776525 1081073 740314 -239510 -911796 -574591 204193 393055
$$ packed form
34352a74810Q4577j27695o5955K83737M08100M1101m87226o83562m03939N8160
34342a067512K69253R6097j30190j4644L86035O58532N68714K24369j99881n35777
34332B54996n12444m0150M23689L12655k04783l81502j169K89410O731m22708
34322b75275l59209R5502L46065J82438q0728j50721k7587J45125J87081j5957
34312D6734k68795j57635L34410O00136J97500m07188m14191J54126M86626J75228
34302G46951k60561k37925O8472J45014l9032j10380L3700J22595K1176r5832
34292C94178j06238r2682o4395R6830K95225K14233j56565l73462j79157J01901
34282A29868J44145J56319L46193L04548l40759r79824o72286L37205P78784J88862
$$ plain form
34272 393055 -61453 -361145 -165251 94026 143108 228622 413151 331426 -67944 -247624
34262 -247624 94587 520049 524392 190341 -170982 -512113 -828222 -938618 -843976 -819720
34252 -819720 -828030 -395261 531939 1211502 1096284 629739 470933 488968 237296 -70097
34242 -70097 91065 542971 605288 155412 -292662 -473468 -585060 -662816 -473996 -88195
34232 -88195 97020 -19527 -156134 -228228 -457903 -844979 -1049409 -873937 -432357 133607
34222 133607 650882 743923 231548 -390978 -476464 -160349 -115596 -454618 -654042 -584358
34212 -584358 -740267 -1259580 -1565857 -1314774 -929476 -811578 -743304 -521179 -493083 -906737
34202 -906737 -1293648 -1097930 -480850 44673 373289 653397 754421 491888 122365 33013
$$ packed form
34272C93055m54508k99692J95894K59277M9082Q5514J84529q1725l99370j79680
34262b47624L42211M25462M343l34051l61323l41131l16109j10396R4642K4256
34252h19720q310M32769R27200O79563j15218m66545j58806J8035k51672l07393
34242g0097J61162M51906O2317m49876m48074j80806j11592p7756J88820L85801
34232h8195J85215j16547j36607p2094k29675l87076k04430J75472M41580N65964
34222A33607N17275R3041n12375o22526q5486L16115M4753l39022j99424O9684
34212e84358j55909n19313l06277K51083L85298J17898O8274K22125K8096m13654
34202i06737l86911J95718O17080N25523L28616K80108J01024k62533l69523q9352
$$ plain form
34192 33013 104483 -95071 -593309 -960430 -911627 -571002 -181144 118147 258010 257165 239662
34181 239662 264182 232084 87047 -77989 -234560 -475812 -706114 -608791 -161757 164921
34171 164921 48681 -169895 5899 479691 749879 651263 476290 473986 615999 781745
34161 781745 847186 678498 325832 91265 119390 120396 -137589 -283893 197235 1065808
34151 1065808 1461898 1030913 396534 289723 628582 799430 568100 282656 235573 248093
34141 248093 64484 -134478 31669 474989 639200 304954 -31031 93775 375647 285814
34131 285814 25109 196412 652778 571110 -173782 -626481 -158677 565208 637020 221787
34121 221787 82667 345834 581530 718421 979617 1149588 820031 271092 208806 603066
$$ packed form
34192C3013P1470j99554m98238l67121M8803L40625L89858K99291J39863q45j7503
34181B39662K4520l2098j45037j65036j56571k41252k30302R7323M47034L26678
34171A64921j16240k18576J75794M73792K70188r8616j74973k304J42013J65746
34161G81745O5441j68688l52666k34567K8125J006k57985j46304M81128Q68573
34151A065808L96090m30985o34379j06811L38859J70848k31330k85444m7083J2520
34141B48093j83609j98962J66147M43320J64211l34246l35985J24806K81872q9833
34131B85814k60705J71303M56366q1668p44892m52699M67804P23885P1812m15233
34121B21787j39120K63167K35696J36891K61196J69971l29557n48939o2286L94260
$$ plain form
34111 603066 674128 170093 -236137 -118324 -2844 -405585 -888141 -743815 -132891 184406
34101 184406 -25884 -301606 -338228 -367961 -606388 -840829 -766898 -384738 118376 583879
34091 583879 800627 525198 -112764 -464862 -40370 760204 1039483 571007 96423 280159
34081 280159 859214 1175431 1085364 822411 360701 -361783 -830823 -433036 471047 839060
34071 839060 454601 218334 624192 941360 522348 5396 304757 1074591 1240661 674634
34061 674634 257588 428319 707125 704422 639173 646641 417653 -136732 -547270 -496794 -329732
34050 -329732 -473448 -785567 -853056 -609608 -303028 -82618 75026 176780 181985 81865
34040 81865 -105464 -333423 -479066 -405222 -83610 413169 947957 1253888 1048455 425855
$$ packed form
34111F03066P1062n04035m06230J17813J15480m02741m82556J44326O10924L17297
34101A84406k10290k75722l6622k9733k38427k34441P3931L82160N03114M65503
34091E83879K16748k75429o37962l52098M24492Q00574K79279m68476m74584J83736
34081B80159N79055L16217r0067k62953m61710p22484m69040L97787R04083L68013
34071H39060l84459k36267M05858L17168m19012n16952K99361P69834J66070n66027
34061F74634m17046J70731K78806k703o5249P468k28988n54385m10538N0476J67062
34050c29732j43716l12119o7489K43448L06580K20410J57644J01754N205j00120
34040H1865j87329k27959j45643P3844L21612M96779N34788L05931k05433o22600
$$ plain form
34030 425855 -97405 -216314 -263735 -636852 -1073996 -1007780 -443004 84821 312344 429328
34020 429328 533809 527614 547734 862154 1264078 1190072 566897 -44008 -278629 -350700
34010 -350700 -438422 -318552 116370 527182 625924 556709 526750 487403 392800 333138 228406
33999 228406 -138581 -621669 -765265 -522444 -349312 -423455 -434888 -356864 -624743 -1191428
33989 -1191428 -1265862 -553282 60002 -212665 -821881 -794948 -274114 -132394 -465140 -545497
33979 -545497 -121703 259817 251025 137568 165516 192621 155102 214238 285723 29053 -527119
33968 -527119 -882524 -740112 -320114 78700 347801 349219 -35688 -542907 -736436 -677917
33958 -677917 -839695 -1243697 -1295970 -682836 151803 674098 842185 757042 344434 -240975
$$ packed form
34030D25855n23260j18909m7421l73117m37144O6216N64776N27825K27523J16984
34020D29328J04481o195K0120L14420M01924p4006o23175o10905k34621p2071
34010c50700q7722J19870M34922M10812R8742o9215k9959l9347r4603n9662j04732
33999B28406l66987m83088j43596K42821J73132p4143j1433P8024k67879n66685
33989a191428p4434P12580O13284k72667o09216K6933N20834J41720l32746q0357
33979e45497M23794L81520q792j13457K7948K7105l7519N9136P1485k56670n56172
33968e27119l55405J42412M19998L98814K69101J418l84907n07219j93529N8519
33958f77917j61778m04002n2273O13134Q34639N22295J68087q5143m12608n85409
$$ plain form
33948 -240975 -484781 -255737 -136390 -475341 -655063 -13249 941889 1107165 369314 -282079
33938 -282079 -221835 111845 174532 132431 296591 405496 50761 -591801 -1011742 -1086938
33928 -1086938 -1069101 -1054701 -956199 -851909 -871974 -825111 -440754 52775 123991 -243157
33918 -243157 -475922 -293206 -90964 -188925 -255448 89715 563814 654968 441474 391325
33908 391325 557506 590091 442262 419425 509318 312735 -195924 -431887 -8834 691762
33898 691762 1077847 1058432 845159 439465 -193589 -687491 -572764 2505 326228 23978
33888 23978 -457646 -498509 -181104 -159825 -688287 -1178236 -983709 -349314 -102465 -456363
33878 -456363 -716251 -383687 68318 1310 -340451 -281100 168383 471083 597940 939632
$$ packed form
33948b40975k43806K29044J19347l38951j79722O41814R55138J65276p37851o51393
33938b82079O0244L33680O2687m2101J64160J08905l54735o42562m19941p5196
33928a086938J7837J4400R8502J04290k0065M6863L84357M93529P1216l67148
33918b43157k32765J82716K02242r7961o6523L45163M74099R1154k13494n0149
33908C91325J66181L2585j47829k2837Q9893j96583n08659k35963M23053P00596
33898F91762L86085j9415k13273m05694o33054m93902J14727N75269L23723l02250
33888B3978m81624m0863L17405K1279n28462m89949J94527O34395K46849l53898
33878d56363k59888L32564M52005o7008l41761N9351M49483L02700J26857L41692
$$ plain form
33868 939632 1271896 914797 89911 -54613 764977 1286916 553514 -578823 -779084
33859 -779084 -257517 -203642 -746141 -868507 -236269 233477 -129493 -790708 -989882 -818638
33849 -818638 -797884 -1005272 -1153881 -1125843 -972895 -660192 -164949 354696 726982 947610
33839 947610 1064723 1062424 934738 697047 329111 -78534 -216941 69464 397331 259191
33829 259191 -230270 -497617 -403782 -390078 -653198 -818624 -657794 -494226 -539271 -412367
33819 -412367 183057 774440 688594 8028 -585232 -718689 -579730 -423134 -350264 -506100
33809 -506100 -983488 -1478933 -1462465 -810754 14064 499608 566467 468844 436609 495521
33799 495521 503462 331035 86133 81043 441770 873752 1026394 972287 1041753 1256043 1272559
$$ packed form
33868I39632L32264l57099q24886j44524Q19590N21939p33402j132337k00261
33859g79084N21567N3875n42499j22366O32238M69746l62970o61215j99174J71244
33849h18638K0754k07388j48609K8038J52948L12703M95243N19645L72286K20628
33839I47610J17113k299j27686k37691l67936m07645j38407K86405L27867j38140
33829B59191m89461k67347R3835J3704k63120j65426J60830J63568m5045J26904
33819d12367N95424N91383q5846o80566n93260j33457J38959J56596P2870j55836
33809e06100m77388m95445J6468O51711Q24818M85544O6859r7623l2235N8912
33799D95521P941j72427k44902n090L60727M31982J52642n4107O9466K14290J6516
$$ plain form
33788 1272559 923629 475097 234817 183607 144723 72967 -25613 -276331 -795043 -1429658
33778 -1429658 -1821385 -1719463 -1175416 -505969 -109352 -159650 -380200 -303232 98549 276824
33768 276824 -129627 -640930 -500576 219276 662933 424214 77376 139559 155091 -510780
33758 -510780 -1402119 -1418760 -477770 198800 -266200 -1250883 -1604156 -1135063 -506192 -108698
33748 -108698 185800 359367 127272 -439000 -789512 -587545 -84133 339136 576855 589393
33738 589393 228285 -445732 -998663 -1081424 -820894 -498848 -99576 480646 964504 874272
33728 874272 197391 -481688 -639298 -363177 -90433 24098 227749 663358 980579 666022
33718 666022 -253838 -1053775 -1025103 -282953 334473 206211 -408044 -762566 -552626 -222910
$$ packed form
33788A272559l48930m48532k40280n1210l8884p1756r8580k50718n18712o34615
33778a429658l91727J01922N44047O69447L96617n0298k20550P6968M01781J78275
33768B76824m06451n11303J40354P19852M43657k38719l46838O2183J5532o65871
33758e10780q91339j6641R40990O76570m65000r84683l53273M69093O28871L97494
33748a08698K94498J73567k32095n66272l50512K01967N03412M23269K37719J2538
33738E89393l61108o74017n52931q2761K60530L22046L99272N80222M83858r0232
33728H74272o76881o79079j57610K76121K72744J14531K03651M35609L17221l14557
33718F66022r19860p99937K8672P42150O17426j28262o14255l54522K09940L29716
$$ plain form
33708 -222910 -316434 -729813 -846629 -382142 187882 228209 -211251 -470329 -168983 334978
33698 334978 506428 327527 168094 178247 144193 -118431 -518350 -847550 -968342 -817896
33688 -817896 -415130 71782 377827 331087 -6968 -352434 -371622 14466 472137 582225
33678 582225 357136 179440 183799 96677 -140497 -93776 414771 747202 258392 -641785
33668 -641785 -960346 -509764 -53594 -75788 -230541 -188472 -193659 -387417 -327916 229995
$$ packed form
33708b22910r3524m13379j16816M64487N70024M0327m39460k59078L01346N03961
33698C34978J71450j78901j59433J0153l4054k62624l99919l29200j20792J50446
33688h17896M02766M86912L06045m6740l38055l45466j9188L86088M57671J10088
33678E82225k25089j77696M359q7122k37174M6721N08547L32431m88810r00177
33668f41785l18561M50582M56170k2194j54753M2069n187j93758N9501N57911
$$ [...]
##END NTUPLES=NMR SPECTRUM
##END=
