##TITLE=31Pdec_49-2021
 CDCl3, 24 sc
 5.07.2021
##JCAMPDX= 6.0         $$ Bruker NMR JCAMP-DX V2.0
##DATA TYPE= NMR SPECTRUM
##DATA CLASS= NTUPLES
##ORIGIN= UXNMR, Bruker Analytische Messtechnik GmbH
##OWNER= root
$$ XWIN-NMR		Version 3.5
$$ Mon Jul  5 10:35:49 2021 Russian Standard Time (UT+4h)  she@DPX200
##.OBSERVE FREQUENCY= 81.013821
##.OBSERVE NUCLEUS= ^31P
##.ACQUISITION MODE= SIMULTANEOUS
##.ACQUISITION SCHEME= undefined
##.AVERAGES= 24
##.DIGITISER RES= 16
##SPECTROMETER/DATA SYSTEM= spect
##.PULSE SEQUENCE= zgpg30
##.SOLVENT NAME= CDCl3
##.SHIFT REFERENCE= (INTERNAL, CDCl3, 0, 248.564)
##AUDIT TRAIL= $$ (NUMBER, WHEN, WHO, WHERE, WHAT)
$$ ##TITLE= Audit trail, XWIN-NMR		Version 3.5
$$ ##JCAMPDX= 5.01
$$ ##ORIGIN= Bruker BioSpin GmbH
$$ ##OWNER= she
$$ F:/spectra/data/she/nmr/P31/1/pdata/1/auditp.txt
$$ ##AUDIT TRAIL=  $$ (NUMBER, WHEN, WHO, WHERE, WHAT)
(   1,<2021-07-05 10:34:49.73 +0400>,<she>,<DPX200>,
      <created by zg, POWCHK disabled, PULCHK disabled
       configuration hash MD5:
       00 E9 B6 7A A2 85 ED C7 34 08 36 98 17 FE 4E 26
       data hash MD5: 32K
       F3 C8 5F 21 BC 20 80 27 2E B2 E3 92 66 D9 CE B9>)
(   2,<2021-07-05 10:34:52.18 +0400>,<she>,<DPX200>,
      <Start of raw data processing
       efp BC_mod = 2 LB = 1 FT_mod = 6 PKNL = 1 PHC0 = -7068.408 PHC1 = -789.7141 SI = 64K 
       data hash MD5: 64K
       EA 2C A0 73 8C 88 89 B7 2E 25 67 BD 9F 9E 7E A3>)
(   3,<2021-07-05 10:35:14.84 +0400>,<she>,<DPX200>,
      <pk PHC0 = 222.6638 PHC1 = -228.4 
       data hash MD5: 64K
       C7 AF 28 13 49 D1 5F 42 EE 31 26 C6 1B 03 69 E2>)
(   4,<2021-07-05 10:35:17.84 +0400>,<she>,<DPX200>,
      <abs ABSG = 5 
       data hash MD5: 64K
       39 27 AA A7 D6 74 CF B1 34 14 6A 3B 2F 32 6C 19>)
$$ ##END=
$$ 
$$ hash MD5
$$ 2F A2 22 C6 DD 71 BB DC 2E 9F 0C 8C 0B AA 55 F1
##$RELAX= 
##$RELAX= 
##$RELAX= 
##$RELAX= 
##$RELAX= 
##$RELAX= 
##$RELAX= 
##$RELAX= 
$$ Bruker specific parameters
$$ --------------------------
##$DU= <F:/spectra>
##$EXPNO= 1
##$NAME= <P31>
##$PROCNO= 1
##$TYPE= <nmr>
##$USER= <she>
##$AMP= (0..31)
100 100 100 100 100 100 100 100 100 100 100 100 100 100 100 100 100 100 
100 100 100 100 100 100 100 100 100 100 100 100 100 100 
##$AQSEQ= 0
##$AQ_mod= 1
##$AUNM= <au_zg>
##$AUTOPOS= <>
##$BF1= 81.014009
##$BF2= 200.13
##$BF3= 200.13
##$BF4= 200.13
##$BF5= 200.13
##$BF6= 200.13
##$BF7= 200.13
##$BF8= 200.13
##$BYTORDA= 1
##$CFDGTYP= 0
##$CFRGTYP= 5
##$CHEMSTR= <none>
##$CNST= (0..31)
1 1 145 1 1 1 1 1 1 1 1 1 1 1 1 1 1 1 1 1 1 1 1 1 1 1 1 1 1 1 1 1 
##$CPDPRG= <waltz16>
##$CPDPRG1= <>
##$CPDPRG2= <waltz16>
##$CPDPRG3= <>
##$CPDPRG4= <mlev>
##$CPDPRG5= <mlev>
##$CPDPRG6= <mlev>
##$CPDPRG7= <mlev>
##$CPDPRG8= <mlev>
##$CPDPRGB= <>
##$CPDPRGT= <>
##$D= (0..31)
0 1 0 0 0 0 0 0 0 0 0 0.03 2e-05 3e-06 0 0 0 0 0 0 0 0 0 0 0 0 0 0 0 0 
0 0 
##$DATE= 1625466889
##$DBL= (0..7)
120 120 120 11 120 120 24 19 
##$DBP= (0..7)
150 150 150 150 150 150 150 150 
##$DBP07= 0
##$DBPNAM0= <>
##$DBPNAM1= <>
##$DBPNAM2= <>
$$ [...]
##$SUBNAM3= <"">
##$SUBNAM4= <"">
##$SUBNAM5= <"">
##$SUBNAM6= <"">
##$SUBNAM7= <"">
##$SUBNAM8= <"">
##$SUBNAM9= <"">
##$SW= 501.771253377433
##$SWIBOX= (0..15)
0 1 3 0 0 0 0 0 0 0 0 0 0 0 0 0 
##$SW_h= 40650.406504065
##$TD= 32768
##$TD0= 1
##$TE= 0
##$TE2= 300
##$TE3= 300
##$TEG= 300
##$TL= (0..7)
0 120 53 12 22 120 120 120 
##$TP= (0..7)
150 150 150 150 150 150 150 150 
##$TP07= 0
##$TPNAME0= <>
##$TPNAME1= <>
##$TPNAME2= <>
##$TPNAME3= <>
##$TPNAME4= <>
##$TPNAME5= <>
##$TPNAME6= <>
##$TPNAME7= <>
##$TPOAL= (0..7)
0.5 0.5 0.5 0.5 0.5 0.5 0.5 0.5 
##$TPOFFS= (0..7)
0 0 0 0 0 0 0 0 
##$TUNHIN= 0
##$TUNHOUT= 0
##$TUNXOUT= 0
##$USERA1= <user>
##$USERA2= <user>
##$USERA3= <user>
##$USERA4= <user>
##$USERA5= <user>
##$V9= 5
##$VALIST= <valist>
##$VCLIST= <CCCCCCCCCCCCCCC>
##$VD= 0
##$VDLIST= <DDDDDDDDDDDDDDD>
##$VPLIST= <PPPPPPPPPPPPPPP>
##$VTLIST= <TTTTTTTTTTTTTTT>
##$WBST= 1024
##$WBSW= 4
##$XGAIN= (0..3)
0 0 0 0 
##$XL= 0
##$YL= 0
##$YMAX_a= 4556
##$YMIN_a= -4724
##$ZGOPTNS= <>
##$ZL1= 120
##$ZL2= 120
##$ZL3= 120
##$ZL4= 120
##$ABSF1= 248.5645
##$ABSF2= -253.2056
##$ABSG= 5
##$ABSL= 3
##$ALPHA= 0
##$AQORDER= 0
##$ASSFAC= 0
##$ASSFACI= 0
##$ASSFACX= 0
##$ASSWID= 0
##$AUNMP= <proc_1d>
##$AZFE= 0.1
##$AZFW= 0.5
##$BCFW= 0
##$BC_mod= 2
##$BYTORDP= 0
##$COROFFS= 0
##$CY= -3
##$DATMOD= 1
##$DC= 0
##$DFILT= <>
##$DTYPP= 0
##$F1P= 0
##$F2P= 0
##$FCOR= 1
##$FTSIZE= 65536
##$FT_mod= 6
##$GAMMA= 0
##$GB= 0
##$INTBC= 1
##$INTSCL= 5.30512e-09
##$ISEN= 30
##$LB= 1
##$LEV0= 0
##$LPBIN= 0
##$MAXI= 10000
##$MC2= 0
##$MEAN= 0
##$ME_mod= 0
##$MI= 50
##$NCOEF= 0
##$NC_proc= -5
##$NLEV= 6
##$NOISF1= 182.463
##$NOISF2= 159.3651
##$NSP= 0
##$NTH_PI= 0
##$NZP= 0
##$OFFSET= 248.5645
##$PC= 4
##$PHC0= -6845.745
##$PHC1= -1018.114
##$PH_mod= 1
##$PKNL= yes
##$PPARMOD= 0
##$PSCAL= 0
##$PSIGN= 0
##$REVERSE= no
##$SF= 81.014009
##$SI= 65536
##$SIGF1= 159.3651
##$SIGF2= -187.1042
##$SINO= 113.3802
##$SIOLD= 16384
##$SREGLST= <1H.CDCl3>
##$SSB= 0
##$STSI= 65536
##$STSR= 0
##$SW_p= 40650.406504065
##$SYMM= 0
##$S_DEV= 0
##$TDeff= 32768
##$TDoff= 0
##$TI= <>
##$TILT= no
##$TM1= 0
##$TM2= 0
##$TOPLEV= 0
##$USERP1= <user>
##$USERP2= <user>
##$USERP3= <user>
##$USERP4= <user>
##$USERP5= <user>
##$WDW= 1
##$XDIM= 65536
##$YMAX_p= 515067806
##$YMIN_p= -7404345
$$ End of Bruker specific parameters
$$ ---------------------------------
##NTUPLES= NMR SPECTRUM
##VAR_NAME=  FREQUENCY,     SPECTRUM/REAL,   SPECTRUM/IMAG
##SYMBOL=    X,             R,               I
##VAR_TYPE=  INDEPENDENT,   DEPENDENT,       DEPENDENT
##VAR_FORM=  AFFN,          ASDF,            ASDF
##VAR_DIM=   65536,         65536,           65536
##UNITS=     HZ,            ARBITRARY UNITS, ARBITRARY UNITS
##FACTOR=    0.620285442955139, 1,           1
##FIRST=     20137.2065510759, 0,            0
##LAST=      -20513.1999529892, 0,           0
##MIN=       -20513.1999529892, -7404345,    0
##MAX=       20137.2065510759, 515067806,    0
$$ Real data points
##PAGE= N=1
##DATA TABLE= (X++(R..R)), XYDATA
$$ [...]
37191g7264m33724l95213k8069K39327K43591K53575M13620M52442J88210m1649
37181H14846J44538M69665K72925m72578r24446m70930L08901L37626m39553r13930
37171h72936l64159N45910P77668L25322p4226j78196l01892m05253j23098L14187
37161c56673K17707l45000m92406K7950L92431J39949m0843L62100O46755J38310
37151F90280m60792j47380O36250O43083j93067p32864m34235P4851K46157K61896
37141E84179K69277K7412l99956n07496j97918L0950j0760P5304L94592M42411
37131G07995K9070k84423j30046K8847k56715n86872l54760K61212N79273L62555
37121C56136o7534m08767n58825m09783N3430N25073O22990L34593k4942k27486
$$ y = [-77264, -510988, -906201, -934270, -694943, -451352, -197777, 215843, 668285, 856495, 814846, 959384, 1429049, 1701974, 1229396, 304950, -165980, 142921, 480547, 40994, -872936, -1237095, -691185, 86483, 411805, 337579, 159383, -142509, -547762, -670860, -356673, -138966, -483966, -976372, -948422, -555991, -416042, -456885, -94785, 551970, 690280, 229488, 82108, 718358, 1361441, 1168374, 435510, 1275, 76126, 322283, 584179, 853456, 880868, 480912, -26584, -224502, -193552, -204312, -129008, 265584, 707995, 737065, 452642, 322596, 351443, 94728, -492144, -846904, -585692, -6419, 356136, 288602, -120165, -678990, -1088773, -1035343, -510270, 112720, 447313, 422371, 194885]
37111A94885k88171k73516j62467P0735L14905L28403K240l48667k03287M55917
37101I0977R24609O09643j66430o24788n58411l72247l06303k56658k35363l11371
37091a206342j83080M23812R88235P10359j59910n02330k2281L08021j13220n55907
37081c12643k74324K52735K56782k7193K35J01222k42481o22379k72550M76010
37071f64586N58487r0569l75187K46765R77210R31001K63805l57301o54439o70531
37061A64655m25805r7189m9989k88372l11226J18962N13272L82908J6406K3432
37051D7054L96927N79622L24718l1933j58116j40509k04416l37598l60014k00004
37041h4269K9465J57408J00851o5187j67640j03071O9422K26279L02583K68927
$$ y = [194885, -93286, -366802, -529269, -458534, -143629, 184774, 187014, -161653, -364940, 90977, 1015586, 1625229, 1458799, 834011, 275600, -96647, -402950, -659608, -894971, -1206342, -1389422, -965610, 22625, 732984, 573074, 70744, 48463, 356484, 243264, -312643, -586967, -334232, -77450, -104643, -104408, -3186, -245667, -868046, -1140596, -664586, -106099, -196668, -571855, -325090, 652120, 1583121, 1846926, 1489625, 835186, 164655, -261150, -358339, -408328, -696700, -1007926, -888964, -375692, 7216, 23622, 47054, 443981, 1023603, 1348321, 1316388, 1158272, 1017763, 813347, 475749, 115735, -84269, -54804, 102604, 203455, 138268, -29372, -132443, -63021, 163258, 465841, 734768]
37031G34768R7040j32365j89715M3554L14315K23148k47442o46066n95171k23041
37021f20975R2071K05761K03388R0092j65556l45127j49942K66590L43421j05680
37011a85957n12250k70047M32290Q60664O43415N8358m55791o63079m70337L9116
37001e23618M49625L11371k49807n66839k67506K28137K94633n9275k64952p955
36991f56186L65869L45921n3288l10830j03065K34691J68004k28188l17855J30516
36981d24411M88250J60324m31515l69609L92300Q82451M65713k91615m62449Q134
36971D17573L88706K25638j75932l09694j14025P8996L9266j04868j04693M1487
36961C82454R9562l2393j71157j62810j23188j70361j58932J4785P4515k30546
$$ y = [734768, 831808, 699443, 509728, 553282, 867597, 1090745, 843303, 197237, -397934, -620975, -528904, -323143, -119755, -29663, -195219, -540346, -690288, -423698, -80277, -185957, -698207, -968254, -535964, 324700, 968115, 1026473, 570682, -92397, -562734, -523618, -73993, 237378, -12429, -579268, -846774, -618637, -324004, -383279, -648231, -656186, -290317, 55604, 2316, -308514, -411579, -176888, -8884, -237072, -554927, -424411, 63839, 224163, -207352, -576961, -184661, 697790, 1163503, 871888, 409439, 417573, 806279, 1031917, 855985, 546291, 432266, 511262, 550528, 445660, 340967, 382454, 482016, 449623, 278466, 115656, -7532, -177893, -336825, -322040, -247525, -478071]
36951d78071n36079k38373N26272Q58425K49777p18688j121710p71966k35308
36942b465721j3065m9351J6732L31775O11703M59568p6089m35930k29479K35679
36932a614178M20312L11608K50128K18706n0943l64191k27899K06565J94453l68096
36922a023535o07800j4893O67479N35739j23508l43426Q4002M76346L60359k4005
36912a3242k74509k91477j50916O0566K36754L33663M02645L82158Q8745l77371
36902C97016n57993k73077L7472k0492j89991q1937J25767R2077K1459K59923
36892a89776N03305K35359k42976j45461M62511O21324m3664p18998o56474k16905
36882c91755j22210l18069k46020J69566M75062M28135K26118P7265j6804q2737
$$ y = [-478071, -1014150, -1252523, -726251, 132174, 381951, -336737, -1458447, -2230413, -2465721, -2478786, -2528137, -2511405, -2179630, -1567927, -1108359, -1184448, -1620378, -1849857, -1614178, -1193866, -882258, -632130, -413424, -464367, -828558, -1056457, -849892, -655439, -1023535, -1631335, -1646228, -978749, -443010, -566518, -909944, -825942, -349596, 10763, -13242, -287751, -579228, -730144, -669578, -432824, -99161, 303484, 685642, 774387, 397016, -160977, -434054, -396582, -417074, -607065, -689002, -563235, -471158, -449699, -189776, 313529, 548888, 305912, 160451, 622962, 1244286, 1200622, 481624, -174850, -391755, -513965, -832034, -1078054, -908488, -433426, -5291, 220827, 298092, 281288, 198551]
36872A98551j08406j17495p8656J35584M54563M74685j9613n64656n20397j5826
36862a61666J50703l23027p35003l84079L67731N87705J01365l11644q7309L72473
36852d22751M02422M6819j25831Q8707L30936K93841Q7211o7710j44014j93062
36842B96568j89080j08214J7202J69952K99700K35459r6684l94709k56356K23983
36832A97821M89107K46455j92985m31806m62210m28189k92243l1191J42889Q2518
36822f79834n534J25633L59884M12581K36041l2718l09367m70628k90885J73835
36812d80992M00019M4446m34033l38793K08022M08698J2553l01755k0524L83340
36802a19019K31065k36988k20274L49430O47266K17712l09092j87426K86865K42420
$$ y = [198551, 90145, -27350, -106006, 29578, 484141, 958826, 939213, 374557, -145840, -161666, -10963, -333990, -1068993, -1453072, -1085341, -497636, -396271, -707915, -795224, -422751, -20329, 26490, -99341, -10634, 320302, 614143, 701354, 633644, 489630, 296568, 107488, -726, 16476, 186428, 486128, 721587, 624903, 230194, -26162, 197821, 686928, 933383, 740398, 308592, -153618, -581807, -874050, -905241, -762352, -679834, -685368, -559735, -199851, 212730, 448771, 416053, 106686, -363942, -654827, -480992, -80973, -36527, -470560, -809353, -601331, -192633, -180080, -481835, -502359, -119019, 112046, -124942, -345216, 4214, 651480, 869192, 560100, 372674, 659539, 901959]
36792I01959l97006p69869l73161K13105K32128j78261l21999l460K98992J82709
36782b14863k07284m29322j85611M05356Q00015N27959j18229k96815J90599M86855
36772I58660k4543o52643m60755J60620J14636n31021o29337Q8813N39634J09694
36762c26242l59448k8452O25674P36201L75535J20934K5097j47607k47584q4358
36752F89750N0161j11548k74327j64330q3682k47910k20603K50414N15729L6900
36742D40554n22208k65728L95511L57409l63201o83375k24675J98125J096l41253
36732a007745k11205K61434N82858N43495K07698k47603n12998l89506j08490
36723h82062j8331m5277O3580J43777j14916m37821k35088M08330P36925M12780
$$ y = [901959, 504953, -264916, -638077, -424972, -192844, -371105, -693104, -696564, -397572, -214863, -422147, -851469, -1037080, -631724, 168291, 696250, 578021, 281206, 471805, 958660, 934117, 281474, -179281, -18661, 95975, -435046, -1064383, -975570, -435936, -326242, -685690, -714142, -88468, 647733, 1023268, 1144202, 1169299, 1021692, 774108, 689750, 739911, 628363, 354036, 189706, 106024, -141886, -362489, -112075, 403654, 440554, -81654, -347382, 48129, 405538, 42337, -641038, -865713, -667588, -666492, -1007745, -1218950, -957516, -374658, 168837, 376535, 128932, -384066, -773572, -882062, -900393, -945670, -882090, -738313, -853229, -1291050, -1526138, -1117808, -380883, 31897]
36713C1897o2451j68065k1907j2870k27799m32248l38543J33237O31899N87410
36703A20560l8759n06793k32842L72623N32808J92305j65701l93578n94265n20644
36693a234286M6030N84408M32173j20744k85951p3867p6234j97520J43712O59533
36683a22746M37860l62553n20684K29964O52580J6759p32621n71218P8694L14821
36673e79144J84000J66051J16895k50078n19542j99781L34609M05723P9704j36198
36663c97761j86704k88373k80232P7977M95066N23376K44531L508j83060m01897
36653c93569m30201j10666K50264L61666L77396L91011J01294m72016o32136o2271
36643f19228M58644K17098k52474j10800L26044K23010k20201j65489K62178J77063
$$ y = [31897, -30554, -198619, -220526, -233396, -461195, -893443, -1231986, -1098749, -466850, 120560, 81801, -424992, -657834, -285211, 247597, 439902, 274201, -119377, -713642, -1234286, -1188256, -603848, -171675, -292419, -578370, -652237, -728471, -925991, -782279, -122746, 315114, -47439, -568123, -338159, 314421, 331180, -401441, -972659, -893965, -579144, -395144, -229093, -112198, -362276, -881818, -1081599, -746990, -341267, -261563, -397761, -584465, -872838, -1153070, -1075093, -580027, -56651, 187880, 191388, 8328, -393569, -823770, -934436, -684172, -322506, 54890, 445901, 547195, 75179, -556957, -619228, -160584, 56514, -195960, -306760, 19284, 242294, 22093, -143396, 118782, 295845]
36633B95845l90074m58013J54506M58483R408l42703L4111M95368L09695j18512
36623D48114r5106J14778j23627n46844l70557L31201O25293J17921m83724m32190
36613d14741O6046K76997j8592l22860j67498K62832L90747J3089m13255l57631
36603f84866Q1236L17821Q3224k38141j86734J50147L36255K21297O4462N7714
36593B02415M2922j51703l14764q7367M21672N92483Q6724n58728n32939J22776
36583a76509M97886P4496n23664m51496J17809L09091j04265m26324j95820J38113
36573g40683N9245j36147R8201N46682N32186N1209j98467J0971O2703l83012
36563i7112o77912k16786M44602L67310k49060l43949K83007O17136M8258o71243
$$ y = [295845, -94229, -552242, -397736, 60747, 70155, -272548, -238437, 256931, 566626, 448114, 353008, 467786, 344159, -202685, -573242, -242041, 383252, 501173, 17449, -414741, -348695, -71698, -90290, -413150, -580648, -317816, 72931, 86020, -327235, -684866, -603630, -285809, -202585, -440726, -627460, -477313, -141058, 80239, 144701, 202415, 245337, 93634, -221130, -308497, 113175, 705658, 792382, 233654, -299285, -176509, 321377, 395873, -127791, -579287, -461478, -152387, -256652, -682976, -878796, -740683, -681438, -817585, -719384, -172702, 359484, 410693, 212226, 223197, 285900, -97112, -775024, -991810, -547208, -179898, -428958, -772907, -489900, 127236, 175494, -495749]
36553d95749o15293J0720M25973M47726L50068J15995l27447n49121j58599L88712
36543d07015L74971n3045k03194l4723p8799l31753k67662Q6018J53511n0879
36533h12570J09174O19827O56439J4877m29620j61720J65204m8892l62908k55595
36523e05784j08134l64373n52486j12339M82348M39379m0691j73585R0809J54665
36513f90191r8634k20554r4305m3792j16822l7746J52869J04777j95733l74023
36503a614154k42692N7791L85980O03806M52464o5025m03317j28505L81425M67879
36493a04348J59492m3189q9196l11796n94225m30015J63465N46290L89986P4551
36483b38985J5610J42769J89940N9543k00265m27847l71325j4226K49027J32478
$$ y = [-495749, -1111042, -1100322, -674349, -226623, 123445, 239440, -88007, -637128, -795727, -407015, -32044, -85089, -288283, -323006, -401805, -733558, -1001220, -915202, -761691, -812570, -703396, -83569, 572870, 587747, 158127, -3593, 161611, 112719, -250189, -505784, -613918, -978291, -1530777, -1643116, -1160768, -721389, -762080, -935665, -844856, -690191, -788825, -1009379, -1103684, -1147476, -1264298, -1302044, -1149175, -1044398, -1240131, -1614154, -1856846, -1799055, -1413075, -809269, -356805, -421830, -825147, -953652, -572227, -104348, 55144, 11955, -77241, -389037, -983262, -1413277, -1249812, -703522, -313536, -238985, -223375, -80606, 109334, 168877, -31388, -459235, -830560, -844786, -595759, -463281]
36473d63281p2589M509J56865L0624j13634J65915N38919K82121m66497p75071
36463g12119l27113J45300N4195k60630k59771J9819K81908M41455M36911J36510
36453d3535k59286k68274J32776L75891J96983N3153K73610M12819j9363o65782
36443A88992p65615k10075L78666M68935R9415l51396n35368l43203J6843K05324
36433h47482J32785K3977M2735Q4527L8848m976M1352Q9366M5215l0265l6839
36422d20757N1479K15008L46328K33534j47855m13758k10147J99370K44537q0432
36412A7307k12640L8116J68617j47135m54757k14314L27251M65515L3550l84303
36402c62793k15553M05141P72838L83911m54320r06158n96237o3649M9084p3073
$$ y = [-463281, -535870, -531361, -374496, -343872, -457506, -291591, 247328, 529449, 62952, -712119, -1039232, -893932, -839737, -1100367, -1360138, -1340319, -1058411, -616956, -180045, -43535, -302821, -571095, -438319, -62428, 134555, 187708, 461318, 874137, 854774, 188992, -576623, -786698, -408032, 60903, 160318, -191078, -726446, -1069649, -1052806, -847482, -714697, -690720, -647985, -563458, -524610, -529586, -488234, -398868, -353653, -383918, -420757, -369278, -154270, 192058, 425592, 277737, -136021, -346168, -146798, 97739, 17307, -195333, -157217, 11400, -135735, -590492, -804806, -477555, -12040, 21510, -362793, -578346, -173205, 599633, 983544, 529224, -376934, -973171, -1036820, -987736, -1060809]
36392a060809J46735N60125M33394k60474n80236P500P55525O77103j11427o97062
36382a29626o21582k01772J65043M00782M91542L36063k6532l17454k90892k6065
36372b20493J32584j6182j98851L6909N77120O65860m9076p91073o30378J04629
36362c88951K78328k85622n49803L0039O49012N14654O9560J03183M39506L96944
36352A256850j0631k41907k20202k92985m39183l14838M2089K46159K06822J39079
36342C71253O2903j29308k49689m9811K41145J89758j36334k96827j97760j07223
36332c01893o1818J29900L49557K57186p5222k07205m6645M1734q3032r9790J82521
36321H5293M54271L22344j88761o53377o02599K6164O25072M17399m76113r44365
$$ y = [-1060809, -914074, -353949, 79445, -181029, -761265, -753765, 1760, 678863, 567436, -129626, -751208, -952980, -787937, -387155, 104387, 440450, 413918, 96464, -194428, -220493, -87909, -104091, -302942, -266033, 311087, 976947, 927871, 136798, -493580, -388951, -110623, -396245, -946048, -916009, -266997, 247657, 317217, 420400, 859906, 1256850, 1246219, 1004312, 784110, 491125, 51942, -262896, -220807, 25352, 232174, 371253, 434156, 304848, 55159, 5348, 246493, 436251, 299917, 3090, -194670, -301893, -363711, -233811, 115746, 372932, 297710, 90505, 43860, 85594, 2562, -97228, 85293, 539564, 861908, 673147, 19770, -582829, -556665, 68407, 485806, 9693, -934672]
36311i34672l65380L92152K47576l65502k14570O12811P43606k38694j058865
36302a181538p26667Q9113L85746L34882N18043O38663J33672n92691o81027j54772
36292a236576K60375L27101L48232L06837o0916m86291m07963N8040K51714M2051
36282e97396p3436O9768J00918p6705j25264j5497p8002j94051J43215P44169
36272a02281O87600k26955r40746o18778J76875M70081K60819J39946J59742j1796
36262e493k65404k71685j96500l49017m23350J5293N50881M17865j64419k40943
36252i32772K82535M56775n3397l32012K01641O71794J10510q79232r36433K4262
36242a386329P31066M13656k98566n15773k39937J9885J18381K19529K65618O2310
$$ y = [-934672, -1300052, -907900, -660324, -1025826, -1240396, -627585, 116021, -122673, -1181538, -1908205, -1819092, -1433346, -1098464, -580421, 58242, 191914, -400777, -1081804, -1236576, -976201, -649100, -300868, 5969, -54947, -541238, -949201, -891161, -639447, -597396, -670832, -601064, -500146, -576851, -702115, -717612, -795614, -989665, -846450, -102281, 585319, 358364, -582382, -1201160, -1024285, -554204, -293385, -153439, 6303, -5493, -270897, -542582, -739082, -1088099, -1511449, -1496156, -945275, -527410, -691829, -932772, -650237, -193462, -246859, -578871, -377230, 294564, 405074, -474158, -1410591, -1386329, -655263, -241607, -540173, -1055946, -1295883, -1275998, -1157617, -938088, -672470, -610160]
36232f10160k44596k47785J35958M94629M44027J00747j09799J3986K73368L81611
36222F31986K86433J25828j9114j93042l94488m57111k08768K45031M95894K25352
36212G38001l60267o59268l74673P9859J25278j73778k52553M1130K33394Q0747
36202e22130J2949L17743M85443K1536n57507l92745L20198N65723Q9203k73705
36192F6708k4603K57961K7435l02575j62242J83911J67272j30481k73403k58932
36182d48949k94459j95430K45905O30270M62363J6716r7905J851k78012q40463
36172g98113r18286l03612L33133M96209M00262K66289n5912m49559l58415K84423
36162a103581P00987L90363o2271O7687M89736M55180Q675j87900k8722n7909
$$ y = [-610160, -854756, -1102541, -966583, -471954, -27927, 72820, -36979, -22993, 250375, 631986, 918419, 1044247, 1025133, 832091, 437603, -19508, -228276, 16755, 512649, 738001, 377734, -281534, -656207, -576348, -451070, -624848, -877401, -836271, -602877, -522130, -509181, -191438, 294005, 315541, -241966, -634711, -314513, 251210, 340413, 66708, 42105, 300066, 327501, 24926, -137316, 46595, 213867, 83386, -190017, -448949, -743408, -938838, -692933, -62663, 399700, 416416, 318511, 320362, 42350, -798113, -1716399, -2020011, -1686878, -1190669, -790407, -524118, -580030, -1029589, -1388004, -1103581, -402594, -12231, -74502, -6815, 482921, 938101, 946776, 758876, 730154, 672245]
36152F72245m21516n82991k61480Q2215J7710j83313n2659L25823N05294L29952
36142D31280P730k55263l29847q0308L86788N60113R4476n34328m97251K11607
36132e003O61915K80460l32477l23812J68101L37480o208k44086k7691J84603
36122F93282q3247n72355p04844l85863q518J31217R6993Q7389J79335K70379
36112b96232J98981j9982j30646K0435J76948J2149l09649l28704k1821J62186
36102e36335N3082j5840J14301J17066j80695m03971k19457J62915M06520M81148
36092b1266L80108k0838m68162l58741K63953M61998k18355q62028n16238K82027
36082a077542L73320j64183k81746J95317L65080o3069k28587L53757Q97909N93119
$$ y = [672245, 250729, -332262, -593742, -511527, -493817, -677130, -729789, -403966, 101328, 431280, 439010, 183747, -146100, -226408, 160380, 720493, 814969, 280641, -216610, -5003, 656912, 937372, 604895, 281083, 449184, 786664, 780456, 536370, 508679, 693282, 610035, 37680, -667164, -1053027, -1061545, -930328, -833335, -745946, -566611, -296232, -97251, -117233, -247879, -227444, -50496, -38347, -347996, -676700, -698521, -536335, -483253, -499093, -384792, -267726, -448421, -852392, -1071849, -908934, -502414, -21266, 358842, 338004, -130158, -488899, -224946, 237052, 18697, -843331, -1359569, -1077542, -704222, -868405, -1150151, -954834, -589754, -652823, -881410, -527653, 370256, 963375]
36072I63375j52270m26889j42309P6776o4489k58604k00552L9693K25680K25611
36062B86022N8012j77582l79015m55048k97343Q4915L65873J70460k95253l26988
36052i65947K40897O06313J39974n71648n79958l5241J54237j39818j48973L82536
36042i17628P43692M40340q2516k31102l6432J68145K18484M1873l15586m62304
36032d33034p1428M44169L74356j58244l41357K792J89286o9208j94237J48405
36022a08500M59013L38314Q4635o7575l64521p29548n41786K11653N65020M0739
36012a12556m92511k21559L06898K24657j84451j30052K73301L78852K35400K91559
36002E69538L16703j95302q39496p12001J07926O10180L93197R4810J62537J90973
$$ y = [963375, 811105, 384216, 241907, 318683, 254194, -4410, -204962, -165269, 60411, 286022, 344034, 166452, -212563, -667611, -964954, -880039, -514166, -343706, -638959, -965947, -725050, -118737, 21237, -550411, -1130369, -1165610, -1011373, -1151191, -1300164, -917628, -173936, 266404, 183888, -47214, -83646, 84499, 302983, 344856, 29270, -433034, -504462, -60293, 314063, 155819, -185538, -182746, 6540, -62668, -256905, -108500, 350513, 688827, 773462, 705887, 341366, -388182, -929968, -718315, -153295, -112556, -605067, -826626, -519728, -295071, -479522, -609574, -336273, 42579, 277979, 569538, 886241, 690939, -148557, -860558, -752632, -142452, 250745, 345555, 508092, 699065]
35992F99065k06438o70832o54384j73912L22609M85987K61060j56301m29029l57192
35982h79367q0096J40282K23141J99466O6639p1135O048K56814L21219J04297
35972B87308L813K25337L55842O6766k59415j70222N6738q2157m08496l85351
35962c09837m3909J58330J72987L01385M59654K57691k38877m99306k83255J38710
35952A13573M60613N44897K96515j52113l18993K5545L68342J48900l37158m14322
35942G35799j26074n0596k24455j55320J63652J94284j13954j44771L15482O62439
35932A256486M49532N7068q570J08969p361l04059l34670Q7450N91500N92652
35922B488997p2161q32631r43516m64199k25934n36010n81227K32718J035198
$$ y = [699065, 492627, -178205, -832589, -1006501, -683892, -197905, 63155, -93146, -522175, -879367, -959463, -819181, -596040, -396574, -329935, -401070, -395022, -138208, 183011, 287308, 291121, 516458, 872300, 939066, 679651, 509429, 566167, 484010, 75514, -309837, -353746, -195416, -22429, 278956, 738610, 996301, 757424, 258118, -25137, 113573, 574186, 1119083, 1415598, 1263485, 944492, 970037, 1338379, 1487279, 1150121, 735799, 609725, 559129, 334674, 179354, 343006, 537290, 423336, 278565, 594047, 1256486, 1706018, 1763086, 1754516, 1863485, 1856124, 1552065, 1217395, 1304845, 1896345, 2488997, 2416836, 1584205, 640689, 176490, -49444, -585454, -1166681, -933963, 101235]
35913A01235O41865m91939p80805J19068Q30025L98519m02807m85693j6068K19462
35903A32862J27740Q3751J7897l37413o60284l83033L18358O34554K38073l15223
35893a42718m04492q3045K00871K83120L71202N50418N31901Q8285m35414m32524
35883E27604R0426L91788K265n74355n88078j00042K34683J59932l4004j66831
35873e6612k97530k97064J5127L34515J73822k65462k50765L30785P11201L75934
35863G73951k10483l61346r8511Q0209k7543j83906j31588J03155K46426P0437
35853B60801k64946l27724m9256Q6175j75326l31700O2348N32548M14033J5971
35843B22924P6772L85155J17770n99289p57121j39965L80271L99964M57808O44319
$$ y = [101235, 743100, 251161, -529644, -410576, 419449, 817968, 415161, -70532, -86600, 132862, 260602, 344353, 362250, 24837, -635447, -1018480, -700122, -65568, 172505, -142718, -547210, -630255, -429384, -146264, 224938, 775356, 1307257, 1395542, 960128, 527604, 618030, 1009818, 1012083, 437728, -150350, -250392, -15709, 144223, 110219, -56612, -354142, -651206, -636079, -301564, -127742, -393204, -643969, -313184, 398017, 773951, 563468, 202122, 103611, 183820, 156277, -27629, -159217, -56062, 190364, 260801, -4145, -331869, -381125, -294950, -470276, -801976, -739628, -207080, 206953, 222924, 299696, 684851, 802621, 203332, -553789, -693754, -313483, 86481, 544289, 1188608]
35833A188608K31009p42323j025278j63860M79061j72075j079867p50576L63442
35824a671859P21859K02977L1140N67737Q64742M27122p7895j18486n2451k25002
35814F69884l50315k11901j43993l87503o14922m72453q8557K47371M84356O58697
35804b09336O91987N05442J11983l81057o49829k99499M77208P60062M7212q08494
35794B45679o53733K22394M61429k72080p88109k88627M17752L24223j59380r584
35784e00036O55711P82548R0818n25426l99727L4068R3238j48323j83683O5655
35774c5157K35453J34433q1445k44497k98805j54355J88855L82063L8033n89948
35764d25370p08758m2659O35258M70030k94853o77293l33085R2989M4271j79272
$$ y = [1188608, 1419617, 677294, -347984, -511844, -32783, -204858, -1284725, -2035301, -1671859, -950000, -747023, -715883, -148146, 716596, 1143718, 1065823, 947337, 894886, 669884, 319569, 107668, -36325, -423828, -1038750, -1511203, -1599760, -1352389, -868033, -209336, 482651, 988093, 1100076, 719019, 69190, -230309, 246899, 1006961, 1054173, 245679, -408054, -185660, 275769, 3689, -784420, -1073047, -655295, -331072, -490452, -500036, 155675, 938223, 1029041, 503615, 103888, 137956, 231194, 82871, -100812, -35157, 200296, 334729, 253284, 8787, -290018, -444373, -255518, 126545, 164578, -425370, -1134128, -1176787, -541529, -71499, -366352, -1043645, -1376730, -1283741, -1239470, -1418742]
35754a418742j5142M96139Q29173O71151J79398k69114l59933n1602L32747M04626
35744G98701J83371K7739O7139O2114j10593k80355l92339n73127o40544j88084
35734a045978N69061P58581J14137m71562k87421O4495k33502o76683k16456Q18780
35724f06548R97773Q39q33187n45716J26613J45880k02440m0772M90847M80526
35714A3815k00950o31621j85649O33691R35292M97706j57455m22878j36771L42885
35704F88065M66377K9389n63405p04449k76283K13362K34370j71906m95412l72834
35694i52726J7455K01744r909k93266k11656K37287O09857N29331O9596l76744
35684a79031m63396j15590M15749O67515L42670l02031o29490l32722K01947M16221
$$ y = [-1418742, -1433884, -937745, -108572, 562579, 741977, 472863, 112930, 61328, 394075, 798701, 982072, 1009811, 1076950, 1139064, 1028471, 748116, 355777, -217350, -857894, -1045978, -476917, 281664, 395801, -75761, -363182, -298687, -532189, -1208872, -1425328, -606548, 391225, 392064, -441123, -986839, -860226, -714346, -916786, -957558, -466711, 13815, -187135, -818756, -1004405, -370714, 564578, 1062284, 904829, 481951, 345180, 688065, 1154442, 1183831, 620426, -84023, -360306, -146944, 87426, -84480, -579892, -952726, -935271, -733527, -743436, -1036702, -1248358, -1011071, -401214, 128117, 197713, -179031, -642427, -758017, -342268, 325247, 667917, 365886, -263604, -596326, -394379, 21842]
35674B1842K64004R7916L6279j38092m30832m36716O4106O14198N54383j04072
35664E43016o34244m76524J10085M30433J96728k33152l89297k12672K8069J44233
35654d93325J57000R9299n9874k22508j23539L08557O90994N64293j03m60288
35644D60506n04877l67580l27324k73264m4710J35763r13k19825p3990L50849
35634h65365N23188L05441J36019K39890K39888j45120n24496l98739N6425K53778
35624a79091M4000j57837l2507K32677K43997r2071m23557l11589J98751M95872
35614A8645J66621l19466k07257L65129N52692K36209K62707Q67682R93269R706
35604B945937r25771m59718P72919J026850O3922p07979n77830l31397m89286
$$ y = [21842, 285846, 383762, 420041, 281949, -148883, -585599, -521493, 92705, 647088, 543016, -91228, -567752, -457667, -27234, 169494, -63658, -452955, -665627, -637558, -493325, -336325, -237026, -296900, -519408, -642947, -334390, 356604, 920897, 920794, 460506, -44371, -411951, -739275, -1012539, -1057249, -921486, -922399, -1142224, -1216214, -865365, -342177, -36736, 99283, 339173, 579061, 433941, -90555, -489294, -432869, -179091, -135091, -292928, -325435, -92758, 151239, 59168, -364389, -675978, -477227, 18645, 185266, -134200, -341457, 23672, 576364, 812573, 1075280, 1942962, 2936231, 2945937, 2020166, 1560448, 2333367, 3360217, 3424139, 2716160, 2138330, 1806933, 1317647]
35595A317647m08771K50698O30376J00614n99334n76456j35961J9811R558J67605
35585G75787R0473n38560r08409j88957Q51505P73338k76845p40575q0814M81828
35575B38771K3124p02474o41668o7189J22207o9805K8935M28308M41651q8251
35565b86391m54922j82110K71719K79784l226K8452M32745O34583L27001q6407
35555I61228j56641m5734j36700l13540j63301K35383L21152p5149m16297k50217
35545c9816J47438K45522O988k11697k53496k61284l24785l61437k87369q8114
35535a428050J88546L62779K32425p5539j14180K71588N96232L33966l25168o98632
35525f56033m75873J6788L54879M34535L26627P2313k31607l74652k36728L3984
$$ y = [1317647, 908876, 1159574, 1789950, 1890564, 1291230, 714774, 578813, 598624, 608182, 775787, 866260, 327700, -580709, -769666, 81839, 855177, 578332, -162243, -243057, 238771, 261895, -440579, -1082247, -1149436, -1027229, -1097034, -1068099, -639791, -198140, -286391, -741313, -923423, -651704, -371920, -375146, -346694, 86051, 720634, 1047635, 961228, 804587, 758853, 622153, 308613, 145312, 380695, 701847, 626698, 210401, -39816, 107622, 353144, 360132, 148435, -105061, -366345, -691130, -1052567, -1339936, -1428050, -1239504, -876725, -644300, -719839, -834019, -562431, 33801, 367767, 42599, -656033, -1131906, -1115118, -760239, -325704, 923, 73236, -158371, -533023, -769751, -735767]
35515g35767J62533O1941m9043R4832M12651M78072O0553m70048n58563k07778
35505g50617O3402L979p4918R4662L14233L44408L10251L45015K30213j78767
35495G01861m92354k64347K58806L87992n7855n11399m24073Q0056M32227K87758
35485C98672j34967l15033k5251L57935L04575j26946l32610m9497K31007K1231
35475C29116m02504m44755r6412J39930P1175L792J27818K26203J10190o6335
35465a782r7369k8432O087K7926J17085K08975J66968J5751m2118R6643K15469
35454F85203o960n02346p38455l67234K14712L22540n8775k31493K12850Q09505
35444C39547Q54454K47216n30434r42198p00849P3473P52172O59162o7476m86824
$$ y = [-735767, -573234, -511293, -560336, -465504, -52853, 425219, 485772, 15724, -542839, -750617, -687215, -683236, -758154, -663492, -349259, -4851, 305400, 650415, 880628, 701861, 209507, -54840, 203966, 591958, 534103, 22704, -401369, -321313, 110914, 398672, 263705, -51328, -76579, 281356, 585931, 458985, 126375, 76878, 307885, 329116, -73388, -518143, -614555, -474625, -403450, -399658, -271840, -45637, 64553, -1782, -99151, -127583, -121496, -93570, 23515, 232490, 399458, 415209, 373091, 469734, 685203, 678243, 175897, -562558, -929792, -715080, -392540, -451315, -682808, -469958, 339547, 1194001, 1441217, 910783, -31415, -732264, -658791, 93381, 752543, 685067, 198243]
35434A98243p4177N25903M34263k16364o02889m63473k77195l05952k31572J23232
35424h89981L73930J77709j99440k66427K1734K97952L27566K16778J18382K481
35414A80684j75281k57473n7290K87439L91662J43550j17580j19839o0376j97277
35404A8219l45069k05323O0107J06703K5031P1417J8844m44537q34186l52774
35394a881568P16916J142251M82591l29189m75621k58761j49464N8741M68330
35385b25774M96323q3821m52801k1197M79863K00902l64602k80183K02523K01348
35375A52581j88924k18236J6340j77614n93774l59618M00427N98650J3509l23657
35365f80316J09015M90951J03207n29110n86034j54946J76298K48959K41078J50272
$$ y = [198243, 124066, 649969, 1084232, 867868, 264979, -198494, -475689, -781641, -1013213, -889981, -516051, -338342, -537782, -804209, -782475, -484523, -156957, 59821, 178203, 180684, 5403, -252070, -309360, -21921, 369741, 513291, 395711, 275872, 215496, 18219, -326850, -532173, -472066, -365363, -340332, -268915, -250071, -694608, -1528794, -1881568, -1164652, -22401, 460190, 131001, -344620, -603381, -752845, -694104, -225774, 270549, 186728, -266073, -287270, 192593, 393495, 28893, -251290, -48767, 152581, -36343, -254579, -238239, -415853, -1009627, -1369245, -968818, -370168, -356659, -680316, -571301, -80350, 22857, -506253, -1092287, -1247233, -1070935, -821976, -580898, -430626]
35355d30626q6972k83660k02115J31244M75557N47040J84171l73838n46575j36537
35345g22311K77558J63131j33926m7940J64918l8536l07025R6999Q35471Q43524
35335A131863J06877k92247n0124q5231p12186q89936l5296P87286N03157k73617
35325A90546l47280J35081J57321l42883m65283L7146L55542k2012n11246l44086
35315a157154L31761P00796L72178j55118j91292J88177K29653l65487q73137
35306i19623n56757J82756L93168K5298j12516K40620M58725K03784q5904j36567
35296c07016k62342m99501l28576K80555N42098J25236k28105P577K28860j38621
35286e79835n29173k36704L06252L08093o677Q4658M50837M13956K4076q4873
$$ y = [-430626, -517598, -801258, -1003373, -872129, -396572, 150468, 334639, -39199, -585774, -722311, -444753, -281622, -415548, -463488, -298570, -337106, -644131, -547132, 288339, 1131863, 1238740, 946493, 896369, 811138, 98952, -790984, -826280, -38994, 464163, 190546, -156734, -21653, 135668, -207215, -672498, -635352, -279810, -301822, -813068, -1157154, -825393, -124597, 247581, 92463, -98829, 89348, 319001, -46486, -919623, -1476380, -1293624, -900456, -875158, -987674, -747054, -288329, -84545, -170449, -307016, -569358, -1068859, -1397435, -1116880, -574782, -449546, -677651, -670074, -441214, -579835, -1109008, -1345712, -1039460, -731367, -738044, -653386, -202549, 211407, 235483, 150610]
35276A50610J43565K07205L1658k8282P811j27113k16027R1515M02616R0135m76826
35265B76867l44104M20594P27629J97555l21043k59725j36000l39990k88365M20753
35255C54171R85815N40010l62533m83448K48135P00981K83552k87973k00522K77923
35245B056111L13755k59193p66435o36673r0661K31466R7206j03571L4634L52375
35235A229014L66540j0029l15948k00170O9638P293l80012o17128m39863r5256
35225c85921J03176J83813K91530L33641J55170r3344j12821O2972Q1884j93046
35215D27054m74602m64273k01555R1992K49680J57677j73219m29244k48806J96876
35205h68420L01969p2295k87312J09071O03911M59664j50283m15439p7149L40371
$$ y = [150610, 294175, 501380, 533038, 504756, 512567, 385454, 169427, 260942, 663558, 753693, 276867, -67237, 353357, 1080986, 1278541, 957498, 697773, 561773, 221783, -66582, 354171, 1339986, 1879996, 1517463, 1034015, 1282150, 1983131, 2266683, 1978710, 1778188, 2056111, 2369866, 2110673, 1344238, 707565, 616904, 848370, 945576, 842005, 876639, 1229014, 1595554, 1585525, 1269577, 1069407, 1139045, 1146338, 766326, 149198, -290665, -385921, -282745, -98932, 192598, 526239, 681409, 588065, 475244, 538216, 620100, 427054, -47548, -511821, -713376, -621384, -371704, -214027, -387246, -816490, -1065296, -868420, -566451, -638746, -926058, -816987, -213076, 246588, 96305, -319134, -396283, -55912]
35195e5912M06491K46008R6485l4428j69920k44296k50000k05467m3603J85783
35185f8859K11771j2423p7642K13481L50636q9173n70996l44655K81333L71928
35175B65401j42314m53258k64681r3168j47933l3912K78890L03013O4197J58326
35165f5439N16866L17491m90918q35150k43296L36480J67382p2499L32349P09134
35155F72400J60818p31193p12437J76806P17811L23825l80335o75279n12724j77244
35145a137552J06577K16865K25687L16042L60781Q609n35862m90769K81020P85082
35135A36480K88450n23913n73227P8843N71696N52167K74784q4710l67967k02385
35125A50218L42617M46473k51450q01709l07485N63108O16325M2526q5159K78292
$$ y = [-55912, 350579, 596587, 693072, 658644, 488724, 244428, -5572, -211039, -254642, -68859, 142912, 130489, 52847, 266328, 616964, 527791, -43205, -387860, -106527, 265401, 123087, -330171, -594852, -688020, -835953, -869865, -590975, -287962, -223765, -65439, 451427, 768918, 278000, -557150, -800446, -463966, -296584, -369083, -36734, 672400, 833218, 102025, -610412, -433606, 284205, 608030, 227695, -447584, -960308, -1137552, -1030975, -814110, -588423, -272381, 88400, 97009, -438853, -929622, -648602, 136480, 424930, -98983, -672210, -593367, -21671, 530496, 805280, 720570, 352603, 150218, 492835, 939308, 687858, -113851, -421336, 141772, 758097, 800623, 715464, 993756]
35115I93756K50364k55620m50644k19553k46031n53704l96830K38709M62666O5373
35105a11514j19933K14175K93460k47894o29389k84290K13544K39359P8252J32377
35095b21853J48665q4151j74476P3378J70283j08134j84734K21472M00756j32906
35085A08300o44482l52234K20207J53994k91511k29658K28227K10523k89778l55385
35075a241797K33227N51510L8962n86263m56248J83853M84599K55834M8243J99212
35065b88868M07985K92626p0646l41093l88435l36270k37046J7050L94018N84034
35055C3355L73187K781j19419R77l5162l91645o91997m85810J71079P52630P98596
35044D08572L44499j40868k49597p5247l6462k30013k45750J70513N89549M31572
$$ y = [993756, 1244120, 988500, 537856, 318303, 72272, -481432, -878262, -639553, -176887, -111514, -231447, -17272, 276188, 28294, -601095, -885385, -671841, -432482, -354230, -221853, -73188, -157339, -331815, -258437, -88154, -196288, -381022, -159550, 241206, 108300, -536182, -888416, -668209, -514215, -805726, -1035384, -807157, -596634, -886412, -1241797, -1008570, -457060, -418098, -1004361, -1460609, -1276756, -792157, -536323, -488080, -288868, 119117, 411743, 341097, 4, -388431, -724701, -961747, -944697, -550679, 33355, 406542, 409323, 289904, 290881, 255719, -135926, -827923, -1313733, -1142654, -390024, 408572, 753071, 612203, 362606, 287359, 250897, 20884, -224866, -54353, 535196, 966768]
35034I66768j76800n45076l34253J21891L86110L67740J64477j48540m69969o75289
35024c42941p02133m76713P2683O92057Q11222K99966j25161J63006O79167N04114
35014A575267k46650n77806j98293Q5699k37693o14213m55739m1234J60307K85944
35004b64411N61614O46498K03098l66704m48878j23422P7556Q969p7461r4789
34994A22070j22885o0544J95635L95285K29897j73331m59792n44015n03260k47626
34984a168566K31506N39573L38790o5765j38741O8508R9818n5740K3472L43075
34974B15930L66622r7169n13868m20940q4781R951q5752M092K73066L36011R0395
34963I3557p7158J14651L67320K05351k90538n11716j64437K48774Q9455m75818
$$ y = [966768, 789968, 244892, -89361, 32530, 418640, 786380, 950857, 802317, 332348, -342941, -1045074, -1521787, -1449104, -757047, 54175, 354141, 228980, 391986, 1071153, 1575267, 1328617, 750811, 552518, 638217, 400524, -213689, -669428, -710662, -550355, -264411, 297203, 943701, 1146799, 780095, 331217, 207795, 285351, 294320, 216859, 122070, -815, -61359, 134276, 529561, 759458, 586127, 126335, -417680, -920940, -1168566, -937060, -397487, -58697, -124462, -263203, -194695, -94877, -150617, -127145, 215930, 582552, 485383, -28485, -449425, -534206, -524255, -610007, -605915, -332849, 3162, 93557, 16399, 131050, 498370, 703721, 413183, -98533, -262970, -14196, 75259, -400559]
34953d00559o46291j09429M91739M37877j22295m71272k88801J18739M05816N30592
34943e3884N08558K67655j05646l03207j71157O6659J18449l7418k74411n52894
34933e37296p97597p35590k11611L99805N07272J22120m4527M29998R58830O87704
34923G79108k35077p51340l30132L16834L03856j58316j52788N18745R77307M52231
34913A720428o63625j250383p56252K11533O08889J41694m25295k45207N01819
34904a56399Q49023L81786k14926k13590J22938J14622j81371j64055J82214K26201
34894I46443j98684m66910k00176J17656k4667l46121l16257m0569l918k24046
34884g57249k60724M4675L55061L68721J75496L7627Q8950K71599L65110J20144
$$ y = [-400559, -1046850, -1156279, -664540, -226663, -348958, -820230, -1109031, -990292, -584476, -53884, 454674, 722329, 616683, 313476, 142319, 208978, 327427, 290009, 15598, -537296, -1334893, -2070483, -2282094, -1882289, -1375017, -1252897, -1297424, -867426, 91404, 779108, 544031, -207309, -537441, -220607, 83249, -75067, -227855, 290890, 1268197, 1720428, 1056803, -193580, -949832, -738299, -129410, 12284, -413011, -658218, -156399, 692624, 1074410, 859484, 645894, 768832, 883454, 702083, 538028, 720242, 946443, 747759, 280849, 80673, 198329, 173662, -172459, -488716, -529285, -533203, -757249, -1017973, -973298, -618237, -249516, -74020, -36393, 52557, 324156, 689266, 809410]
34874H09410m14408p61371m92330J72202N41622L07644q2879q6612J81122J98295
34864C72695q9731j42660K78698N77528J41197o13752o93482J3706N01920J31638
34854D77757m15945k38725L60934L90425k42078o07336j98771L99469M96514J94932
34844F17176l8171j11422k05185l21708l14929j40131J39273L80554L38249n8207
34834B85499l80232j08987N50925P89019K77257m03166o33512m77860k51280J4741
34824c37596K69336J93128k36706m50230j11027K54031P9542k66158j03689L56771
34814c52598L60579n0309n1633N54398R23008M61441k93529n52414l60039k44738
34804C94166k84845j82003J3112p1192l94518l83374K58871J008722J096722M53003
$$ y = [809410, 395002, -366369, -858699, -686497, -144875, 162769, 79890, -6722, 174400, 372695, 282964, 140304, 419002, 996530, 1137727, 523975, -169507, -155801, 346119, 477757, 61812, -176913, 184021, 574446, 332368, -274968, -473739, -74270, 422244, 617176, 579005, 467583, 262398, -59310, -374239, -514370, -375097, 5457, 343706, 285499, -94733, -203720, 347205, 1136224, 1413481, 1010315, 376803, -101057, -352337, -337596, -68260, 124868, -111838, -562068, -673095, -419064, -339522, -605680, -709369, -352598, 7981, -42328, -93961, 460437, 1383445, 1844886, 1551357, 998943, 638904, 394166, 109321, -72682, -59570, -130762, -525280, -908654, -649783, 358939, 1455661, 1908664]
34794A908664k41834m49909l89304n37292p84893n72909J14170M75386k0924p33034
34784a231879o26077K71365Q87679N85460q6150l21861r0223J56214K60658L20800
34774A25986K39008r9607m06565l11838L903M3209j94799k07632J52201L88839
34764b67295J26473l30326m65224j88024K50854O13689O77143K64240l89616o53283
34754c61369k70161K02729J52400k02117k05482J92634M22775K33248l586J2060
34744A73131R0428Q171j02051m9321Q6088J28316N0043p9120j54557k9005K76479
34733C98602M07206R3782l38679l56473m8410K2506k11869k25286J15005K60963
34723A17347l0805k41183n9796p971m59026p67452k09828P34495R61648K99429
$$ y = [1908664, 1666830, 1216921, 827617, 290325, -494568, -1067477, -953307, -477921, -498845, -1231879, -1857956, -1586591, -698912, -113452, -199602, -521463, -611686, -455472, -194814, 125986, 364994, 265387, -141178, -453016, -449113, -405904, -600703, -808335, -656134, -267295, -140822, -471148, -936372, -1124396, -873542, -259853, 417290, 681530, 291914, -361369, -631530, -428801, -276401, -478518, -684000, -491366, -68591, 164657, 161071, 173131, 263559, 271730, 169679, 120358, 206446, 334762, 384805, 305685, 151128, 122123, 398602, 805808, 899590, 560911, 204438, 156028, 178534, -33335, -258621, -143616, 117347, 86542, -154641, -214437, -222408, -681434, -1448886, -1658714, -924219, 37429, 336858]
34713C36858l87934m88675k18672L7010J99361K55719J70547J08384K42586L54987
34703F10171J27927k39335k85767j08300k57978p45522q40152j21329Q23294J104727
34693F7736N76302j41422m37794k55408J2368J737k11711k12949J53705M54448
34683G012J96226m38439p38549l38461L60480O83526L75602k22056n27948k67238
34673i09845K43145M47444K25930k0306k3214O442j11550j28551J51292L97611
34663B78398K33004j33227k40257p6548M1386L9696M0179k4288k44407l92662
34653d78726k27770O6776J83215J52288P4867k12546o66114o88994L5038P70878
34643i91088O18768j49850n27018k79882o5379j90409k72861j29154j9081O8929
$$ y = [336858, -51076, -539751, -758423, -721413, -522052, -266333, -95786, 12598, 255184, 610171, 738098, 498763, 212996, 104696, -153282, -898804, -1738956, -1860285, -1036991, 67736, 644038, 502616, 64822, -190586, -178218, -176481, -388192, -601141, -447436, 7012, 203238, -235201, -973750, -1312211, -951731, -268205, 107397, -114659, -642607, -909845, -666700, -219256, 6674, -13632, -36846, -30404, -141954, -270505, -119213, 278398, 511402, 378175, 137918, 61370, 102756, 142452, 182631, 158343, -86064, -478726, -706496, -639720, -456505, -304217, -229350, -441896, -1108010, -1797004, -1761966, -991088, -372320, -522170, -1049188, -1329070, -1394449, -1584858, -1857719, -1986873, -2005954, -1937025]
34633a937025M38158Q75218P54651J28926k03209M1400J99680j85795o41666o05298
34623a134960k42949J6182J22989J66207N7747j51320j50629J03191K33861R4604
34613h85077L8948K51886L53099K0944m51380n72846k60276K27107N97096N85473
34603i5026J07798m71755o09584k61773Q2039J11926J0341m504K7739M9809O8364
34592i84626l6963l24231m48842n5878N36072O54328K40736j49300k60422l02307
34582a131433k28721K75239R66059J083474M72900j27753k00121q0161j70811
34573H58672k68774p9951K16971L23851K53622J15082r3414k88619l24616k80078
34563D32746k89849j82179J71674L64137L9975k83127P4625O52297M18244m55124
$$ y = [-1937025, -1498867, -623649, 131002, 259928, 56719, 98119, 297799, 112004, -529662, -1134960, -1377909, -1361727, -1238738, -1072531, -1014784, -1166104, -1316733, -1213542, -979681, -885077, -846129, -594243, -241144, -220200, -671580, -1244426, -1504702, -1277595, -680499, -95026, 12772, -458983, -1068567, -1330340, -1248301, -1136375, -1126034, -1130538, -1102799, -1052990, -984626, -1021589, -1345820, -1794662, -1850540, -1314468, -660140, -419404, -568704, -829126, -1131433, -1360154, -1084915, -118856, 964618, 1437518, 1309765, 1109644, 1029483, 858672, 589898, 509947, 726918, 1050769, 1304391, 1419473, 1326059, 1037440, 712824, 432746, 142897, -39282, 132392, 496529, 536504, 253377, 328002, 980299, 1398543, 943419]
34553I43419p21110p1818L94349N0282l32281q2423K76618J49230j08367o7939
34543D29960n6086k98367k55062L35273O93531J85807n62144o38743j94319N8058
34533c02092J3820M456N4703P6727K29865M32409J81095n02450p22267l8844O54040
34522H1462M25154k87140m88180j43108J14667J75872L10118L18864j15327n83367
34512a90985m38298J22725L46658P7105j81854j51904L491J63700K99537K34138
34502B84313p6108k69581j01765Q8572n2192k57162j33937J23891J36041M7752
34492b10176J90176L82946K44256r1166k04357r8932q2168j63964j33713l5291
34482b02389m5719o4748R2095K58353J30739j96280l04305j2457M06483N53729
$$ y = [943419, 222309, 150491, 544840, 595122, 262841, 180418, 457036, 606266, 497899, 429960, 373874, 75507, -179555, 155718, 849249, 1035056, 472912, -165831, -360150, -302092, -288272, -283816, -229113, -152386, 77479, 509888, 690983, 188533, -533734, -572578, 81462, 506616, 219476, -268704, -411812, -297145, -121273, 188845, 507709, 392382, -190985, -629283, -506558, -159900, -82795, -264649, -416553, -413062, -249362, 50175, 284313, 208205, -61376, -163141, -74569, -126761, -383923, -517860, -393969, -257928, -210176, -20000, 362946, 607202, 516036, 311679, 212747, 130579, -33385, -167098, -202389, -248108, -312856, -220761, 37592, 168331, -27949, -332254, -344711, 61772, 615501]
34472F15501L25377K6005J3320J79470O3379l43078m12500O0632K75578l37447
34462D66237r67814n99909K52548L56346j50689j05459M87520M41864l81673p35397
34452i36426j91454J89087j12779k34218K37648M41987K5984q7220M01814L75690
34442A10113n36426r01272J07665J058985N59152m55745m36437K23871K01985
34433f8109l66098m01492Q1487K32294J1044J565J25608o6054l30486j72556J80284
34422g72513K69388K40193K95558J11912l48975l97267J58441M31326j1282k78942
34412c02161J97873N25556l849n21667j40854M39713K59856k57064l43207k79176
34402d24980m13108j54244O94081J045081L62909j77789J96347L54580m96562
$$ y = [615501, 940878, 966883, 980203, 1159673, 1223052, 879974, 467474, 528106, 803684, 466237, -501577, -1101486, -848938, -492592, -643281, -748740, -261220, 180644, -201029, -936426, -1127880, -938793, -1051572, -1285790, -1048142, -606155, -580171, -667391, -265577, 110113, -426313, -1327585, -1219920, -160935, 398217, -57528, -493965, -270094, -68109, -434207, -835699, -754212, -521918, -510874, -509309, -383701, -449755, -780241, -952797, -772513, -503125, -262932, 32626, 144538, -204437, -601704, -443263, -11937, -23219, -302161, -104288, 421268, 417419, -104248, -245102, 194611, 454467, 197403, -145804, -424980, -838088, -992332, -298251, 746830, 1109739, 931950, 1128297, 1482877, 986315]
34393I86315j000798m7565R37856L64602o75249m25269L62823J2935q20686m23182
34383g28218O74937O76083j59497j76324M52511J76191q02816q06084K30607P29038
34373B66428L14146P9266K27003m4533n26194k95311K39244m4873o77536l06346
34363g68706O87995P53877l3584k43704J95396R9204m61851l16997L78082L90245
34353F79957j52615o8458M16566O7503p69065n97808L94242N72072j92171l97278
34343d7055K88408O16792J59204k30512k88480m79400n19425R1349N50930l1084
34333A10727o37552P4573J123900P54435l75040m29396J98295j46191r72575n70211
34323h69035M96040L18895o26862k85140J046871J219250J66159k67310P5844
$$ y = [986315, -14483, -62048, 875808, 1240410, 565161, 139892, 502715, 515650, -305036, -728218, -53281, 622802, 463305, 286981, 739492, 915683, 112867, -693217, -462610, 266428, 580574, 659840, 886843, 842310, 316116, 20805, 260049, 215176, -462360, -768706, -80711, 673166, 639582, 395878, 591274, 690478, 228627, -88370, 289712, 679957, 527342, 458884, 875450, 942953, 173888, -423920, -29678, 542394, 350223, -47055, 241353, 858145, 1017349, 786837, 498357, 18957, -500468, -409119, 141811, 110727, -526825, -452252, 671648, 1426083, 1051043, 621647, 819942, 673751, -298824, -869035, -372995, -54100, -680962, -966102, 80769, 1300019, 1466178, 1198868, 1274712]
34314A274712j42922n55528K07771J239589N82633r44977j015876m6063j36679
34305D62660p70097N3888J391853P57948r69824r11288M69454M36511n93317n8035
34295B69753J312907P27776r59778o53684Q99168N69857q14575j56754J292019
34286B486689J43674j839859n21547K173132J270201j445738l17343L003961K075777
34277G028947j791754j448606K347249K193459j196184N8737N009600M870795
34269A7072243Q97357L208265J0130772R679774M583935J0828402K5865994K9432902
34261A11699644K7546051N6700865J16930829J38703056O3487361o3921322j36380394
34254C14766090j12376875n2678948k5803936k9788640k7598827j3288130o746094
$$ y = [1274712, 1131790, 576262, 784033, 2023622, 2606255, 1661278, 645402, 599339, 462660, -307437, -253549, 1138304, 1896252, 926428, 15140, 484594, 921105, 327788, 269753, 1582660, 2310436, 1350658, 696974, 1596142, 2165999, 1351424, 1194670, 2486689, 2630363, 790504, 268957, 2442089, 3712290, 2266552, 1949209, 4953170, 7028947, 5237193, 3788587, 6135836, 8329295, 7133111, 7191848, 12201448, 17072243, 17969600, 21177865, 31308637, 40988411, 45572346, 56400748, 82266742, 111699644, 139245695, 195946560, 312877389, 451580445, 515067806, 451146484, 314766090, 202389215, 149710267, 123906331, 94117691, 66518864, 53230734, 46484640]
34247D6484640j0639380j0132442l135136q55854m359119m314495j95108M8769
34239A2901875l382463k948395J028089J221730k339070k648853P63501J486844
34231F083258j320012j961130N24287J062602j236451j638421P95137J549145
34223C858415o47623j806632m19287L64770o23682p14388P17238Q81616p93203
34214H17224j434843j26692P18547J50877m6808N76080M43561l32270J0405J005231
34204A781312M89871j033853r75914N16109P63777m89487q23197J52060L24497
34195G05175n44325m35922O62772N28869q43136r26374N85055J006379m81205
34186B57288j344236k22408R11381M89806k18752R5791N91650L30628o3552m9127
$$ y = [46484640, 35845260, 25712818, 22577682, 21721828, 17362709, 13048214, 12853106, 12901875, 9519412, 6571017, 7599106, 8820836, 6481766, 3832913, 4596414, 6083258, 4763246, 2802116, 3326403, 4389005, 3152554, 1514133, 2309270, 3858415, 3210792, 1404160, 984873, 1349643, 725961, 11573, 728811, 1610427, 817224, -617619, -744311, -25764, 125113, 78305, 654385, 1097946, 765676, 776081, 1781312, 2271183, 1237330, 261416, 777525, 1541302, 1051815, 228618, 380678, 705175, 160850, -275072, 387700, 916569, 73433, -852941, -267886, 738493, 257288, -1086948, -1309356, -397975, 91831, -126921, -31130, 560520, 891148, 827596, 778469]
34176G78469j92231n99149m50253K18452L42751j18657o7904N34082N57554k6836
34166I76278o3841M42241K66737n73163p08987K16K05031l46756l93626L22651
34156A26781N31291j39204n18125j46942L0634l22107l76717L390m0269m38264
34146a289532r6357Q92687J080147J53294m95296j75412J62286q8566k48048M3654
34136f1143J42646j29898q2734L30357K96604k02299k55083J70887Q7239n54402
34126b57826o19081J37157O06831L40996J70478L95338K27398m47708n98522N6701
34116A1762M37613K2771l02600J3989K34403j60591n17255l14014m8556j19122
34106g41600r6035K43044L58823L2686j33055J58142L47612R2148j33272M4407
$$ y = [778469, 586238, -12911, -463164, -244712, 98039, -20618, -88522, 445560, 1003114, 976278, 912437, 1354678, 1621415, 1048252, 339265, 339481, 544512, 197756, -195870, 126781, 658072, 518868, 743, -146199, -115565, -437672, -814389, -810999, -851268, -1289532, -1385889, -493202, 586945, 740239, 244943, 69531, 231817, 143251, -104797, -61143, 81503, -48395, -131129, 199228, 495832, 293533, 38450, 209337, 296576, -257826, -876907, -739750, -132919, 208077, 378555, 773893, 1001291, 553583, -44939, 11762, 449375, 472146, 169546, 183535, 417938, 257347, -259908, -573922, -622478, -741600, -837635, -594591, -235768, -203082, -336137, -177995, 169617, 261765, 128493, 172900]
34096A72900K93909K66573P5168j26008k87773j81795K50919M38396o6002o67331
34086A68956n44197J4819J67278o3204j05340m2109k11843k07864L41140O74836
34076A92472R3025n41212j76696M35057P9639n23309K0971R63535N31161p27838
34066C46805o76941N96393Q56733k74442o51065M93933J190213K77652o88281
34057A471000l97823P5728l67163p98166k41171M04666J20892l65830r6692L48574
34047A54015J20047l04398j96561O0680n9820j61255Q2831J39122k16555k83586
34037f65480J40911J93995l45473l95095M50136R72062M12308k20478o5136J25085
34027F02835l03268m81799K51577Q65612M11084k70106j68358Q6047l32685o96358
$$ y = [172900, 466809, 733382, 808550, 682542, 394769, 212974, 463893, 902289, 836287, 168956, -375241, -360422, -193144, -256348, -361688, -403797, -615640, -823504, -482364, 192472, 285497, -255715, -432411, 2646, 82285, -441024, -420053, 543482, 1074643, 346805, -330136, 266257, 1122990, 848548, 197483, 691416, 1881629, 2159281, 1471000, 1073177, 1148905, 781742, -16424, -257595, 147071, 267963, -97867, -194559, 154015, 274062, -30336, -226897, -166217, -226037, -387292, -304461, -165339, -381894, -665480, -524569, -330574, -676047, -1071142, -621006, 351056, 763364, 542886, 477750, 602835, 299567, -182232, 69345, 934957, 1346041, 1075935, 907577, 993624, 660939, -35419]
34017c5419j73731L89153J0021m32206K50436J180190P51708n59350r24246q5242
34007C71314N64877M37215K66858L51980J22952m99289q65779p64669n40335j70433
33997g25309N26952R62679L61620q17670j271302o25171K51247O21156N53219
33988a62579L11080L0183n3151J49023K43375m3933k61901M7592M65424L45521
33978A070634r9016k28421n7850j4094l7451J60263L36929J20285k11900k06481
33968H32898o7424j67363k22050J29765M33227J12460m02559l05861K17007L34474
33958H94574k6176j97302J9109J79935J01101K1199m734q5518o4681J70993K52105
33947A260605r3707m08811j88963K50459L55953K58686K94927K04811k61864n69985
$$ y = [-35419, -209150, 180003, 190024, -242182, 8254, 1188444, 1940152, 1380802, 456556, 371314, 936191, 1373406, 1640264, 1992244, 2115196, 1615907, 750128, -14541, -554876, -725309, -198357, 764322, 1125942, 308272, -963030, -1588201, -1336954, -715798, -162579, 148501, 178684, 125533, 274556, 517931, 473998, 212097, 259689, 725113, 1070634, 971618, 743197, 685347, 671253, 633802, 794065, 1130994, 1251279, 1039379, 832898, 765474, 598111, 376061, 505826, 939053, 1051513, 648954, 343093, 560100, 894574, 868398, 671096, 690205, 870140, 971241, 992440, 987706, 902188, 837507, 1008500, 1260605, 1166898, 758087, 569124, 819583, 1175536, 1434222, 1729149, 1933960, 1672096, 1102111]
33937A102111k67024J5901m08414q97105m57501M38549N21500j69415m29915L5287
33927e16026K84219q2687l55963j48528R270j72738k38635J7519J67779P5998
33917i59792J62530M68646M71602R1351j10915K4448P996k79253l36964o9513
33907e29864l4334l69217m74095r3824K43764J95584O7036J8559k10608m91350
33897a678349k52839M18980O93838L68626J91155M03453K36890n37548q93406
33888a049200k46952L97627Q5718m60764j49404N44393M57382j77665j89813M01343
33878c87335M39408k49898m89759K02664P60958L68688k29990q0488M03309K75440
33868A012997k88409l63662R7108K20116k54160n28463j18332L20485Q1403m44267
$$ y = [1102111, 835087, 850988, 442574, -454531, -912032, -473483, 48017, -121398, -551313, -516026, -231807, -314494, -670457, -818985, -809715, -982453, -1221088, -1203569, -1035790, -959792, -797262, -328616, 142986, 234337, 123422, 147870, 155866, -123387, -460351, -529864, -564198, -933415, -1407510, -1501334, -1257570, -1061986, -994950, -976391, -1186999, -1678349, -1931188, -1512208, -818370, -449744, -258589, 144864, 381754, -155794, -1049200, -1296152, -898525, -812807, -1273571, -1422975, -878582, -421200, -598865, -788678, -387335, 52073, -197825, -687584, -484920, 276038, 644726, 414736, 334248, 737557, 1012997, 724588, 360926, 458034, 678150, 423990, -104473, -222805, 97680, 179083, -265184]
33858b65184m48755q966J65253j781R8380N50246O40315O5815m78201l91760n1577
33847a26215R161N0469M62218Q19218N84450K20101M56179R03842Q10188Q99977
33837E089588K576967M962208M820967P29500m250709n845270l623370r31737
33829C528144k72954q42337q61418k90851j55724n59987p43677m56769j04242
33820g59815J46214M24633N33148J62174l49826l21774J77242L55064n1336l65544
33810d9820j08435K34624Q4368k45736j12088L51030M58780J07295j03588R8614
33800G15044K32505r3627n03126m25427K7341K32367m7768l85260l41256m3044
33790f32251R2451O258N6609M13154O92919M32914k30894o66955n04661J1055
$$ y = [-265184, -713939, -722905, -557652, -559433, -461053, 89193, 729508, 795323, 317122, -74638, -126215, -117054, -66585, 395633, 1214851, 1799301, 2019402, 2475581, 3379423, 4189611, 5089588, 7666555, 12628763, 17449730, 18179230, 13928521, 8083251, 4459881, 3528144, 3255190, 2412853, 1551435, 1260584, 1104860, 544873, -198804, -655573, -759815, -613601, -188968, 344180, 506354, 156528, -165246, 11996, 367060, 315724, -49820, -158255, 76369, 160737, -84999, -197087, 153943, 612723, 720018, 616430, 715044, 947549, 853922, 350796, -74631, -47290, 185077, 137309, -247951, -589207, -632251, -539800, -533542, -476933, -63779, 629140, 1062054, 831160, 164205, -340456, -329401]
33780c29401M32398N40167L10021j45380m44561j77476M61060O96825J80071m47005
33770A076719m29895L6228J88071j54703m65002l82823q3961J69427K78822J48512
33760C81395j96361l93176j71809J10076m6719m02533l04414J94548L78512O5187
33750c85294j41957L5596J23078j09268j53074K50014M98835J39978k77692q3497
33740a03281M18944N20849K46698R6162O4620k08250n86126n95996k96899j75213
33730f18492k39896k5369M70453O46048K75709q2282L9922L29878K72086m2383
33720A025674j49032K8483J32784m395j31659m6873N0455j01725l49914l16996
33710A36802k6102O0023k30378m04230j8909N31842M78449j99986p00116m93931
$$ y = [-329401, 102997, 643164, 953185, 807805, 363244, 185768, 646828, 1343653, 1523724, 1076719, 646824, 683052, 871123, 716420, 251418, -131405, -215366, -45939, 232883, 381395, 185034, -208142, -379951, -269875, -316594, -719127, -1023541, -828993, -450481, -385294, -527251, -491655, -368577, -477845, -630919, -380905, 117930, 257908, -19784, -103281, 315663, 836512, 1083210, 1179372, 1243992, 1035742, 449616, -146380, -443279, -618492, -858388, -883757, -413304, 232744, 508453, 426171, 466093, 795971, 1068057, 1025674, 876642, 905125, 1037909, 1033514, 901855, 854982, 905437, 803712, 453798, 136802, 110700, 170723, -59655, -463885, -482794, 49048, 527497, 327511, -372605, -866536]
33700h66536N4269L31680K24417k1338k32504l03301j23475J86358K62592k4428
33690e12266l53716m07998k40017k0844K11316L66857K76355O0218R4309L78125
33680a47661M27661P4308j89988m3721Q7902j93117m94141l16461J4418p3856
33670h54656k92805O5523P74179Q19315r138o89120m69642Q2399Q6762l00384
33660g87567k74185K87374O62945L77370k03907m84487l49085o1328J81705L18858
33650c32307K86625J00622n6121p1079r8345k54900k87430O7893N03551M37669
33640B96178q2162l50084l1185L86810M27272K47552M3088m28102j112348j192162
33630a795143k32652Q03412P44001l3652k22071L39068N58732J7254m37220k59223
$$ y = [-866536, -812267, -480587, -256170, -277508, -510012, -813313, -936788, -750430, -487838, -512266, -865982, -1273980, -1513997, -1534841, -1323525, -956668, -680313, -620095, -525786, -147661, 280000, 354308, 164320, 120599, 208501, 15384, -478757, -795218, -780800, -854656, -1147461, -1081938, -307759, 511556, 502418, -186702, -656344, -573945, -487183, -787567, -1061752, -774378, -111433, 265937, 62030, -422457, -771542, -832870, -651165, -332307, -45682, 54940, -1181, -72260, -170605, -425505, -712935, -645042, -141491, 296178, 214016, -136068, -167253, 219557, 646829, 894381, 937469, 509367, -602981, -1795143, -2027795, -1224383, -480382, -514034, -736105, -397037, 161695, 178949, -258271, -517494]
33620e17494l905r1982m9521L80329N22734l9428n53316k58078L52211L42845
33610H4395k22782n50180l38937N9782L29920L59582Q5708k63885j74836M02930
33600b28303P66431M00883k95337o79532o78432m80089r0502K89848J87488k76412
33590a083957k53269M57350Q27026K05194m89445k50436K97622Q690p26316o02493
33580a610034L70449Q93466M97758Q5804K41691M19309J32519k49726l11313k27190
33570B42733k15777j53048k6670o4908k07910j22437J40062J89506N6060J53302
33560i087M27693L51735j26694m48318m03911l97184n43631l68777K61596P09333
33550e47245N01452L2765j31309q0803j88404l62990k24456K05270M50794J98664
$$ y = [-517494, -521399, -613381, -662902, -282573, 240161, 200733, -352583, -610661, -258450, 84395, -138387, -688567, -1027504, -967722, -637802, -278220, -192512, -456397, -631233, -228303, 538128, 939011, 643674, -35858, -714290, -1194379, -1284881, -995033, -807545, -1083957, -1337226, -879876, -52850, 152344, -337101, -587537, -289915, -281225, -1007541, -1610034, -1239585, -346119, 151639, 237443, 479134, 898443, 1030962, 781236, 469923, 242733, 26956, -126092, -152762, -217670, -425580, -548017, -407955, -218449, -162389, -9087, 418606, 770341, 643647, 195329, -208582, -605766, -1149397, -1518174, -1256578, -547245, -45793, -13028, -144337, -225140, -413544, -776534, -1000990, -795720, -344926, -146262]
33540a46262k92217m59932q6945L90294L94951J0924j17647K07042L96977O4574
33530C61759k95008j54684J34101R734k82462k06595K1119j15077l53607j16929
33520i97649K90554J45083k77770p2868N97319O15940j51133n28898k8547L19577
33510h8392j87780o24202J5465J037448J025846n7011r08869p18698K7280M84886
33500E973M07559P8017j83063k73089k88505l17140k60337r552K54551K43207
33490c42379K4598n5512P8316J60351P1332k7016o3036j29310j75890o0595J12325
33479d06816J33264Q4816J40579J36718j08201k81321o3673J36748k04996o24293
33469a057175k33541O89969Q91653O3988o44530m07682J57633J85877j63080k71567
$$ y = [-146262, -438479, -898411, -985356, -595062, -200111, -189187, -306834, -99792, 297185, 361759, 66751, -87933, 46168, 55902, -226560, -433155, -412036, -527113, -880720, -997649, -707095, -562012, -839782, -912650, -315331, 300609, 149476, -379422, -407969, -88392, -276172, -900374, -884909, 152539, 1178385, 1121374, 212505, -506193, -478913, 5973, 413532, 491549, 308486, 35397, -253108, -570248, -830585, -840137, -585586, -342379, -317781, -373293, -294977, -134626, -63294, -90310, -153346, -282656, -458546, -519141, -406816, -273552, -188736, -48157, 88561, -19640, -300961, -364634, -227886, -432882, -1057175, -1290716, -600747, 290906, 354894, -289636, -697318, -539685, -353808, -516888, -788455]
33459g88455m2887L07672O81094P88026K10673p13921r32808j71964N10052L16220
33449A63702j07576Q0296M47800J66923m02708k88391L87843N68276k4922n15007
33439D76236k96137J63812J97073j40798l43946j74699J53716K65535j024l76471
33429g6703m22106j27090L8473j33665k00989K10883O99945O12042K467m66166
33419A37091m37198j79309o1753j27508j91622r3318J31440K11655n8942m05316
33409a074780k86071L07977O75961L17752l51770n53669j02294N33532Q43222
33400C09860O18011l2159o59918p32184k24999K66972K81435N0839K1339J54883
33390E4079J18286q1877r8147K10843N59355N55083J00129m73968o67545l57944
$$ y = [-788455, -831342, -523670, 157424, 945450, 1156123, 442202, -490606, -662570, -152518, 163702, 56126, 136422, 584222, 751145, 348437, 60046, 447889, 1016165, 991243, 476236, 180099, 343911, 540984, 400186, 56240, -118459, 35257, 300792, 299768, -76703, -498809, -625899, -587426, -721091, -922080, -711197, -11252, 600790, 603257, 137091, -300107, -479416, -541169, -668677, -860299, -953617, -822177, -610522, -669464, -1074780, -1360851, -1052874, -376913, -59161, -410931, -964600, -1066894, -533362, 309860, 927871, 895712, 235794, -496390, -721389, -454417, -172982, -122143, -100804, 54079, 172365, 90488, -7659, 203184, 762539, 1317622, 1417751, 943783, 276238, -81706]
33380h1706J0722M0628k3596K23176N03142K29554l69424m16634K01420N65932
33370H83214J91797k25628n2034K35106l8636n58786n82703j07937L18735M89838
33360E52966M90964K11958l39555o25389k42884L06222K52723k83255m91421o7253
33350b34924M43113M30655j25062p16670p27278r024P61049P22998J9147l03552
33340B60452J45030M97649J04563l74442j90659J19521k70095q52181n34305M30112
33330f64355P07474m1430p19528n37158K3366K51547J67758Q2170M1385O3504
33320f25267K52854M34110K75832p9313j31933J28390J65361j89197m42812k50518
33310d62493J09094K66641K09389K3407k73675m80577l02580J54715M36579L64278
$$ y = [-81706, -70984, -30356, -53952, 169224, 672366, 901920, 532496, 115862, 317282, 883214, 1075011, 849383, 797349, 1032455, 993819, 435033, -147670, -255607, 63128, 552966, 1043930, 1255888, 916333, 290944, 48060, 354282, 607005, 323750, -167671, -234924, 208189, 638844, 513782, -202888, -930166, -939190, -178141, 544857, 564004, 260452, 405482, 903131, 1007694, 633252, 442593, 562114, 292019, -560162, -1094467, -664355, 43119, 1689, -717839, -1254997, -1231631, -980084, -812326, -730156, -688771, -625267, -372413, 61697, 337529, 258216, 126283, 254673, 420034, 230837, -211975, -462493, -353399, -86758, 122631, 146038, -127637, -608214, -910794, -756079, -319500, 44778]
33300D4778J56143o4786l33295m23042k0340N92769O95159J52327l29617k08259
33290B61837K04800L32656J08822j42477k00405m3369K30094L65189J20409l67947
33280H69609o43798m55633o354L27169L01287p3152m43231l19395K89847O89369
33270E35718L79886j68429j98754J89284L31435J87173L06815O78549O21261j3812
33260B849126m92794l50340k4369K1044j8541P9084J7285l92257p11288n45126
33250D31824j77066n055J18531M29789O44292M19798J1848j49084j78708m08660
33240A137509o38232l98797J91825M86558J98911k88394n20717m46185k64589
33231e42111j51091j58327j48871J11034N61806P23055K83171l49032m99695j36109
$$ y = [44778, 200921, 136135, -197160, -620202, -640542, -47773, 647386, 799713, 470096, 261837, 466637, 799293, 908115, 765638, 565233, 521864, 751958, 1117147, 1237556, 869609, 225811, -229822, -236176, 90993, 392280, 319128, -124103, -443498, -153651, 535718, 915604, 747175, 548421, 737705, 1069140, 1256313, 1563128, 2241677, 2862938, 2849126, 2356332, 2005992, 1981623, 2002667, 1984126, 2063210, 2080495, 1688238, 976950, 431824, 254758, 249703, 368234, 798023, 1442315, 1862113, 1873961, 1724877, 1546169, 1137509, 499277, 100480, 292305, 778863, 977774, 689380, 168663, -277522, -542111, -693202, -851529, -1000400, -889366, -327560, 395495, 678666, 329634, -170061, -306170]
33221c06170J54116O7641o3298N0881J60758l0303l06430l06144j50552j84118
33211i13619k62523O9319O65347P42889M8145n93296m19513J17785R2818l90194
33201h42842l95295K55905O65768L36291p9154L7815K88292J32246r1312J27986
33191D35700M19847J59982l55215l94310q9078j49572m90250l08827M41960Q03446
33181D73683K84317m08319m85663q9300K34982L62311M23619L69196J31232j66213
33171A129845m26724o36414o02102j57892K84596O9603o25759p94735l0261P76816
33161a013027O66894r5479n54881l76644L5754L59144N86240O32108L58783k3616
33151E75276j03450J16885J62380k24742o48492n47975J2015L39507K1338m33326
$$ y = [-306170, -152054, -84413, -147711, -96830, 63928, 33625, -272805, -578949, -729501, -913619, -1176142, -1106823, -441476, 301413, 349558, -243738, -663251, -545466, -452648, -842842, -1238137, -982232, -316464, 19827, -59327, -21512, 266780, 399026, 307714, 435700, 855547, 1015529, 660314, 266004, 176926, 27354, -462896, -771723, -329763, 473683, 758000, 349681, -135982, -225282, 9700, 372011, 795630, 1164826, 1296058, 1129845, 703121, 66707, -535395, -693287, -408691, -339088, -964847, -1759582, -1789843, -1013027, -346133, -441612, -996493, -1373137, -1337383, -978239, -391999, 240109, 598892, 575276, 471826, 588711, 751091, 526349, -122143, -670118, -658103, -318596, -297258, -730584]
33141g30584k46575M34256O23551l6759o35225l29665L82622N40961K57535L00731
33131E60848N70268K89376m30519o17202j45804n047n18703p20837q1105N17155
33121e81570L16538p1739O8595K40507j60481m83961O2976P86044M97412m47247
33111B27074o75505k1932L63481L6920j82246J44384L43740k4484l64014j62344
33101c14926J40903M1217j67033q1419J9480k04903l76196m826N66035N92076
33091B10408M4913m02518l82266j89324j39007j33168n002J40893J66866J97170
33081d91035L96250N92043M30013o8157l91004j83066K06041J57830l21376n88790
33071b61251l12998O4534O1729j27287o0943J88246K24053K3637j08309j25734
$$ y = [-730584, -977159, -542903, 80648, 43889, -591336, -921001, -538379, 2582, 260117, 560848, 1131116, 1420492, 989973, 372771, 226967, 221920, -296783, -1017620, -1098725, -581570, -265032, -336771, -268176, -27669, -188150, -672111, -609135, 176909, 674321, 227074, -448431, -470363, -106882, -69962, -252208, -107824, 235916, 211432, -152582, -314926, -174023, -132806, -299839, -381258, -361778, -566681, -942877, -947703, -381668, 210408, 255321, -147197, -529463, -718787, -857794, -990962, -995964, -855071, -688205, -491035, -94785, 497258, 927271, 859114, 468110, 285044, 491085, 648915, 327539, -261251, -574249, -509715, -447986, -575273, -636216, -447970, -223917, -200280, -308589, -434323]
33061d34323k29061l55479k31107R2841K78677K70472L02305L44776J24031k49502
33051h6370k97418J9617J34317k19366n19937k53532L12903N90423M77260K45170
33041D03067j2273k95148l48022K6534M55810L62573j90149n29588k92403J41348
33031b78251K38467n4248m09009n19824k58532K67259O46876M59931j42247m35502
33021d85080j0721N70778M28375m26795j013282o18902L10885P97736N26294K2211
33011A01499j95864j63137j21911p4363P7079K35006K47791J74220J36659O2239
33001D79218j21591j73759J60407N75975M47178k18160n92693j55550M52655K72363
32991A126043n55009r35319l78769L47270L83286q0466l07473j26080J04602K76495
$$ y = [-434323, -663384, -1018863, -1249970, -1157129, -878452, -607980, -305675, 39101, 163132, -86370, -383788, -364171, -229854, -449220, -969157, -1222689, -909786, -319363, 157897, 403067, 390794, 95646, -252376, -225842, 229968, 592541, 402392, -127196, -419599, -278251, -39784, -94032, -503041, -1022865, -1281397, -1014138, -367262, 92669, -49578, -485080, -495801, 74977, 503352, 76557, -936725, -1555627, -1244742, -447006, 79288, 101499, -94365, -257502, -379413, -453776, -376697, -141691, 106100, 280320, 416979, 479218, 357627, 183868, 344275, 920250, 1367428, 1149268, 556575, 401025, 853680, 1126043, 571034, -364285, -743054, -395784, -12498, -92964, -400437, -526517, -421915, -145420]
32981a45420N22942N97484R7287o31110o48761K13553R04531N50019l31653o46959
32971D81913k69242R911k03359m68214l65532m0424K51180M96393N98392K68240
32961G59258m14309p83610l60371M32426P38982L12467k86365m82924l18082j76473
32951e79001j64504m7677K34781L34387J2589l37555j46228L93966M38113k48336
32941a09465p75241l69038M38033O00152J29813o3053K73251M07707j2273l36263
32931A83623o6921K91105J56258j29287J4892L21565J51277l27408l53200J76360
32921D18264N39969L29144k1396k8892J71265K51721K50219L16935K91266l8779
32911B479716m74035o11367m24073k69537l13891k95004P540L38276K56409k54344
$$ y = [-145420, 377522, 975006, 1072293, 441183, -207578, 5975, 910506, 1460525, 1128872, 481913, 212671, 222582, 19223, -448991, -814523, -854947, -603767, -107374, 491018, 759258, 344949, -438661, -799032, -366606, 372376, 684843, 398478, -84446, -402528, -579001, -743505, -791182, -556401, -222014, -209425, -546980, -693208, -299242, 138871, -109465, -884706, -1253744, -815711, -215559, -85746, -148799, 124452, 532159, 519886, 183623, 116702, 407807, 564065, 434778, 449670, 771235, 922512, 595104, 241904, 418264, 958233, 1287377, 1265981, 1237089, 1408354, 1660075, 1910294, 2227229, 2518495, 2479716, 2005681, 1394314, 970241, 700704, 386813, 91809, 99349, 437625, 694034, 439690]
32901D39690p24038p34086l04574K50021O03539N31205N8014l84703k89151K35222
32891c18861M50786k6528o08860n41258J2742K85805Q4664n2969J66406L82430
32881a65643K72302J1892j58799k73470l25508j41752J92353K77955J8935j84335
32871d76070r1722K6875m8566j12784k7035l9137k37011k25184J93272N11182
32861e26180K29444l34010n01457j73270K21059M10531L90395J15265l56167o07978
32851a132368l00123K73247N31400L84992K16792K07401J44014j31423m55692
32842b61760n31359j76017M97909R99958Q14230L9560o21315p09323m59832k09091
32832f17040Q9794M04484L19596k32936n22730k1624O27212M61096l47746p69314
$$ y = [439690, -284348, -1018434, -1323008, -1072987, -469448, 61757, 119771, -264932, -554083, -318861, 131925, 105397, -503463, -1044721, -1031979, -746174, -661510, -714479, -548073, -165643, 106659, 118551, -40248, -313718, -639226, -780978, -588625, -310670, -291735, -476070, -567792, -540917, -589483, -702267, -729302, -768439, -1005450, -1230634, -1037362, -526180, -296736, -630746, -1132203, -1305473, -1084414, -673883, -283488, -168223, -524390, -1132368, -1432491, -1159244, -627844, -242852, -26060, 181341, 325355, 193932, -261760, -793119, -969136, -471227, 528731, 1342961, 1382521, 761206, 51883, -407949, -617040, -527246, -122762, 196834, -36102, -558832, -580456, 46756, 507852, 160106, -609208]
32822f09208m13391J31045L27259K10295p2919m30821n35420j24006M01059M02656
32812g13451P076r9398J73269K46155o989l2522L07273L77304j17337n38042l21438
32801g18100J73645L66755L38799M21920M68098J76211k46822l65674j93783p3680
32791C47369r6419r8196o0342j01717j95841k21949j81015j15572J9602J81329
32781e22751J43215j61442l98639k30177J82572L61500J50331o4191J81821Q19814
32771D62053J156131N14083q98555j918444j531966k6301J255274J304492L30952
32762F47719o70490q79084k26022N75525N86931l51474j208674q62566M04897
32753a983238J155938O60173k15400l22413K43256N17126J14035l91879l99889
$$ y = [-609208, -1022599, -891554, -564295, -354000, -426919, -857740, -1393160, -1517166, -1116107, -713451, -706375, -805773, -632504, -386349, -393338, -425860, -118587, 258717, 141380, -396662, -718100, -544455, -177700, 161099, 583019, 1051117, 1227328, 980506, 614832, 421049, 347369, 250950, 152754, 92412, -9305, -205146, -427095, -608110, -723682, -704080, -522751, -379536, -540978, -939617, -1169794, -987222, -625722, -475391, -539582, -357761, 462053, 1618184, 2132267, 1233712, -684732, -2216698, -2242999, -987725, 316767, 647719, -22771, -901855, -1127877, -552352, 34579, -316895, -1525569, -2388135, -1983238, -827300, -167127, -382527, -704940, -461684, 55442, 169477, -222402, -622291]
32744f22291j9902K12951L6184k69461k37529J97575N67765M55352N9240j15986
32734B63898L920P9419L1873J29110L41308K42528k34080n46607l67120j00814
32724a56565j90425m05774l00320L9069K15882J87362J94995K57943K15613J13184
32714A70964J05027R6119j12285m02217m42135j82842O4917O3020p3669o6035
32704g79136J75859M05848K73467k03988n13370k44965K91009M43832J46138p3990
32694g9296j1302l9784k77336k43594K44506N34046R2991n46134n10481J17216
32684g19168M66831J51683l22530l78947k3815L61137M50289J56632l07649n54335
32674g19872m10430r6429J26578K54358L12649J77438j11689k30894q8278n6359
$$ y = [-622291, -642193, -429242, -393058, -662519, -900048, -702473, -134708, 320644, 379884, 263898, 267818, 347237, 379110, 508220, 849528, 1092056, 857976, 311369, -55751, -156565, -346990, -752764, -1053084, -1014015, -798133, -610771, -415776, -157833, 57780, 170964, 275991, 372110, 259825, -142392, -584527, -767369, -702452, -639432, -713101, -779136, -603277, -197429, 76038, -127950, -641320, -886285, -595276, -151444, -5306, -79296, -90598, -130382, -407718, -651312, -406806, 127240, 220231, -325903, -836384, -719168, -252337, -100654, -423184, -802131, -825946, -464809, -14520, 142112, -165537, -719872, -1130302, -1226731, -1100153, -845795, -533146, -355708, -467397, -698291, -786569, -842928]
32664h42928l07998l85032N4529N14097L54128j40805j62990L43629O08254K17538
32654B52422l46305m63404j03198L30810M46492R8144m49004o22607j82792L56868
32644f82574L62205m5276k50711j00285K0838m3900m1872J04365J58548O2075
32634d56587P403J8841Q914J70860O57705R58261M03948o70757j152646o91268
32624g45326j15181n0138q9487J97613L83690J6069m42808l41831O8768J37110
32614i81521m2095J05502M93512M49025j25210n35242l61162J2195J47033J73877
32604f64086L25246L86342P4802l52918l67493N2641L28533O4215l68424k67104
32594g88246M71230J142929J076904M50871j5078n7877j31453n68816r40768o29661
$$ y = [-842928, -1150926, -1535958, -1481429, -967332, -613204, -754009, -916999, -573370, 34884, 252422, -93883, -557287, -660485, -329675, 116817, 214961, -234043, -856650, -1039442, -682574, -320369, -365645, -616356, -716641, -695803, -739703, -781575, -677210, -518662, -456587, -449184, -430343, -421429, -250569, 407136, 1365397, 1769345, 1098588, -54058, -745326, -860507, -910645, -1000132, -802519, -418829, -402760, -845568, -1187399, -1118631, -981521, -1023616, -918114, -424602, 24423, -100787, -636029, -997191, -984996, -837963, -664086, -338840, 47502, 122304, -230614, -598107, -545466, -216933, -152718, -521142, -788246, -317016, 825913, 1902817, 2353688, 2338610, 2280733, 2149280, 1580464, 639696, 10035]
32584A0035K01856O92597L48821l53789n99345k18234K05322J38103k56422m06509
32574b37565j06074K68310L32140J78943R5505N9179j20932l09870j54644K90512
32564B95504M97687J79600l08375m83063l07345j3443K97606N48679M80408j9993
32554A167265n67997o98007n11810m51693n09881k41806L49858N91049J49613
32545g23409k88798L6349P06074O18531l17525q89426l07443O02830O22236n8277
32535A142k35829L62581O75239L0589p85684p50241p2303L10023J44943m7244
32525c66784K3280J33363J21344M4275j41356m22427l91233K37870Q86418O84325
32515H09075k12195p16953l58037J35833O7549k62000k73275m0097Q3917J63455
$$ y = [10035, 211891, 904488, 1253309, 899520, 300175, 81941, 287263, 425366, 168944, -237565, -343639, -75329, 256811, 435754, 531259, 590438, 469506, 159636, 4992, 295504, 793191, 972791, 664416, 181353, -125992, -139435, 158171, 706850, 1187258, 1167265, 599268, -98739, -610549, -1062242, -1572123, -1813929, -1464071, -873022, -723409, -1012207, -975858, -269784, 348747, 31222, -858204, -1165647, -562817, 59419, 1142, -234687, 127894, 803133, 833722, 48038, -702203, -774506, -464483, -319540, -366784, -343504, -210141, -88797, -44522, -185878, -608305, -999538, -761668, 124750, 809075, 596880, -120073, -478110, -342277, -274728, -536728, -810003, -850100, -766183, -602728]
32505f02728L60992L95976M083m10908k72937K34862L98941L9485k76425j16250
32495b44909K57781L52981Q5765k30367l15575j80105k6636J4343Q552M5111N2213
32484a80846l3817l2674K29095N07230M03633K2534j44788j9572k106j32791N2458
32473F68356N39270N45067k50662r71998p77839j44807l4802l56348l01950J83524
32463i02189M31157L46436M67131P17143L55920n58309q68378m1419Q38361N67289
32453A353142m64508r25548l98712K95765L85997l7145m59011n63175l17713J24470
32443a006438M77547N16866K87471j110k26618l69830l87840k35132N2958L80948
32433e11178N92577M48985j33612p54754p84133j45964M75106M85863J30195J8286
$$ y = [-602728, -241736, 154240, 158323, -252585, -525522, -290660, 108281, 147766, -128659, -244909, 12872, 365853, 451618, 221251, -94324, -274429, -301065, -286722, -278170, -233059, -180846, -214663, -247337, -18242, 488988, 892621, 915155, 770367, 750795, 748689, 615898, 668356, 1207626, 1752693, 1502031, 530033, -247806, -392613, -427415, -783763, -1085713, -902189, -471032, -124596, 342535, 1059678, 1415598, 857289, -11089, -52508, 785853, 1353142, 888634, -36914, -435626, -139861, 246136, 208991, -250020, -813195, -1130908, -1006438, -528891, -12025, 275446, 274336, 47718, -322112, -709952, -945084, -892126, -511178, 81399, 530384, 396772, -357982, -1142115, -1288079, -812973, -327110, -196915, -178629]
32423a78629J92697J81254j28472k48814J29253N76739M64380j72112o39822m32365
32413b55891J82225N08803K28742k94727n03659k74320N8009J96354J92390K37523
32403B75449L37516L17872P2637k84253m97207l93426p5081J54248J37211M8725
32393I3691Q6309J08248j26863m40000l80855L3051K15403r6605l26348J01703
32383g32266P66657P43320m1832o58072m88125j6262M4893j75192q6122K89674
32373c53327L51275n5913l63071j81976J29115J11714r5160j21693j4087j1012
32363f04135k384K06958L39312K3918m03922k51542L69435N59667O015n03472
32353b60150l22553J05098J09677j23095p0877J23319J9704j98627q2759J44333
$$ y = [-178629, 14068, 195322, 66850, -181964, -52711, 524028, 988408, 816296, 176474, -255891, -73666, 435137, 663879, 369152, -134507, -408827, -350818, -154464, 37926, 275449, 612965, 930837, 1003474, 719221, 222014, -171412, -246493, -92245, 44966, 93691, 180000, 288248, 161385, -278615, -659470, -626419, -411016, -507621, -833969, -732266, 34391, 777711, 735879, 77807, -410318, -426580, -381687, -556879, -643001, -353327, -2052, -57965, -421036, -603012, -473897, -362183, -457343, -579036, -593123, -604135, -606519, -399561, -60249, -36331, -440253, -691795, -322360, 237307, 243322, -260150, -582703, -477605, -367928, -491023, -561900, -438581, -418877, -617504, -700263, -555930]
32343e55930k9455l29818n8446N68218N72857j88713p15938m29799L7563N8218
32333a071243l7089J61191K68358r1243m01765o8212N14534O17061L63980K95152
32323E50724K05373m43808j210090j014416J28033Q97149N31541j26674m907O35017
32313A47942P67208J76890l87919m16955k00683j43026j59456k4301J21326l053
32303a22027k82389l02115J8350K48579O5175k45540k02999J37310K75818M5406
32293c64432j64059p1138N8722q6816k95450j50918K85032N18024K86327j45900
32283a30608l65772k42667M2823K36982K46945J97165K29889K71059J37034j38897
32273D83953l13420k90655k07709j32359j812R0152m8605k71659j96333J11772
$$ y = [-555930, -585385, -915203, -973649, -405431, 167426, -21287, -737225, -1167024, -1129461, -1071243, -1108332, -947141, -678783, -770026, -1171791, -1240003, -725469, -108408, 255572, 550724, 756097, 312289, -897801, -1912217, -1784184, -887035, -355494, -482168, -487075, 147942, 915150, 1092040, 704121, 287166, 86483, -56543, -215999, -240300, -118974, -122027, -404416, -706531, -688181, -439602, -374427, -619967, -822966, -685656, -409838, -364432, -528491, -599629, -540907, -627723, -923173, -1074091, -789059, -271035, 15292, -130608, -496380, -739047, -696224, -459242, -212297, -15132, 214757, 485816, 622850, 483953, 170533, -120122, -327831, -460190, -462002, -371850, -420455, -692114, -888447, -776675]
32263g76675J36756j59075j00866N49079R34680L28335n94279o44754R7737M53129
32253B24067m8133o01751n03535q6134O4918k915R528K5715j09787j53131J74306
32242a006852N98644N61262m891n34150n10815q1809J48025q8169l17565K9539
32232a206781O93227Q28157K87570m1921L76117P57802K06180p34145q22457n7450
32222B86299L80885K8276l37083k18827j22789l35148k53106L96213P96255L39293
32212I60268k78008k01019J67278l8985n90356n73199K8468L26772k3469m03818
32202f26068k93723R7890L56193L33838M3603l40801l97930N8954M95498K74702
32192B156l24626m13640J86731O77947M61332j21995m54999m16324j87648J64405
$$ y = [-776675, -639919, -798994, -899860, -350781, 583899, 912234, 317955, -326799, -229062, 224067, 175934, -425817, -929352, -1015486, -950568, -953483, -943955, -918240, -1028027, -1181158, -1006852, -408208, 153054, 148163, -385987, -896802, -978611, -830586, -918755, -1236320, -1206781, -513554, 314603, 602173, 560252, 936369, 1694171, 1900351, 1166206, 343749, 286299, 667184, 695460, 358377, 139550, 16761, -318387, -571493, -175280, 620975, 960268, 682260, 481241, 648519, 609534, 19178, -554021, -525553, -198781, -222250, -626068, -919791, -821901, -465708, -131870, -88267, -429068, -826998, -768044, -272546, 2156, -322470, -736110, -549379, 128568, 589900, 467905, 12906, -403418, -591066, -426661]
32182d26661N42359O53977L56464q9299l53746l92670l00695r8311J34406J72023
32172A97847p9387l91073m64325k37765J39734M59207N06075J88567k77189n01179
32162d59488l46118o1444P6563P5779R5438J74018K04155R2166j07190j76396
32152d32517O1372M20531M12539j24658o29553m44533K36465N38540R7270m41051
32142c05595l65766J15932K82623j4645k29191l7430J68426o9089n12894n22025
32132a489654K7340N36579M92923J16181o1491K3083K3727j06806K007M52460
32122A6349P64214N11020r0159n21842n95542m32122j12580K64355M00865J07488
32112C12046l15035l73301J408M26255N58742L43755q7541m70868n13996k43258
$$ y = [-426661, 115698, 769675, 1126139, 1036840, 683094, 290424, -10271, -108582, 25824, 197847, 118460, -272613, -736938, -974703, -834969, -375762, 130313, 318880, 41691, -459488, -805606, -867050, -790487, -714708, -619270, -445252, -241097, -148931, -256121, -432517, -371145, 49386, 461925, 337267, -292286, -736819, -500354, 38186, 135456, -305595, -671361, -555429, -272806, -287451, -516642, -554072, -385646, -454735, -967629, -1489654, -1462314, -925735, -432812, -316631, -378122, -355039, -331312, -438118, -436111, 16349, 780563, 1291583, 1201424, 679582, 84040, -348082, -460662, -196307, 204558, 312046, -2989, -376290, -374882, 51373, 610115, 953870, 866329, 395461, -118535, -361793]
32102c61793n8212j44932j21181L21285P42129N11426j70644m93205j94599J86972
32092B17246K34312J19747L7243j43875m26966n03978l05962j92421k98706k29617
32082a492977K40423O53095M86866p5609m23876k94225Q9224M04684M41260J38984
32072A67849k85102m41195k27279K6340N4094Q741R6662J75653J5916k83414m28764
32061a120499k95542N3153M84464P47439N84066R4754k88174l69489l90791m84443
32051i85062l84167K6018L51422K79942R7033J51915K49260J11283O031K41872
32041A45547M12093m0655p36690p43610j6980M59058J41837l14885j35355M64216
32031c65424P28229M20455p1410l54989l24749p2786J44176N1091k66002l61975
$$ y = [-361793, -420005, -564937, -686118, -364833, 377296, 888722, 718078, 224873, 30274, 217246, 451558, 571305, 608548, 464673, 37707, -466271, -772233, -964654, -1263360, -1492977, -1252554, -599459, -112593, -188202, -612078, -906303, -817079, -412395, 28865, 167849, -117253, -558448, -785727, -759387, -705293, -696552, -599890, -424237, -408321, -691735, -1120499, -1416041, -1362888, -878424, -130985, 453081, 547835, 259661, -109828, -500619, -985062, -1369229, -1343211, -991789, -711847, -614814, -462899, -213639, -102356, -96325, 145547, 557640, 516985, -219705, -963315, -980295, -521237, -379400, -694285, -829640, -365424, 362805, 783260, 711850, 356861, 32112, -40674, 103502, 154593, -111409, -473384]
32021d73384n3171K65128K22872P0482K41509N65118M49066k07284p85405p33546
32011d38615k03032K52461L35041J84755Q4455J53956K74688K43235K9680j56015
32001G60609j50378r7356k21883m08577l07646J00695L80621K37210o0568r8284
31991A34443R2715J82787R5733K1050k9767k30884m78492l89466N6970L01439
31981b43472n0111n74201n30490J45662P63113P55594K76547j41458k10463l5613
31971A55108J44731J89531R8944n6286k24432l70440l92602j73712J94427L85258
31961d9473K05613j19835k21459m5698J61129K30472J88822P0318j21080k91491
31951G318l36684l01637k47209p5922K24314L26213k4667m58310l80626Q7452
$$ y = [-473384, -526555, -261427, -38555, 31927, 273436, 838554, 1287620, 1080336, 294931, -438615, -641647, -389186, -54145, 130610, 215065, 369021, 643709, 886944, 916624, 760609, 610231, 512875, 290992, -117585, -425231, -324536, 56085, 293295, 232727, 134443, 227158, 409945, 505678, 526728, 496961, 266077, -212415, -601881, -544911, -243472, -293583, -867784, -1398274, -1252612, -489499, 266095, 542642, 401184, 190721, 155108, 299839, 489370, 588314, 532028, 307596, -62844, -455446, -629158, -434731, -49473, 156140, 36305, -185154, -230852, -69723, 160749, 349571, 419889, 298809, 7318, -329366, -631003, -878212, -954134, -729820, -403607, -428274, -886584, -1267210, -1179758]
31941a179758K02540k32623m79996J466O66124O78917J26931k37269j64992q4941
31931g03601k04006j87172J21261L08830O3534k36930m5481M99699O96638K07033
31921E19805n16612q17817n66560j28440J89699L71696M19402K01769k41216m94239
31911a062513j94050M05341O26111J97383l76717m31806O4025N27426M73383J0384
31901B38967l84593m20143k05247K0145J73718K62028K22101P7440J04007M54019
31891E42442O91038K52225n57426p35860n1004M46031l0471p07966m38050M33891
31881a55150N87131j94694p87414n54971q8245Q5294K18366L84837R9400n35143
31871i40589n56192K54467P21099J23252n23172j64692M67865J69432n65663l82449
$$ y = [-1179758, -977218, -1209841, -1689837, -1688371, -1022247, -343330, -216399, -453668, -618660, -703601, -907607, -1094779, -973518, -664688, -601154, -838084, -883565, -383866, 312772, 519805, 3193, -814624, -1381184, -1509624, -1319925, -948229, -528827, -327058, -568274, -1062513, -1256563, -851222, -225111, -27728, -404445, -836251, -772226, -244800, 228583, 238967, -145626, -565769, -771016, -750871, -577153, -315125, -93024, -15584, 88423, 542442, 1233480, 1485705, 928279, 192419, 141415, 587446, 556975, -150991, -589041, -155150, 431981, 237287, -550127, -1105098, -1193343, -1108049, -889683, -504846, -405446, -940589, -1496781, -1242314, -521215, -397963, -921135, -1085827, -617962, -448530, -1014193, -1396642]
31861a396642N40272P60893j908n12958j52972K78314J79578J2447J01461L265
31851a88250l62873k92446L36871N55444n6400m54696J58439Q43233L65028p56695
31841A47655j033537k90766K63358L2336k70346k1718L93413M10566J27058j11579
31831c53560k95738m87558m64420n2918M88564P56748O63750L77764J7210l49845
31821B99997n51088m14329j2987L48695M30443K80649J43735J56233J79868L850
31811H65066l11192m37835j97332J66164K58655M805k94229l34420j07815J77401
31801b10732L50831L72176K30773r2513m76937o07432k94360J82285L39303J51276
31791e5330P7860K73380K38349l47847q81261n59473L76309Q57070M25202k56892
$$ y = [-1396642, -856370, -95477, -97385, -610343, -763315, -485001, -305423, -292976, -191515, -188250, -551123, -843569, -506698, 48746, -7654, -462350, -303911, 539322, 904350, 147655, -885882, -1176648, -913290, -880954, -1151300, -1173018, -779605, -369039, -241981, -353560, -649298, -1136856, -1601276, -1654194, -1165630, -408882, 254868, 632632, 649842, 299997, -251091, -665420, -678407, -329712, 100731, 381380, 525115, 681348, 861216, 865066, 553874, 116039, -81293, 84871, 343526, 348331, 54102, -280318, -388133, -210732, 140099, 512275, 743048, 650535, 173598, -433834, -728194, -545909, -206606, -55330, 22530, 295910, 534259, 186412, -694849, -1254322, -878013, -20943, 404259, 147367]
31781A47367m63109k77863j33121p4776Q5869K90476L13526R8145k38415n19786
31771g71687n14925j44549K28924J34674k68437k90950K62850P31553N51641J3963
31761f6943l11568l50854k63064M6729N63824P80092L48547k26225k40818J36363
31751D16083J61942l03401o52476n01918j04397K31484M88223O16739M42556L7066
31741H31901k80247m11909n36470o49626n10371j23224J71255J94499J19755Q1700
31731a112737j367j24322j09498O1419J71819J05390n2094k36020l70149j97754
31721a865313L58924P41100L08223n89692q32778o2613P48569O72511P1728j31987
31711e81328J32303J89243j71307m03595j20971L55501N16477K87749l2198j63962
$$ y = [147367, -315742, -593605, -726726, -801502, -715633, -425157, -111631, -13486, -251901, -771687, -1286612, -1431161, -1202237, -1067563, -1336000, -1626950, -1364100, -632547, -80906, -66943, -378511, -729365, -992429, -945700, -381876, 398216, 746763, 520538, 279720, 416083, 578025, 274624, -377852, -879770, -984167, -752683, -264460, 352279, 794835, 831901, 551654, 139745, -396725, -1046351, -1556722, -1679946, -1508691, -1314192, -1194437, -1112737, -1114104, -1238426, -1347924, -1286505, -1114686, -1009296, -1061390, -1297410, -1667559, -1865313, -1506389, -765289, -457066, -1046758, -1879536, -1942149, -1193580, -521069, -449341, -581328, -449025, -259782, -431089, -834684, -955655, -600154, -83677, 204072, 171874, 7912]
31701G912m4760J79033K82271J86260L0020n8315j25996k09662j87797j9280Q6357
31690A26043m207p6752N2396J30158j19201l74551r8043N17666O46190K6032n73871
31679B51860m31625J23083K83197m3253k37818q134K27455Q3012k05177k04053
31669a61453N1725J63497k2622k31918j78846P1117K42235K12535J08603O7429
31659C22302L1987j29424l52949l77648p8789L13148M52102K71896R517j16051
31649C46091q8927R099R6831P5443q7427k14965p1618K78383M81668L46642M1590
31638A212810k45970n23599p01526m88035Q8171M28529J22958l39383k14788L49006
31628c11827N26590J01381k67186j68563O642o8364o9705K16554L19816o7871
$$ y = [7912, -36848, 142185, 424456, 610716, 640736, 582421, 456425, 246763, 58966, 39686, 126043, 121836, 45084, 97480, 227638, 108437, -266114, -364157, 153509, 799699, 825731, 251860, -179765, -56682, 226515, 183262, -54556, -62690, 164765, 247777, 42600, -161453, -109728, 53769, 31147, -200771, -379617, -308500, -66265, 146270, 254873, 322302, 354289, 224865, -128084, -505732, -584521, -271373, 180729, 452625, 462142, 346091, 257164, 266263, 363094, 438537, 351110, 136145, 64527, 342910, 824578, 1171220, 1212810, 966840, 443241, -258285, -746320, -658149, -229620, -106662, -446045, -660833, -311827, 214763, 316144, 48958, -119605, -112963, -181327, -251032, -34478, 285338, 217467]
31618B17467l43183Q8750O79551M75928l60043p98672n37211k63389l05388j46264
31608a292454M21152P02176K07501m74648n49030j21145J98332K58380K71163
31599c78573J89424j11217l26568r4485L08487K86823j54824m09726j60635K60563
31589e90731M30211K95064L6155j54586j45491j9719r0442m50407o66045l28205
31579a684196K62416M64008K12531j3664o4292k58611o03223o11725j45681K45543
31569b196894J89875R8582M44104R25309R00286L26832k50769m45545l05679j0623
31559c24522K91351M31306L33468J14573j21177m01081o26939n20199r4402J78270
31549g39352L3895j22783J25143M71494L86215K0056q0465P9901O0816r5871O8760
$$ y = [217467, -125716, -36966, 642585, 1118513, 758470, -40202, -577413, -840802, -1146190, -1292454, -871302, -169126, 38375, -436273, -985303, -1106448, -908116, -649736, -378573, -189149, -300366, -626934, -721419, -412932, -126109, -280933, -690659, -851294, -590731, -160520, 134544, 170699, 16113, -129378, -149097, -239539, -689946, -1355991, -1684196, -1421780, -957772, -745241, -758905, -823197, -1081808, -1685031, -2296756, -2442437, -2196894, -2007019, -1908437, -1464333, -539024, 361262, 688094, 437325, -8220, -313899, -324522, -33171, 398135, 731603, 846176, 724999, 323918, -303021, -823220, -917622, -739352, -705457, -828240, -703097, -231603, 154612, 174668, 94203, 174104, 234920, 139049, 207809]
31538B07809M51919M00742j29557l59993L6234L49636K4867m25000l66068j28413
31528F2176k93538n40022k20602L47982L10097k16338k56165L35510N35306j16367
31518e1961o05675q871R47873R01606j15372p64571l66506K88219K86747j54509
31508C56980k72487L5801K31367N9069j69800j76684q0673n7658l9594M5296L6169
31497c2214j86267l87092k50218J23640L09302J52999l6824L103Q4324j08355
31487c27602m76758n88165k51302K42172M93732M17210K03581L6266k3072K6529
31477b47409J28506J41562k0509k00760j33442J48028K45730n2450l41310q2916
31467d14970N34898P00808P9487o76531q29664n17282l18731k50883J02207O43612
$$ y = [207809, 659728, 1060470, 930913, 570920, 607154, 956790, 981657, 556657, 190589, 62176, -231362, -771384, -991986, -644004, -333907, -550245, -806410, -470900, 64406, -51961, -657636, -666507, 281366, 1182972, 1067600, 303029, -63477, 224742, 511489, 356980, 84493, 120294, 351661, 410730, 240930, 64246, -16427, -74085, -113679, -68383, -32214, -218481, -605573, -855791, -732151, -422849, -269850, -306674, -303571, -219247, -327602, -804360, -1392525, -1643827, -1401655, -907923, -490713, -287132, -250866, -273938, -247409, -118903, 22659, 2150, -198610, -332052, -184024, 61706, 9256, -332054, -414970, 119928, 820736, 900223, 223692, -605972, -1123254, -1441985, -1692868, -1590661, -947049]
31457i47049P63370L58105P5120K84216N06956K52595k01653l55570k84765l28064
31447A23261l93080j88769J40438K17906P5017L3963J20436J24710Q1008J41459
31437D76349J36950j47986m03523j52986L83815M79902j4812m68761m55037k51917
31427d18006j64425l3246K57537L90896J46634j59284j73447l8800m2201j06314
31417c40656l7462N7065J9322J4792K24941M15128K58385r5656k19406m6425J10132
31406C60160Q4137j2780j25652k93983l56361n5316M61452O40637K20983l74501
31396E48776n84679m09681k66935l08808k69080m59K27142J63857J1258R0543
31386g98066K73729J63366k28682m49749l02472q0788L2051K58605O41710P31154
$$ y = [-947049, -183679, 174426, 249546, 533762, 1040718, 1293313, 1091660, 736090, 451325, 123261, -269819, -458588, -318150, -100244, -25227, 8736, 129172, 253882, 334890, 476349, 613299, 465313, 61790, -91196, 292619, 772521, 757709, 288948, -166089, -418006, -582431, -615677, -358140, 32756, 179390, 20106, -153341, -192141, -234342, -340656, -378118, -321053, -301731, -286939, -61998, 353130, 611515, 515859, 296453, 250028, 360160, 444297, 431517, 305865, 11882, -344479, -399795, 61657, 702294, 923277, 548776, -35903, -445584, -712519, -1021327, -1290407, -1290866, -1063724, -899867, -888609, -798066, -524337, -360971, -589653, -1039402, -1341874, -1422662, -1390611, -1132006, -490296, 240858]
31376B40858L09516q4928M8961L10989M7477n03354n68641j22473J29282j1441
31366b03754N262L52792M40374k8194m78426l89781o1780K1776m4614M1214K00861
31355a44270K38858K28047K20426M0593k63484k77021R2047L25665J12659j17853
31345D55667N0164L11882K29210k0386p2803m8290j75991k26916K5690K21482
31335G49709l1431m12269l89394j07721p4800k71975k70414K0651L41748N46263
31325A00367N30417Q9509n78717p23616p9927M93851K25431l17818j89543K88321
31315a61725R5207o38216p58450L517O29815M73734O1227m2063k0604j09310j14074
$$ y = [240858, 550374, 465446, 514407, 825396, 872873, 369519, -199122, -321595, -192313, -203754, -198492, 154300, 594674, 566480, 88054, -301727, -363507, -341731, -386345, -345131, -144270, 94588, 322635, 543061, 583654, 320170, 43149, 135196, 460861, 573520, 455667, 505831, 817713, 1046923, 1026537, 953734, 905444, 729453, 502537, 528227, 749709, 718278, 306009, -83385, -191106, -265906, -537881, -808295, -787644, -445896, 100367, 630784, 720293, 141576, -582040, -661967, -168116, 57315, -260503, -450046, -161725, -66518, -704734, -1463184, -1459667, -829852, -356118, -294891, -336954, -357558, -466868, -580942]
$$ [...]
##END NTUPLES=NMR SPECTRUM
##END=
