##TITLE=31Pdec_48-2022
 CDCl3, 24 sc
 25.7.2022
##JCAMPDX= 6.0         $$ Bruker NMR JCAMP-DX V2.0
##DATA TYPE= NMR SPECTRUM
##DATA CLASS= NTUPLES
##ORIGIN= UXNMR, Bruker Analytische Messtechnik GmbH
##OWNER= root
$$ XWIN-NMR		Version 3.5
$$ Mon Jul 25 14:48:34 2022 Russian Standard Time (UT+4h)  she@DPX200
##.OBSERVE FREQUENCY= 81.013821
##.OBSERVE NUCLEUS= ^31P
##.ACQUISITION MODE= SIMULTANEOUS
##.ACQUISITION SCHEME= undefined
##.AVERAGES= 24
##.DIGITISER RES= 16
##SPECTROMETER/DATA SYSTEM= spect
##.PULSE SEQUENCE= zgpg30
##.SOLVENT NAME= CDCl3
##.SHIFT REFERENCE= (INTERNAL, CDCl3, 0, 248.564)
##AUDIT TRAIL= $$ (NUMBER, WHEN, WHO, WHERE, WHAT)
$$ ##TITLE= Audit trail, XWIN-NMR		Version 3.5
$$ ##JCAMPDX= 5.01
$$ ##ORIGIN= Bruker BioSpin GmbH
$$ ##OWNER= she
$$ F:/spectra/data/she/nmr/P31/1/pdata/1/auditp.txt
$$ ##AUDIT TRAIL=  $$ (NUMBER, WHEN, WHO, WHERE, WHAT)
(   1,<2022-07-25 14:47:34.09 +0400>,<she>,<DPX200>,
      <created by zg, POWCHK disabled, PULCHK disabled
       configuration hash MD5:
       00 E9 B6 7A A2 85 ED C7 34 08 36 98 17 FE 4E 26
       data hash MD5: 32K
       62 DB A9 0D 9F B8 C2 64 4A 9D 28 7C 8F 69 9C 83>)
(   2,<2022-07-25 14:47:36.70 +0400>,<she>,<DPX200>,
      <Start of raw data processing
       efp BC_mod = 2 LB = 1 FT_mod = 6 PKNL = 1 PHC0 = -10459.35 PHC1 = 537.4568 SI = 64K 
       data hash MD5: 64K
       A1 EF C5 F2 85 C5 10 30 1B 6A D7 5C 9F 47 5B 71>)
(   3,<2022-07-25 14:48:04.15 +0400>,<she>,<DPX200>,
      <pk PHC0 = 81.37791 PHC1 = -181.2 
       data hash MD5: 64K
       4B 2A DA FE 56 38 B4 27 E9 12 D8 C1 4F 15 5E F3>)
(   4,<2022-07-25 14:48:07.68 +0400>,<she>,<DPX200>,
      <abs ABSG = 5 
       data hash MD5: 64K
       8A 7F 97 7C D2 A0 2A 89 03 A6 D6 15 3A 4F 38 4B>)
$$ ##END=
$$ 
$$ hash MD5
$$ D3 39 D5 6D 79 BD EC CD 2A D7 C1 EF 0A 89 7F FF
##$RELAX= 
##$RELAX= 
##$RELAX= 
##$RELAX= 
##$RELAX= 
##$RELAX= 
##$RELAX= 
##$RELAX= 
$$ Bruker specific parameters
$$ --------------------------
##$DU= <F:/spectra>
##$EXPNO= 1
##$NAME= <P31>
##$PROCNO= 1
##$TYPE= <nmr>
##$USER= <she>
##$AMP= (0..31)
100 100 100 100 100 100 100 100 100 100 100 100 100 100 100 100 100 100 
100 100 100 100 100 100 100 100 100 100 100 100 100 100 
##$AQSEQ= 0
##$AQ_mod= 1
##$AUNM= <au_zg>
##$AUTOPOS= <>
##$BF1= 81.014009
##$BF2= 200.13
##$BF3= 200.13
##$BF4= 200.13
##$BF5= 200.13
##$BF6= 200.13
##$BF7= 200.13
##$BF8= 200.13
##$BYTORDA= 1
##$CFDGTYP= 0
##$CFRGTYP= 5
##$CHEMSTR= <none>
##$CNST= (0..31)
1 1 145 1 1 1 1 1 1 1 1 1 1 1 1 1 1 1 1 1 1 1 1 1 1 1 1 1 1 1 1 1 
##$CPDPRG= <waltz16>
##$CPDPRG1= <>
##$CPDPRG2= <waltz16>
##$CPDPRG3= <>
##$CPDPRG4= <mlev>
##$CPDPRG5= <mlev>
##$CPDPRG6= <mlev>
##$CPDPRG7= <mlev>
##$CPDPRG8= <mlev>
##$CPDPRGB= <>
##$CPDPRGT= <>
##$D= (0..31)
0 1 0 0 0 0 0 0 0 0 0 0.03 2e-05 3e-06 0 0 0 0 0 0 0 0 0 0 0 0 0 0 0 0 
0 0 
##$DATE= 1658746053
##$DBL= (0..7)
120 120 120 11 120 120 24 19 
##$DBP= (0..7)
150 150 150 150 150 150 150 150 
##$DBP07= 0
##$DBPNAM0= <>
##$DBPNAM1= <>
##$DBPNAM2= <>
$$ [...]
##$SUBNAM3= <"">
##$SUBNAM4= <"">
##$SUBNAM5= <"">
##$SUBNAM6= <"">
##$SUBNAM7= <"">
##$SUBNAM8= <"">
##$SUBNAM9= <"">
##$SW= 501.771253377433
##$SWIBOX= (0..15)
0 1 3 0 0 0 0 0 0 0 0 0 0 0 0 0 
##$SW_h= 40650.406504065
##$TD= 32768
##$TD0= 1
##$TE= 0
##$TE2= 300
##$TE3= 300
##$TEG= 300
##$TL= (0..7)
0 120 53 12 22 120 120 120 
##$TP= (0..7)
150 150 150 150 150 150 150 150 
##$TP07= 0
##$TPNAME0= <>
##$TPNAME1= <>
##$TPNAME2= <>
##$TPNAME3= <>
##$TPNAME4= <>
##$TPNAME5= <>
##$TPNAME6= <>
##$TPNAME7= <>
##$TPOAL= (0..7)
0.5 0.5 0.5 0.5 0.5 0.5 0.5 0.5 
##$TPOFFS= (0..7)
0 0 0 0 0 0 0 0 
##$TUNHIN= 0
##$TUNHOUT= 0
##$TUNXOUT= 0
##$USERA1= <user>
##$USERA2= <user>
##$USERA3= <user>
##$USERA4= <user>
##$USERA5= <user>
##$V9= 5
##$VALIST= <valist>
##$VCLIST= <CCCCCCCCCCCCCCC>
##$VD= 0
##$VDLIST= <DDDDDDDDDDDDDDD>
##$VPLIST= <PPPPPPPPPPPPPPP>
##$VTLIST= <TTTTTTTTTTTTTTT>
##$WBST= 1024
##$WBSW= 4
##$XGAIN= (0..3)
0 0 0 0 
##$XL= 0
##$YL= 0
##$YMAX_a= 1933
##$YMIN_a= -1835
##$ZGOPTNS= <>
##$ZL1= 120
##$ZL2= 120
##$ZL3= 120
##$ZL4= 120
##$ABSF1= 248.5645
##$ABSF2= -253.2056
##$ABSG= 5
##$ABSL= 3
##$ALPHA= 0
##$AQORDER= 0
##$ASSFAC= 0
##$ASSFACI= 0
##$ASSFACX= 0
##$ASSWID= 0
##$AUNMP= <proc_1d>
##$AZFE= 0.1
##$AZFW= 0.5
##$BCFW= 0
##$BC_mod= 2
##$BYTORDP= 0
##$COROFFS= 0
##$CY= -3
##$DATMOD= 1
##$DC= 0
##$DFILT= <>
##$DTYPP= 0
##$F1P= 0
##$F2P= 0
##$FCOR= 1
##$FTSIZE= 65536
##$FT_mod= 6
##$GAMMA= 0
##$GB= 0
##$INTBC= 1
##$INTSCL= 5.30512e-09
##$ISEN= 30
##$LB= 1
##$LEV0= 0
##$LPBIN= 0
##$MAXI= 10000
##$MC2= 0
##$MEAN= 0
##$ME_mod= 0
##$MI= 50
##$NCOEF= 0
##$NC_proc= -6
##$NLEV= 6
##$NOISF1= 182.463
##$NOISF2= 159.3651
##$NSP= 0
##$NTH_PI= 0
##$NZP= 0
##$OFFSET= 248.5645
##$PC= 4
##$PHC0= -10377.97
##$PHC1= 356.2568
##$PH_mod= 1
##$PKNL= yes
##$PPARMOD= 0
##$PSCAL= 0
##$PSIGN= 0
##$REVERSE= no
##$SF= 81.014009
##$SI= 65536
##$SIGF1= 159.3651
##$SIGF2= -187.1042
##$SINO= 113.3802
##$SIOLD= 16384
##$SREGLST= <1H.CDCl3>
##$SSB= 0
##$STSI= 65536
##$STSR= 0
##$SW_p= 40650.406504065
##$SYMM= 0
##$S_DEV= 0
##$TDeff= 32768
##$TDoff= 0
##$TI= <>
##$TILT= no
##$TM1= 0
##$TM2= 0
##$TOPLEV= 0
##$USERP1= <user>
##$USERP2= <user>
##$USERP3= <user>
##$USERP4= <user>
##$USERP5= <user>
##$WDW= 1
##$XDIM= 65536
##$YMAX_p= 295725840
##$YMIN_p= -4848737
$$ End of Bruker specific parameters
$$ ---------------------------------
##NTUPLES= NMR SPECTRUM
##VAR_NAME=  FREQUENCY,     SPECTRUM/REAL,   SPECTRUM/IMAG
##SYMBOL=    X,             R,               I
##VAR_TYPE=  INDEPENDENT,   DEPENDENT,       DEPENDENT
##VAR_FORM=  AFFN,          ASDF,            ASDF
##VAR_DIM=   65536,         65536,           65536
##UNITS=     HZ,            ARBITRARY UNITS, ARBITRARY UNITS
##FACTOR=    0.620285442955139, 1,           1
##FIRST=     20137.2065510759, 0,            0
##LAST=      -20513.1999529892, 0,           0
##MIN=       -20513.1999529892, -4848737,    0
##MAX=       20137.2065510759, 295725840,    0
$$ Real data points
##PAGE= N=1
##DATA TABLE= (X++(R..R)), XYDATA
$$ [...]
39808C51171M92695K71142J83814N9256j87845l70818m09987l50687j15331L23252
39798B46662O81165O45735K74031j10002k17710O4985M98572M88603k14016q98536
39788A459489p30826j49519l93668j468071j793290m31156J450412K117503J371658
39779A432532K84183l66421m85532j52685L36093L72561k21154p64915o60883
39770b26221k10631J14329M81598R98816J003382P4947r13875r10159l12905k72010
39760a72729p69987p34594J14424Q52411Q46253N02938L33766K41224l6063n17636
39750F60007j111846j503039j047294M18836J835511J920008Q26288j26463k75221
39741A596787j43699k31085m00085n27199o58510m52733L83798J069187M91542
$$ y = [351171, 843866, 1115008, 1298822, 1358078, 1170233, 799415, 389428, 38741, -76590, 246662, 927827, 1573562, 1847593, 1737591, 1519881, 1584866, 2083438, 2572041, 2358025, 1459489, 728663, 579144, 185476, -1282595, -3075885, -3507041, -2056629, 60874, 1432532, 1716715, 1350294, 864762, 712077, 1048170, 1420731, 1199577, 434662, -226221, -436852, -322523, 159075, 1157891, 2161273, 2236220, 1322345, 412186, 99281, -172729, -942716, -1677310, -1562886, -710475, 135778, 638716, 972482, 1213706, 1177643, 660007, -451839, -1954878, -3002172, -2583336, -747825, 1172183, 1998471, 1872008, 1596787, 1453088, 1222003, 821918, 294719, -363791, -816524, -432726, 636461, 1128003]
39732A128003q49462j153714N838R03724K85481p89017q01925q2876J31195j46288
39722a369041k3238M32848L44880k84839n01960J8407N63032O26750M77140L34196
39712F18175j2857n01306n56424N2562P01649O28201j63025r11054q40619Q2485
39702i02213R76541Q51381j73368q43889l47756N72897O81530m2891n60905l23904
39692a12577K27747N69160N95729K66020l71147p53226k99166N44804O48402j83889
39682A131857q30941m71143K60853L01663l17229o67584k86576K95604L22023
39673b61473k70632p47665l57543P25285J449046J148944M11525J36001J60588
39664B394076k50081q48181o32198L05077O17518j53327p50818l04319K15366
$$ y = [1128003, 278541, -875173, -869335, 34389, 319870, -469147, -1271072, -1353948, -1222753, -1369041, -1392279, -959431, -614551, -899390, -1401350, -1382943, -819911, -193161, 283979, 618175, 605318, 104012, -452412, -399850, 301799, 930000, 766975, -144079, -984698, -902213, 74328, 925709, 752341, -91548, -439304, 133593, 815123, 772232, 211327, -112577, 115170, 684330, 1280059, 1546079, 1174932, 421706, 122540, 667344, 1315746, 1131857, 300916, -170227, 90626, 392289, 75060, -592524, -879100, -583496, -261473, -532105, -1279770, -1637313, -912028, 537018, 1685962, 2097487, 2233488, 2394076, 2143995, 1295814, 663616, 968693, 1586211, 1432884, 682066, 377747, 593113]
39655E93113j64443n02336M33601J646245J120936q65787j865407q45321M65654
39646A6255M61865q7745J58316O98781K33587q72245r82899K40870J260382Q44560
39636A971727l59187q74767k32766P16327R01294J01024r04115j148000n51179
39627c79642k3802k74119q15261o23411M31240J402193J464413P39979r7050n27545
39617A296995m29110o3932R1404j50719m07131l07545j22347k31347k70993K86823
39607c07902Q82727M15735q04816j052739K56244J369725O42302r63084j273655
39598h35463n9638Q83890N30399k03194k72653K4620k5571l18686l39107k9756
39588f45159L44138O18685O05845J32828m65031n30778o7368J76408r0190k42801
$$ y = [593113, 428670, -73666, 359935, 2006180, 3127116, 2261329, 395922, -449399, 16255, 478120, 390375, 548691, 1247472, 1481059, 608814, -374085, -133215, 1127167, 1971727, 1612540, 737773, 505007, 1221334, 2122628, 2223652, 1319537, 171537, -379642, -403444, -677563, -1492824, -2116235, -1684995, -282802, 1181611, 1921590, 1824540, 1296995, 867885, 803953, 895357, 744638, 337507, 29962, -92385, -323732, -594725, -307902, 574825, 990560, 185744, -866995, -610751, 758974, 1401276, 438192, -835463, -895101, -11211, 519188, 315994, 43341, 67961, 42390, -276296, -615403, -645159, -301021, 317664, 923509, 1056337, 591306, 60528, -6840, 169568, 79378, -163423]
39578a63423P9334K44184k80244r39751r84625o16282l90392j55120M41616R68903
39568a795800Q23142L85822M42661P80011N63996r9773l05670k1268j99124r41801
39558c67804r96220K33957J403122R75383n64857j381425p19044M33795R79660
39549c433R46879Q36597N97738j06755r94316j253848o46290L2192l0662n30111
39539a152009n04838K24503Q29622P95535O09522P12382O30536q1423p55994n06771
39529H01065K55958L52910l47261q14597n16016o755K39411M03204M73600K9217
39519H70736o99606p14011J83985P78186J92982o74380m46600O96788J306926
39510A495006O10095p18849j514906j185490k3855J013295J078229L53603j61719
$$ y = [-163423, -84089, 160095, -120149, -1059900, -2044525, -2660807, -3051199, -3206319, -2764703, -1795800, -972658, -586836, -144175, 635836, 1199832, 1100059, 794389, 773121, 573997, -367804, -1364024, -1130067, 273055, 1248438, 683581, -697844, -1416888, -983093, -3433, 943446, 1780043, 2377781, 2271026, 1276710, 22862, -623428, -591236, -621898, -1152009, -1656847, -1432344, -602722, 192813, 802335, 1514717, 2145253, 2063830, 1307836, 801065, 1057023, 1409933, 1062672, 248075, -267941, -274696, -35285, 367919, 841519, 870736, 171130, -542881, -358896, 419290, 612272, -62108, -508708, 188080, 1495006, 2105101, 1386252, -128654, -1314144, -1337999, -324704, 753525, 1107128, 945409]
39501I45409l3179J05456k07619m23420o0736L03196P0360k09278J17112L84709
39491I92010k82684j045572l46130J337094J712966M6864j555292j100724O11303
39482C69835J446588Q57896n0319n48344q23051q37683j52889R62227J413478
39473B637738O53178o32192j501334j707155j382646n61074M67386R51084N17945
39464e57070j57489j94902K67525M05539N9397j12407J58625L18387K8860k59981
39454d3516k34105l28182p44683p25521K34433J179704R32395J9193r5498N56371
39444G50591M67130p29231j433085n63896O93877O96145l19734r19110o06386
39435a963699k9016L36202N12020M44326J40910O7322N13391R16828O35200l0893
$$ y = [945409, 912230, 1017686, 810067, 386647, 325911, 629107, 699467, 490189, 607301, 992010, 709326, -336246, -682376, 654718, 2367684, 2414548, 859256, -241468, 369835, 1816423, 2674319, 2624000, 2075656, 1252605, 414922, 262033, 1224260, 2637738, 3290916, 2658724, 1157390, -549765, -1932411, -2493485, -2026099, -1075015, -557070, -714559, -909461, -641936, -236397, -177000, -289407, -130782, 187605, 216465, -43516, -277621, -605803, -1350486, -2076007, -1841574, -661870, 270525, 289718, 194220, 750591, 1217721, 488490, -944595, -1508491, -814614, -118469, -438203, -1357313, -1963699, -1992715, -1656513, -1144493, -700167, -559257, -491935, 21456, 938284, 1573484, 1542591]
39425A542591l84532l83634l14152n8794L37976J16210r80020j665380p77206
39416b566941O47397P08213l67336n93451M81557J071990K17038o12849r614J064078
39406D0082Q72927m21642j168712o06214M37004Q82728N21529n0914j01034M29438
39396H35192O57328j48545j219455j000104N91024J767776J215559k94922j238750
39387A165103j189958o36123Q16L53646P7784m21403k24027M79221K75902j095432
39377a214471j781608n29097J133495J168414J78576J54494J055604J108896M5213
39368A319516n46474j42735n1308p76547r84605J9262Q76702M04000n34894o63889
39358a080972k67935j65643r1014L85204N22850l08909r98532k12774J126765
$$ y = [1542591, 1158059, 774425, 460273, 401479, 739455, 855665, -124355, -1789735, -2566941, -1919544, -1211331, -1578667, -2172118, -1690561, -618571, -401533, -1014382, -1023996, 40082, 913009, 491367, -677345, -1283559, -846555, 36173, 557702, 506788, 405754, 835192, 1492520, 1343975, 124520, -875584, -284560, 1483216, 2698775, 2403853, 1165103, -24855, -660978, -660162, -306516, -228732, -650135, -874162, -394941, -119039, -1214471, -2996079, -3525176, -2391681, -1223267, -1044691, -890197, 165407, 1274303, 1319516, 773042, 630307, 578999, -197548, -1182153, -1162891, -286189, 117811, -417083, -1080972, -1348907, -1514550, -1605564, -1220360, -697510, -1006419, -2004951, -2217725, -1090960]
39349a090960R34153p36757j600323n78658P18900O90076P8843L78282J278136
39340G1692J300289K40993o04214m26501K50109P27134R08189P09724j43876j270655
39330A762884j572321o85207K86517K12310n47104q70279n37259j69524Q7344
39321b032639O49093J331456J277185L11980n98086o51374j85473P7542M4637
39312B24321J0962j04j19012k71519l60840m45462m63956k32199Q2818P7455q6683
39301a584219K50770J053959J339642O36965k08093l73001k77737n72598q16901
39292e51213l47653K57565k1811q21656q14499J97307J019012R51939N98078N12821
39282I79890L01880m23968j165826j220123o28309J1498K55669Q7996j65406j30565
$$ y = [-1090960, -156807, -893564, -2493887, -3072545, -2353645, -1663569, -1584726, -1206444, 71692, 1371981, 1612974, 1008760, 582259, 832368, 1559502, 2467691, 3177415, 3033539, 1762884, 190563, -494644, -208127, 4183, -542921, -1413200, -1950459, -2119983, -2032639, -1383546, -52090, 1225095, 1537075, 938989, 287615, 102142, 179684, 224321, 235283, 235179, 116167, -155352, -516192, -961654, -1425610, -1657809, -1574991, -1497536, -1584219, -1333449, -279490, 1060152, 1697117, 1489024, 1116023, 838286, 265688, -551213, -898866, -641301, -663112, -1484768, -2299267, -2101960, -1082948, -131009, 467069, 979890, 1281770, 857802, -308024, -1528147, -2156456, -2144958, -1889289, -1801293, -1966699, -2097264]
39272b097264J16980Q6579k09771N2570J146558J816243Q95565o34405p97733
39263C75322M20504J097381M19548l09878k03697k25370j059599j505824n42833
39254a534446N83039K17459q59903n22388J315266K424459J404355n92400j607401
39245H28040j053705K69624J314538J427959N51426p14798j515450j419451o37344
39236i49161K38387N45721L2946o49015m59662N87187J135946K81469j025448
39227b61630j232858k78856N91143O79558M05064K48461K18630L10447N48425
39218A228384O09932K19244k33153k66379j95960n04479p24809j50732O54943
39209F36991M92903m36527o69393K21127J011723Q31990K54295o2320k88007m24454
$$ y = [-2097264, -1980284, -1893705, -2103476, -2050906, -904348, 911895, 1807460, 1173055, 375322, 795826, 1893207, 2312755, 2002877, 1799180, 1573810, 514211, -991613, -1534446, -951407, -733948, -1593851, -2116239, -800973, 1623486, 3027841, 2435441, 828040, -225665, 43959, 1358497, 2786456, 3337882, 2623084, 1107634, -311817, -949161, -710774, -165053, -132107, -781122, -1240784, -653597, 482349, 763818, -261630, -1494488, -1773344, -1182201, -502643, -97579, 150882, 369512, 679959, 1228384, 1838316, 2057560, 1824407, 1558028, 1362068, 857589, 132780, -17952, 636991, 1129894, 693367, 23974, 245101, 1256824, 2088814, 2343109, 2280789, 1992782, 1568328]
39199A568328K5555O78003K33342j207412j544764K20707J955279J287906q38312
39190B378632j704957r11893m05607q55947p49722N32074J279856J92573j402026
39181a647017j486410j85158P78431N91562l2756k58439K5144N36138Q77252O14091
39171a87162k28445r01377p42232m3659M27797M92160M92756M32567k1955o97651
39161i77201q63948k46461N10535O99135M12640K13314K75986K77548k550l55040
39151e6042m48238k08440J99524N92769Q17436O80442P7395p35882j184086q75742
39141a140864l7210O64094P07155J10403n98609p22563L1356J079842J325838
39132A419442L53491r49095j384389q36384j22191K84365N51317O14369J05082
$$ y = [1568328, 1593883, 2271886, 2505228, 1297816, -246948, -26241, 1929038, 3216944, 2378632, 673675, -238218, -643825, -1499772, -2249494, -1717420, -437564, -244991, -1647017, -3133427, -3318585, -2540154, -1948592, -1981348, -2239787, -2214643, -1678505, -801253, -187162, -415607, -1316984, -2059216, -2102875, -1675078, -1182918, -690162, -257595, -279550, -977201, -1841149, -2087610, -1577075, -877940, -465300, -251986, 24000, 301548, 298998, -56042, -504280, -712720, -513196, 79573, 897009, 1577451, 1654846, 918964, -265122, -1140864, -1178074, -513980, 193175, 303578, -295031, -1017594, -986238, 93604, 1419442, 1772933, 823838, -560551, -1396935, -1519126, -1234761, -683444, -69075, 36007]
39123C6007n86650l61197Q28872J396145L32340r72446n67222J041263J480445
39114B627557J2179j448629j288026l67217j98759m56271J16847J239015J372758
39105A609454K54782n85245j61637N58709K85161o62860j015417m71201Q9308
39096i8946N9775j75157o0661L30729N94921N98133M68235K81630L7028k21242
39086A814445m34819n65453n35947l41262k35978m50487o32095j05275R94508
39077d92363J467144N82141o59875p77124n551M6000r83801j457943l00984J128733
39067a453623J015861j26875l53255N86748R53139n5727r71411l65569J023880
39058B53168J531811Q61618L569m11469n32834m94014k50663l3361j20237k77239
$$ y = [36007, -550643, -911840, -82968, 1313177, 1645517, 673071, 105849, 1147112, 2627557, 2639736, 1191107, -96919, -464136, -662895, -1119166, -1002319, 236696, 1609454, 1864236, 1278991, 1117354, 1676063, 1961224, 1298364, 282947, -188254, -98946, -39171, -214328, -274989, 55740, 650661, 1248794, 1717029, 1998659, 2035687, 1814445, 1379626, 814173, 278226, -63036, -299014, -749501, -1381596, -1486871, -492363, 974781, 1556922, 897047, 119923, 114372, 160372, -823429, -2281372, -2582356, -1453623, -437762, -564637, -917892, -331144, 621995, 566268, -405143, -770712, 253168, 1784979, 2646597, 2650166, 2238697, 1705863, 1211849, 961186, 927825, 807588, 530349]
39048E30349j02670K39533K59386r1432m98688q66813j163116r86859r0140Q80556
39038a889894J016417M24897M6230K48864M65733K48149j72150m44350m05749
39029d61853J79197J253208J830766Q99926q16336j316656p8739R85739K40479
39020B715731j265043j421426j65399O68027J69288o38599o65240j28308L19007
39011d11962N94859P52962N27050l7926k72154J44695N36903K27153l90962n17603
39001A153015k20372j89108m87724m70915N1858M20246J34958l81826l83939K62299
38991a11508J019250J234670N93875n96974j412910j067828O6550O99067K30204
38982F54396m41425k66586L99619M73344l3481m9816O77353R96826J25293j057839
$$ y = [530349, 427679, 667212, 926598, 835166, 336478, -530335, -1693451, -2680310, -2770450, -1889894, -873477, -448580, -402350, -153486, 312247, 560396, 388246, -56104, -461853, -282656, 970552, 2801318, 3701244, 2884908, 1568252, 1489513, 2475252, 2715731, 1450688, 29262, -136137, 531890, 701178, 62579, -602661, -730969, -411962, 182897, 935859, 1462909, 1424983, 1152829, 1297524, 1834427, 2061580, 1670618, 1153015, 932643, 743535, 255811, -215104, -163246, 257000, 391958, 10132, -373807, -111508, 907742, 2142412, 2736287, 2139313, 726403, -341425, -274875, 424192, 654396, 212971, -53615, 346004, 819348, 785867, 736051, 1413404, 2410230, 2535523, 1477684]
38972A477684j273739o09551p5862M6868L25111Q55867R48254K85285m84158o57261
38962H38498l49410j16599k06453n13076q58195r82102o02290J67840P14234N70391
38952a337162j244l53506k20891J41131M46817O51947P20944M75316r7235n69638
38942a43521m61887O1772K54150k03994o08110j52018P84344J017376K52277m79002
38932C21387l75611L8708l7122l95896m26811k68966l10441j41577P29343J536693
38922F69707J096325j62495n79290J75592N66909k78956j149090p72490J49618
38913b84170K25513l62413l53833M17300Q14192K16774o76434r78966o26810o6781
38903a675628L82917O29072O75443N68430L27124q373k22861j33883n272k43843
$$ y = [1477684, 203945, -405606, -481468, -434600, -109489, 746378, 1694632, 1979917, 1495759, 838498, 489088, 372489, 166036, -347040, -1205235, -2187337, -2789627, -2621787, -1907553, -1337162, -1338406, -1691912, -1912803, -1771672, -1324855, -672908, 48036, 523352, 426117, -143521, -605408, -543636, -289486, -493480, -1101590, -1253608, -469264, 548112, 800389, 321387, -54224, -15516, -52638, -448534, -875345, -1144311, -1454752, -1596329, -866986, 669707, 1766032, 1603537, 1024247, 1199839, 1766748, 1487792, 338702, -433788, -284170, -58657, -421070, -774903, -357603, 456589, 673363, -3071, -982037, -1608847, -1675628, -1292711, -663639, 11804, 580234, 907358, 898985, 676124, 542241, 536969, 293126]
38893B93126n85858l06340N30090R22418M68336L8141K41434L06058m91755j278205
38883A37445q28380L49826P01320j3122n78710l79209o0962q2349l7216L01569
38873d89788M94211L12656Q4545l1815j36133N5557P75869J165176J32369j568805
38863G93842j792824o8556J463280J063415k28891m56918L66057P66800K65909
38854B172114l29560n91251q72843j184811r89432k15280N17581P79288O72190
38845d2004L34008j51846m14133j14877M00356M59939N4768j99322p8827l3470
38835B14592l37888n91313l16584L45862P79424N49665j47773o21562l74778K97934
38825b02421O77221N97575N32287N80051J62723q10528j316147n65680O45978
$$ y = [293126, -292732, -599072, -68982, 853436, 1321772, 1359913, 1601347, 1907405, 1415650, 137445, -690935, -341109, 360211, 347089, -231621, -610830, -671792, -754141, -791357, -489788, 4423, 317079, 401624, 369809, 233676, 289233, 1065102, 2230278, 2362647, 793842, -998982, -1067538, 395742, 1459157, 1230266, 773348, 1139405, 1906205, 2172114, 1842554, 1251303, 378460, -806351, -1795783, -2011063, -1493482, -714194, -42004, 292004, 140158, -273975, -388852, 11504, 471443, 526211, 326889, 248062, 214592, -123296, -714609, -1031193, -685331, 94093, 643758, 495985, -125577, -500355, -202421, 474800, 1072375, 1604662, 2184713, 2347436, 1536908, 220761, -344919, 301059]
38816C01059Q96470L1634q27292q59616k24990N40581Q99253L91749o95642j102373
38806f49167j37497R32343M21181j100809j367945K14437J599058J120619k21439
38797H10781n69867Q7242L73150k23071q98348q74012j28690Q60395J333094O71064
38787A441738o85259j327663o15496L76029M53509O539L7179L45644J12206l49032
38777b04606q5925N68559L45328o87742r91520j3379R30108P93675K02598p4464
38767G82632m74765j342610j663936n56891R39747J117080N2420o55575k57242
38758b059140M63136P33417O55403M18735j17821p58334q71461l09653L25757
38749a519961N53056M38827Q5408m61313o86766M966J087077J144894j58586j329199
$$ y = [301059, 1197529, 1229163, 401871, -457745, -682735, -142154, 757099, 1148848, 453206, -649167, -786664, 145679, 566860, -533949, -1901894, -1687457, -88399, 1032220, 810781, 240914, 328156, 701306, 478235, -420113, -1294125, -1422815, -562420, 770674, 1441738, 756479, -571184, -1186680, -810651, -357142, -350603, -313424, 32220, 144426, -204606, -290531, 278028, 623356, -64386, -1055906, -1069285, -139177, 654498, 857096, 782632, 307867, -1034743, -2698679, -3255570, -2315823, -1198743, -1146323, -1801898, -2059140, -1596004, -862587, -207184, 211551, 93730, -664604, -1536065, -1845718, -1519961, -966905, -528078, -442670, -903983, -1590749, -1585783, -498706, 646188, 487602, -841597]
38739h41597r75804L37818J032100O21307q9094m36306m91875m24460k09272M0963
38729a436220J64538L02620N57702N40091J077l67029K38483J224674J118166
38720B344102k29032j180341n94797N47285O37249l15153r77991o97376q0193
38711e46247K23671K68279K42495K1400m06507o40764l31198L58908R13434Q83787
38701I87258J86463p23007j064150n05321L44326O21686K81581j7361J2492k947
38691A21020k68683m24896k17123P9170J91938K02776P4193m73416j187765j140122
38681c042908j1217J132883J166847M79523K84378P59255R61318M32100k38405
38672A923774n20892n61999m76150k7748O25011P93239L20890m5714J53665L50723
$$ y = [-841597, -1817401, -1479583, -447483, 173824, 84730, -351576, -843451, -1267911, -1477183, -1436220, -1271682, -969062, -411360, 128731, 129808, -237221, 1262, 1225936, 2344102, 2115070, 934729, 339932, 887217, 1524466, 1209313, 231322, -466054, -546247, -322576, -54297, 188198, 209598, -196909, -837673, -1168871, -809963, 103471, 987258, 1173721, 450714, -613436, -1118757, -774431, -152745, 128836, 111475, 123967, 121020, -147663, -572559, -789682, -710512, -518574, -315798, -241605, -715021, -1902786, -3042908, -3054125, -1921242, -754395, -274872, 9506, 768761, 1730079, 2162179, 1923774, 1402882, 840883, 364733, 336985, 961996, 1755235, 2076125, 2030411, 2184076, 2534799]
38662B534799j7255n21196n21476k52865k92853m88666l04398J53839L41861K30773
38652H62563K18522K99192J27928k41893m46409m78369n25066l44049L69572J150820
38642I92811J198633N80155J11289O4044p3534n05653p64045n94984l17491j22370
38632E68855J34036L19454J25869j22405K03701P64325M88526o42104j332809
38623E07448r40906l65458l70683m26701m9667J40362j94675o8468J065553J767728
38613A064533N85351j370006j773898m58978N68031K61328l15976j63647J75188
38604a428074j23935q17726j129725o76100M61593J711914K025218R54670l28635
38595F49200l39113M77227L26706r96874j562647k55194J459713J680169N39183
$$ y = [2534799, 2517544, 1996348, 1474872, 1222007, 929154, 440488, 136090, 289929, 631790, 862563, 1081085, 1380277, 1508205, 1266312, 819903, 341534, -183532, -527581, -158009, 992811, 2191444, 2771599, 2882888, 2946932, 2873398, 2367745, 1603700, 1008716, 691225, 568855, 702891, 1022345, 1148214, 1025809, 1229510, 1993835, 2482361, 1840257, 507448, -433458, -798916, -1169599, -1596300, -1645967, -1505605, -1700280, -1768748, -703195, 1064533, 1649884, 279878, -1494020, -1952998, -1384967, -1123639, -1439615, -1603262, -1428074, -1552009, -2369735, -3499460, -4175560, -3713967, -2002053, 23165, 977835, 649200, 310087, 787314, 1114020, 117146, -1445501, -1700695, -240982, 1439187, 1978370]
38586A978370n58450r54532q27729k66057N46413R31829N40460k2037j60758j38539
38576A068970k54695j44531K58899J46697p32378j164157k61679Q94362Q78094
38567F89582J79113J24736M37771q4154j046309r04274K22797N19648m91105j139435
38557a491630m19794N26111O04074M20593O02219L73808p02838j254351j59690
38548a501498J249492J047061k31200n48389K71727N01602l18977o02891L99669
38539B66596J166629M11437p83160p57890J22091K79277m85738q90339l35997
38530a007094L69251N26485M62280N91558O22752J89658m89541j033865j341705
38521a110221j233211l58846R97231J675328R44603l68753q27111k01518M32620
$$ y = [1978370, 1419920, 465388, -362341, -628398, -81985, 849844, 1390304, 1368267, 1207509, 1068970, 814275, 669744, 928643, 1075340, 342962, -821195, -1082874, -188512, 689582, 868695, 993431, 1431202, 1347048, 300739, -603535, -380738, 138910, -352195, -1491630, -1911424, -1385313, -781239, -360646, 241573, 615381, -87457, -1341808, -1501498, -252006, 795055, 563855, 15466, 287193, 788795, 469818, -133073, 266596, 1433225, 1844662, 1061502, 303612, 425703, 704980, 219242, -671097, -1007094, -637843, -111358, 350922, 942480, 1565232, 1754890, 1265349, 231484, -1110221, -2343432, -2702278, -1705047, -29719, 914884, 546131, -280980, -482498, -49878]
38512d9878L09103j41090j72587J82276K79270k06832q16535p44552K03982J075246
38502h1597O23431r55395j761501m80928J545418J786698l4783j441570n84099
38493a384326J308900J825798N93359p06433q75651l37672Q4302K38821K81965
38484A029063J73089j14812m08731n39167m04135N7487N63493M60063m07415j110088
38474g01153o98618L88048Q76974M78236J16575L32949N85018M06505J65117J79690
38464B129341O2691m25657p09707l12308K48655K38447j65784k74560K3201K76207
38454A090526K07035j95675r05232j540731j316345q0104J054355J000328K22183
38445d63660k3288L95196N25504J02755j11215J20161N6839m82051n45759K34576
$$ y = [-49878, 259225, 118135, -54452, 127824, 407094, 200262, -616273, -1360825, -1156843, -81597, 541834, -413561, -2175062, -2655990, -1110572, 676126, 641343, -800227, -1384326, -75426, 1750372, 2343731, 1637298, 761647, 423975, 508277, 747098, 1029063, 1202152, 1087340, 678609, 139442, -264693, -207206, 356287, 816350, 408935, -701153, -1399771, -1011723, -134749, 343487, 460062, 793011, 1378029, 1784534, 1949651, 2129341, 2192032, 1766375, 1056668, 744360, 993015, 1231462, 1065678, 791118, 814319, 1090526, 1297561, 1101886, 196654, -1344077, -2660422, -2740526, -1686171, -685843, -463660, -486948, -91752, 433752, 536507, 425292, 545453, 602292, 120241, -425518, -190942]
38435a90942O92767k0189p84672j56147J168216J250252q1370r60122l82428L78956
38425I14321o9019j140549j357859n01858M42081P99199O08231K7350o28613o60440
38415a567156J68263Q85833N04718l26233j35751J006420J408093K99390j024297
38406A219280j232868p53608n73868m63765K92498J226277J215938K80568n11309
38397F99143o96460o80727n03910K34519J116500J027927n9192p74875m11489
38388d8564Q691m28070q52865j9120J484985J875387O54347q59096j388520r58183
38378e31008k72350J31784q685n10732n66117L79738J495471J345976M031q15919
38368F52189k22147N11401l3439j166685j183817r76Q50410O38986K79429N26708
$$ y = [-190942, 501825, 481636, -303036, -459183, 709033, 1959285, 1877915, 917793, 535365, 914321, 845302, -295247, -1653106, -2154964, -1712883, -913684, -305453, -278103, -906716, -1567156, -1398893, -513060, -8342, -334575, -470326, 536094, 1944187, 2243577, 1219280, -13588, -767196, -1341064, -1804829, -1512331, -286054, 929884, 1210452, 699143, 2683, -678044, -1181954, -947435, 169065, 1196992, 1137800, 362925, -48564, -39873, -467943, -1320808, -1339928, 145057, 2020444, 2674791, 1815695, 427175, -531008, -803358, -671574, -680259, -1190991, -1757108, -1377370, 118101, 1464077, 1468108, 652189, 430042, 941443, 908004, -258681, -1442498, -1443474, -593064, 45922, 325351, 852059]
38358H52059P59980K51952m41885l19126M73188Q30729K30444p01286j108322
38349H27733p93731j40078M00440N78980L53577j92360q57618j212971p42370
38340a778398M81450J409401J010574k44337p41404P3356Q04530J52880j070094
38331I7958j139350N917Q35232O39147K88926L98501L04778m62744j038779n31190
38321f01604M91490Q57687M22795j67346p10234j321357j541500q10784L45768
38312c035085P91095M13511J43605K75342N9942o60852p51766M48687J717018
38303e98503J454003l9706j032754p83669j94686l5402J35341P78280J264723
38294I47627Q63795P6479q5096K66754J35377n75413p36867J97986J138621Q29271
$$ y = [852059, 1612039, 1863991, 1422106, 1102980, 1576168, 2406897, 2637341, 1936055, 827733, 34002, -106076, 294364, 873344, 1226921, 1034561, 176943, -1036028, -1778398, -1296948, 112453, 1123027, 878690, 137286, 210642, 1015172, 1168052, 97958, -1041392, -1035475, -200243, 438904, 727830, 1126331, 1431109, 968365, -70414, -601604, -110114, 747573, 1170368, 1003022, 292788, -1028569, -2570069, -3380853, -3035085, -2243990, -1830479, -1686874, -1411532, -1351590, -2012442, -2764208, -2315521, -598503, 855500, 815794, -216960, -1000629, -1195315, -1230717, -1095376, -317096, 947627, 1811422, 1887901, 1802805, 2069559, 2204936, 1629523, 892656, 1090642, 2229263, 3058534]
38284C058534l67681j040124o49609K8229K25221L7293j68244m20367q21415j042632
38274a160795o39342K57915R33454Q72397M02250L15660P77728R43614Q9452j139173
38264A653160j391770n33912J04308k39055o00892L0799R26698P28403l69170
38255C08569r56940n35731J04461M05742N32431M40017j15299o29572l52456K23904
38245e74874p7490r69090q68735M33949J184046M38299m52643j94059L82703l180
38235g01074q05495o63523L57232J080478J018921N31915j24453p21550p27044
38226g54593j23043J87488k47276n66843p9425N16889N04383M58090Q52826P41838
38216A490334n10041j509304q21625M88384M78562n07375o46393K04479O48252
$$ y = [3058534, 2690853, 1650729, 1001120, 1029349, 1254570, 1291863, 1123619, 703252, -118163, -1160795, -1800137, -1542222, -608768, 263629, 665879, 981539, 1759267, 2702881, 2792333, 1653160, 261390, -272522, -168214, -407269, -1008161, -977362, -50664, 677739, 308569, -648371, -1184102, -1079641, -673899, -141468, 298549, 183250, -446322, -798778, -574874, -652364, -1621454, -2490189, -2056240, -872194, -433895, -886538, -1080597, -697894, -701074, -1506569, -2170092, -1812860, -732382, 286539, 818454, 694001, -27549, -754593, -877636, -690148, -937424, -1504267, -1583692, -1066803, -562420, -104330, 748496, 1490334, 980293, -529011, -1350636, -862252, -383690, -891065, -1537458, -1332979, -684727]
38207f84727M44035M86024N41719k83190j118639k75395J420087J331269o00186
38198A260997j377516K88476J872818J079368q06143j350517m35061N39047R60533
38189B032002P81569k75671j626739j594353R7817J235209K17007j364566j148205
38180a645930M46373J199339N24736k13548j42022K77899M56563K28630m03085
38171G28955r55001n81480M98804P48674l74758j177711k70488J069135R62625
38162F48755N2728K41885J261019J110642m57641j488972r77694j51234j70062
38153F9426n55245n27129k34259J6264L76006P20880M99317j96576n05239j48295
38143d84850J53024j5260j15706K25960M81726J73046k70445k22912J67570K89365
$$ y = [-684727, -240692, 245332, 787051, 503861, -614778, -890173, 529914, 1861183, 1260997, -116519, 171957, 2044775, 3124143, 2318000, 967483, 532422, 1071469, 2032002, 2813571, 2537900, 911161, -683192, -585375, 649834, 866841, -497725, -1645930, -1199557, -218, 524518, 310970, 168948, 446847, 903410, 1132040, 728955, -226046, -807526, -308722, 439952, 65194, -1112517, -1383005, -313870, 648755, 701483, 943368, 2204387, 3315029, 2857388, 1368416, 390722, 239488, 69426, -485819, -1012948, -1247207, -1230943, -854937, -134057, 365260, 168684, -336555, -484850, -331826, -347086, -462792, -236832, 244894, 417940, 147495, -75417, 92153, 381518]
38133C81518l1914l92330l92510j05797J7097k71983n73504k99405L80104O14783
38123f73941J03381m48642m31250r7443J93353N60014Q52826M01221o77241j041377
38113a259099o0909R08866M64631o65888q79280k20588N6829k17735r2608O27722
38103a338059J160008J173770R41746L71365o21721j177601n38880L68252J20640
38094D59520q23927q33879J02473M01849l12545o24284J24823P56965L56049l11859
38084g04815j96943N95508J312552J367421M64675r24867j376735k14240R78120
38075A300676L30865j263689j340910J87020R83264K68870j86506L53522K33051
38066H66163j155566j702931j67888J371726Q57193m08189k39347P01540M21240
$$ y = [381518, 349604, -42726, -435236, -541033, -523936, -795919, -1369423, -1668828, -1288724, -673941, -570560, -1019202, -1450452, -1547895, -1354542, -794528, 58298, 459519, -217722, -1259099, -1320008, -411142, 53489, -612399, -1491679, -1712267, -1655438, -1873173, -1965781, -1338059, -178051, 995719, 1937465, 2308830, 1687109, 509508, -29372, 338880, 459520, -364407, -1198286, -1095813, -693964, -1006509, -1630793, -1505970, -749005, -392956, -704815, -901758, -306250, 1006302, 2373723, 2838398, 1913531, 536796, 322556, 1300676, 1631541, 367852, -973058, -786038, 197226, 466096, 279590, 633112, 866163, -289403, -1992334, -2160222, -788496, 68697, -339492, -578839, 122701, 543941]
38057E43941p61365r75150j45489J95507j85367j00285N75442O58995j18884o82762
38047i95417n15259k78466m08149n32046l73350m7717M52567J026538J032547
38038f38752J51658p65991q07027l58384k13258j03171M57651O93429k90252j492652
38028c366749j121795N79386J585070J095251L47397L07102M81023L91631M09038
38019G07354N41306M0392j077940j559869p25207M81436R79983R46903R63893
38010A298251Q55859K73121l86327n06577j61357J44474J52214j69164p38712
38001G61782j078904n90331M60115R37340L37830m10332k67619M44418O58522
37992A252821J68922k45395r6360K31719K11495j67524o21897r43057r16969l21205
$$ y = [543941, -217424, -1192574, -1338063, -1142556, -1327923, -1428208, -852766, -193771, -312655, -995417, -1510676, -1789142, -2197291, -2729337, -3102687, -3150404, -2697837, -1671299, -638752, -487094, -1253085, -2060112, -2418496, -2631754, -2734925, -2277274, -1583845, -1874097, -3366749, -4488544, -3909158, -2324088, -1228837, -881440, -574338, -93315, 298316, 707354, 1248660, 1289052, 211112, -1348757, -2073964, -1592528, -612545, 334358, 1298251, 2154110, 2427231, 2040904, 1534327, 1372970, 1517444, 1669658, 1500494, 761782, -317122, -907453, -447338, 490002, 827832, 417500, 149881, 594299, 1252821, 1421743, 1176348, 1079988, 1311707, 1523202, 1355678, 733781, -209276, -1126245, -1447450]
37982a447450O16370J070253M89890m52320m59992O16573J336665N85797p28250
37973A627536q94217R7920N96476j64270j024386q70348k33812n3587o1409M12053
37963e68044R23826N63977l97722p92272k52399M37855N59524J34808m68160q37687
37953f96294o11882O8866M83065K77380K5700K32952M57965K22684J7081L58260
37943H35777N93930j00860j140186j293063n57986Q5185L47938O36931Q09897
37934B17563M49101K5740K27810M93078r8402q78300n17393M06056J01258j155577
37924g29066j063175Q28853J972215P18941j074605r85539M74855J225896Q74357
37915B242732N14052L97347q9378p51024p58992k07795J4488l13299o47499p31179
$$ y = [-1447450, -831080, 239173, 729063, 276743, -183249, 433324, 1769989, 2355786, 1627536, 733319, 831239, 1427715, 1263445, 239059, -631289, -865101, -918688, -980097, -568044, 355782, 919759, 522037, -270235, -522634, -84779, 474745, 609553, 141393, -696294, -1308176, -1239310, -756245, -478865, -453165, -220213, 237752, 460436, 477517, 835777, 1429707, 1328847, 188661, -1104402, -1662388, -1577203, -1229265, -592334, 217563, 666664, 692404, 920214, 1413292, 1314890, 436590, -80803, 325253, 426511, -729066, -1792241, -963388, 1008827, 1727768, 653163, -332376, 142479, 1368375, 2242732, 2756784, 3154131, 3064753, 2313729, 1554737, 1346942, 1361430, 1048131, 400632, -330547]
37905c30547o27676j18691P96038J246824N51562m69649n05398K24852L02864
37896A070179o38809j339262p79948M52333J026334L97581p44748j158998k63230
37887a978568J027922J138604p0410q56116m6565J050183N51942r88305j327639
37878a498952K4744J148537P31230k26355m28993k47310n41874r07413m60994
37869b407380M82502Q43269M12273l8372K3430M44998Q88939J010402M42417o44476
37859A458002j281998p85655J85180M60901r564k79946J4878K52376O8869l7071
37849D5972K99015N85532K69083l77964o79021m17440J25697N92012O70961K35911
37839A349758l27735l89925K9393J86664k14387m69799m7245M11562Q6137o06758
$$ y = [-330547, -958223, -1076914, -280876, 965948, 1517510, 1047861, 542463, 767315, 1070179, 431370, -907892, -1687840, -1235507, -209173, 188408, -556340, -1715338, -1978568, -950646, 187958, 117548, -738568, -785133, 265050, 816992, -171313, -1498952, -1474208, -325671, 405559, 179204, -249789, -497099, -1038973, -1946386, -2407380, -1924878, -1081609, -669336, -707708, -684278, -239280, 649659, 1660061, 2102478, 1458002, 176004, -609651, -424471, 36430, 26866, -253080, -238202, 14174, 83043, 45972, 344987, 930519, 1199602, 821638, 142617, -274823, -149126, 442886, 1113847, 1349758, 1022023, 632098, 661491, 848155, 633768, 163969, 116724, 528286, 614423, 7665]
37829G665o09240J14851N80519L00430k19056m68141m45398j65741L77283P19915
37819A93087L86663j30928N4604O34092L91224o90947j109433j88107P65469N40331
37809H46055j55337j35051K48838q435o01425m54080L34854O40029J35908l90875
37799D60481m09517j34715K11262N41105M82750j44345o51116k97670M87493P43730
37789A289458M59427K68333J03695m79067r93095n84199K73463K76857n22220
37780I2652p18861Q8121O50097J76411n31359o08542l11727o2891L06066P08604
37770b11429N12435k44640n70512m6638N83329Q42962J133456J371379O58712
37761D029054q56343j485377n11948M06161k54020j443213j281598j5639O40556
$$ y = [7665, -601575, -486724, 93795, 394225, 175169, -292972, -738370, -904111, -526828, 193087, 579750, 448822, 503426, 1137518, 1528742, 837795, -271638, -459745, 305724, 846055, 690718, 555667, 804505, 796070, 194645, -259435, 75419, 715448, 851356, 460481, 50964, -83751, 127511, 668616, 1151366, 1007021, 355905, 58235, 545728, 1289458, 1748885, 2017218, 2120913, 1641846, 648751, 64552, 338015, 614872, 92652, -626209, -538088, 112009, 288420, -242939, -851481, -1163208, -1226099, -920033, -211429, 301006, 56366, -514146, -560784, 22545, 865507, 1998963, 3370342, 4029054, 3172711, 1687334, 1175386, 1581547, 1327527, -115686, -1397284, -1412923, -772367]
37752g72367K60767j05266K5674J71653K63361O97118J055379L69748j152341
37743H13726k030356j459791k63628M14261M23974K72176K52951L41921M71519
37734g63247N59799M86256K13720j11563j73554K76968R43023R86046Q3899q01198
37724A700149o32478j1923l30967j289098j087486N06100J380274L69488p55515
37715a51456j41646J170889J127979q653m96049j39245q6124l91220j99419J77549
37705H62605k49880r78520p15211P7296j47951j019345o70002P77791J125927
37696i37290k8269m44616P36975J264907k63861j626698n25926J437634J215644
37687H28500q26203j569762J6894J607979J184795m40361j347998r52297M6266
$$ y = [-772367, -511600, -616866, -591192, -419539, -156178, 540940, 1596319, 1966067, 813726, -1216630, -2676421, -2940049, -2525788, -2101814, -1829638, -1576687, -1234766, -763247, -203448, 282808, 496528, 384965, 211411, 488379, 1431402, 2417448, 2501347, 1700149, 1067671, 1055748, 724781, -564317, -1651803, -1145703, 234571, 604059, -151456, -293102, 877787, 2005766, 1997113, 1501064, 1361819, 1275695, 884475, 685056, 862605, 612725, -365795, -1081006, -1003710, -1151661, -2171006, -2841008, -2063217, -937290, -965559, -1410175, -673200, 591707, 327846, -1298852, -1824778, -387144, 828500, 2297, -1567465, -1550571, 57408, 1242203, 801842, -546156, -1498453, -1452187]
37678a452187Q77892J095569N56866l32486p92071m80702J31587L80189J49806
37669A34463j16246j8459K53465P9474o99217j267824p72478L36961P28517Q7088
37659a254256l92485J47530Q92724O64460k41694n60533N2555O79574N59623l1725
37649E15773m06873l34141j04706q0407k99328m39583k32636J42984L66317N60890
37639c11710J023544J397020R10345l28249j105133o12127N07485J079766P15448
37630C276389k20422j222887j711163j201061j3558Q13874Q16621N86126N48362
37621A672281K75555l46963m62965K46171N67736l94352j423817q88744N87253
37612a67845J059794L48283M1879N27199L29671j053111j852018p08684J052695
$$ y = [-1452187, -574295, 521274, 1078140, 745654, -46417, -527119, -395532, -15343, 134463, 18217, -242, 253223, 332697, -366520, -1634344, -2406822, -2069861, -1341344, -1254256, -1646741, -1499211, -606487, 57973, -183721, -744254, -691699, -12125, 547498, 515773, 108900, -225241, -329947, -410354, -709682, -1149265, -1381901, -1238917, -872600, -311710, 711834, 2108854, 3019199, 2690950, 1585817, 973690, 1481175, 2560941, 3276389, 3055967, 1833080, 121917, -1079144, -1092702, -278828, 537793, 1123919, 1672281, 1947836, 1600873, 1137908, 1384079, 1951815, 1557463, 133646, -755098, -167845, 891949, 1240232, 1282111, 1809310, 2138981, 1085870, -766148, -1474832, -422137]
37603d22137J311621J46555o21666k04051L93686K14875l97188o68294n50657
37594g97256m86762n23458k56420L75071P07798J52211p67799p79331M65746J684328
37584b25872J520630L13386n19112m85812l56514o27505q41500o01966j52552
37575a976817L34564R50785J216249L22380j223969j555075J1393J611938J265609
37566I57057l81954j224610p49778j46695J12498P37268J617767J427656j21078
37557B228131j367013j021634o946J49691m21601n86169k07845k6116j03061R5690
37547a266873L53273m1825p12444m11558Q68418J492131N41378p35916p82831
37538f96247M0431K89629k54330m78339J67358R52521J071528N26034k83699r35496
$$ y = [-422137, 889484, 1036039, 414373, 210322, 604008, 818883, 421695, -246599, -797256, -1284018, -1807476, -2063896, -1688825, -981027, -828816, -1596615, -2375946, -1910200, -225872, 1294758, 1608144, 1089032, 603220, 246706, -380799, -1222299, -1824265, -1976817, -1642253, -691468, 524781, 847161, -376808, -1931883, -1920490, -308552, 957057, 575103, -649507, -1399285, -1545980, -1433482, -696214, 921553, 2349209, 2228131, 861118, -160516, -167462, -17771, -439372, -1025541, -1233386, -1259502, -1362563, -1266873, -913600, -955425, -1667869, -2079427, -1211009, 281122, 822500, 86584, -696247, -655816, -366187, -620517, -1098856, -931498, 21023, 1092551, 1618585, 1334886, 399390]
37528C99390q95408n322Q37981N32398m99251o12618N91453J408055M83862j073629
37518A166911j306846k34843M67390J24686k71645j6181L09343J65195j1168J67415
37508E60257K12321k80847p58052n96176j32012k902r4723K9210K11248R0294
37498g61382o8167J22778K32524l52269j086190p57757O00645J475624R45126
37489C50932k9517n0285P32803R62204O9512r50596r13580m648M93836q4532q63145
37478b87016o02345M73029Q22265k27569j346653r74747M92790J367407J061168
37469G78329N00169K86024n8073p13815r09307l13791J67276j39294n09087j26526
37459a038095M39117K49072l47953m12804j27007l40160q23497n45868M20453
$$ y = [399390, -496018, -501340, 336641, 869039, 369788, -242830, 348623, 1756678, 2240540, 1166911, -139935, -374778, 92612, 217298, -54347, -70528, 238815, 404010, 392842, 560257, 772578, 491731, -266321, -862497, -994509, -997411, -1092134, -1062924, -851676, -761382, -829549, -706771, -474247, -826516, -1912706, -2670463, -2069818, -594194, 350932, 321415, 271130, 1003933, 1966137, 2035649, 1085053, 171473, 166825, 660661, 576129, -287016, -889361, -416332, 405933, 178364, -1168289, -2143036, -1650246, -282839, 778329, 1278498, 1564522, 1506449, 792634, -116673, -430464, -263188, -402482, -911569, -1038095, -598978, -349906, -697859, -1110663, -1237670, -1577830, -2401327, -2947195, -2526742]
37450b526742Q26569K56926k12029K50272J063532J293585Q37046R1016o16149
37441A264026q54292l02366M53002L08227p05924j188661l53619P93181R76472
37432C90046L52189j70907l71354m58355j84636O10861J147347N94559n19793
37423A389957r14259l53204K00673J08019k70223m16580k95369o4116J52974J63910
37413b98218n9211j56964O4636J32355l67399q90233o19689J99785N87301L50728
37403a056909K44404N81196P52541L57938j34671j91067R1143L62853M19978N8664
37393A486070p20563j238763p32718L82719P94950J42035m41004j09283M13452
37384b3105J16988o31681p10790M6058P79894R39353P61014N44507K59193q1774
$$ y = [-2526742, -1700173, -1443247, -1655276, -1405004, -341472, 952113, 1789159, 1880175, 1264026, 409734, 107368, 560370, 868597, 162673, -1025988, -1379607, -586426, 390046, 742235, 571328, 199974, -258381, -443017, 167844, 1315191, 1909750, 1389957, 475698, 122494, 323167, 431186, 160963, -255617, -550986, -615102, -462128, -298218, -357429, -514393, -449757, -317402, -684801, -1575034, -2194723, -1994938, -1407637, -1056909, -812505, -231309, 521232, 879170, 744499, 553432, 644575, 1007428, 1427406, 1486070, 765507, -473256, -1205974, -823255, -28305, 113730, -327274, -436557, -23105, 93883, -537798, -1248588, -1202530, -422636, 516717, 1277731, 1822238, 2081431, 1999657]
37374A999657k56601j48405J16974L11204J69368m24421j038640q94336P2428
37365i2772P71484K41367r35509j288384m04273O16095P31511J89465j19882J00316
37355a90582M00876K89569k69384q15231o80425L23808J357075J203355j86555
37346A432506j347836j051427P2204M49682j90042n23295L10717J407907J387572
37337A947988K14840r46888j188080n08279N23594J092317N76644n77282r08261
37328B26593K11267J303260O27562j086182j422547J64638J482932Q89696m29653
37319A967566o19509O5133K33791j54752j58564J23510j41963o35646k61457P11859
37309A129968P89615l05145j120035p74405p8920J75755L86567Q08642O25095
$$ y = [1999657, 1743056, 1594651, 1711625, 2022829, 2192197, 1767776, 729136, -165200, -92772, 678712, 920079, -15430, -1303814, -1708087, -1091992, -360481, -171016, -290898, -190582, 210294, 499863, 230479, -584752, -1265177, -941369, 415706, 1619061, 1432506, 84670, -966757, -894553, -444871, -634913, -1158208, -847491, 560416, 1947988, 2162828, 1215940, 27860, -480419, 43175, 1135492, 1712136, 1134854, 226593, 437860, 1741120, 2368682, 1282500, -140047, 24591, 1507523, 2397219, 1967566, 1348057, 1413190, 1646981, 1492229, 1333665, 1457175, 1315212, 679566, 418109, 1129968, 1919583, 1614438, 494403, -280002, -358922, -183167, 203400, 1012042, 1637137]
37300A637137n33192j399258p27800P04215J069001l3572j244423j336190m26545
37291b290627O11383J106093Q74153J48244n92953r49356q03042k44115M39064
37282a701156P47030M26473l2449O5167N33941M94100k12501o73373l27794J72834
37272e07728J05656j60614P1655N50700M63617k53847q16012o58074j0748M98880
37262g16515M25897j48285n97862l68755K32441L58379j07002l30244Q0658L66669
37252h04619n9353m80517m7133O35626L53273o40391p77370M71817J645663J234450
37242A531446k96445j177422n94870M92869P87525K34512k34274j75101j11986
37233D56254m15344n15325J16844Q21537N86006k97994n98477j08442P7580n03061
$$ y = [1637137, 1103945, -295313, -1023113, -318898, 750103, 716531, -527892, -1864082, -2290627, -1679244, -573151, 301002, 449246, -143707, -1093063, -1896105, -2140220, -1701156, -954126, -527653, -560102, -494935, 39006, 533106, 320605, -352768, -680562, -507728, -402072, -562686, -491031, 59669, 523286, 269439, -546573, -1204647, -1215395, -716515, -290618, -438903, -1036765, -1405520, -1173079, -814700, -921702, -1251946, -1171288, -804619, -863972, -1344489, -1391622, -755996, -402723, -1043114, -1820484, -1348667, 296996, 1531446, 1235001, 57579, -537291, -44422, 743103, 977615, 743341, 568240, 456254, 40910, -474415, -357571, 463966, 1049972, 751978, 153501, 45059, 122639, -380422]
37223c80422q68438l17281L51448K58988m7824L51413J083762J122279M57123
37214B011048j28316m81014r93505j392371r41532J53383P47949L60927k24831
37205h88262k22058J73753M03249M13581M49670M76123K95558J0354m3379J79532
37195A248121K46870k07466q21613p65142J15029Q49005N72320k19762m57671
37186E59691j66425k01614n29954k75651L96041J97225r06979j085673N08803
37177a504536J995940J393499m38207j254124o71817K032K95911P57699J123777
37168A700174N16890o32540r16081k89405j49582q69338j188386m83278K21753
37159b089793J52410j6365L55344P23690N58690L09427L05913K5841o36090p15629
$$ y = [-380422, -1248860, -1566141, -1214693, -955705, -1003529, -652116, 431646, 1553925, 2011048, 1882732, 1401718, 408213, -984158, -1925690, -1772307, -1024358, -663431, -888262, -1110320, -936567, -533318, -119737, 329933, 806056, 1101614, 1111968, 1068589, 1248121, 1494991, 1287525, 465912, -299230, -184201, 664804, 1237124, 1017362, 559691, 393266, 191652, -338302, -613953, -217912, -20687, -927666, -2013339, -1504536, 491404, 1884903, 1446696, 192572, -479245, -477213, -181302, 576397, 1700174, 2217064, 1584524, 668443, 379038, 229456, -639882, -1828268, -2311546, -2089793, -1937383, -1953748, -1598404, -874714, -316024, -6597, 299316, 325157, -310933, -1026562]
37149a026562J45815P02074O2770n83595K16366J635268J664972J70539j060696
37140A926951j088534p08926m77157J60038J169217J264876M1654q25168Q831
37131A471782J227664P85427p38567r77605L31988Q48639m76009j535720m72849
37122D64750J243031J197362j32396m51094M17039M91092o91484j223372j76929
37113A137999P78000J78217r48181r43007L7088Q21063J061795R22545J74282
37104C219801j020036j489743n71641O61015Q88827L57665N6889P2058j5463l7383
37094B121989J83218P1269o23763r32930j60433P02096M64430l35095n23312l35604
37084F31865o12568q04495K08145J768472J957561M34894j000346r28256J3587
$$ y = [-1026562, -880747, -178673, -115903, -699498, -483132, 1152136, 2817108, 2987647, 1926951, 838417, 129491, -347666, -187628, 981589, 2246465, 2288119, 1462951, 1471782, 2699446, 3484873, 2746306, 1768701, 2100689, 2949328, 2473319, 937599, 464750, 1707781, 2905143, 2772747, 2321653, 2738692, 3229784, 2538300, 1314928, 1137999, 1915999, 2094216, 1146035, 203028, 240116, 1061179, 2122974, 3045519, 3219801, 2199765, 710022, 138381, 799396, 1688223, 2045888, 2102777, 2174835, 2159372, 2121989, 2305207, 2376476, 1752713, 819783, 659350, 1361446, 1825876, 1490781, 967469, 631865, 19297, -785198, -577053, 1191419, 3148980, 3583874, 2583528, 1655272, 1668859]
37075A668859L42119l46140j050985o09130P86313J464847L35883j236097j041089
37066C14580O07324J212048Q9322o37033O5708K90427j076178j868797l34281
37057a336880J542036J346001K85000O02900J314961K76274j490313j546725m85331
37048E07923n12952j031335N4178J802854J530756k22121n69580N28943N69247
37039B657913n26475n15249M19867l5096j394252q34718J260208J457896n67726
37030A922368j338101K24558J202041K94479k32304N91022P91013r2113n792J039319
37020D396490O21522r27720n81643J347048J321997m72324p2697K442545K614732
37011A0689950L09831M15124L284773L833607K106875L963956Q505222P512673
$$ y = [1668859, 2010978, 1664838, 613853, 4723, 791036, 2255883, 2591766, 1355669, 314580, 921904, 2133952, 2223274, 1586241, 1651949, 1942376, 866198, -1002599, -1336880, 205156, 1551157, 1836157, 2439057, 3754018, 4030292, 2539979, 993254, 507923, -5029, -1036364, -982186, 820668, 2351424, 2129303, 1559723, 2088666, 2657913, 2131438, 1616189, 2036056, 2000960, 606708, -228010, 1032198, 2490094, 1922368, 584267, 808825, 2010866, 2305345, 2073041, 2664063, 3455076, 3362963, 3357171, 4396490, 5018012, 4090292, 3508649, 4855697, 6177694, 5705370, 5632673, 8075218, 10689950, 10999781, 11414905, 14699678, 18533285, 20640160, 24604116, 33109338, 40622011]
37003D0622011J687623K649814J2174157J6988966J5154780K6974263N9366837
36996A75618451P7506821M2600568k9036684p6906973o8982167l4191139j4659866
36989G1949011j4608573j3389276n374507k023178o220874q317655m597008j641442
36981A5776498k584754k989360j003840k70771j718033j797693J23947N62097
36973F098091j131403j634034j35438M06747q56337j322434j43422M73432j89822
36964A565380k78668O22790P68517l9107q7577O31693L50109p86562p79708L45898
36954B312765M88713n72926q79941j10562M088o63120k88028J128320J305447
36945B724756k45180j165932k47329P26962K70231n74890n48583j63485j13051
$$ y = [40622011, 42309634, 44959448, 57133605, 74122571, 89277351, 116251614, 175618451, 253125272, 295725840, 266689156, 189782183, 120800016, 86608877, 71949011, 57340438, 43951162, 38576655, 36553477, 30332603, 22014948, 17417940, 15776498, 13191744, 10202384, 9198544, 8927773, 7209740, 5412047, 5535994, 6098091, 4966688, 3332654, 3197216, 3603963, 2747626, 1425192, 1281770, 1755202, 1565380, 1286712, 1909502, 2678019, 2638912, 2551335, 3183028, 3533137, 2746575, 1966867, 2312765, 2801478, 2228552, 1348611, 1238049, 1242137, 579017, 290989, 1419309, 2724756, 2479576, 1313644, 1066315, 1793277, 2063508, 1488618, 940035, 776550, 663499]
36936F63499Q2633O20223N38726n42041j414822j006025J89314J061079J118949
36927A311535M21159n91093j053945n60195P9273L4982j58321K32255M73301l06007
36917a17056j010602o1885J697501K068166R64665J63254l2934q92979k088563
36908F89567j686894J87585R13818m13000j384235k83176J162673Q54398l39315
36899b98579m87168J49403J38736k82207J62765J159087J137954k1074o78154
36890I80763k3231P15630K55184p84637q42992K71273J104417O61418k05059k13737
36880A919029K89496J4345q43404o96599N35537P44214r73718k310644j089361
36871b411105J122763J285413m46596j260616k78069N18762J3367m43367J62107
$$ y = [663499, 746132, 1366355, 1905081, 1363040, -51782, -1057807, -868493, 192586, 1311535, 1732694, 1141601, 87656, -472539, -393266, -358284, -516605, -284350, 188951, -117056, -1127658, -1189543, 507958, 2576124, 3540789, 3704043, 3671109, 2778130, 689567, -997327, -809742, 104076, -308924, -1693159, -1976335, -813662, 40736, -298579, -785747, -636344, -497608, -779815, -617050, 542037, 1679991, 1658917, 980763, 957532, 1673162, 1928346, 1143709, 300717, 571990, 1676407, 2337825, 2132766, 1919029, 2208525, 2222870, 1379466, 682867, 1218404, 1962618, 988900, -1321744, -2411105, -1288342, -2929, -449525, -1710141, -1988210, -1469448, -1456081, -1899448, -1737341]
36862a737341P98461N31223J08724K68999M06773N4536o1087M45315O47383k1878
36852A441108o48246n04788l89345j070547j674415r47174P73521J977862J742211
36843G00187L68960j028162j197547N8452J165920M75699j232864j595161k04653
36834b489169P98613K64784k73277L74780Q33476j59821j063237K2023J856731
36825A64903J773222j26383j259950n92492L00359K17960r5640J36081L27785
36816H45845j31684o99137o76627k97417j46913l26309o28027q08740m53785O28776
36806b694018J690651J585697K94326q91480r64894k24612N14620Q72233P16595
36797H99118q6910j136150j373544k60356J270289J713717P40631m90307p83859
$$ y = [-1737341, -938880, -407657, -298933, -29934, 376839, 431375, 370288, 815603, 1462986, 1441108, 792862, 288074, -101271, -1171818, -2846233, -3793407, -3019886, -1042024, 700187, 1069147, 40985, -1156562, -1098110, 67810, 543509, -689355, -2284516, -2489169, -1690556, -1425772, -1699049, -1324269, -490793, -650614, -1713851, -1691828, 164903, 1938125, 1811742, 551792, -40700, 259659, 477619, 381979, 518060, 845845, 714161, 15024, -661603, -959020, -1105933, -1432242, -2060269, -2869009, -3322794, -2694018, -1003367, 582330, 876656, -14824, -979718, -1204330, -689710, 182523, 899118, 812208, -323942, -1697486, -1957842, -687553, 1026164, 1766795, 1276488, 492629]
36788D92629k17163K18841R929k82907N1816P40905Q64630K70227j04165L02149
36778B346891N97975l27615j883068k196116o06413J282656J593107M41641n68827
36769F80231n90261k07822j5370K75769Q64890J037163K17229p95147p53256J52981
36759H66407N29564r7057o54849l66565O6600j54387n13569k09419K97598N1780
36749a83897o56223o78215J23357P08221N27129J61135J80058M14666N39460M78966
36739A614657J23840n10841q42617l55817L63031K63849n00543p05451O0128Q79239
36729C89475J078320J002982Q83081K99543o40056r02079p9405P65273O00218
36720C397352k21693q42695j113053j143243o83544J48286M78993m2934m94168
$$ y = [492629, 275466, 494307, 504236, 221329, 273145, 1014050, 1878680, 2148907, 2044742, 2346891, 2944866, 2617251, 734183, -1461933, -2068346, -785690, 807417, 1249058, 680231, 89970, -117852, -133222, 142547, 1007437, 2044600, 2261829, 1466682, 713426, 866407, 1395971, 1298914, 644065, 277500, 344100, 189713, -323856, -533275, -235677, -183897, -840120, -1518335, -1394978, -686757, -159628, 1507, 181565, 596231, 1135691, 1614657, 1738497, 1227656, 385039, 29222, 392253, 656102, 155559, -549892, -489764, 389475, 1467795, 2470777, 3353858, 3653401, 3013345, 2111266, 2031861, 2797134, 3397352, 3175659, 2332964, 1219911, 76668, -606876, -458590, 20403, -22531, -516699]
36711e16699j35100L56818J70377j41948K44515P41634L01710n73162m37268P56774
36701G67651J503416R35793k08506r40496j120905r92739o57727k96023j22263
36692a131799J7547L52044N77858K81602k23857l26988j44891j72291j91251L04306
36682f57720Q13715L56339p03743q86574P3417O94957J12837n80162k52994M24478
36672f05450K89394l11098k64589L62674O28547M34692M27720M95966o5020r45416
36662D47420r73138q7776L95814o1559l86536O2742K38595o06849j160907k2442
36652b154636J639215J529339j85341j047490j07693Q21986L33033m60821j79806
36643A87786M70706K75155k09417R3066N30415q7872j004447n97477O41707P45189
$$ y = [-516699, -651799, -294981, -124604, -266552, -22037, 719597, 1021307, 448145, 10877, 767651, 2271067, 3206860, 2998354, 2057858, 936953, -55786, -713513, -1009536, -1131799, -1114252, -762208, -184350, 97252, -126605, -453593, -598484, -770775, -962026, -657720, 155995, 512334, -191409, -1077983, -1004566, -309609, -196772, -776934, -1029928, -605450, -316056, -627154, -891743, -529069, 99478, 534170, 961890, 1457856, 1392836, 447420, -525718, -613494, -217680, -279239, -665775, -603033, -364438, -971287, -2132194, -2154636, -515421, 1013918, 828577, -218913, -326606, 495380, 828413, 367592, 187786, 658492, 933647, 724230, 817296, 1347711, 1259839, 255392, -342085, 299622, 1044811]
36633A044811l48863p24673L5354J40311r34062j150160N04602J794949O63778
36624A026047j277396j188924O09182J425011M69323m38895j78782K87399J29764
36615H62729n0784J69954L3922q62186j485245q35469N34771J356865J203349
36606I27906M76745m12900j101785j106911l81654L46407M37182K15891L82723
36597b16396Q20232P01779k10831j026515p98374K17816Q31697M08169l67143
36588C60434m57219J78065P03323O39749K83150o5133m63450p53879m99862J21998
36578D7176K52467k85251m67754L18817J062853N80928n55633q29360l3265O44756
36568G35734N52442K02027p748l25255o95313n50147O5147K81395k13021n83170
$$ y = [1044811, 695948, -28725, 6629, 146940, -787122, -1937282, -1432680, 362269, 1026047, -251349, -1440273, -831091, 593920, 1063243, 624348, 445566, 732965, 862729, 811945, 981899, 1015821, 153635, -1331610, -2167079, -1632308, -275443, 927906, 1404651, 991751, -110034, -1216945, -1598599, -1252192, -815010, -599119, -216396, 603836, 1305615, 1094784, 68269, -730105, -512289, 319408, 727577, 360434, -96785, 81280, 784603, 1424352, 1707502, 1642369, 1178919, 425040, -74822, 47176, 299643, 14392, -453362, -134545, 928308, 1509236, 953603, 124243, 90978, 735734, 1288176, 1490203, 1482455, 1157200, 461887, -88260, -23113, 258282, 45261, -537909]
36558e37909j62141N55367Q07966O36764M42663K17471j01725j49144K56112N08375
36548B473799j0964q97650j192948o84120o8789P5434j27503k87632k09780J55703
36538g74450P14511J002478M36996q24015j602667q73394P92139J591478O22635
36529A085711r28390j336498n73743k0247j96780j43392O54232J157071M64105
36520A62069n55220n21929L86271R30067P56049M70139K07974l86541r68242p68872
36510b88235n1594J38303k65626k78814L13274N74586J41386k13915j64748l96948
36500d92331r93158q58956L83439J433441J252988N57107K64670r0984j035775
36491D20441j603687p99058M54673O34792O3291J44655P94501O76726k84096p07228
$$ y = [-537909, -700050, -144683, 663283, 1300047, 1742710, 1960181, 1858456, 1709312, 1965424, 2473799, 2462835, 1565185, 372237, -311883, -380672, -305238, -432741, -720373, -930153, -774450, -59939, 942539, 1379535, 555520, -1047147, -1920541, -1128402, 463076, 1085711, 157321, -1179177, -1752920, -1773167, -1969947, -2113339, -1459107, -302036, 162069, -393151, -915080, -528809, 401258, 1157307, 1627446, 1835420, 1448879, 480637, -288235, -339829, -201526, -467152, -745966, -432692, 141894, 283280, 69365, -95383, -492331, -1485489, -2344445, -1961006, -527565, 725423, 1282530, 1547200, 1456216, 420441, -1183246, -1982304, -1527631, -892839, -829548, -684893, 109608, 786334, 502238, -204990]
36481b04990j50992K40949j75754n90241l75895p6563j25085l7335M10005N53231
36471e32670J64944J03888P48290J017646O3528j106082r69274K61448J006377
36462G58095N15834m39357q59191n43888O9430L79255L8142o01395p25378j35733
36452a544186M08875L66042J94038L24981K25745n47971j170504o64879M15686
36443a992173P93636M59225L57989M89915M9235p14976o83240j3095p6593q60087
36433b190164o11674J077301K067173R29769o37257n14812M96618L53026o03778
36424C66202m51306O43823N76007q73752j340851K26197J634162Q07755j041475
36415E46762j399094r6699R69015Q60749M05498K93725J12515n13331j101763
$$ y = [-204990, -355982, -115033, -290787, -881028, -1256923, -1333486, -1458571, -1495906, -1085901, -532670, -367726, -263838, 484452, 1502098, 1565626, 459544, -509730, -248282, 758095, 1273929, 834572, -24619, -568507, -499077, -119822, -81680, -683075, -1408453, -1544186, -1135311, -769269, -575231, -250250, -24505, -572476, -1742980, -2407859, -1992173, -1198537, -739312, -381323, 108592, 157827, -557149, -1240389, -1253484, -1330077, -2190164, -2801838, -1724537, 342636, 1272405, 635148, 120336, 616954, 969980, 366202, -85104, 558719, 1134726, 260974, -1079877, -853680, 780482, 1588237, 546762, -852332, -949031, 19984, 880733, 1286231, 1579956, 1692471, 1179140, 77377]
36406G7377j092976o57964l08647j79104m1074K09940L58816J72157j86182k22633
36396a870290K15248N41885J47706n99913o87356J43869R87263R86454L41129
36387B05995k09066l35222j76797Q0380L00381L92601M27302M52099K14905m20929
36377I31649r02974o15845k0602j41720q32949q05924K60511J009640M91576l57900
36367i84538k86368L91334O10570K62458j23985n19179r52904p72346K96719J118862
36357i59377O65969j45650J85326J135653Q66418o96741j596491q89307P0119
36348a364081M9613j83225N11105J548585J516937L68975n69394m94436n755l4015
36338A344309n64895p50725j10911P14193P18169n8408m98335l6075M65761R1162
$$ y = [77377, -1015599, -1673563, -1982210, -2161314, -2202388, -1992448, -1633632, -1461475, -1647657, -1870290, -1655042, -1113157, -965451, -1565364, -2252720, -2108851, -1121588, -135134, 205995, -3071, -338293, -515090, -434710, -134329, 258272, 685574, 1137673, 1352578, 931649, 28675, -587170, -607772, -749492, -1582441, -2388365, -2127854, -1118214, -626638, -984538, -1270906, -879572, -269002, -6544, -130529, -649708, -1602612, -2374958, -2078239, -959377, -293408, -439058, -253732, 881921, 1748339, 1051598, -544893, -1434200, -1364081, -1314468, -1497693, -986588, 561997, 2078934, 2447909, 1878515, 1384079, 1378324, 1344309, 779414, 28689, -82222, 631971, 1350140, 1291732, 793397, 757322, 1223083, 1314245]
36328A314245o36946o09261P9477L55781r5447m88791k82893J73870M04903L64466
36318E79404J93507O3333J33361J68192l20502r97289o75066P27408J368700O2211
36308A303259j510603j125708M66008Q03672k07990l95438P07259J163695L28230
36299A532384k0188P73929P77670q65706j850477m67787J216097O09864j130482
36290E75304j101862O01973J335301K55173q54171q64561n89552n98840k51041
36281a492276N54321P63131M0666m29822J89060J069392J048623K47185l92965
36272A597315m62846l20715l68268n46017m63966K9147M46167K25060k43663M9499
36262e8287J008490J099212m32428k039435j804157j18506R97316P59945K65280
$$ y = [1314245, 677299, 68038, 147515, 503296, 407849, -80942, -363835, -189965, 214938, 579404, 772911, 836244, 969605, 1137797, 817295, -179994, -855060, -127652, 1241048, 1303259, -207344, -1333052, -867044, -63372, -271362, -666800, 40459, 1204154, 1532384, 1512196, 2286125, 3063795, 2198089, 347612, -120175, 1095922, 1705786, 575304, -526558, 75415, 1410716, 1665889, 811718, -52843, -642395, -1241235, -1492276, -937955, -174824, -134158, -563980, -374920, 694472, 1743095, 1990280, 1597315, 1134469, 813754, 445486, -100531, -564497, -535350, -89183, 135877, -107786, -58287, 950203, 2049415, 1616987, -422448, -2226605, -2345111, -1347795, -587850, -322570]
36253c22570M13935O94865L14716n65817j127364q10945K03965J073023J027774
36244I01582L38674P031J67454k39305j538126k278015j281554L82608R65834
36235b573817O09461O17140R82377O67734j48653k64610K61384J49223o79924
36226c79685q16290J47813Q35452L79416l10628k92873J9742J0956l5467K03243
36216b38321L54960J90593Q1068Q3727k49310p03343l74689O63359J074625K85190
36206A167859o05633o51139l56411l24968q9871O45360R75524K46970o22297n51376
36196a65982M498O5060j10736L08775J024716J023242K59463l62115m09915k37880
36186A399126j20411k2988k0387j63275j85311M4192J88701J02504J89442M96260
$$ y = [-322570, 91365, 786230, 1100946, 535129, -592235, -1403180, -1199215, -126192, 901582, 1240256, 1247287, 1414741, 1175436, -362690, -2640705, -3922259, -3539651, -2573817, -1964356, -1347216, -364839, 302895, 154242, -110368, 151016, 300239, -379685, -1195975, -1048162, -212710, 166706, -143922, -436795, -417053, -406097, -441564, -238321, 116639, 307232, 388300, 472027, 222717, -480626, -855315, -191956, 882669, 1167859, 562226, -88913, -445324, -770292, -860163, -214803, 760721, 1007691, 385394, -165982, -161484, -96424, -207160, 101615, 1126331, 2149573, 2409036, 2046921, 1637006, 1399126, 1278715, 1255727, 1235340, 1072065, 886754, 930946, 1119647, 1222151, 1411593, 1907853]
36176A907853K69560p49971j449980q42659L00386N37565j12297m69235k02008
36167h10786r0666m09820m70128L3939M26589J95815j75069J4195O64305J038576
36157D16950O32593l23241j076817j066436m85603M2143L11687N89227Q33575
36148a25922O34169Q9309j72885j29444m20931q75028l60378J133928J812404
36139A585222O60962p70311p26753L4412j53234q27376m11125O21112M01948q43646
36129d28789r32602M41492R87936k82719j284394l12639J237751J342518M33941
36120A202495N3795J28748k86806q30224n40259J52672J72401j64302J81561Q31202
36110I01283N39007m54502o46113K33248Q77652O34711J83900j97854j067076
$$ y = [1907853, 2177413, 1427442, -22538, -865197, -564811, -27246, -139543, -608778, -810786, -901452, -1311272, -1781400, -1747461, -1320872, -1125057, -1300126, -1285931, -621626, 416950, 1049543, 726302, -350515, -1416951, -1902554, -1860411, -1548724, -959497, -125922, 508247, 597556, 424671, 295227, -125704, -1000732, -1361110, -227182, 1585222, 2246184, 1475873, 749120, 783532, 630298, -197078, -608203, 12909, 414857, -428789, -1361391, -919899, 68037, -214682, -1499076, -1811715, -573964, 768554, 1202495, 1256290, 1385038, 1098232, 268008, -272251, -119579, 52822, -111480, 70081, 901283, 1440290, 985788, 339675, 572923, 1450575, 2085286, 2269186, 2071332, 1004256]
36101A004256k057672j718257M4288J226426N81719m79400k56803N34069K63165
36092h58209o18258l31426J044948J495179K82824r19229p31086m690l7283m06184
36082a083414L1477J041411J414301Q70108J65982l41662q77304j152498n14670
36073d46269O50112J001058J62690o14467l08981M25764M52699j48490n45001
36064F29115n75050n96735m36229K92698J072047R09997j22001r13955r52858
36055f92971p72163n93297J37049J297045J509689N6952j603317j523809Q7843
36046b096979J224932Q27109j47034m40622k7854M46839O89767O42600J75394
36037A294152m59006n19236K04894Q17189M74794l52681n90861j49570J32233
$$ y = [1004256, -1053416, -2771673, -2727385, -1500959, -919240, -1398640, -1655443, -1121374, -858209, -1476467, -1807893, -762945, 732234, 1015058, 95829, -635257, -639947, -677230, -1083414, -1051937, -10526, 1403775, 2273883, 2439865, 2098203, 1220899, 68401, -446269, 203843, 1204901, 1367591, 753124, 444143, 869907, 1322606, 1174116, 629115, 54065, -542670, -978899, -686201, 385846, 1295843, 1173842, 259887, -692971, -1465134, -2058431, -1921382, -624337, 885352, 942304, -661013, -2184822, -2096979, -872047, -44938, -191972, -632594, -660448, -213609, 476158, 1118758, 1294152, 835146, 315910, 520804, 1337993, 1812787, 1460106, 869245, 719675, 851908]
36028H51908p4224k46278j51126k59713p02763q05898k16489L62734K77637K0626
36018i43586L41175Q48505N85648l16137p28043k63528J99553j6270m23467l18811
36008a034961J70051N59359Q13791J031616R15944K78163l56363l64291L6541
35999B049850J10137l70428j010855j442725j445548p13607O96162J821693J578675
35990A273354J80372r76942r87979k95675K59046M39136L42546q7624p30975j017892
35980a602633n70236K31374P55412Q36538O17225J48688l75892m95782j98219
35971f53525k54215j053174j570700n84414J283109K013398Q87640n18309n93099
35962a043289K01924M05187j63886m34504O0219O50154P87314O62148M03410k32442
$$ y = [851908, 777684, 531406, 380280, 120567, -582196, -1388094, -1604583, -1241849, -964212, -943586, -602411, 246094, 831742, 515605, -212438, -475966, -276413, -292683, -716150, -1034961, -864910, -305551, 508240, 1539856, 2455800, 2733963, 2377600, 2013309, 2049850, 2159987, 1789559, 778704, -664021, -2109569, -2823176, -2127014, -305321, 1273354, 1453726, 476784, -511195, -806870, -547824, -108688, 233858, 146234, -584741, -1602633, -2172869, -1941495, -1186083, -349545, 267680, 416368, 40476, -455306, -653525, -907740, -1960914, -3531614, -4116028, -2832919, -819521, 68119, -450190, -1043289, -841365, -436178, -600064, -1034568, -974349, -324195, 463119, 1125267, 1528677, 1296235]
35952A296235j001956j025490r0729P47497N86393m1897j53231P2021k49640j004307
35942h65104j098905k18162O03527N12102l6531j89977N5361J68220N2864N010
35932a011595P1934R9202J52723L13258K97172j06308m36575j14640N09171M88361
35922B62703k26247n22902K00190R37167M93979n44096m65811R42380J725007
35913B802370L94474j759056k192126n06031J063467O93915q01357j425743o17227
35904b347314N35939J003408O88501k5727o28182n83583P7068N03945J51854k64087
35894h88178O9548M79206j82538j278420r92688O70939J522579M86487p19306
35885h32371l69653O14806M39443n90733q34290q6939M46236L86946L98629M56783
$$ y = [1296235, 294279, -731211, -821940, -74443, 511950, 470053, 316822, 388843, 139203, -865104, -1964009, -2182171, -1578644, -1066542, -1103073, -1293050, -1237689, -1069469, -1016605, -1011595, -939661, -840459, -687736, -374478, -77306, -183614, -620189, -734829, -225658, 262703, 36456, -486446, -286256, 650911, 1144890, 600794, 134983, 1077363, 2802370, 3196844, 1437788, -754338, -1260369, -196902, 497013, -304344, -1730087, -2347314, -1811375, -807967, -119466, -145193, -773375, -1356958, -1279890, -775945, -624091, -888178, -818630, -339424, -521962, -1800382, -2793070, -2122131, -599552, -113065, -832371, -1202024, -587218, -147775, -738508, -1572798, -1659737, -1213501, -826555, -427926, 28857]
35875B8857j28284r83314q61380K33899Q85389N45035K24485M28354K12752q62937
35865b77144j528551p32377N55096P92106J19484j95683J43297K96732j30724
35856i57764n47450l53545L79467J142618J322867N43043p67062j436221p60187
35847a434234O21221J508098J408450N87435n48954j452370j394857l08369P17760
35838b95820O35663j74065n58882l02734j80420m96631o64241l01946K42196O42604
35828a454276R70842J103619O64374j10371l40214J59644L29927o30533j856410
35819a163398j810320l72913R73421J048530K51014l06585k39950N6456L64067
35810a199678Q80691J473751J408967L02170j030831j303379l10491P87099Q62102
$$ y = [28857, -99427, -1082741, -1944121, -1710222, -824833, -279798, -55313, 373041, 585793, -277144, -1805695, -2538072, -1982976, -1190870, -1071386, -1267069, -1123772, -827040, -957764, -1505214, -1858759, -1479292, -336674, 986193, 1529236, 762174, -674047, -1434234, -813013, 695085, 2103535, 2690970, 2142016, 689646, -705211, -1013580, -295820, 339843, 165778, -393104, -695838, -876258, -1372889, -2037130, -2339076, -2096880, -1454276, -483434, 620185, 1284559, 1174188, 833974, 993618, 1323545, 693012, -1163398, -2973718, -3346631, -2373210, -1324680, -1073666, -1380251, -1620201, -1563745, -1199678, -318987, 1154764, 2563731, 2865901, 1835070, 531691, 221200, 1008299, 1870401]
35801A870401M4917o72958o63180j72477J35695j29133p01157q45252j71456O98900
35791f05700P27728j43627p80474l67313M85523O95606K27717p5605J66663N01087
35781H31605M71687J22169k93820n36424m01099l1548j3543n76286r84852m77667
35771a889778M65602P36954L04602J62814N47646N14453l09597q51066k46338
35762e64708P01369P31253n353l99930j62254L6714r2886j47115j8215j08023
35752b9148m05502l44284J33239L01951j05199k56133M71989J224906O83070r35038
35742G39851j893690j116921M75302J220745P12957m0493j22941L15971N75131
35733H65912K90027l77581r76398r62485j03919R88014J180575J65028q95599
$$ y = [1870401, 1915318, 1242360, 579180, 406703, 542398, 413265, -287892, -1133144, -1304600, -605700, 122028, -21599, -802073, -1169386, -683863, 11743, 239460, 163855, 330518, 831605, 1303292, 1425461, 1131641, 595217, 194118, 162570, 149027, -427259, -1412111, -1889778, -1424176, -687222, -382620, -219806, 327840, 842293, 532696, -318370, -564708, 136661, 867914, 862561, 462631, 300377, 337091, 244205, 97090, 78875, -29148, -434650, -778934, -645695, -343744, -448943, -705076, -233087, 991819, 1674889, 739851, -1153839, -2270760, -1795458, -574713, 138244, 97751, -25190, 290781, 865912, 1155939, 778358, -198040, -1160525, -1264444, -276430, 904145, 1069173, 173574]
35724A73574p17998L63599Q36835J20205p43846p44570k37024j3760N9169N09483
35714c94333R54872N27932n66199j108415o45014j06506k38115m51313L0570P33116
35704a263405O61031l4445k65424K53627O13644K34400k75127k34396L9184m0050
35694c10961k38227M154M58045M17969r2684l43095p8138J93707J68466J35027
35684C14263J96602k5419n42735o74392j00697M58227K52235l78507n71315j72861
35674a244599K84429M65482M12910J60387j78230k32977Q3401K24550j32619l54639
35664e11905J54437O99982J89762r90374j313185l40519P12771Q91012O63440
35655A55421O97518O96650J99058m38777o57668n56056m42239k12040J84222L29830
$$ y = [173574, -544424, -180825, 656010, 776215, 32369, -712201, -949225, -962985, -903816, -394333, 560539, 1088471, 522272, -586143, -1231157, -1337663, -1575778, -2027091, -1996521, -1263405, -602374, -636819, -902243, -648616, -34972, 199428, -75699, -310095, -270911, -310961, -549188, -545034, -86989, 330980, 238296, -104799, -182937, 10770, 179236, 314263, 510865, 485446, -57289, -731681, -832378, -374151, -121916, -500423, -1071738, -1244599, -960170, -494688, -81778, 78609, -99621, -332598, -249197, -24647, -157266, -511905, -357468, 342514, 532276, -458098, -1771283, -2111802, -1399031, -508019, 155421, 852939, 1549589, 1748647, 1309870, 652202, 96146, -346093, -558133, -373911, -44081]
35645d4081K7637k56943k05536j61212k74713l8665O22659Q04680P9996n30590
35635B3232j88522K11407m10669j179174n44999R19787J174200O229n87847L11664
35625b64692J084505K88308j056191j173657r7193Q39835J005566O52133k2634
35616A255980o88149m99778P28855J554789N65543j345746j904375o06166O20190
35607c18857K63225p12955n13589Q18987J563040P65976n71725r40761j82148
35598A71193N91596N53891o222m45912p00729r78761r67568j53856J091363J578383
35588G33378P67620m69720r71151o12388n0289L22219N26372M91171J23405k75666
35578E84951k90486j0999J52429J58002K72139L97333R9824n91596r88885o13181
$$ y = [-44081, -16444, -273387, -478923, -640135, -914848, -953513, -330854, 473826, 553822, 23232, -165290, 46117, -364552, -1543726, -2088725, -1168938, 5262, 11491, -576356, -264692, 819813, 1108121, 51930, -1121727, -1218920, -379085, 626481, 1278614, 1255980, 567831, 68053, 796908, 2351697, 2917240, 1571494, -332881, -939047, -318857, -55632, -768587, -1282176, -463189, 1099851, 1865827, 1294102, 353341, 171193, 762789, 1316680, 1310458, 864546, 163817, -814944, -1782512, -1936368, -845005, 733378, 1500998, 1031278, 60127, -552261, -602550, -280331, 246041, 737212, 860617, 584951, 294465, 283466, 435895, 593897, 866036, 1263369, 1363193, 771597, -217288, -830469]
35568h30469J09971L18201k74826j020291r76158J06037J445143J985153J458224
35559B320985M71288l79490r65881j122605m50930Q56748J625515R30589n77332
35550B708887j337629p40534L27892P04259J11251q30341j230081o56331L46412
35541e96215P05976J77935k56507P1499L37670l79144j243334p53227O89256J162167
35531h3924K63836k41497N76327J184591J74644j251819j111088K27329O85083
35522D23482l10723j142884n06248R60117J797548J343096q654j247165j315651
35513g082o0259J310975J451875N00894k99649m11154l91994n57221m64616K7001
35503A098770L29367J69490N7823K57231K59681j72031m10495r1857P9024n00523
$$ y = [-830469, -720498, -402297, -677123, -1697414, -2673572, -2567535, -1122392, 862761, 2320985, 2792273, 2412783, 1446902, 324297, -126633, 730115, 2355630, 3286219, 2708887, 1371258, 630724, 958616, 1662875, 1774126, 943785, -286296, -942627, -596215, 109761, 287696, 31189, 102688, 440358, 61214, -1182120, -1935347, -1246091, -83924, 179912, -61585, 514742, 1699333, 1873977, 622158, -488930, -261601, 423482, 112759, -1030125, -1536373, -576256, 1221292, 2564388, 2555734, 1308569, -7082, -67341, 1243634, 2695509, 3196403, 2896754, 2485600, 2093606, 1536385, 1071769, 1098770, 1428137, 1597627, 1655450, 1912681, 2172362, 2000331, 1589836, 1497979, 1577003, 1076480]
35493A076480j153451r22024j29505J74043o7295O0901Q08320J304201R18456
35484B070126J10910m03907n36005m60828r0494N31722Q05850K10395q16380j197384
35474B24005m75154N98622Q60622j8303j165047j370892l41966R59529J337261
35465F08677O60676j04224j62678K10967K78254n0513k30181o7346n2898n13190
35455E77544r61823p27449Q7282P64212R17210P53966M52295j03835q00613j097696
35445a38907p40985k50567k42564n62410n77434j22932L58278N09964L89759J46264
35435a231534j27914k00859J37808O21323O75977J93597k95681l92650l35946
35426i55879m92752p31946o33375o4772P27976J385442J556601J020644R015p64437
$$ y = [1076480, -76971, -998995, -1128500, -954457, -1021752, -960851, -152531, 1151670, 2070126, 2181036, 1777129, 1241124, 780296, 689802, 1221524, 2027374, 2237769, 1421389, 224005, -251149, 347473, 1208095, 1189792, 24745, -1346147, -1688113, -728584, 608677, 1269353, 1165129, 1002451, 1213418, 1491672, 1441159, 1210978, 1143632, 1090734, 577544, -384279, -1111728, -1024446, -260234, 656976, 1410942, 1863237, 1759402, 958789, -138907, -879892, -1130459, -1373023, -1935433, -2512867, -2635799, -2277521, -1767557, -1377798, -1231534, -1359448, -1560307, -1422499, -801176, -125199, 68398, -227283, -619933, -955879, -1448631, -2180577, -2813952, -2878724, -2150748, -765306, 791295, 1811939, 1820954, 1056517]
35416A056517p36061j22295L20428J60696k70851l60067p51K56247o7438o55206
35406d18781p38929j64680L92649M79892M70956O33649L62419p09079j474424
35397a166328o38762J022522J350920m9696j108725m01499P60714N46010n71786
35388b56630q36087l9498N00366K82081J39089N15551Q18754O43862L09019l4731
35378B041776o39232j284824j272455n55093R5417K64345L08180M36566L44877
35369b60443l4509l16294l60853l44888j33835M54252Q53668L89816l68895k71460
35359c93441M26803L49541n98386r67991k93513J46352k10378j69902O93196P44405
35349b73314q25211j961546p89058J110612J072427l63948m85410J061432J872055
$$ y = [1056517, 320456, 198161, 518589, 679285, 408434, 48367, 47616, 303863, 236425, -418781, -1157710, -1322390, -929741, -449849, 21107, 654756, 1017175, 308096, -1166328, -1805090, -782568, 568352, 518656, -590069, -991568, -230854, 315156, -256630, -1092717, -1132215, -631849, -349768, -210679, 304872, 1123626, 1767488, 2076507, 2041776, 1402544, 117720, -1154735, -1709828, -1614411, -1350066, -1041886, -605320, -260443, -294952, -611246, -972099, -1316987, -1450822, -996570, -142902, 246914, -121981, -393441, 33362, 382903, -215483, -1183474, -1476987, -1330635, -1541013, -1710915, -1017719, -273314, -1098525, -3060071, -3849129, -2738517, -1666090, -2030038, -2515448, -1454016, 418039]
35340D18039Q13475m92518o34121k30496o5042K64839Q89037Q91587N3718l89012
35330A519506J98981O37335j14576j220563j365766o77310j02108J00546J87702
35321h36253J53549K5999R7589J88861k90266r56599m85666J157627K029790R08666
35311A993297p54146r78669l1783N33136M01945K50614j9754p97080j236752l10736
35301i49928J074896J096979r9378o47597m5813K21582n27686r63055j27986Q46418
35291a21568N50503n79126j111946o13217K35136P61053P19188J89020l11514
35282b82471j83138L56895M33126q0690k25785M56560R96596M47962n66312p49810
35272F02933m6307L54832k60772j245151j484885o59227N24108J111506Q30525
$$ y = [418039, 1231514, 738996, 104875, -125621, -190663, 74176, 963213, 1854800, 1908518, 1519506, 1718487, 2355822, 2241246, 1020683, -345083, -1022393, -1124501, -1023955, -836253, -682704, -656705, -559116, -370255, -660521, -1617120, -2102786, -945159, 1084631, 1993297, 1239151, 260482, 228699, 761835, 1163780, 1414394, 1394640, 597560, -639192, -949928, 124968, 1221947, 1122569, 474972, 429159, 650741, 123055, -840000, -967986, -121568, 428935, -150191, -1262137, -1875354, -1640218, -879165, -159977, 29043, -282471, -465609, -108714, 324412, 243722, 17937, 474497, 1471093, 1919055, 1352743, 602933, 556626, 911458, 650686, -594465, -2079350, -2738577, -2214469, -1102963, -272438]
35263b72438K22568j37895k56082l28087k29866O5323Q9444k93357k30943Q04474
35253e66859J584224N81610j401837j966231n88851P02387O21808L41628Q89974
35244A97853J099770j44065j490563j076082M50009J039436L99832j52004k27464
35235I6722m87392p14608p3339Q90002P45661l04037n98176J38519L73101m12830
35225c46377p65861J00117Q56123L47834n42246n85164j30097M882J15604O42359
35215c02826Q80103J86481n69882l18946L46851K13902m01506k63179N11904N79477
35205H62379l34969r26018l43490O13348P65954M3960p16104q08251k20692M33279
35195f30604N27842K20523K62617O74830L95381r85408k037125j299108M10106
$$ y = [-272438, -49870, -187765, -443847, -771934, -1001800, -936477, -847033, -1140390, -1371333, -566859, 1017365, 1598975, 197138, -1769093, -2357944, -1655557, -1033749, -692121, 197853, 1297623, 1153558, -337005, -1413087, -963078, 76358, 476190, 324186, 96722, -390670, -1105278, -1178617, -288615, 457046, 153009, -445167, -306648, 66453, -346377, -1112238, -1012121, -155998, 191836, -350410, -935574, -1065671, -1060789, -945185, -302826, 577277, 763758, 193876, -125070, 221781, 435683, 34177, -229002, 282902, 862379, 527410, -398608, -742098, -128750, 637204, 681164, -34940, -843191, -1063883, -630604, -102762, 117761, 380378, 1055208, 1450589, 465181, -1571944, -2871052, -2460946]
35186b460946J063057L83533n0300M48121P97994L62801O8832N08645O93877j48187
35176A667427j010277p02016J67667K97077j26090L8969P40867P85113j34955
35167A723782r44305q38490k09115K77744M81035M23250M0338m33109n72151m35090
35157d86111m21886l89609K29177J237498J536824O04069o76081j163974q02067
35148c32160k72689R5975M46551P92270R06790O62646J19008n37578r22470o69714
35138B88629P285L47509n2282p22108r89367p39746k02559N01354J150697J265385
35128H54797P12425N7715k20052m01250q10313r86171m13494L66543L97832k01537
35118f43505m76984k33757k14232o14491o54570N5147Q53745J160060J177268
$$ y = [-2460946, -1397889, -1014356, -1064656, -616535, 181459, 544260, 613092, 1121737, 1815614, 1667427, 657150, -44866, 122801, 419878, 293788, 332757, 1073624, 1858737, 1723782, 779477, -59013, -268128, 9616, 490651, 913901, 954239, 521130, -51021, -486111, -907997, -1297606, -1068429, 169069, 1705893, 2309962, 1633881, 469907, -332160, -604849, -508874, -62323, 729947, 1636737, 2299383, 2418391, 1880813, 958343, 288629, 295914, 643423, 591141, -130967, -1120334, -1860080, -2062639, -1561285, -410588, 854797, 1567222, 1624937, 1404885, 1003635, 193322, -792849, -1206343, -839800, -441968, -643505, -1120489, -1354246, -1568478, -2182969, -2837539, -2782392, -1928647, -768587, 408681]
35109D08681J006394K61797p61473q44927K04768O44204p10326k164064j272920
35100c227866J318346K452147R44988q31420o23770O00562O87026k57407m70794
35091E91812L32355O39703j70423q23212l07577N69251O04563k5109l75859k59079
35081G76425j46060j61094j74048m40158j090584j315941k71492J274078J515780
35072c3094J32218j052358n61056P48313J159105N82749K40469M50077K86872
35063A953295n92151j248807r50396j73946L55132N85150N57673l9984r84211
35054e38245j155750p2051J015978P25710l81976o77763j378K61512l78304p03688
35044a905955M9308P81501K94928p15751p34258K55122Q97639N61568o0180l76410
$$ y = [408681, 1415075, 1676872, 915399, 70472, 275240, 919444, 209118, -1954946, -3227866, -1909520, 542627, 1487615, 656195, 32425, 632987, 1320013, 1062606, 591812, 924167, 1563870, 1393447, 570235, 262658, 831909, 1436472, 1411363, 1035504, 776425, 630365, 469271, 295223, -144935, -1235519, -2551460, -2822952, -1548874, -33094, 99124, -953234, -1514290, -765977, 393128, 975877, 1216346, 1666423, 1953295, 1361144, 112337, -838059, -1012005, -656873, -71723, 485950, 445966, -538245, -1693995, -1766046, -750068, -24358, -406334, -1084097, -1085475, -823963, -1202267, -1905955, -1856647, -1075146, -780218, -1495969, -2230227, -1975105, -1077466, -515898, -576078, -952488]
35034i52488n73598o26643L6090J249033J647027M73774r89169j010534J03835
35025f42673N27693k27373n82666N04132J718792J291624l18973j102836l84654
35016G83066M89833L73406k16903l11793K1784J59181N2000N1074J30659O0063
35006A592370j5861J37981K64110k7305n17480o15707k17280K09485L02065J14833
34996A227211j42484k78824j62985Q0477J20153o5079p4333K01568K76601p6000
34986A106305k99799j1153K25338q0780k96530K24465O82254l3159j231048j213213
34976i27320j2275N99565L532m30724N4963L29421k82700m87316N95398J404869
34966H47413L23518j381984j360803Q4437O39745j49918l98201O30134J274574
$$ y = [-952488, -1526086, -2152729, -2116639, -867606, 779421, 1253195, 264026, -746508, -642673, -114980, -342353, -925019, -420887, 1297905, 2589529, 2270556, 1167720, 783066, 1272899, 1646305, 1429402, 1117609, 1139393, 1298574, 1350574, 1401648, 1532307, 1592370, 1576509, 1714490, 1978600, 1951295, 1433815, 818108, 600828, 810313, 1112378, 1227211, 1084727, 805903, 642918, 723395, 843548, 778469, 704136, 905704, 1182305, 1106305, 806506, 795353, 1020691, 939911, 643381, 867846, 1550100, 1516941, 285893, -927320, -939595, -340030, -336498, -767222, -712259, -382838, -665538, -1152854, -557456, 847413, 1170931, -211053, -1571856, -1487419, -847674, -997592, -1395793, -765659, 508915]
34957E08915M93673l26134J40263R02713N28575l47060k88571L20094L6118q81182
34947A087404p01365P40738J356237j16147k021204j997031j99681J104103O96291
34938e0655k92107l75750K70877N09328J16401r4396K17448L91713J5501k51093
34928D57267K44193R20908P37080j77037o97450m56095k93167o83505q32819m6029
34918h26654Q99973P68345k73162r10985o18853k07742l16396m26218J20984R31591
34908h59117J086344L99389n00312j056429j133951o73871L10546J338852J651050
34899E62501J027031P4019m70849m40513j43220P5477l269m05912q19121p96478
34889a340334l59533o9523j84899j38941O03407J468206J332368J62128p33963
$$ y = [508915, 1002588, 676454, 816717, 1719430, 2248005, 1900945, 1612374, 1932468, 1968586, 1087404, 386039, 1126777, 2483014, 2366867, 345663, -1651368, -1851049, -746946, -50655, -342762, -718512, -447635, 61693, 178094, 83698, 301146, 692859, 708360, 457267, 701460, 1622368, 2359448, 2182411, 1484961, 1028866, 735699, 52194, -780625, -826654, 73319, 841664, 568502, -342483, -961336, -1169078, -1485474, -1911692, -1790708, -859117, 227227, 626616, 126304, -930125, -2064076, -2737947, -2427401, -1088549, 562501, 1589532, 1663551, 1192702, 752189, 608969, 684446, 681177, 275265, -543856, -1340334, -1699867, -1769390, -1954289, -2093230, -1489823, -21617, 1310751, 1472879, 738916]
34880G38916m03439N19388Q21651L67230k4189m563n3328l87694m77882m2804
34870A053286K81291o0773m90897j60423M99861K59427q44544j227290j18229
34861h08291J018684N36203q30737r80550L94925J412542Q74203k17718n98937
34852H00324n22282o12721m77566J70967L21110p15904j550477n68610J229677
34843a925482J512876L11613j33762P30443Q58663o33703j618933m53692J097824
34834b54153O32583j022059j243662K47038J317910R48440K86755K21110K04296
34825A338258j36337j96133K20071L47884q8094l05239N5890K26480k39049n63913
34815F59818j13432M24218J48150n83098p27354q6459N42500M58414k43292q63670
$$ y = [738916, 335477, 854865, 1676516, 2043746, 2019557, 2014994, 1961666, 1573972, 1096090, 1053286, 1334577, 1273804, 782907, 622484, 1122345, 1381772, 537228, -690062, -808291, 210393, 746596, -84141, -1064691, -669766, 742776, 1616979, 1399261, 800324, 278042, -334679, -812245, -641278, -320168, -1036072, -2586549, -3155159, -1925482, -412606, -100993, -234755, 495688, 1354351, 720648, -898285, -1351977, -254153, 378430, -643629, -1887291, -1640253, -322343, 626097, 912852, 1133962, 1338258, 1201921, 1005788, 1225859, 1573743, 1485649, 1180410, 1236300, 1462780, 1223731, 659818, 546386, 970604, 1118754, 535656, -191698, -278157, 264343, 722757, 479465, -384205]
34805c84205p29588J21336Q39590P13348Q3568k40060j99708k83250l76552K4072
34795d31449N68476L79202k96117k53521N57926P21146k80351j045168n03163
34786e83019L91800L71754j62426k00033R2789R0692R3830M68868M53610n09192
34776E08673j204541l01004J183703J151717k90270r85230p2069R56440Q01272
34767A748691J5561l85946l03597K6401N42926P85449J38476r38133j234976o42632
34757b47780k36569k74643J56909J056401J036999k00013q89411M5712J085980
34748A533585N51862o54980o60681K87230M81149k88368o31993r1055K91545k9883
34738G88411l39524j54367M5521o9950j20426R3117K39609K63208N07593Q37892
$$ y = [-384205, -1113793, -992457, -152867, 560481, 644049, 403989, 204281, -78969, -455521, -431449, 137027, 516229, 220112, -33409, 524517, 1245663, 965312, -79856, -583019, -191219, 180535, 18109, -181924, -89135, 1557, 95387, 564255, 1017865, 508673, -695868, -996872, 186831, 1338548, 1048278, 63048, -9021, 947419, 1748691, 1764252, 1378306, 1074709, 1101110, 1644036, 2429485, 2567961, 1629828, 394852, -247780, -484349, -758992, -602083, 454318, 1491317, 1291304, 401893, 447605, 1533585, 2085447, 1430467, 769786, 1057016, 1538165, 1249797, 617804, 526749, 818294, 788411, 448887, 294520, 340041, 270091, 149665, 242782, 482391, 745599, 1253192, 2091084]
34728B091084O71209P4426k15989p9233k23768q20222j029692l63718M60899N61093
34718A126089k4040p38701j231005j247507n89048L67994Q13837N75054L42275
34709f05052M95240N14980j4501o50508q36389o31179k39147L51733P84239L50478
34699d80106p54993j171588j81469J107827J299784N86050O9002n715j61844m45316
34689a38368m82305l56420l12290k3749P20279J105788L61098p00939o63147K53357
34679b36696N08228k67668p76240k69060L94075M33086L82214Q31650J168017
34670B167606N46522o93048j434188j098696l4066R15398R56229P9959o49796
34661G55920l24255L82129J68532o01897k83336J063648J172585q68024k605275
$$ y = [2091084, 2762293, 2836719, 2620730, 2541497, 2317729, 1497507, 467815, 104097, 564996, 1126089, 1102049, 363348, -867657, -2115164, -2704212, -2336218, -1522381, -947327, -605052, -109812, 405168, 390667, -259841, -1096230, -1727409, -1966556, -1614823, -830584, -480106, -1235099, -2406687, -2588156, -1480329, -180545, 405505, 474507, 468792, 306948, -138368, -620673, -977093, -1289383, -1313132, -592853, 512935, 874033, 173094, -490053, -236696, 271532, 3864, -772376, -1041436, -647361, -214275, 167939, 999589, 2167606, 2714128, 2021080, 586892, -511804, -545870, 369528, 1325757, 1405716, 755920, 431665, 813794, 982326, 380429, 97093, 1160741, 2333326, 1465302, -1139973]
34652a139973j583121Q88742J613793J45160j007718m72286L07200o2231o92500
34643b002934j95095R53055J254831M97549j20175J86671Q93669J098666O20412
34634C186649n2787n26954q74016j228861j317915p95034n48K31533k09076l42918
34624a929927M95747J472708J273741l9770j065895q39960J86699R29388P83660
34615A266391n2505q35718q65560k01256L64264L43455J39725J81292J26065l60283
34605A05870p09260l04685L39224L73762R2907L45458Q77074O99420j21782n85993
34595A111995n74264q97465j433124r90529N30366J549417J075123N6609l12198
34586A15930k17259k63437k29348J71803M20804J28972j42461M1026R5777m19950
$$ y = [-1139973, -2723094, -1834352, -220559, -75399, -1083117, -1555403, -1248203, -1310434, -2002934, -2198029, -1244974, 9857, 507406, 387231, 573902, 1467571, 2566237, 3186649, 3133862, 2606908, 1732892, 504031, -813884, -1608918, -1609466, -1377933, -1587009, -1929927, -1434180, 38528, 1312269, 1272499, 206604, -633356, -446657, 482731, 1266391, 1213886, 378168, -487392, -688648, -324384, 19071, 158796, 340088, 466153, 105870, -603390, -908075, -568851, -195089, -102182, 243276, 1120350, 1819770, 1697988, 1111995, 537731, -359734, -1792858, -2783387, -2253021, -703604, 371519, 428128, 115930, -101329, -364766, -594114, -422311, -1507, 127465, -14996, 26030, 121807, -298143]
34576b98143p89556l56101K40088J95640m5156K36566N69169J88294m01232k57424
34566g17855K52461R2283n51981o11063k2590L05715K09486L48496O68609M22413
34556C95974j85721l3231R11500J205393J49207j023622r79109j49785J56490
34547D47096l30721p69087n32797J86305Q45669J053376P54549K53998o4542j32280
34537A711566j03971J9606K60316K92863j81563p37347o13055J16409M89786N575
34527A260185o59461o23209M5847N42586L64602j86780m15720l8267L91491R2908
34517G74182p64032j028624j74430P12898L77125p43786j197356o48150r942L16382
34507b385733P85922J227794P16989n95291j148876k66703O98896N19059j4415
$$ y = [-298143, -1087699, -1443800, -1203712, -1008072, -1053228, -816662, -247493, -59199, -460431, -717855, -465394, -373111, -925092, -1536155, -1558745, -1253030, -1043544, -695048, -26439, 395974, 210253, 177022, 1088522, 2293915, 2443122, 1419500, 440391, 290606, 447096, 116375, -652712, -1185509, -999204, -153535, 899841, 1654390, 1908388, 1843846, 1711566, 1607595, 1627201, 1887517, 2180380, 1998817, 1261470, 648415, 764824, 1254610, 1260185, 600724, -22485, 23362, 565948, 930550, 743770, 328050, 289783, 681274, 774182, 10150, -1018474, -1192904, -480006, -102881, -846667, -2044023, -2692173, -2702115, -2385733, -1599811, -372017, 344972, -250319, -1399195, -1665898, -967002, -447943, -462358]
34498d62358L33999R81557N30234p27844j140549k94676M40387J43859l88355
34489e83746j16302O66166R18444K89369o23391r88180l57927R56624J868190
34480B029247J419089J8066q20876l75527L09206l0524r94356j169720l06385
34471G8220M06504L05169J47107M96374N37309l94646j171549l69241J204018
34462A239265J388735j1099q88342k47374K63968o31977j412754k27361J808029
34453A281090K128032N61026p92061r93506j047461j342126r14367K90364Q24626
34444d383J86811k84011J34277K82793n57038j099650k54323Q95869R24394L03237
34434E27976J23338L8970o39687j104198l57461O89606N71719j53499O8398Q91758
$$ y = [-462358, -128359, 853198, 1383432, 655588, -484961, -779637, -339250, -195391, -583746, -700048, -33882, 884562, 1173931, 550540, -437640, -795567, 161057, 2029247, 3448336, 3466402, 2645526, 2269999, 2579205, 2548681, 1554325, 384605, 78220, 484724, 789893, 937000, 1433374, 1970683, 1576037, 404488, 35247, 1239265, 2628000, 2616901, 1728559, 1481185, 1745153, 1113176, -299578, -526939, 1281090, 3409122, 3970148, 3178087, 2184581, 1137120, -205006, -1119373, -829009, -4383, 182428, -101583, 32694, 315487, -241551, -1341201, -1595524, -699655, 224739, 527976, 651314, 690284, 50597, -1053601, -1411062, -721456, -149737, -303236, -234838, 656920]
34424F56920O55842n16490p92876J51751N48499l89223j207019p92070j3373K12312
34414a485727M59652J163080J283356J20232j036601p26935L46085M81970l64843
34405B40269p97649l09943K41139K73288J07772k8247l19056n60247k08775N36898
34395h24551P49011J91490k08806K34842R08162Q45906J32430l77022l97842m96312
34385G57308j014382j384031q65130L56620J218020R03206l26233j446448j624318
34376c425388q35437K44438Q54549P91793M99187M19889M02985Q6212k79118l3079
34366a273969P65110J182947P41683J13059n0453j30923n68447p30380K4684Q15349
34356H88660L27328q80921r40750L42272R56671j97393j437106p85608J015304
$$ y = [656920, 1312762, 796272, 3396, 155147, 703646, 314423, -892596, -1684666, -1698039, -1485727, -1026075, 137005, 1420361, 1540593, 503992, -222943, 123142, 605112, 240269, -557380, -867323, -626184, -352896, -245124, -273371, -592427, -1152674, -1361449, -824551, -75540, 115950, -92856, 141986, 1050148, 1896054, 2028484, 1651462, 1253620, 757308, -257074, -1641105, -2506235, -2149615, -931595, -28389, -354622, -1801070, -3425388, -4260825, -4016387, -3161838, -2370045, -1870858, -1450969, -1047984, -961772, -1240890, -1273969, -508859, 674088, 1415771, 1528830, 1478377, 1347454, 779007, 48627, 73311, 888660, 1215988, 335067, -605683, -263411, 693260, 495867, -941239, -1726847, -711543]
34347g11543J600638L82008q15105m60712P16641R40532k46202j478236j313072
34338a385051m5410O51382j6260p60377n5316J385041J424388k18482j272388
34329b92473j76474J622603J864111O04290m28534o11298p23402r95955p56532
34320A06336J861L59662K4620k30993K0528K56661J38842P9655K60370J69949
34310A187491l65572o71096l28048N1948j89705o72723n45843L05990J177899
34301d9659J375107P72720j58284o58841l48994K66863L25323l05936q98634q41410
34291e21745k49436L86027O03101R9746q76344j362293o90395M26568P32525K44877
34281a207369Q8825N17275N09873l36495j000994p34398j35400K40813Q63028
$$ y = [-711543, 889095, 1271103, 455998, -4714, 711927, 1652459, 1406257, -71979, -1385051, -1430461, -779079, -795339, -1555716, -1611032, -225991, 1198397, 979915, -292473, -468947, 1153656, 3017767, 3622057, 3193523, 2582225, 1858823, 862868, 106336, 108197, 467859, 492479, 261486, 282014, 538675, 677517, 757172, 1017542, 1187491, 821919, 150823, -177225, -125277, -314982, -987705, -1533548, -1227558, -49659, 1325448, 2098168, 1939884, 1281043, 932049, 1198912, 1524235, 1218299, 319665, -521745, -771181, -385154, 217947, 317693, -558651, -1920944, -2611339, -2184771, -1452246, -1207369, -1118544, -601269, -91396, -427891, -1428885, -2163283, -2298683, -2057870, -1194842]
34272a194842J760034J599628k41285j936412j409783N40712J298893J68781r72984
34263c87258p25075J29501L86709J72371J65078L44270L45984K06064Q2739j08889
34253F11494l24145k65881K6008Q3170k14328l87915j19056L34179O05137M82968
34243H31631k45520j372916j764324m43700J645878K296076R19005n71537n14455
34234G80138K36197j1109j012630j138225r5870O51295K21459m65822k89064M12623
34224g11008N57583L8151j64518N14453J302024J042110k00365j074195o82528
34215F21707J89433K23150m69468n49770M22337J254581Q98742j38643q00999
34206A651070r09685p86557l70375K95226M83460j68953o94584j11019Q73219
$$ y = [-1194842, 565192, 2164820, 1923535, -12877, -1422660, -881948, 416945, 585726, -387258, -1112333, -982832, -596123, -423752, -258674, 85596, 431580, 637644, 720383, 611494, 287349, 21468, 47476, 130646, -83682, -471597, -590653, -256474, 348663, 831631, 586111, -786805, -2551129, -2994829, -1348951, 947125, 1866130, 1294593, 780138, 1016335, 1005226, -7404, -1145629, -1241499, -590204, -368745, -834567, -1123631, -711008, -153425, -115274, -279792, 234661, 1536685, 2578795, 2378430, 1304235, 621707, 811140, 1034290, 564822, 15052, 437389, 1691970, 2590712, 2452069, 1651070, 741385, -45172, -415547, -120321, 363139, 194186, -500398, -611417, 261802]
34197B61802Q75040J02852m9010N13850L97599o86849j080579J79966J535008
34188B049679J071463o57518j553575j009022l42031l86060l30508N62969J424338
34179H29735R39096o31060j657720j248152k01976L62972M81396P63727R74839
34170F12857L36616q13964r85616K82454J363455P24200p17042q52645M58344
$$ y = [261802, 1136842, 1239694, 1190684, 1704534, 2102133, 1415284, 334705, 514671, 2049679, 3121142, 2463624, 910049, -98973, -441004, -827064, -1157572, -594603, 829735, 1768831, 1137771, -519949, -1768101, -1970077, -1607105, -1125709, -361982, 612857, 949473, 135509, -850107, -567653, 795802, 1520002, 802960, -49685, 408659]
$$ [...]
##END NTUPLES=NMR SPECTRUM
##END=
