##TITLE=31Pdec_48-2021
 CDCl3, 24 sc
 5.07.2021
##JCAMPDX= 6.0         $$ Bruker NMR JCAMP-DX V2.0
##DATA TYPE= NMR SPECTRUM
##DATA CLASS= NTUPLES
##ORIGIN= UXNMR, Bruker Analytische Messtechnik GmbH
##OWNER= root
$$ XWIN-NMR		Version 3.5
$$ Mon Jul  5 10:44:01 2021 Russian Standard Time (UT+4h)  she@DPX200
##.OBSERVE FREQUENCY= 81.013821
##.OBSERVE NUCLEUS= ^31P
##.ACQUISITION MODE= SIMULTANEOUS
##.ACQUISITION SCHEME= undefined
##.AVERAGES= 24
##.DIGITISER RES= 16
##SPECTROMETER/DATA SYSTEM= spect
##.PULSE SEQUENCE= zgpg30
##.SOLVENT NAME= CDCl3
##.SHIFT REFERENCE= (INTERNAL, CDCl3, 0, 248.564)
##AUDIT TRAIL= $$ (NUMBER, WHEN, WHO, WHERE, WHAT)
$$ ##TITLE= Audit trail, XWIN-NMR		Version 3.5
$$ ##JCAMPDX= 5.01
$$ ##ORIGIN= Bruker BioSpin GmbH
$$ ##OWNER= she
$$ F:/spectra/data/she/nmr/P31/1/pdata/1/auditp.txt
$$ ##AUDIT TRAIL=  $$ (NUMBER, WHEN, WHO, WHERE, WHAT)
(   1,<2021-07-05 10:42:47.90 +0400>,<she>,<DPX200>,
      <created by zg, POWCHK disabled, PULCHK disabled
       configuration hash MD5:
       00 E9 B6 7A A2 85 ED C7 34 08 36 98 17 FE 4E 26
       data hash MD5: 32K
       7E E1 C3 F8 D7 11 46 DC 78 5F AC BE 34 C5 B4 77>)
(   2,<2021-07-05 10:42:50.40 +0400>,<she>,<DPX200>,
      <Start of raw data processing
       efp BC_mod = 2 LB = 1 FT_mod = 6 PKNL = 1 PHC0 = -6845.745 PHC1 = -1018.114 SI = 64K 
       data hash MD5: 64K
       C2 45 BE DB F0 BA AD 12 3D BF 0B 33 48 21 78 C4>)
(   3,<2021-07-05 10:43:11.78 +0400>,<she>,<DPX200>,
      <pk PHC0 = 54.67801 PHC1 = -118.2 
       data hash MD5: 64K
       BB 6F A5 B7 36 AD 6F BD A2 0E 86 95 57 4C CB 9F>)
(   4,<2021-07-05 10:43:15.48 +0400>,<she>,<DPX200>,
      <abs ABSG = 5 
       data hash MD5: 64K
       9F C8 6D E7 D4 39 F0 C4 8A 31 FF 29 A9 0A 13 BF>)
$$ ##END=
$$ 
$$ hash MD5
$$ B1 37 D3 63 3F 8A 4A 49 39 9C 5D 2C 27 E5 28 78
##$RELAX= 
##$RELAX= 
##$RELAX= 
##$RELAX= 
##$RELAX= 
##$RELAX= 
##$RELAX= 
##$RELAX= 
$$ Bruker specific parameters
$$ --------------------------
##$DU= <F:/spectra>
##$EXPNO= 1
##$NAME= <P31>
##$PROCNO= 1
##$TYPE= <nmr>
##$USER= <she>
##$AMP= (0..31)
100 100 100 100 100 100 100 100 100 100 100 100 100 100 100 100 100 100 
100 100 100 100 100 100 100 100 100 100 100 100 100 100 
##$AQSEQ= 0
##$AQ_mod= 1
##$AUNM= <au_zg>
##$AUTOPOS= <>
##$BF1= 81.014009
##$BF2= 200.13
##$BF3= 200.13
##$BF4= 200.13
##$BF5= 200.13
##$BF6= 200.13
##$BF7= 200.13
##$BF8= 200.13
##$BYTORDA= 1
##$CFDGTYP= 0
##$CFRGTYP= 5
##$CHEMSTR= <none>
##$CNST= (0..31)
1 1 145 1 1 1 1 1 1 1 1 1 1 1 1 1 1 1 1 1 1 1 1 1 1 1 1 1 1 1 1 1 
##$CPDPRG= <waltz16>
##$CPDPRG1= <>
##$CPDPRG2= <waltz16>
##$CPDPRG3= <>
##$CPDPRG4= <mlev>
##$CPDPRG5= <mlev>
##$CPDPRG6= <mlev>
##$CPDPRG7= <mlev>
##$CPDPRG8= <mlev>
##$CPDPRGB= <>
##$CPDPRGT= <>
##$D= (0..31)
0 1 0 0 0 0 0 0 0 0 0 0.03 2e-05 3e-06 0 0 0 0 0 0 0 0 0 0 0 0 0 0 0 0 
0 0 
##$DATE= 1625467367
##$DBL= (0..7)
120 120 120 11 120 120 24 19 
##$DBP= (0..7)
150 150 150 150 150 150 150 150 
##$DBP07= 0
##$DBPNAM0= <>
##$DBPNAM1= <>
##$DBPNAM2= <>
$$ [...]
##$SUBNAM3= <"">
##$SUBNAM4= <"">
##$SUBNAM5= <"">
##$SUBNAM6= <"">
##$SUBNAM7= <"">
##$SUBNAM8= <"">
##$SUBNAM9= <"">
##$SW= 501.771253377433
##$SWIBOX= (0..15)
0 1 3 0 0 0 0 0 0 0 0 0 0 0 0 0 
##$SW_h= 40650.406504065
##$TD= 32768
##$TD0= 1
##$TE= 0
##$TE2= 300
##$TE3= 300
##$TEG= 300
##$TL= (0..7)
0 120 53 12 22 120 120 120 
##$TP= (0..7)
150 150 150 150 150 150 150 150 
##$TP07= 0
##$TPNAME0= <>
##$TPNAME1= <>
##$TPNAME2= <>
##$TPNAME3= <>
##$TPNAME4= <>
##$TPNAME5= <>
##$TPNAME6= <>
##$TPNAME7= <>
##$TPOAL= (0..7)
0.5 0.5 0.5 0.5 0.5 0.5 0.5 0.5 
##$TPOFFS= (0..7)
0 0 0 0 0 0 0 0 
##$TUNHIN= 0
##$TUNHOUT= 0
##$TUNXOUT= 0
##$USERA1= <user>
##$USERA2= <user>
##$USERA3= <user>
##$USERA4= <user>
##$USERA5= <user>
##$V9= 5
##$VALIST= <valist>
##$VCLIST= <CCCCCCCCCCCCCCC>
##$VD= 0
##$VDLIST= <DDDDDDDDDDDDDDD>
##$VPLIST= <PPPPPPPPPPPPPPP>
##$VTLIST= <TTTTTTTTTTTTTTT>
##$WBST= 1024
##$WBSW= 4
##$XGAIN= (0..3)
0 0 0 0 
##$XL= 0
##$YL= 0
##$YMAX_a= 6623
##$YMIN_a= -7581
##$ZGOPTNS= <>
##$ZL1= 120
##$ZL2= 120
##$ZL3= 120
##$ZL4= 120
##$ABSF1= 248.5645
##$ABSF2= -253.2056
##$ABSG= 5
##$ABSL= 3
##$ALPHA= 0
##$AQORDER= 0
##$ASSFAC= 0
##$ASSFACI= 0
##$ASSFACX= 0
##$ASSWID= 0
##$AUNMP= <proc_1d>
##$AZFE= 0.1
##$AZFW= 0.5
##$BCFW= 0
##$BC_mod= 2
##$BYTORDP= 0
##$COROFFS= 0
##$CY= -3
##$DATMOD= 1
##$DC= 0
##$DFILT= <>
##$DTYPP= 0
##$F1P= 0
##$F2P= 0
##$FCOR= 1
##$FTSIZE= 65536
##$FT_mod= 6
##$GAMMA= 0
##$GB= 0
##$INTBC= 1
##$INTSCL= 5.30512e-09
##$ISEN= 30
##$LB= 1
##$LEV0= 0
##$LPBIN= 0
##$MAXI= 10000
##$MC2= 0
##$MEAN= 0
##$ME_mod= 0
##$MI= 50
##$NCOEF= 0
##$NC_proc= -4
##$NLEV= 6
##$NOISF1= 182.463
##$NOISF2= 159.3651
##$NSP= 0
##$NTH_PI= 0
##$NZP= 0
##$OFFSET= 248.5645
##$PC= 4
##$PHC0= -6791.067
##$PHC1= -1136.314
##$PH_mod= 1
##$PKNL= yes
##$PPARMOD= 0
##$PSCAL= 0
##$PSIGN= 0
##$REVERSE= no
##$SF= 81.014009
##$SI= 65536
##$SIGF1= 159.3651
##$SIGF2= -187.1042
##$SINO= 113.3802
##$SIOLD= 16384
##$SREGLST= <1H.CDCl3>
##$SSB= 0
##$STSI= 65536
##$STSR= 0
##$SW_p= 40650.406504065
##$SYMM= 0
##$S_DEV= 0
##$TDeff= 32768
##$TDoff= 0
##$TI= <>
##$TILT= no
##$TM1= 0
##$TM2= 0
##$TOPLEV= 0
##$USERP1= <user>
##$USERP2= <user>
##$USERP3= <user>
##$USERP4= <user>
##$USERP5= <user>
##$WDW= 1
##$XDIM= 65536
##$YMAX_p= 363012165
##$YMIN_p= -2561961
$$ End of Bruker specific parameters
$$ ---------------------------------
##NTUPLES= NMR SPECTRUM
##VAR_NAME=  FREQUENCY,     SPECTRUM/REAL,   SPECTRUM/IMAG
##SYMBOL=    X,             R,               I
##VAR_TYPE=  INDEPENDENT,   DEPENDENT,       DEPENDENT
##VAR_FORM=  AFFN,          ASDF,            ASDF
##VAR_DIM=   65536,         65536,           65536
##UNITS=     HZ,            ARBITRARY UNITS, ARBITRARY UNITS
##FACTOR=    0.620285442955139, 1,           1
##FIRST=     20137.2065510759, 0,            0
##LAST=      -20513.1999529892, 0,           0
##MIN=       -20513.1999529892, -2561961,    0
##MAX=       20137.2065510759, 363012165,    0
$$ Real data points
##PAGE= N=1
##DATA TABLE= (X++(R..R)), XYDATA
$$ [...]
39580 -144198 -308155 -175374 100068 225324 142444 -16689 -176611 -312954 -352156 -278582
39570 -278582 -218422 -249267 -264423 -182909 -125601 -202094 -300501 -297541 -298453 -424628 -530140 -413172
39558 -413172 -180756 -105702 -216437 -328714 -404480 -553933 -716234 -668329 -376729 -64538
39548 -64538 87392 52034 -199678 -646211 -1000379 -908448 -453172 -127143 -185350 -346167
39538 -346167 -289572 -124886 -130873 -301715 -429677 -449388 -427196 -344895 -156576 27455 50838
39527 50838 -48183 -103823 -78903 -73131 -128446 -208921 -334006 -542847 -734419 -717834 -446858
39516 -446858 -76459 223149 389516 407481 272280 64990 -45953 34143 199850 240206
39506 240206 65115 -182294 -259925 -88613 143287 182177 -1651 -196612 -213794 -75901
39496 -75901 69468 116209 34724 -155039 -367838 -478257 -436702 -325617 -260303 -273963 -321819
39485 -321819 -346525 -323813 -291242 -317656 -379849 -321705 -59119 221899 248887 31467 -156231
39474 -156231 -172611 -150108 -185456 -160085 -7706 89158 -21397 -171565 -97313 171622 369475
39463 369475 367321 287497 281780 352785 379619 230809 -93976 -377836 -357235 -54131 205048
39452 205048 192818 38085 -23277 40642 133205 205531 189393 -26941 -359101 -492358 -311595
39441 -311595 -113627 -123095 -91180 244332 575172 410227 -110891 -353614 -105081 197574
39431 197574 217256 159725 298377 519201 577682 460210 272653 58514 -98056 -70682
39421 -70682 55825 20717 -184649 -244378 -32455 148593 55075 -115323 -92120 34252
39411 34252 54111 33822 124852 201859 55105 -210276 -310028 -206810 -97770 -79098 -107849
39400 -107849 -191590 -325557 -338846 -101951 195103 273108 191169 213422 307515 163325 -249751
39389 -249751 -527374 -385652 -77009 -37453 -301787 -495054 -343346 -14008 92710 -182576
39379 -182576 -568307 -679141 -459553 -185649 -50327 38359 176417 230441 64959 -196517
39369 -196517 -357160 -425497 -474191 -395480 -94460 206523 192489 -86124 -305139 -360861
39359 -360861 -425190 -528383 -462902 -162675 152711 293593 271094 103340 -227388 -551586
39349 -551586 -591220 -380647 -272589 -380579 -372781 -32797 321986 284315 -48830 -263370
39339 -263370 -226893 -163444 -234058 -352547 -388283 -313932 -161958 -2659 66377 31904 -7071
39328 -7071 -21958 -125099 -324005 -385485 -154022 144121 160842 -110036 -364178 -395210 -237640
39317 -237640 15369 281864 428010 379536 265877 239827 222144 72233 -72506 47182
39307 47182 341522 417131 155096 -97707 -39455 191944 304918 265559 209073 151861 33984
39296 33984 -82173 -77648 30375 130552 187137 226769 228908 173236 135805 196572 295609
39285 295609 317101 286837 349417 544120 719108 707730 523126 331533 251516 221752 109010
39274 109010 -58650 -64571 207802 545412 617024 377920 93809 -25053 -15049 30578
39264 30578 107254 171970 97601 -106990 -220297 -109583 53422 42323 -109612 -219337
39254 -219337 -231159 -186980 -56182 171940 321547 201408 -101669 -317217 -345414 -314615
39244 -314615 -316867 -293154 -177627 17299 241233 380176 262771 -112190 -435394 -416099
39234 -416099 -184780 -87365 -134720 -11228 349796 591096 461004 167179 7872 -44883
39224 -44883 -152094 -252964 -192174 -36564 13827 -64822 -131393 -124590 -96596 -76121 -82305
39213 -82305 -196579 -430946 -593951 -488464 -208480 -57490 -180425 -417437 -510437 -353038
39203 -353038 -78924 20480 -233183 -623935 -687674 -288035 138939 137809 -156601 -278238
39193 -278238 -151409 -134611 -370280 -549684 -452219 -309123 -388188 -529784 -405789 -50895
39183 -50895 173716 64443 -230913 -466634 -534565 -453775 -305147 -204030 -217099 -284145
39173 -284145 -299908 -263491 -270057 -370768 -511463 -590371 -521325 -285556 8528 169691 117624
39162 117624 -9360 -31304 35491 28414 -111692 -275039 -357308 -358025 -290143 -144339 1380
39151 1380 -11996 -200084 -334569 -210599 58904 178295 67200 -55787 -11779 99407
39141 99407 98357 18966 43723 216052 383584 423449 381152 350106 325684 244464 108898
39130 108898 12674 43589 160911 179856 -39285 -343244 -365376 -262 332038 150758
39120 150758 -416918 -752700 -561031 -204597 -94197 -128708 -26755 109591 -21061 -352985
39110 -352985 -516910 -417417 -331647 -405786 -436820 -250796 27722 203303 225019 63566
39100 63566 -333182 -804650 -973576 -694538 -305549 -220295 -427824 -595266 -526108 -309654
39090 -309654 -119498 -63862 -175784 -386246 -540395 -547394 -461367 -349357 -190560 8978
39080 8978 135854 115387 17469 -79471 -186172 -271031 -220461 -60948 -7335 -114472 -111544
39069 -111544 177277 471541 404112 69834 -152637 -187503 -261523 -392043 -328726 -40143
39059 -40143 173969 167556 153431 267372 295936 60924 -237183 -323805 -258023 -267884 -363437
39048 -363437 -374764 -236468 1785 321244 657154 790373 564371 145007 -149098 -211040
39038 -211040 -150524 -39371 101422 137167 -66975 -370442 -468333 -315653 -185833 -244934
39028 -244934 -329372 -265812 -165793 -207549 -303640 -229285 -4724 88659 -104431 -392349 -487570
39017 -487570 -370891 -287301 -399428 -562707 -521516 -268928 -74638 -127722 -295046 -335896
39007 -335896 -230635 -131317 -75214 32011 171924 194697 90706 50600 159464 243947
38997 243947 158395 26632 21146 67471 -17661 -215671 -363814 -438402 -536103 -617596 -528983
38986 -528983 -293159 -135575 -155503 -183479 -63351 98574 91653 -102819 -282799 -235722
38976 -235722 68257 423087 518169 232672 -188493 -381889 -298982 -226863 -344991 -472173
38966 -472173 -364760 -80786 118087 108805 -6025 -76831 -46647 27535 7416 -194148 -456108
38955 -456108 -547405 -440069 -349040 -372468 -326240 -107878 24041 -183188 -515816 -548045
38945 -548045 -263108 -62330 -176280 -417865 -561040 -627437 -688430 -673677 -534141 -383327
38935 -383327 -328608 -320595 -278053 -211959 -142071 -47747 27706 -4368 -89232 -54157 96667
38924 96667 126675 -82706 -338878 -424783 -361382 -235047 -6881 288212 379303 91819
38914 91819 -304406 -388355 -145102 70062 71785 25743 73058 96667 -24041 -179566 -210738
38903 -210738 -148130 -111803 -95490 -8964 138716 240478 235241 132105 -71757 -359348 -579987
38892 -579987 -522899 -186309 135604 160253 -43134 -164373 -85733 -21417 -165044 -388687
38882 -388687 -447342 -342554 -269639 -274364 -198967 23655 232760 247620 57670 -218827 -408823
38871 -408823 -317591 103489 580716 722414 470155 147818 5776 -35511 -92343 -65493
38861 -65493 114288 240810 111278 -113086 -113003 115352 262345 139874 -118649 -281472
38851 -281472 -251104 -82122 74941 63118 -113939 -247510 -164401 48967 182585 170020
38841 170020 72145 -94888 -312506 -419946 -258450 56580 213308 68484 -230084 -486302
38831 -486302 -650919 -747738 -751567 -602223 -288092 81394 275530 125822 -220796 -382423
38821 -382423 -202134 33185 2848 -197329 -255602 -134578 -43639 -15916 123351 360388
38811 360388 415627 162006 -153926 -238190 -96902 56388 82992 8097 -56532 -7834 149197
38800 149197 279243 272280 188259 142631 112784 1656 -171591 -305833 -375417 -388215 -279088
38789 -279088 -40756 140180 102381 -37303 -87739 -106129 -225619 -313428 -183752 -38070
38779 -38070 -236932 -671670 -851173 -644628 -436391 -451491 -444568 -228562 -10438 33242
38769 33242 45611 89679 -71469 -467827 -647178 -310993 162797 270859 110238 73645
38759 73645 131440 -21599 -306483 -337750 -90102 55382 -56989 -162553 -74311 52325
38749 52325 51433 -23917 -115733 -285620 -505423 -594220 -482251 -320194 -243839 -230417 -233816
38738 -233816 -244123 -174408 73040 373681 457410 287282 115914 83574 31445 -150925
38728 -150925 -266488 -117679 137140 198800 71111 13596 102717 119873 -78441 -318732
38718 -318732 -362909 -233449 -119181 -63212 44937 191897 191516 -10254 -193641 -176987 -86579
38707 -86579 -106719 -128040 55507 304281 265636 -48983 -221481 -67236 73812 -116820
38697 -116820 -453480 -575549 -456566 -279804 -71864 188499 311269 132180 -135946 -168566
38687 -168566 -35749 -60514 -258636 -334304 -207691 -124595 -195874 -225522 -99058 12221
38677 12221 -26263 -87279 -27105 99264 202875 305048 389488 339017 156021 35917 84505
38666 84505 157546 114650 40346 67043 151380 176215 127810 40640 -87662 -201400 -158242
38655 -158242 67499 283638 305455 158516 -36730 -217648 -304525 -172057 130651 308803
38645 308803 178374 -59150 -130412 -130840 -346664 -714773 -824452 -519492 -169613 -165737 -386775
38634 -386775 -415960 -151714 82958 31152 -170430 -266418 -271071 -364091 -503026 -417602 -37516
38623 -37516 315019 312857 49297 -109493 -6495 173268 222473 162430 132166 180047 242695
38612 242695 243116 148570 -15358 -166960 -217256 -143889 -18568 26065 -116376 -390963 -546650
38601 -546650 -381087 -46910 81938 -72512 -162570 24720 168363 -95091 -508095 -483128
38591 -483128 23204 429775 383359 193610 222165 295323 75100 -304614 -406314 -164444
38581 -164444 5277 -206723 -601203 -755329 -538193 -222545 -142210 -332345 -545502 -591830
38571 -591830 -557913 -620519 -756922 -802169 -727010 -652824 -611123 -511192 -359111 -274964 -252983
38560 -252983 -149521 22791 44983 -157747 -362944 -384474 -326244 -347083 -397675 -375862 -341315
38549 -341315 -373084 -385455 -286235 -165715 -137436 -139634 -79254 -16215 -14302 20898 141457
38538 141457 169232 -39173 -290902 -299420 -113505 -18324 -97227 -188441 -224099 -309557 -466249
38527 -466249 -567434 -559350 -522109 -489606 -408508 -281542 -162071 -22551 169957 277336
38517 277336 129724 -155798 -244803 -20324 271587 366995 271532 138976 54468 24747
38507 24747 34352 35882 -3596 -16442 85513 241874 295688 213228 104501 42181 27765
38496 27765 103898 287219 409217 277734 13097 -54942 116304 185511 -53774 -345574
38486 -345574 -349743 -108137 89146 115033 42643 -93136 -319308 -565980 -686827 -622601
38476 -622601 -420979 -153827 66918 82836 -140626 -390297 -403182 -167759 78543 118479
38466 118479 -57042 -262168 -242594 102384 521956 570729 112346 -457884 -667996 -518674
38456 -518674 -361094 -355665 -354101 -263327 -182178 -136354 -7231 171534 160820 -76030 -205943
38445 -205943 -1494 267394 218816 -47727 -100476 166227 395210 310814 61134 -84228
38435 -84228 -91872 -70489 -47471 -12217 -9879 -28056 58311 267749 389153 259952 27635
38424 27635 -71264 -65319 -147865 -335175 -497737 -649878 -891486 -1094265 -1004995 -709729 -625476
38413 -625476 -889946 -1102869 -893017 -449709 -211884 -254631 -301457 -199103 -54855 31145
38403 31145 75411 69412 -25326 -144711 -192818 -221204 -328289 -418617 -308805 -63533 42368
38392 42368 -65504 -156703 -87673 -39691 -211719 -476076 -536888 -327373 -80202 -41682 -226493
38381 -226493 -441080 -498687 -425764 -437595 -644863 -842672 -746038 -410038 -196572 -271133
38371 -271133 -366171 -184831 154952 286456 89874 -202318 -366017 -445649 -598738 -818508
38361 -818508 -921593 -789427 -541040 -408685 -457613 -522703 -468847 -392915 -434064 -493161 -368940
38350 -368940 -131672 -74817 -241883 -305601 -74234 162737 54161 -249019 -274453 109397
38340 109397 528114 607594 370742 62884 -179547 -350965 -421214 -319771 -45418 279437
38330 279437 453771 313484 -111510 -543797 -665374 -431783 -116184 -7893 -139297 -343332
38320 -343332 -478061 -501588 -394589 -151503 127108 242124 80061 -244082 -499625 -584380
38310 -584380 -580842 -568810 -499475 -331837 -191956 -248049 -461387 -624340 -661862 -725470 -917604
38299 -917604 -1083460 -1010405 -728502 -462257 -347639 -354083 -456525 -705930 -1078813 -1388708
38289 -1388708 -1444374 -1248047 -972183 -769162 -663096 -617292 -630683 -708750 -767452 -661036
38279 -661036 -355847 -14775 165756 161187 81742 -14493 -144487 -267927 -297056 -257837 -277571
38268 -277571 -365663 -373212 -242261 -123391 -140572 -204421 -191281 -149972 -171442 -202650 -180544
38257 -180544 -215723 -415317 -626406 -609550 -406631 -275878 -294248 -299015 -223650 -194041 -234991
38246 -234991 -185700 -35871 -60843 -409345 -771036 -721297 -287884 84440 106422 -52504
38236 -52504 -84578 17728 -13351 -307131 -610943 -558581 -150567 179979 71654 -311257
38226 -311257 -497184 -313386 -47275 9228 -74794 -73880 25835 43342 -115151 -344032 -462424
38215 -462424 -367158 -125683 38225 -40694 -228871 -225391 8956 169647 74235 -41927
38205 -41927 85338 294854 246711 -36543 -236447 -261444 -313136 -434595 -395929 -127251
38195 -127251 94295 49375 -128053 -223100 -227104 -176278 3667 258611 289068 -29429 -337222
38184 -337222 -243239 88069 175336 -78925 -335576 -406811 -449636 -531545 -454353 -172218 6238
38173 6238 -124300 -314702 -248412 -41768 -44874 -294581 -486969 -443800 -328686 -371011 -562496
38162 -562496 -678101 -516109 -126192 171207 92949 -232709 -369431 -144299 106893 39502
38152 39502 -198942 -243540 -76743 40415 51723 104024 141621 -35985 -302354 -270283 70883
38141 70883 259390 83402 -67090 153515 479298 486528 261138 167824 206356 81794
38131 81794 -222273 -413410 -392016 -361964 -426796 -446890 -345263 -235491 -193173 -178148 -211314
38120 -211314 -350763 -476613 -397283 -197741 -173291 -376836 -555818 -589767 -627470 -694357
38110 -694357 -560796 -179233 128707 160520 146330 277514 278391 -135307 -633583 -612361 -63341
38099 -63341 370346 235260 -235613 -550350 -529590 -302445 -16625 232541 339460 251363
38089 251363 51502 -120592 -205168 -242593 -300501 -391522 -421800 -252525 110001 423312
38079 423312 419543 104037 -245160 -363030 -207692 65359 231454 149197 -86149 -185781
38069 -185781 -5474 211552 112499 -273752 -542293 -432387 -119717 81703 95720 38711
38059 38711 -23654 -106453 -193787 -244271 -252461 -207941 -65211 152171 295419 243988 56144
38048 56144 -124623 -246188 -334772 -380597 -360777 -326980 -340821 -350260 -262097 -128777 -119133
38037 -119133 -261721 -339068 -132713 272457 519757 345037 -121545 -468912 -445306 -233123
38027 -233123 -200372 -412750 -555606 -396449 -140516 -150259 -421137 -571459 -349603 63645
38017 63645 317195 274708 46267 -212797 -403460 -476653 -455599 -426772 -430253 -409019 -326893
38006 -326893 -259670 -292436 -401859 -511467 -567429 -488043 -191250 193158 316059 40604
37996 40604 -264661 -164697 205050 303142 -44859 -455055 -623062 -686357 -772121 -670755
37986 -670755 -298274 -57012 -269781 -579664 -455084 -58917 3964 -310411 -413332 -59713
37976 -59713 272831 177848 -111093 -246998 -334722 -580544 -807153 -756590 -560514 -487975
37966 -487975 -478865 -322376 -67011 130745 330869 580999 608341 208687 -256396 -267924
37956 -267924 77236 231490 44708 -119585 -91148 -109225 -245347 -206600 80108 213089
37946 213089 -77597 -499379 -661098 -598161 -547505 -533544 -481114 -456352 -498531 -453849 -240578
37935 -240578 -37985 37086 170948 488512 722720 585844 240813 47254 37913 20800
37925 20800 21685 202764 451840 485764 326171 263760 345084 298088 33759 -156073 -36747
37914 -36747 234957 363166 260023 9972 -292331 -529991 -584538 -516193 -562778 -816246
37904 -816246 -1045924 -999776 -758846 -608529 -628703 -614389 -416622 -181145 -142667 -283241
37894 -283241 -352641 -228505 -91449 -142227 -282045 -266074 -104448 -56070 -202869 -305912
37884 -305912 -200610 -79906 -188870 -434803 -536843 -436695 -332858 -383913 -564898 -744606
37874 -744606 -756222 -506075 -165406 -93223 -375489 -631360 -529412 -287077 -310682 -521552
37864 -521552 -494544 -186423 -16220 -166134 -296379 -126778 128009 151307 6801 -53295
37854 -53295 -832 26521 -3723 -64873 -218417 -463207 -583154 -407545 -122032 -66574 -285090
37843 -285090 -510232 -556804 -495641 -429260 -315982 -95784 152230 273558 202691 17576
37833 17576 -135810 -159220 -79331 -21659 -83270 -223502 -296210 -202647 -13909 81445 -10787
37822 -10787 -152409 -131032 46608 158761 109402 76623 196856 307953 229995 117795
37812 117795 211031 349507 142941 -366838 -629606 -310648 252315 508392 332862 -1332
37802 -1332 -249208 -340896 -269387 -84790 68034 77106 -23638 -156484 -302600 -421203 -421883
37791 -421883 -329066 -314466 -435399 -496472 -320869 -25766 120493 10118 -243943 -440786
37781 -440786 -409792 -161718 4949 -232630 -749383 -1026477 -831866 -551149 -605838 -842350
37771 -842350 -840294 -588632 -432643 -475048 -469168 -298393 -166596 -232857 -365439 -371657 -256820
37760 -256820 -160255 -180087 -306923 -422458 -383367 -217963 -159513 -332633 -519665 -448106
37750 -448106 -197904 -60530 -86416 -88758 -48423 -148105 -362521 -384428 -103992 144898 26465
37739 26465 -324940 -502124 -366365 -171083 -181721 -353700 -443669 -348810 -222257 -216302 -225806
37728 -225806 -62878 157720 97603 -253450 -444010 -223074 -17635 -353577 -1017923 -1291315
37718 -1291315 -945202 -509344 -494834 -799499 -1009364 -906430 -526399 -42570 260543 194061
37708 194061 -36793 -41912 161254 137249 -255224 -571596 -446175 -143177 -103632 -276373
37698 -276373 -302323 -125660 1434 -15107 -34218 -3325 -18752 -86699 -104400 -66503 -63000
37687 -63000 -101786 -130330 -176030 -271337 -314029 -203025 -36785 21644 -8585 -12017 -4203 -57278
37675 -57278 -111617 -97959 -127626 -297661 -432326 -325728 -125321 -115631 -212936 -99044 174267
37664 174267 198964 -95942 -263120 -50363 164998 -23127 -385252 -409230 -90032 77692
37654 77692 -172145 -544703 -627098 -380020 -90890 -11799 -132652 -224535 -70572 289183
37644 289183 553175 461410 77752 -291884 -423467 -352082 -272977 -338007 -515496 -606266
37634 -606266 -454229 -168050 -27194 -118780 -216991 -125205 28083 5238 -172521 -297909
37624 -297909 -317558 -338066 -344285 -203513 30998 111849 -25705 -147061 -102606 -74939 -262335
37613 -262335 -531198 -609270 -469075 -286359 -137960 12784 113614 62721 -89329 -216523
37603 -216523 -360892 -638152 -916164 -895961 -571934 -297725 -261262 -197038 157457 570534
37593 570534 588125 167953 -257656 -319065 -68734 190151 229269 35675 -209731 -284474
37583 -284474 -174119 -121232 -286845 -466255 -370003 -103097 -45010 -250174 -330391 -53449
37573 -53449 280993 278056 -19104 -304463 -495295 -710957 -896924 -832893 -508230 -182415
37563 -182415 -25240 48196 126050 132111 13101 -121525 -184220 -260599 -422635 -534926 -433154
37552 -433154 -209724 -129638 -285107 -498430 -578021 -525486 -446035 -376942 -288101 -180120 -86450
37541 -86450 425 118823 236337 230599 32703 -243164 -393896 -355744 -251895 -184450 -98320
37530 -98320 49317 103078 -109401 -448869 -557401 -336230 -96473 -103041 -192510 -66910
37520 -66910 203269 270560 37728 -218768 -272230 -200643 -143423 -82051 1380 -7432 -147851
37509 -147851 -245837 -175288 -78404 -119641 -202201 -180283 -179364 -381120 -612451 -539693 -243639
37498 -243639 -181642 -493819 -748594 -566349 -153474 47575 -23438 -85016 -2343 84677
37488 84677 53633 -53434 -165801 -258682 -292864 -245520 -195990 -246853 -383054 -524436 -656166
37477 -656166 -767488 -738125 -473059 -112866 80233 39702 -68369 -109807 -105729 -100185 -102570
37466 -102570 -183823 -426721 -719858 -792450 -554949 -252001 -161532 -262073 -323542 -242568
37456 -242568 -151089 -212342 -406904 -542016 -444297 -138585 167425 283242 191072 -7856
37446 -7856 -216598 -345331 -295438 -82351 88738 36881 -135689 -172053 -25194 111747
37436 111747 145155 203580 341512 366777 128092 -210250 -380490 -373382 -381089 -458941 -467446
37425 -467446 -340338 -202989 -165072 -145745 -218 256540 437506 374008 78734 -263312
37415 -263312 -444641 -401627 -261983 -216550 -320682 -433286 -384774 -199348 -89386 -192050
37405 -192050 -376624 -408208 -270971 -190558 -306290 -470429 -471278 -335052 -258041 -304365 -335352
37394 -335352 -236052 -73177 7233 -52985 -194434 -317439 -363064 -349167 -331375 -316786 -245066
37383 -245066 -71857 168468 387789 475909 339129 34881 -153541 15507 358631 402608
37373 402608 17039 -361033 -329052 -66556 12292 -92526 -63715 137480 226556 123364
37363 123364 82960 213879 246360 -56935 -536206 -844639 -832009 -602209 -348638 -219753
37353 -219753 -226331 -248806 -231341 -297709 -517152 -680927 -564811 -305579 -213241 -303131 -355622
37342 -355622 -344521 -401530 -430407 -227935 40633 9666 -223496 -177255 187590 347492
37332 347492 104259 -66095 138814 294679 -16875 -490682 -630866 -515464 -465741 -378866
37322 -378866 -23124 322944 191801 -299517 -599786 -513272 -290441 -71324 188330 330545
37312 330545 123107 -240491 -312773 -83592 12806 -179665 -323238 -192416 -14006 -35877
37302 -35877 -162617 -218362 -249232 -356768 -457658 -395449 -176822 -1033 -92321 -451968
37292 -451968 -728609 -521241 61651 410856 198131 -171309 -198934 -15432 -4898 -60994
37282 -60994 163499 505667 485353 129640 -90542 -85545 -188738 -384268 -265440 147108
37272 147108 325744 142191 71447 261951 233795 -138063 -191547 426603 1004481 807423
37262 807423 244782 185273 577120 643037 197009 -131211 27732 265941 124578 -251830
37252 -251830 -432949 -296930 -84878 -62437 -254030 -432553 -387713 -239449 -308038 -591323
37242 -591323 -674570 -356771 -15082 -30233 -195787 -121583 82059 40749 -191015 -247913
37232 -247913 -132658 -180330 -383783 -350640 10334 313731 318504 211865 141321 -17702
37222 -17702 -230846 -150951 313568 710644 659692 389867 309637 365396 238242 -66532
37212 -66532 -270318 -320290 -412053 -575540 -634955 -577852 -588612 -661834 -545174 -197869 21864
37201 21864 -152436 -464322 -473921 -180760 5509 -118770 -278934 -155531 165689 358561
37191 358561 307071 172240 92653 55460 62632 191482 407529 502531 349055 94703 -29332
37180 -29332 -6519 -12148 -156240 -380798 -573611 -652070 -549137 -256463 77501 195586
37170 195586 -37292 -466079 -752964 -676138 -332889 -42992 -40605 -274439 -517967 -615841
37160 -615841 -563177 -414990 -246460 -174335 -264875 -408746 -438386 -392286 -485658 -757239 -937134
37149 -937134 -792687 -452697 -230950 -233164 -295853 -245454 -74036 101597 142832 -10700
37139 -10700 -257471 -399444 -359176 -262222 -246966 -300680 -360581 -440649 -536497 -535212 -377619
37128 -377619 -205982 -180104 -231885 -184405 -50919 -20676 -169730 -360771 -435174 -371587 -261169
37117 -261169 -233775 -369260 -568503 -581253 -307831 1394 30797 -175870 -292515 -182066
37107 -182066 -37685 -20735 -21663 94866 216759 140230 -115434 -324623 -346621 -265405 -240279
37096 -240279 -310747 -373356 -309986 -119736 73569 148376 106808 45361 22595 2729 -69707
37085 -69707 -187469 -292402 -344931 -364550 -401661 -464850 -482901 -366500 -112863 175608 372476
37074 372476 400984 263774 69485 -4081 115475 265915 224667 16304 -115020 -73044
37064 -73044 -51990 -212210 -406021 -397402 -216184 -97021 -148498 -270681 -350445 -360713 -294301
37053 -294301 -170995 -109061 -232686 -478944 -616993 -501261 -233275 -48870 -89030 -282561
37043 -282561 -428636 -412856 -337592 -373818 -499400 -518491 -364748 -213412 -215341 -298098 -348107
37032 -348107 -409109 -535667 -610730 -506721 -304087 -154233 -42208 109638 216761 141614
37022 141614 -58325 -214929 -296968 -347724 -280085 -11555 269559 282001 72804 -43955
37012 -43955 29433 70852 -39838 -124609 -45219 54019 2785 -122537 -150678 -66215 45601
37001 45601 163570 294057 369058 300508 82470 -206859 -436202 -467810 -302615 -163864
36991 -163864 -268556 -522881 -641313 -564309 -512070 -590199 -626440 -505512 -393052 -459023
36981 -459023 -605261 -657288 -638896 -661232 -699202 -675666 -634210 -637864 -613975 -481160 -316167
36970 -316167 -216067 -118822 38048 105016 -80219 -350110 -334187 59605 510298 668975
36960 668975 508227 260644 167024 314598 577441 681560 459123 64820 -187571 -216400
36950 -216400 -246958 -470796 -821288 -1174440 -1575384 -2082632 -2510538 -2561961 -2214135 -1781011
36940 -1781011 -1536766 -1422851 -1217169 -887056 -646698 -689180 -956980 -1191347 -1166545 -885360
36930 -885360 -582015 -510874 -688610 -872724 -842674 -656070 -549310 -630455 -783976 -859348
36920 -859348 -823138 -716131 -591944 -525373 -557127 -606734 -573347 -528460 -620824 -763472 -673121
36909 -673121 -333539 -141495 -374875 -757408 -846781 -669476 -611652 -788017 -924004 -863623
36899 -863623 -789293 -829340 -805116 -562678 -283823 -235243 -391098 -526576 -553677 -540810 -478591
36888 -478591 -255649 120722 447176 527984 376396 169545 44784 -19018 -121828 -284131
36878 -284131 -423245 -492103 -558137 -684138 -803736 -805053 -682265 -508228 -315808 -122672
36868 -122672 -21382 -106367 -331914 -557477 -701302 -743978 -652179 -447222 -280732 -264862
36858 -264862 -282674 -158656 40461 101559 17943 -18648 26849 -24013 -216863 -351366 -313076
36847 -313076 -248698 -276854 -274835 -127135 25076 -16560 -209324 -354067 -362494 -284888 -182959
36836 -182959 -124765 -201726 -393799 -496229 -334225 -11027 179166 68136 -231847 -465573
36826 -465573 -475915 -326058 -197141 -159102 -109392 8087 58108 -57705 -167604 -74041
36816 -74041 74921 -15603 -269579 -309851 -71067 81209 -44400 -176064 -95581 -20510
36806 -20510 -172729 -335588 -212595 56059 125759 -19935 -152368 -233261 -376552 -516516
36796 -516516 -508910 -459581 -559916 -678020 -529275 -213832 -142032 -385872 -540071 -356072
36786 -356072 -123319 -208146 -511510 -640572 -443747 -146803 -37425 -175558 -392080 -497219
36776 -497219 -493911 -558828 -761519 -900669 -769534 -494078 -380120 -466004 -497129 -363260
36766 -363260 -266100 -348798 -431459 -298193 -48552 50263 -58657 -197198 -248398 -295288 -457996
36755 -457996 -713981 -911040 -906252 -685692 -372998 -115709 30609 78065 10045 -189339
36745 -189339 -412754 -469434 -308584 -101231 -20926 -29325 19937 130863 153709 18985 -142131
36734 -142131 -159993 -24717 141297 241702 247247 126154 -133344 -419790 -559229 -541166
36724 -541166 -548139 -663195 -702199 -511721 -298394 -394373 -741351 -907153 -663941 -270944
36714 -270944 -72015 -61233 -9170 175170 384060 470415 325482 -64152 -513964 -748083
36704 -748083 -725039 -682956 -749815 -745771 -543607 -357804 -409206 -535865 -469664 -317762 -385089
36693 -385089 -630681 -717947 -580830 -519096 -659299 -710313 -426076 -15961 125285 -78645
36683 -78645 -345801 -409735 -288039 -200280 -287524 -435056 -422031 -257464 -219118 -447511 -673541
36672 -673541 -560364 -180482 110295 172166 147110 85213 -137708 -492287 -717044 -670878
36662 -670878 -503512 -384884 -311838 -269701 -328944 -464665 -513965 -436719 -398702 -469408 -462919
36651 -462919 -241478 17500 41828 -184630 -446392 -558718 -485683 -319142 -256915 -479826
36641 -479826 -922520 -1253360 -1182810 -731204 -160544 247015 324530 100213 -192858 -321431
36631 -321431 -305098 -327529 -407427 -372502 -176069 18118 120140 203519 231411 16675 -390788
36620 -390788 -600392 -393824 -62665 24905 -65176 -57759 26932 -41368 -256386 -381835 -339792
36609 -339792 -266715 -217679 -116703 11581 44302 3194 38660 157823 213964 188916 239939
36598 239939 411915 526354 439965 242086 120517 159681 306600 412769 308905 -13191
36588 -13191 -297401 -272233 -10958 138397 5840 -207589 -237619 -73671 105270 149957
36578 149957 13367 -255574 -506596 -594210 -556696 -572760 -685030 -705540 -479890 -122185
36568 -122185 111536 93533 -107813 -336846 -453034 -412492 -316374 -300709 -341393 -285208 -122442
36557 -122442 -73727 -298565 -647019 -831770 -750260 -516648 -277658 -135885 -162031 -321757
36547 -321757 -452657 -462276 -480751 -656076 -874950 -894363 -706706 -538322 -483881 -395750 -197965
36536 -197965 -62382 -145212 -346525 -477214 -500375 -463233 -358287 -227274 -242903 -467752
36526 -467752 -658552 -561774 -318340 -299859 -582017 -868409 -940315 -875901 -764332 -530139
36516 -530139 -200876 -61353 -292534 -641226 -706733 -450367 -189278 -156690 -293140 -440538
36506 -440538 -524005 -515291 -389098 -183063 -14540 1105 -176712 -482359 -739547 -764429
36496 -764429 -555868 -321483 -244887 -306759 -395638 -465958 -490871 -412694 -280367 -281000 -465420
36485 -465420 -607341 -542283 -464985 -613390 -824668 -764436 -493165 -394106 -556765 -652551
36475 -652551 -481606 -239259 -123542 -57026 43682 72216 -12721 -64052 -62227 -211623 -503936
36464 -503936 -555829 -189384 166384 41658 -378972 -559323 -402381 -265369 -311368 -349236
36454 -349236 -303194 -354299 -529001 -576198 -399527 -239896 -246059 -202231 73285 335546 227436
36443 227436 -171591 -419349 -289317 -20247 44448 -118868 -234528 -84776 229299 375127
36433 375127 121001 -414908 -856154 -917223 -651689 -354547 -250904 -313791 -386283 -428869
36423 -428869 -557713 -809837 -988058 -886853 -621377 -526980 -706143 -904665 -933661 -957503
36413 -957503 -1149998 -1285881 -1007891 -408141 12798 -9967 -224306 -312554 -319610 -446297
36403 -446297 -648132 -695416 -529955 -332105 -255163 -272571 -302116 -333998 -382784 -411332 -377167
36392 -377167 -316053 -318525 -420425 -547550 -586039 -501636 -374190 -307959 -316219 -303548 -164083
36381 -164083 99618 357062 467214 419894 324136 245406 132482 -35169 -127229 -28019
36371 -28019 140828 148790 -7345 -106061 -65798 -63527 -191611 -243019 -22657 317644 473422
36360 473422 379371 187438 -28522 -295671 -533259 -575482 -414352 -233679 -189237 -288852
36350 -288852 -455784 -570153 -505896 -285901 -133390 -196532 -306706 -219471 -10860 25375
36340 25375 -170541 -354131 -353572 -241657 -109555 54950 206297 212826 64343 -107931 -257031
36329 -257031 -430989 -543688 -435930 -224077 -250651 -558640 -749103 -553773 -237408 -180187
36319 -180187 -329541 -368200 -229202 -125264 -180261 -314716 -431776 -487822 -441582 -330118
36309 -330118 -320451 -502095 -716632 -774445 -733381 -760361 -827847 -783463 -633652 -503715 -372914
36298 -372914 -116663 200645 335768 206993 9520 -58982 -12306 24444 -28983 -185648
36288 -185648 -382728 -473117 -364920 -184708 -156318 -291827 -347404 -136249 226788 444971
36278 444971 336707 -2289 -281951 -286868 -115847 -90829 -361596 -709551 -852765 -804568
36268 -804568 -747528 -685393 -484705 -199381 -61762 -133027 -223381 -208956 -187642 -249186 -318170
36257 -318170 -327593 -353213 -457423 -553593 -535758 -423102 -294944 -195930 -162948 -222541 -308766
36246 -308766 -304827 -206973 -128005 -125881 -172500 -287172 -511272 -735937 -767983 -605188 -432440
36235 -432440 -316467 -157659 15166 15208 -135633 -145609 73839 211914 64826 -104354 -29570
36224 -29570 54542 -198581 -587341 -605106 -257999 -113045 -457680 -869965 -817152 -349039
36214 -349039 36320 11394 -299653 -538241 -463319 -156730 48332 -90767 -447335 -692129
36204 -692129 -711678 -683281 -725342 -697771 -452627 -109970 60207 -53463 -309726 -465697
36194 -465697 -366603 -63493 202697 202314 -52509 -328208 -427032 -353875 -238095 -194956 -275083
36183 -275083 -442778 -572507 -547762 -382491 -186736 -39198 27715 -24542 -183126 -323090
36173 -323090 -345064 -325321 -381850 -469609 -501145 -571757 -787131 -934190 -686593 -164026 103686
36162 103686 -108943 -419433 -432481 -269905 -239648 -316107 -311107 -300388 -455624 -610801 -444084
36151 -444084 -45416 121167 -131162 -463541 -514961 -345876 -238309 -301370 -446101 -581617
36141 -581617 -668377 -672060 -590667 -479354 -390786 -349025 -396259 -560214 -741046 -747425 -518438
36130 -518438 -231936 -116982 -197166 -277948 -185374 9428 38739 -243358 -621317 -718650
36120 -718650 -455920 -138919 -17580 20098 137589 167564 -138156 -607794 -786248 -566963
36110 -566963 -317750 -313393 -405221 -384483 -316976 -298059 -189252 102516 320547 185166 -112903
36099 -112903 -113640 251213 543699 424709 78287 -103618 -43086 1141 -181801 -531663
36089 -531663 -857390 -1051614 -1108517 -1015291 -748149 -403987 -221245 -329627 -507615 -370352
36079 -370352 135699 591559 589778 229558 -46372 -16984 134686 176784 121079 87841 78528
36068 78528 21109 -76420 -156758 -230706 -338125 -428100 -400204 -268513 -181178 -234909 -331379
36057 -331379 -277692 -22685 252065 316331 163043 33523 117500 287468 253961 -24971
36047 -24971 -258350 -221650 -77138 -134761 -408358 -626528 -635795 -545672 -454630 -302768 -107733
36036 -107733 -89606 -350447 -616518 -565374 -306604 -255220 -552875 -887265 -927710 -704252
36026 -704252 -474800 -409882 -502213 -632805 -644111 -483564 -328890 -416593 -701046 -872829
36016 -872829 -774419 -571459 -421921 -253186 -43216 -33201 -362849 -705187 -627512 -211510
36006 -211510 46530 -80230 -313974 -343985 -195236 -32650 104329 219168 235292 121894
35996 121894 -11171 -78781 -148298 -282456 -379672 -304516 -96166 66591 62475 -75858 -212627
35985 -212627 -221185 -106095 -23226 -102011 -267654 -358463 -390295 -523801 -758882 -875827 -749047
35974 -749047 -514403 -325874 -154552 28823 80104 -93887 -286787 -222538 35576 151234
35964 151234 -22324 -276307 -379774 -362558 -358118 -331304 -139409 193383 438785 446916 348085
35953 348085 373429 532621 603595 453455 227499 136999 173669 164388 37039 -115421 -198689
35942 -198689 -198588 -117851 21920 120324 86415 -7505 -776 125628 242421 291754 339962
35931 339962 398248 383314 300524 280133 374573 497998 612366 765388 883782 777027
35921 777027 462939 237437 247206 227991 -102337 -582403 -809568 -680938 -464406 -401469
35911 -401469 -494422 -658783 -847018 -996827 -1035644 -967237 -840754 -662292 -458290 -359357
35901 -359357 -448464 -571259 -495819 -255546 -135917 -290112 -550659 -682045 -655514 -580523
35891 -580523 -496201 -362542 -202831 -135579 -246594 -479208 -677550 -734324 -682970 -634328
35881 -634328 -641695 -660846 -620700 -475825 -213244 98938 274906 144102 -243840 -647030
35871 -647030 -886947 -964387 -917876 -745133 -524436 -421074 -455480 -430950 -226106 1328
35861 1328 59497 14345 44414 136571 146495 65634 -4333 -79229 -252269 -447614 -453841 -239298
35849 -239298 -38863 -65590 -275178 -461883 -477732 -333648 -184556 -223116 -491149 -794680
35839 -794680 -890308 -736114 -476585 -237336 -61660 -2056 -107377 -306244 -435458 -410797
35829 -410797 -279330 -110630 56962 163166 129254 -58761 -332248 -599450 -771812 -774897
35819 -774897 -616531 -419222 -315510 -335042 -432390 -559257 -660156 -685128 -665865 -677046
35809 -677046 -668659 -481545 -109604 226181 375341 432394 474573 370776 78105 -121235
35799 -121235 -9075 137885 -91607 -569682 -765275 -532245 -294486 -355782 -470954 -307993
35789 -307993 28219 211366 182390 135877 167350 196867 181191 192269 278987 368429 323354
35778 323354 74593 -274113 -491339 -450088 -292245 -252751 -357163 -446016 -464418 -517233
35768 -517233 -618712 -610817 -408012 -138599 43597 127204 145151 72742 -78023 -198129
35758 -198129 -208500 -140498 -38014 91073 182771 135271 -13546 -83695 -7939 61334 -14000
35747 -14000 -164535 -249964 -251599 -226846 -196400 -178686 -223693 -314802 -340599 -255368 -171809 -213607
35735 -213607 -366585 -539582 -674841 -745867 -754120 -768130 -840351 -863134 -687006 -430660 -440858
35724 -440858 -810273 -1151999 -1060186 -639485 -341679 -375176 -531279 -567825 -505609 -472031
35714 -472031 -451863 -344043 -175901 -99476 -160386 -197824 -69078 99085 42784 -243018
35704 -243018 -427357 -269495 42353 152833 11038 -140430 -157062 -112145 -61918 28942
35694 28942 101060 567 -270658 -526314 -664335 -736145 -714365 -473281 -88735 131784
35684 131784 59596 -77862 -83296 -78554 -209278 -334969 -286254 -212435 -358122 -640162 -766258
35673 -766258 -685709 -608060 -612857 -551531 -364342 -217802 -243240 -352839 -415193 -443931 -496446
35662 -496446 -510073 -376199 -132451 26177 -55791 -322777 -544937 -528353 -302686 -103337
35652 -103337 -153542 -451248 -769769 -882159 -795156 -727082 -809529 -873215 -669528 -284782
35642 -284782 -107921 -299583 -540225 -495496 -297025 -272635 -392799 -369366 -197209 -155806
35632 -155806 -273912 -250333 -11351 88732 -179146 -539932 -641736 -555624 -566503 -704117
35622 -704117 -780217 -737252 -688950 -696834 -703022 -625660 -414740 -116525 62404 -67610 -376562
35611 -376562 -511559 -365728 -180832 -97851 53497 363228 618738 720862 951006 1486478
35601 1486478 1974272 1991679 1677983 1475216 1435151 1245768 833645 479948 357334 344949
35591 344949 315183 271490 196345 62368 -12129 100866 272492 260982 78066 -73870
35581 -73870 -170039 -344605 -546052 -567679 -430893 -388892 -506109 -568931 -477864 -395339 -404540
35570 -404540 -342106 -120124 56969 -22671 -269482 -423824 -356399 -135072 74012 100053
35560 100053 -98168 -331989 -351201 -152138 21393 3957 -130723 -265940 -416979 -630776
35550 -630776 -841859 -912558 -764243 -464563 -228538 -256252 -481779 -604014 -499080 -436957
35540 -436957 -677281 -1023078 -1079111 -828290 -598398 -533140 -486222 -416100 -463217 -585037
35530 -585037 -535748 -325304 -298411 -587060 -852276 -780998 -511665 -332742 -257488 -159273
35520 -159273 -68745 -53870 -15100 119340 168544 -54769 -413983 -627896 -660694 -676873 -712282
35509 -712282 -659839 -525701 -447346 -469459 -503087 -493948 -459831 -387403 -258047 -150160 -155332
35498 -155332 -216123 -202416 -129000 -143034 -304141 -521359 -702037 -821216 -846050 -743965
35488 -743965 -591635 -535394 -594340 -621585 -523793 -413913 -448897 -574636 -550518 -250667 138480
35477 138480 299637 154037 -42581 -30296 113974 99934 -141391 -333575 -236418 14469
35467 14469 98402 -64190 -260164 -321356 -320937 -398069 -555732 -720843 -873538 -992391 -966330
35456 -966330 -723325 -410241 -271422 -333733 -388209 -339891 -374580 -633313 -899133 -845364
35446 -845364 -505115 -232755 -223135 -334955 -409898 -476612 -544201 -473426 -223221 -5057 -4221
35435 -4221 -127264 -206077 -268807 -399385 -499056 -434961 -302770 -295644 -403598 -472594 -473177 -475784
35423 -475784 -440666 -281192 -82844 -19309 -82719 -109366 -33085 82395 196716 276765 217596
35412 217596 1370 -168549 -132889 -45814 -96429 -119690 135272 465217 400762 -84369
35402 -84369 -516781 -622403 -619451 -713892 -774697 -694542 -635024 -666586 -554942 -198493 59675
35391 59675 -106318 -483497 -596016 -329788 15212 163789 91857 -85359 -219760 -190601
35381 -190601 -29731 73358 -7119 -209982 -449188 -729034 -1009712 -1148881 -1087019 -917805
35371 -917805 -706915 -460290 -319256 -477347 -800271 -884182 -658405 -543316 -764144 -916007
35361 -916007 -580763 -28649 153028 -109218 -388474 -441262 -403379 -382943 -311489 -199991
35351 -199991 -160589 -156467 -57892 53618 -45283 -341671 -574608 -604324 -519292 -400229 -269481
35340 -269481 -249910 -460167 -748207 -824716 -660813 -467491 -317670 -127399 12059 -120269
35330 -120269 -453097 -632589 -533695 -390703 -337116 -226018 -43849 -70757 -401367 -692370
35320 -692370 -662874 -507955 -519488 -614789 -581167 -506189 -578084 -676119 -564937 -343182 -298722
35309 -298722 -427229 -489812 -465952 -534018 -640139 -528903 -245620 -175596 -460620 -765975
35299 -765975 -801069 -715825 -752097 -815826 -690240 -449979 -353138 -457704 -620688 -774874
35289 -774874 -942217 -1046068 -971461 -780137 -632767 -521813 -311225 -27222 136635 131137
35279 131137 133034 257001 402618 467402 506781 575953 597891 519299 445838 486809 589722
35268 589722 653327 683531 710155 673603 546591 466024 574874 793316 897544 788970
35258 788970 570094 403468 397340 562790 782028 902631 961296 1185740 1632475 1973562
35248 1973562 1863345 1408247 1014865 841962 700949 490472 392198 519523 653060 530993
35238 530993 237386 89757 210970 396557 409435 264409 149145 134255 87755 -82532
35228 -82532 -230883 -175927 -22770 -31625 -167050 -112105 156596 200807 -194762 -541784 -299624
35217 -299624 254765 362029 -130616 -601852 -591439 -322136 -161199 -114555 -89392 -170368
35207 -170368 -334758 -310939 -44470 78047 -171013 -400061 -171821 262974 315756 -38715
35197 -38715 -255199 -74617 131254 -13856 -336912 -413872 -172790 44710 -53990 -357794
35187 -357794 -495512 -286517 29222 83849 -162858 -434625 -573936 -685811 -780352 -620781
35177 -620781 -155727 198800 49032 -400730 -622791 -485450 -317298 -324160 -354206 -281660
35167 -281660 -241828 -346338 -452555 -382262 -170316 40187 177970 195302 13501 -316810
35157 -316810 -522296 -367148 25086 270907 175912 -33437 1497 325249 629266 654490
35147 654490 487698 374827 378009 383589 349093 311619 201074 -76793 -362957 -360861 -99365
35136 -99365 48798 -65647 -146323 -4548 55234 -245311 -584875 -464608 -7361 185212
35126 185212 -86070 -386467 -346295 -121433 -5900 14755 94548 209224 265701 339225
35116 339225 558693 855913 1023092 975221 819550 683790 564768 355132 206 -372772
35106 -372772 -534351 -418730 -235745 -207112 -264204 -172319 85101 247295 125555 -167507
35096 -167507 -399024 -482684 -490154 -505494 -550058 -594108 -590295 -521245 -417565 -304179 -170454
35085 -170454 -41597 -11047 -119666 -271211 -363899 -426745 -507565 -519391 -369395 -181129
35075 -181129 -189364 -412073 -598346 -532447 -260309 8777 118101 66827 -14957 10353 135801
35064 135801 217591 173281 72456 -33744 -215171 -461223 -547996 -318606 30034 177384
35054 177384 102462 35036 70376 100211 66991 7631 -113580 -326598 -447072 -267248 54839
35043 54839 146707 -14593 -75765 76879 104232 -190702 -468741 -372638 -110757 -120217 -357471
35032 -357471 -375833 -47730 229861 138073 -114218 -139338 66871 163518 -32824 -330861
35022 -330861 -470723 -445843 -408589 -390681 -293626 -113457 12047 8079 -47591 -84688 -118211
35011 -118211 -103276 73337 324121 309206 -119884 -598858 -652338 -312419 -49759 -147771
35001 -147771 -436660 -631419 -641951 -513509 -319414 -179720 -187687 -278565 -336649 -399798 -542483
34990 -542483 -614259 -392187 14050 234690 157812 47030 75050 91626 -19147 -102027
34980 -102027 -42446 -7093 -152706 -359169 -469426 -536018 -600849 -505890 -212669 -57119
34970 -57119 -325131 -749137 -814620 -474842 -175217 -186954 -295781 -228366 -59928 -34382
34960 -34382 -198354 -401454 -548104 -678205 -812644 -840593 -639933 -304654 -149860 -364940
34950 -364940 -702383 -711939 -326604 19449 -14472 -212749 -176384 49725 81484 -152821
34940 -152821 -268890 -17227 325887 357150 106882 -47334 73577 226474 86978 -337856
34930 -337856 -713236 -743707 -473737 -202923 -134739 -188063 -188629 -139807 -174289 -296755 -362285
34919 -362285 -332163 -357684 -515369 -632059 -534539 -347897 -335022 -496393 -562700 -401571
34909 -401571 -198202 -142805 -152627 -66798 47302 -109 -196056 -330096 -299755 -204764 -133053
34898 -133053 -54293 41346 92496 107075 165178 220209 104965 -166176 -320447 -208012 -63600
34887 -63600 -183833 -495616 -671551 -564819 -299871 -20125 200230 241148 13060 -312997
34877 -312997 -386763 -83570 328061 505502 402854 250166 244044 327769 261209 -95355
34867 -95355 -563078 -776001 -576053 -194807 19731 -46276 -268590 -485929 -574401 -459249
34857 -459249 -219932 -76578 -122600 -202783 -204170 -261947 -445537 -473869 -99390 396290 520981
34846 520981 292232 167814 282180 282935 26527 -106379 158744 507604 527954 320914
34836 320914 233768 258511 130294 -132915 -224958 -55226 111376 64664 -89369 -158888
34826 -158888 -135869 -126504 -155849 -151815 -63895 65649 134135 80271 -29172 -50597 62985
34815 62985 190095 195330 101407 30253 11457 -48693 -192364 -290476 -174187 123820 340234
34804 340234 256287 -41156 -268340 -287718 -200076 -91544 99557 365154 492243 334021
34794 334021 57412 -87148 -102219 -126444 -133230 -30446 59310 -50544 -246439 -244917 -55488
34783 -55488 40753 -32441 -70298 -16264 -62000 -232612 -285822 -172266 -189704 -469725 -694358
34772 -694358 -590014 -361613 -330922 -444820 -478207 -458863 -513935 -508418 -254933 44935 -6957
34761 -6957 -407451 -732139 -737207 -630248 -655924 -719845 -588643 -266752 -1918 -4752 -271688
34750 -271688 -627019 -860406 -856459 -652442 -379849 -141368 57014 258187 438137 457360
34740 457360 206386 -160939 -265360 78699 565497 719768 474433 192615 119549 98109
34730 98109 -85661 -347317 -460138 -371856 -201343 -66297 -47723 -181940 -366888 -420788
34720 -420788 -338309 -321027 -449168 -531893 -435521 -343986 -476201 -714902 -762111 -554856 -296226
34709 -296226 -147885 -104129 -124586 -203177 -321278 -458736 -607780 -688763 -566849 -277777
34699 -277777 -93823 -181272 -320429 -199221 103504 202210 -40321 -317338 -312639 -104806
34689 -104806 980 -106427 -262638 -301107 -234741 -144463 -35900 93707 145845 38496
34679 38496 -103749 -80801 34642 -71619 -456371 -720406 -543375 -177417 -74006 -204468
34669 -204468 -176141 70591 167893 -48615 -293733 -344800 -359568 -488653 -565681 -428372
34659 -428372 -217429 -108897 -49393 858 -129394 -493246 -779295 -710337 -460414 -363827
34649 -363827 -411727 -355272 -138755 83073 221186 259027 120071 -192426 -455677 -495871
34639 -495871 -454453 -518073 -557562 -365068 -102913 -134057 -473523 -773942 -834199 -783495 -765844
34628 -765844 -780722 -868600 -1125207 -1448927 -1562043 -1393442 -1199761 -1193297 -1267699 -1224935 -1081705
34617 -1081705 -980691 -930805 -828239 -687893 -673677 -853806 -1047066 -1023903 -825059 -741350
34607 -741350 -924481 -1153052 -1114326 -807935 -479831 -237168 11982 249050 271256 11408
34597 11408 -316933 -503993 -563326 -575067 -534789 -466311 -462028 -498171 -436665 -315655 -371485
34586 -371485 -632850 -786510 -648064 -484661 -606250 -864435 -851334 -447726 83873 440093
34576 440093 506755 366897 247908 332093 501878 463745 228859 181903 493306 790578
34566 790578 692437 371292 240150 331113 376463 321923 344579 461344 503451 434649 368943
34555 368943 314694 196673 84754 116787 237480 281235 264139 326081 430985 403091 243317
34544 243317 147466 202573 293340 324034 333173 363476 373639 299210 106500 -182103 -443457
34533 -443457 -517597 -394179 -226836 -102131 38776 176470 146631 -62592 -190968 -82369
34523 -82369 42298 -77299 -321604 -369443 -163594 40789 12656 -237681 -493635 -490229
34513 -490229 -173529 146747 112945 -178350 -284951 -77140 104591 59620 27479 161638
34503 161638 188102 -88150 -382137 -407908 -339266 -388409 -352528 -57552 151961 -73022
34493 -73022 -417730 -355066 -6798 74645 -193591 -373162 -258076 -77986 27269 183744
34483 183744 403668 507335 472366 461611 482711 380761 164236 -1615 -103256 -262493
34473 -262493 -454453 -541380 -526620 -498548 -416560 -222010 -37681 8109 4038 50447 33493
34462 33493 -130097 -261274 -208249 -89505 30702 343952 825103 980746 537215 -15956
34452 -15956 -100705 110342 115114 -35636 30436 194996 29438 -386044 -556981 -387766
34442 -387766 -223014 -168668 -35252 122455 74113 -33319 156436 527415 617785 396282
34432 396282 273291 354204 328302 123001 40837 185142 320803 356747 434080 513288 397031
34421 397031 171360 121861 231910 251208 189927 234951 284651 120011 -77341 35130
34411 35130 311120 305295 8116 -209033 -253551 -289168 -207948 183749 574227 462068 -17578
34400 -17578 -280804 -207881 -150722 -153750 42025 291924 159542 -275257 -487831 -364929
34390 -364929 -244780 -182095 31174 209469 2777 -297691 -104656 365653 329492 -210835
34380 -210835 -389590 115500 619897 600706 372467 316920 311200 221565 198637 239646 154256
34369 154256 85542 335578 644505 467683 -17268 -87357 310466 485050 209010 998
34359 998 96315 151430 103190 289962 572987 392919 -136009 -261936 111328 275808 34588
34348 34588 -4736 332077 472848 309574 482408 1086423 1317233 844722 375645 397184
34338 397184 487178 314128 206314 290184 163701 -164337 -115876 308323 364125 -106017
34328 -106017 -359614 -96422 118518 77678 262305 640079 532328 28763 63344 695921
34318 695921 867637 304101 32176 483893 772060 466916 387787 926009 1263126 988978
34308 988978 831471 1077716 992445 484992 523139 1191189 1292608 629567 571480 1502215
34298 1502215 1941693 1225702 751263 1377472 1917803 1523511 1232980 1758543 2070522
34289 2070522 1604590 1488479 2162429 2318222 1637438 1816119 3326526 4170369 3546544
34280 3546544 3482311 4919733 5771367 5085167 5274339 7605912 9567488 9689468 10630635
34271 10630635 14137696 17681156 19877721 23964880 31541854 39020387 45625114 57621927
34263 57621927 77811296 100319697 126659170 175648102 256887343 338015186 363012165
34256 363012165 311492567 222568142 150411098 111714956 88559282 66517101 48919829
34249 48919829 39781821 33755632 26303908 20220478 17805832 15952599 12476306 9851540
34241 9851540 9606973 9184201 7003260 5292843 5502931 5625807 4255393 3079805 3314204
34232 3314204 3472453 2563070 2009422 2630732 2931208 2051159 1427762 1945279 2246111
34223 2246111 1410153 678154 998858 1309215 733879 237330 652348 1122604 848675
34214 848675 497006 671931 777131 458807 419882 844987 799777 95098 -87961 660296
34204 660296 1094464 545466 139369 684695 1177066 654725 -127802 -175275 102607 -8118
34194 -8118 -161088 74356 154292 -320556 -628389 -227343 123324 -309485 -887817 -739497
34184 -739497 -217961 -86565 -187835 -44593 76106 -211187 -495191 -293200 22742 -64570
34174 -64570 -310674 -357156 -496366 -924509 -1047865 -466863 118580 -47232 -540949 -546038
34164 -546038 -201622 -148349 -316677 -220693 -4421 -167772 -567397 -625990 -313690 -109345
34154 -109345 -171446 -245904 -218015 -164285 -58835 80861 30542 -225723 -287146 17434 216850
34143 216850 -78709 -510374 -577552 -451443 -563753 -783459 -667784 -251568 31195 16333
34133 16333 -110692 -207345 -214278 -27841 284415 395954 187062 -10651 48646 130803 17426
34122 17426 -42908 186426 417631 292583 -12253 -124952 -96265 -197187 -398522 -520217
34112 -520217 -619500 -787667 -848057 -687739 -574684 -688660 -675647 -203437 336103 286311
34102 286311 -295829 -717898 -622044 -318311 -158186 -96137 19490 119995 52955 -172837
34092 -172837 -394889 -454483 -335641 -198293 -205221 -289674 -239874 -39893 90992 57445 30664
34081 30664 130727 220437 140854 -71509 -296849 -436631 -362085 -33579 296534 319971
34071 319971 134986 102195 225863 149448 -154818 -234922 100438 409267 279684 -75401
34061 -75401 -210731 -68546 104520 152556 58338 -130597 -238231 -110388 74909 20051
34051 20051 -129678 38308 387617 275579 -358329 -702284 -288567 234970 136731 -259974
34041 -259974 -216193 172633 235712 -83100 -193340 82342 247256 9019 -281847 -266539
34031 -266539 -105758 -119025 -277910 -321590 -164804 12793 4931 -188481 -357721 -323786
34021 -323786 -152933 -17923 96663 306193 477062 342457 27249 4147 352294 543851
34011 543851 255467 -98031 -49396 159383 42738 -257217 -208109 191718 383609 122069
34001 122069 -198574 -182780 69280 246548 241650 116813 -70943 -242855 -270263 -108699
33991 -108699 124255 263036 233345 84050 -64324 -128729 -145396 -177767 -159171 16877
33981 16877 241184 249403 14902 -154293 -40955 173753 184269 -39867 -280629 -341188
33971 -341188 -166950 141263 336181 225966 -50468 -157943 -47296 -44657 -348202 -710736
33961 -710736 -787232 -561785 -261205 -48039 51191 88981 172357 331485 396888 235000
33951 235000 66867 214241 549484 623542 369979 198343 306518 435434 454764 614057
33941 614057 968233 1126319 889831 596105 477473 244634 -267797 -614076 -436918 -148878
33931 -148878 -294752 -649900 -626060 -262339 -113586 -338720 -561612 -551335 -454214 -383169
33921 -383169 -280220 -173012 -153177 -145095 -47978 8912 -98551 -182117 -65913 -11891 -354743
33910 -354743 -884714 -1101459 -965541 -883818 -1020372 -1140229 -1122596 -1129716 -1220794 -1241923 -1167669
33899 -1167669 -1157853 -1197769 -1038846 -601494 -156492 -10721 -205523 -552892 -806542 -818733
33889 -818733 -663070 -535659 -459963 -281026 -42776 -46972 -340702 -520344 -343110 -145214
33879 -145214 -266514 -453652 -327031 -83942 -148630 -400682 -397466 -178849 -180177 -432864
33869 -432864 -511078 -276053 -62401 -59624 -52048 127573 342771 432194 367240 133635 -173189
33858 -173189 -214899 195164 655973 615906 166744 -100933 41339 283135 406953 533562
33848 533562 741200 966475 1265484 1686041 2008947 2173412 2711988 4006435 5419798
33839 5419798 6298810 7713810 11605955 17568654 21882649 21030427 15542388 9285774
33831 9285774 5380764 3870219 3099571 2054874 924950 220186 59739 178847 262378
33822 262378 202489 89851 3169 -82342 -161788 -167610 -155009 -306791 -620732 -806034 -659913
33811 -659913 -358127 -197123 -217904 -254574 -202805 -85108 20138 4700 -177076 -383942
33801 -383942 -433717 -393540 -476058 -631046 -578876 -322095 -228299 -442477 -613021 -441386
33791 -441386 -143700 -79904 -238927 -395949 -498471 -580158 -543925 -353498 -221322 -299905
33781 -299905 -399350 -305480 -144755 -115091 -98282 92429 298891 259922 93393 113829 299638
33770 299638 371794 303328 297355 306881 54119 -427736 -716958 -589968 -321997 -263210 -422993
33759 -422993 -617719 -759561 -839462 -832333 -755105 -660577 -507859 -226585 48481 48268 -240865
33748 -240865 -498369 -491476 -342705 -249072 -186136 -83138 -69030 -288308 -610721 -772431
33738 -772431 -720911 -604383 -506539 -422949 -424907 -575244 -704221 -557167 -204177 -17909
33728 -17909 -146575 -286570 -143564 134588 223028 116514 64026 131462 160487 126109 199267
33717 199267 403211 511567 395321 205762 77100 -98455 -408523 -651606 -579110 -276560
33707 -276560 -59903 -57407 -112972 -83834 -41608 -141371 -405152 -678104 -774750 -681545 -590591
33696 -590591 -648447 -720724 -582534 -307427 -191744 -265379 -231497 -18464 9548 -348112
33686 -348112 -699868 -609125 -262287 -150074 -323938 -455384 -452000 -480040 -480286 -226370 149194
33675 149194 241098 31732 -69804 67290 105569 -93562 -178111 61417 287495 186901
33665 186901 -1391 70378 253474 179007 -128186 -350344 -412023 -502643 -670403 -758350
33655 -758350 -690220 -522671 -270662 47218 245375 125286 -217034 -459140 -432540 -274420
33645 -274420 -220376 -377034 -657284 -833628 -728075 -437393 -251764 -262404 -232807 3991
33635 3991 244054 228577 52309 -37062 -81775 -295174 -582184 -578477 -211554 138222 170561
33624 170561 65358 155541 417033 533273 367043 118257 -2553 -50887 -185450 -358039
33614 -358039 -361188 -186373 -124927 -372722 -680022 -620636 -163352 263164 295758 -982
33604 -982 -346088 -566894 -603568 -434266 -176885 -77509 -202214 -296722 -150910 54412 7322
33593 7322 -251817 -392645 -292410 -181825 -258712 -404592 -388236 -187668 379 -15304
33583 -15304 -256878 -578311 -784032 -781590 -637441 -483267 -414944 -495768 -741209 -1010321
33573 -1010321 -1034041 -716901 -340318 -272804 -501034 -655823 -529127 -343707 -402034 -654858
33563 -654858 -801654 -716587 -564792 -508329 -496489 -419389 -313492 -278192 -273696 -166780 32738
33552 32738 139536 46788 -114142 -149992 -47141 56276 65972 -1174 -89505 -142131 -106991
33541 -106991 -1512 63265 9824 -97562 -159760 -201602 -311523 -463309 -518332 -396372
33531 -396372 -165331 7222 -62782 -447670 -962871 -1248060 -1120084 -761898 -456861 -275167
33521 -275167 -167449 -182205 -346310 -474904 -389937 -229858 -245047 -374418 -359737 -221826
33511 -221826 -249696 -507923 -711827 -637801 -344628 20921 299510 224276 -315672 -879178
33501 -879178 -824922 -185727 288203 132941 -285855 -477152 -531071 -722326 -879491 -682646
33491 -682646 -289390 -133152 -277300 -443642 -540730 -695623 -847877 -775759 -526718 -425789
33481 -425789 -615166 -899142 -1064601 -1070676 -921622 -643901 -412426 -427601 -622593 -722426
33471 -722426 -625509 -508793 -517597 -556577 -455849 -203855 33969 52759 -208967 -548596
33461 -548596 -642944 -408558 -106670 13093 1500 -8848 -89868 -326524 -518668 -401821
33451 -401821 -70045 141870 141295 127160 187106 170374 -9593 -233413 -388419 -480953 -499031
33440 -499031 -396760 -255513 -237883 -337976 -384000 -321700 -285207 -348693 -416496 -409988 -370609
33429 -370609 -328379 -250458 -165969 -168106 -251642 -311491 -322335 -342711 -332422 -181082 37976
33418 37976 64451 -205105 -547517 -681473 -558587 -311644 -69645 76419 56739 -108666
33408 -108666 -293594 -387363 -369132 -230842 69084 503820 899313 1040919 866446 544396
33398 544396 346931 388935 478012 317378 -98168 -418997 -367370 -86526 83937 50337
33388 50337 -18412 -26354 -63872 -189389 -292337 -214348 97767 545971 899290 922510 606022
33377 606022 213121 -113 -34357 -37468 -78279 -131984 -132417 63868 550569 1094144 1303514
33366 1303514 1284356 1709749 2828654 3780480 3504235 2131170 822079 298769 223598
33357 223598 75067 -106471 -113593 -79183 -177278 -247987 -114974 43636 -2890 -127338 -70740
33346 -70740 117785 159523 -76397 -479917 -832481 -895267 -580017 -164981 -81412 -342747
33336 -342747 -492334 -288039 -68736 -177280 -399324 -358222 -158264 -173748 -392796 -444596
33326 -444596 -198136 86415 175416 65451 -209049 -610289 -914591 -832800 -398943 14493
33316 14493 138894 51458 -67831 -185442 -324369 -411101 -344529 -138294 75760 148852
33306 148852 25766 -186480 -288977 -198346 -44340 1151 -73938 -161457 -189026 -148410 -52584
33295 -52584 48204 92471 112612 191815 261648 132666 -172255 -347999 -242047 -117717
33285 -117717 -238426 -418609 -317771 -9414 132014 24009 -50561 45490 123724 75355
33275 75355 78144 240989 356930 231823 44320 142691 587468 1079514 1303940 1234154
33265 1234154 1107746 1140484 1256014 1154546 726830 295963 257463 536934 663532 409774
33255 409774 88612 97182 393522 613153 563729 399022 344118 415979 463057 413086 401291
33244 401291 585592 849779 848697 459279 27360 -49715 131418 146750 -97013 -238994
33234 -238994 -65848 136326 26499 -292749 -477169 -427457 -306605 -227475 -195233 -257243
33224 -257243 -443941 -616166 -612140 -511725 -529798 -675227 -752403 -702542 -692315 -797370 -822537
33213 -822537 -570196 -149355 116572 30542 -306145 -614357 -683833 -544398 -418238 -470751
33203 -470751 -627968 -699550 -636019 -551659 -520537 -497776 -456240 -449715 -491985 -507319 -462087
33192 -462087 -424360 -432553 -431454 -407101 -445441 -562890 -621470 -538557 -448453 -503743 -639305
33181 -639305 -711737 -749584 -829809 -800672 -438080 118681 411687 253546 -5369 32266
33171 32266 285035 380419 195531 -56140 -197778 -287333 -435383 -627336 -773784 -810793
33161 -810793 -728315 -593263 -525463 -550352 -527372 -358812 -203277 -289601 -557259 -718247
33151 -718247 -688149 -691380 -857876 -983833 -858801 -610301 -507476 -578538 -648043 -635827 -583389
33140 -583389 -470989 -264288 -100864 -166628 -379633 -452608 -311649 -192956 -235843 -249778
33130 -249778 -61757 132260 21922 -333454 -546059 -400221 -80252 123992 131867 26304
33120 26304 -122570 -261158 -294834 -175718 -16271 -4536 -202945 -498666 -745361 -879915
33110 -879915 -889638 -751322 -478841 -205336 -121886 -274931 -469418 -465957 -280335 -178057
33100 -178057 -309666 -469550 -367557 -73071 33796 -205835 -471527 -383894 -17573 212636
33090 212636 85646 -235676 -516434 -700907 -797384 -744635 -540736 -364055 -403445 -622105
33080 -622105 -798200 -762089 -530786 -272728 -196325 -380690 -641574 -673755 -429789 -237225
33070 -237225 -385511 -699020 -732386 -354164 89694 230188 94117 -20520 58492 221334
33060 221334 244613 34026 -264219 -371847 -168388 111039 69575 -407935 -989476 -1232943
33050 -1232943 -1021851 -614400 -331077 -266743 -277907 -196666 -47628 -25181 -211400 -384810
33040 -384810 -258609 97805 269535 10092 -428649 -623196 -506737 -389986 -518775 -793415
33030 -793415 -929492 -762834 -383455 -66720 -62046 -344059 -584866 -490686 -163800 -354
33020 -354 -211531 -586931 -783552 -707329 -509909 -328461 -186969 -112315 -179233 -383467 -562702
33009 -562702 -524619 -242623 107236 298768 236440 6124 -223512 -337298 -320488 -203311
32999 -203311 -9444 216728 372814 356721 180430 -13874 -76931 27295 226428 412763
32989 412763 481385 359184 78138 -203045 -337959 -352224 -376114 -417610 -333608 -86152
32979 -86152 109096 27765 -245846 -410654 -345611 -255354 -377109 -672446 -893214 -876334
32969 -876334 -688102 -509460 -443488 -435518 -362575 -204752 -103536 -200710 -442137 -626642
32959 -626642 -647895 -579831 -496436 -339744 -58116 225636 313879 159064 -119537 -403149
32949 -403149 -630063 -707819 -539038 -201141 29637 -47139 -313471 -469551 -382246 -192746
32939 -192746 -92281 -120306 -218708 -349256 -456591 -420271 -197537 31790 28691 -198598
32929 -198598 -414947 -496596 -547963 -620700 -556641 -272102 17776 102282 138113 408753 834028
32918 834028 1083700 1144819 1350549 1750082 1883592 1431227 734864 341562 291463 242901
32908 242901 110601 117181 266435 241274 -75653 -377194 -403769 -319039 -390252 -549855 -547862
32897 -547862 -375876 -254843 -269005 -260685 -89490 183284 380492 356807 84691 -285036
32887 -285036 -487969 -408333 -238517 -232651 -357146 -382531 -284913 -286777 -444394 -483208 -217157
32876 -217157 98849 88896 -211348 -428934 -409222 -393434 -583964 -809424 -792154 -566342
32866 -566342 -405956 -410530 -391971 -203037 17891 50761 -79088 -150646 -89139 -62328 -176916
32855 -176916 -272613 -182160 -49620 -134149 -357386 -363001 -78876 117202 -35938 -269753
32845 -269753 -227998 -59117 -165189 -508378 -632591 -368497 -61899 -1268 -39857 31853
32835 31853 120778 93874 82603 215559 301966 126230 -127384 -112775 120768 179874 -79680
32824 -79680 -344999 -294305 589 209775 110662 -253627 -656382 -869427 -830366 -649584
32814 -649584 -448694 -275883 -196829 -290428 -462656 -471680 -284752 -183582 -321800 -442476
32804 -442476 -314513 -170522 -317413 -555183 -485741 -230944 -244558 -465840 -335950 231143
32794 231143 575089 272476 -212226 -273628 -55743 -76762 -341993 -425693 -236723 -116893
32784 -116893 -217809 -293120 -180047 -71182 -166402 -351120 -376084 -175024 104633 262933
32774 262933 182875 -89218 -369553 -520659 -586949 -659627 -672974 -483582 -126924 153750
32764 153750 152893 -111414 -443911 -629663 -585553 -438349 -412455 -573842 -748873 -757331 -625262
32753 -625262 -486043 -397465 -374856 -473308 -678810 -825964 -788584 -648600 -511757 -299955
32743 -299955 35285 227475 -31749 -553254 -752690 -402880 35289 38078 -273840 -344404
32733 -344404 27107 436593 452156 154554 -66309 -66751 -45346 -143485 -244341 -256764 -333172
32722 -333172 -597623 -850292 -820309 -594484 -477956 -490629 -370456 -96821 -4052 -235707
32712 -235707 -463576 -376822 -131014 -37895 -85489 -85058 -72251 -206133 -413062 -476442 -392411
32701 -392411 -324990 -286140 -169137 -36506 -55380 -171931 -156423 24409 161302 138891
32691 138891 53121 -15316 -77874 -76422 73380 236466 140260 -216227 -493378 -455722 -257511
32680 -257511 -170003 -233838 -321769 -376674 -430529 -487200 -509786 -474771 -385908 -290807 -287579 -424621
32668 -424621 -599525 -664228 -617883 -576295 -570454 -516065 -377166 -221524 -111320 -58687 -73513
32657 -73513 -137147 -162256 -98180 -23018 -14403 -24920 -26296 -130768 -358637 -444447 -172419
32646 -172419 210818 267764 -5187 -194272 -95065 67793 89378 56069 55593 -25958 -262965
32635 -262965 -539840 -767084 -961701 -1018495 -741778 -241787 57113 -9195 -109804 21790
32625 21790 152775 -25919 -363185 -509434 -486982 -600121 -898753 -1102440 -1026135 -789914
32615 -789914 -604850 -560851 -613730 -626142 -463776 -174429 5376 -74046 -306793 -524130
32605 -524130 -678978 -727850 -566392 -270165 -162380 -390035 -637231 -543840 -227017 -66689
32595 -66689 -122898 -124421 57063 294149 527230 825507 1095468 1086878 796424 571927 669284
32584 669284 924972 1014420 865683 662837 544952 452020 257154 -26253 -207357 -114089
32574 -114089 186337 445580 521926 482177 394773 231464 74959 169784 550957 843726
32564 843726 723514 401743 311939 442202 392904 67261 -142189 34919 336007 372414
32554 372414 165019 28811 93890 179181 83357 -168467 -376650 -394916 -288223 -241948
32544 -241948 -305492 -329925 -237626 -200113 -370826 -583592 -573326 -396396 -325962 -388209 -355196
32533 -355196 -200879 -181038 -377765 -538801 -514448 -502104 -662705 -820616 -785871 -692369
32523 -692369 -751999 -912876 -1019682 -1076974 -1084110 -865065 -395975 -68928 -230762 -631171
32513 -631171 -756117 -575992 -484642 -573751 -523568 -267395 -188448 -444380 -613242 -348028
32503 -348028 34972 39761 -243312 -323317 -83203 106147 -6826 -267043 -469553 -627222
32493 -627222 -781256 -847744 -781325 -666242 -548988 -389207 -243981 -259100 -385806 -366371
32483 -366371 -136261 18958 -111786 -330702 -347160 -205897 -132910 -146179 -128244 -136340 -296449
32472 -296449 -482872 -461430 -306660 -312827 -494384 -548154 -352105 -124031 -4937 122798
32462 122798 268131 188082 -171642 -467180 -462372 -400605 -544996 -672631 -446083 -42620
32452 -42620 68493 -157689 -329516 -268135 -190395 -219791 -186648 -32449 15707 -135106 -216792
32441 -216792 -33574 178701 101750 -184880 -359919 -333382 -275254 -278587 -287321 -325271 -517611
32430 -517611 -833439 -1022081 -904069 -593207 -338901 -239552 -206699 -160486 -148899 -243886
32420 -243886 -387763 -431174 -344485 -314610 -540381 -947273 -1209108 -1093725 -715276 -391472
32410 -391472 -307848 -389015 -459350 -437364 -360072 -295238 -288360 -362284 -495309 -590045 -537065
32399 -537065 -360406 -243982 -332201 -533310 -614146 -482053 -277792 -191780 -292397 -529680
32389 -529680 -772860 -833794 -620252 -312471 -212519 -352765 -450262 -339700 -211533 -258480
32379 -258480 -337177 -235375 -64228 -64178 -172984 -150753 -43489 -119751 -353079 -381311 -73394
32368 -73394 234714 224561 665 -168674 -235425 -278712 -255883 -94271 109651 192189 124217
32357 124217 -37190 -270119 -510448 -598587 -489441 -397524 -530808 -760746 -760449 -433920
32347 -433920 -26904 180462 137769 -26774 -187470 -303817 -389396 -443263 -423420 -312389
32337 -312389 -187874 -154492 -210979 -273202 -312609 -351654 -346054 -244080 -157051 -246006 -399363
32326 -399363 -288375 141947 499612 444317 131238 -63365 -61937 -73015 -209735 -398358
32316 -398358 -572841 -695056 -644226 -346709 8043 116901 -65544 -289641 -332527 -190986
32306 -190986 16414 173676 224260 240711 364786 546668 497716 114846 -227889 -132916
32296 -132916 207946 251929 -100228 -398483 -373051 -292751 -422095 -558168 -402924 -73862
32286 -73862 88438 4477 -162243 -336308 -532972 -649414 -563767 -389910 -360660 -477808
32276 -477808 -523609 -420594 -346032 -445779 -629056 -716669 -649271 -480202 -270894 -64748
32266 -64748 98935 200756 252843 285353 327173 367864 330193 149151 -100078 -256498 -303477
32255 -303477 -410564 -651203 -827231 -736261 -496813 -401986 -514987 -623878 -570514 -408967
32245 -408967 -231607 -49380 114556 199029 219264 235116 179000 -70683 -389455 -438250
32235 -438250 -138334 121758 -29002 -434189 -647671 -558946 -472255 -586777 -715016 -618797
32225 -618797 -386573 -306138 -480628 -717442 -755837 -525350 -217723 -140204 -428214 -863099
32215 -863099 -1060137 -892592 -638320 -632905 -874203 -1078073 -1042381 -809895 -516269 -253226
32205 -253226 -107447 -172290 -423871 -672142 -730656 -602868 -447117 -397163 -466582 -584776
32195 -584776 -660255 -630051 -505955 -364886 -256710 -148383 -7434 96932 61610 -86033
32185 -86033 -186496 -147814 -70204 -108178 -260021 -376359 -361409 -281212 -252877 -295853 -335021
32174 -335021 -300015 -166297 61909 329257 499586 441933 183597 -89081 -227939 -261900
32164 -261900 -289956 -314778 -284139 -245612 -318051 -498790 -629498 -599704 -474372 -361307 -262692
32153 -262692 -146986 -69466 -96154 -167831 -175418 -143070 -192255 -310340 -300647 -46559 258305
32142 258305 258742 -165421 -708680 -913346 -662924 -342620 -404405 -795554 -995979 -686560
32132 -686560 -169560 56813 -38832 -74074 123335 300930 228397 16250 -144617 -264709
32122 -264709 -391106 -417629 -283100 -141201 -96694 8370 265054 382207 83508 -342660
32112 -342660 -351996 56865 350279 302080 285030 539033 693717 395041 -27754 -32345 267223
32101 267223 270242 -160276 -481186 -292669 105136 201438 -33507 -236758 -218008 -129299
32091 -129299 -136832 -175595 -81707 157291 357311 331666 108483 -87298 -98362 -9344 27977
32080 27977 50062 184661 343551 254252 -141144 -531088 -592521 -346950 -59009 57186
32070 57186 -81232 -448391 -832384 -891853 -519085 -57235 66800 -138986 -311833 -282032
32060 -282032 -252531 -390408 -528927 -434350 -167864 19967 43898 30310 47728 -17813 -273208
32049 -273208 -629617 -881088 -914644 -775945 -556966 -301551 -49913 92255 25020 -194672
32039 -194672 -360653 -339434 -231628 -230327 -346592 -380573 -192103 86440 180631 -7301
32029 -7301 -277179 -353536 -196205 -33434 -72254 -243986 -314360 -203041 -63616 -34393 -66966
32018 -66966 -85679 -165356 -385878 -600702 -556801 -246604 32809 17928 -247641 -520056
32008 -520056 -626086 -575585 -491030 -482437 -548005 -583989 -533661 -487596 -544989 -624863 -565313
31997 -565313 -389523 -282456 -280656 -207245 -3957 103801 -46392 -223832 -70921 382361
31987 382361 719274 649873 312347 22435 -91044 -109814 -119971 -113914 -66092 -17342 -51902
31976 -51902 -193049 -341490 -369741 -292094 -257824 -320253 -315799 -92092 223473 348878 208993
31965 208993 -4269 -130017 -199706 -261967 -261809 -202440 -229297 -383685 -434976 -183342 172684
31954 172684 233541 -59283 -340784 -324079 -128281 1329 50965 114340 99261 -160671
31944 -160671 -567377 -803743 -738530 -560111 -460522 -411353 -352954 -393804 -642683 -968586
31934 -968586 -1108605 -957678 -627681 -296897 -122614 -195278 -407763 -459150 -193957 124992
31924 124992 115960 -184003 -354995 -193066 25605 -8977 -209503 -298327 -226395 -149706 -136745
31913 -136745 -144349 -193732 -332586 -465134 -433787 -254697 -90928 -14767 20582 443 -144220
31902 -144220 -333435 -358396 -171145 25190 54271 -23573 -66425 -66247 -93317 -139575 -147648
31891 -147648 -132527 -162573 -246915 -317201 -307582 -220570 -141870 -191521 -395004 -598465 -603509
31880 -603509 -410690 -234381 -240262 -362768 -426282 -354104 -205438 -86616 -71540 -139167 -169762
31869 -169762 -85361 15365 -18869 -162953 -289510 -438642 -735944 -1014451 -891198 -390517
31859 -390517 -108354 -440369 -971363 -1052125 -725452 -551470 -662642 -619663 -246132 21645
31849 21645 -154816 -482212 -542446 -420500 -445242 -610880 -650883 -480539 -219286 43663
31839 43663 189775 -4303 -515760 -857200 -642616 -212213 -206210 -616985 -818209 -541407
31829 -541407 -230566 -270815 -424673 -331436 -109838 -85514 -247178 -359351 -381707 -411568
31819 -411568 -388110 -205861 5251 39572 -44444 -47914 -1225 -94149 -296200 -362896 -207670
31808 -207670 14346 184173 303644 304190 66484 -315574 -551817 -514972 -367028 -265800
31798 -265800 -166060 -1430 129442 74857 -182350 -502334 -671461 -550300 -274242 -210963
31788 -210963 -496788 -726518 -439710 143692 307347 -185699 -768157 -897261 -746837 -762683
31778 -762683 -929737 -916758 -693069 -540064 -569410 -632285 -643930 -648185 -611480 -480512 -393226
31767 -393226 -502911 -643417 -529114 -262765 -243438 -527844 -701999 -520457 -278843 -330691
31757 -330691 -562612 -629115 -470190 -301330 -246688 -262208 -327745 -459738 -574846 -554395
31747 -554395 -435183 -377855 -458712 -613111 -744748 -771318 -618647 -313972 -54692 -47075
31737 -47075 -281776 -564351 -731561 -739426 -604002 -400861 -284500 -345971 -452137 -372027
31727 -372027 -73228 240303 387124 353351 167453 -179731 -603216 -869161 -810562 -524666
31717 -524666 -256669 -149491 -186350 -296767 -405760 -428600 -332938 -192373 -97607 -41588
31707 -41588 27406 77399 22436 -132585 -277855 -332858 -310152 -250724 -188851 -179772 -258493
31696 -258493 -357155 -365082 -291106 -263516 -345390 -458495 -516432 -511898 -440365 -282043 -114620
31685 -114620 -86653 -203174 -307275 -359214 -509598 -747166 -744702 -336295 79244 1326
31675 1326 -436398 -636485 -406207 -166695 -217670 -308081 -173863 -41209 -223582 -560870
31665 -560870 -693542 -666650 -798866 -1068096 -1097306 -764951 -418628 -374443 -516616 -535125
31655 -535125 -341045 -108826 -36332 -144278 -237618 -81185 286179 499893 306702 -51670
31645 -51670 -148746 17832 71976 -96932 -147510 123605 388268 248370 -169699 -383299
31635 -383299 -178986 188598 348234 153708 -275130 -672062 -799894 -631880 -354873 -148573
31625 -148573 -39374 -16539 -145066 -435384 -707911 -738861 -499737 -158125 104867 207717
31615 207717 181684 152782 234807 371636 369519 142812 -172185 -396884 -481888 -456036 -363886
31604 -363886 -319580 -441383 -639713 -660475 -450334 -274293 -337732 -515917 -622340 -695588
31594 -695588 -796384 -772008 -520261 -279060 -316628 -498375 -514953 -395465 -402904 -534153
31584 -534153 -566853 -554559 -795199 -1253991 -1480724 -1251800 -909997 -882786 -1173020 -1493644
31574 -1493644 -1629985 -1519738 -1234299 -1004831 -1005835 -1032776 -720659 -168006 77500 -168883
31564 -168883 -398895 -198566 88912 -59817 -468776 -524209 -117081 257469 289384 194270
31554 194270 199878 177897 -38207 -330349 -491506 -494804 -403903 -219158 34566 220774 223456
31543 223456 69046 -145510 -337848 -423513 -348767 -180822 -48123 27071 113848 195758
31533 195758 165998 17836 -115548 -148753 -143625 -196760 -336152 -519354 -623677 -498689
31523 -498689 -188432 -21033 -248635 -655259 -801650 -636227 -530725 -669527 -776227 -592824
31513 -592824 -284205 -134890 -125514 -86268 -51380 -150234 -282913 -216513 40804 219379 144194
31502 144194 -72983 -197947 -95303 193513 481394 578787 489316 397968 401525 376072 209110
31491 209110 7900 -70023 -46565 -11365 72125 239922 338036 207559 -25184 -93034 29119
31480 29119 122858 67402 -51807 -143908 -186123 -121025 76025 239937 179084 -4801 -26584
31469 -26584 133816 182199 -26243 -264360 -292703 -180746 -112982 -94679 -30990 65439 117867
31458 117867 118251 84308 -3186 -112065 -131306 -38705 24648 -52036 -199890 -300944 -334704
31447 -334704 -308008 -188710 -14223 76791 25593 -73631 -164904 -313119 -490017 -491673 -233572
31436 -233572 65314 176850 158236 162263 162408 109293 150379 376986 521393 285194 -126054
31425 -126054 -209170 103103 328834 138780 -217041 -351286 -273169 -236211 -291140 -276954
31415 -276954 -151904 -85795 -219906 -470751 -592571 -399976 40054 438157 573851 528964
31405 528964 511543 498554 275408 -148960 -437077 -363613 -131401 -57917 -131810 -122045 -9376
31394 -9376 -31469 -306751 -646595 -802988 -744894 -612968 -506465 -406373 -275784 -167113
31384 -167113 -193226 -383978 -612347 -727820 -738122 -755352 -774950 -666828 -423730 -230971
31374 -230971 -189337 -157592 -23848 57519 -71331 -231337 -133869 131576 175006 -125152
31364 -125152 -465584 -591376 -585715 -563957 -433482 -185036 -100274 -337382 -550220 -319486
31354 -319486 176237 349331 19331 -395816 -545818 -556724 -620165 -603550 -361371 -113874
31344 -113874 -161612 -424465 -601878 -638158 -685274 -721015 -580314 -320295 -182857 -190543 -146196
31333 -146196 -69983 -237190 -659654 -920626 -742637 -393606 -272779 -378879 -485187 -586949
31323 -586949 -803202 -996797 -897945 -568657 -388683 -542337 -797000 -838800 -600330 -223652
31313 -223652 83428 122262 -144852 -461164 -486969 -204090 58307 40354 -180099 -366602
31303 -366602 -377779 -195625 93237 269486 138541 -179012 -303322 -68473 232567 227254
31293 227254 -59324 -282954 -235343 -37643 78629 26326 -108940 -194222 -178777 -131665
31283 -131665 -149311 -238443 -335919 -409175 -441073 -355421 -115224 112035 84656 -170998 -344227
31272 -344227 -239906 4516 192543 327760 446069 420308 168451 -109973 -168562 -76317
31262 -76317 -86645 -227201 -296006 -224883 -159950 -167323 -134340 -24125 22562 -64501 -153133
31251 -153133 -136512 -93690 -94262 -36056 149940 292048 183953 -104551 -333048 -431997 -506644
31240 -506644 -536383 -348270 41484 313796 231445 -45542 -214199 -247019 -316860 -402661
31230 -402661 -279235 74304 350949 322131 127997 884 -79121 -223369 -308666 -121337
31220 -121337 237103 396221 201607 -98848 -224039 -200393 -228691 -372923 -507741 -496276
31210 -496276 -339916 -181777 -159509 -217468 -148012 88818 229519 75728 -160902 -175332
31200 -175332 -95518 -281759 -650441 -702038 -318901 -18641 -185562 -530797 -638891 -601682
31190 -601682 -680195 -721334 -445069 -54857 3247 -251297 -411727 -389089 -480942 -731095
31180 -731095 -779563 -470894 -123058 -12930 -14945 48813 82399 -22703 -125907 -95429 -69332
31169 -69332 -210986 -415227 -486624 -430322 -362238 -301105 -238802 -244495 -309212 -262058 -44698
31158 -44698 101492 -48224 -344302 -469047 -389317 -344696 -450576 -572150 -585424 -538514
31148 -538514 -521978 -551035 -615179 -717039 -831314 -913806 -953609 -947231 -859236 -695944 -565522
31137 -565522 -553892 -586189 -531967 -404579 -314545 -251943 -84537 199846 405904 367948 173737
31126 173737 55749 106144 186921 122953 -77954 -236961 -223323 -112769 -87834 -207116
31116 -207116 -343791 -360870 -270772 -183180 -162035 -194111 -252962 -324754 -385706 -403234 -355140
31105 -355140 -228482 -29619 177238 282137 230355 91818 -18287 -80336 -181597 -370445
31095 -370445 -541376 -523110 -292708 -42446 29243 -47600 -95257 -88049 -200521 -483503 -672837
31084 -672837 -499297 -77462 229711 281592 264245 327349 369110 269865 127515 107708 189766
31073 189766 219367 147132 70178 48625 4344 -140606 -281720 -195105 156786 464237 377387
31062 377387 -27881 -302263 -214049 -38081 -88435 -233458 -170251 38659 88611 -50144
31052 -50144 -163948 -248183 -445845 -575185 -285063 238478 322733 -212898 -702032 -586912
31042 -586912 -195375 -128525 -354892 -466915 -459572 -607729 -795303 -635741 -190188 46259
31032 46259 -108489 -339456 -444830 -585713 -804833 -818024 -508086 -196652 -166226 -262026
31022 -262026 -231499 -152496 -229821 -400024 -442669 -339964 -258990 -263726 -265853 -213153 -157952
31011 -157952 -163863 -246280 -360328 -390296 -240778 2807 115113 -2678 -216178 -377474
31001 -377474 -499777 -618489 -640088 -485370 -277609 -225003 -364531 -545941 -629239 -594749
30991 -594749 -496417 -403806 -370141 -386708 -384669 -317241 -199034 -45972 139653 282631 240734
30980 240734 -9711 -270384 -312648 -133596 74567 175478 197066 192365 114846 -96279
30970 -96279 -363096 -487574 -338698 12486 348404 461427 266453 -148965 -529395 -600743
30960 -600743 -340756 -50421 -14154 -139118 -127093 32857 34060 -227425 -435597 -342911
30950 -342911 -169841 -229210 -395845 -315477 6001 209911 122519 -77648 -216599 -302423
30940 -302423 -326192 -220272 -73039 -83099 -237173 -320582 -297567 -364188 -544598 -574153 -327645
30929 -327645 -55304 -11941 -114172 -152059 -108364 -80728 -89012 -130576 -243906 -382388 -426401
30918 -426401 -432984 -617753 -944464 -1023885 -637393 -100893 140283 56532 -66642 -51752
30908 -51752 101569 347410 517227 333593 -191379 -582162 -469628 -141176 -130653 -425593
30898 -425593 -546005 -332305 -149478 -253894 -423090 -379541 -213872 -170176 -266009 -334164
30888 -334164 -280745 -146458 -23399 -2890 -104394 -216019 -216670 -151165 -137838 -137369 -23339
30877 -23339 132756 108041 -98999 -213814 -101915 18910 -67344 -234323 -221293 -14713
30867 -14713 183660 253700 218002 81246 -180567 -473752 -602833 -485279 -254177 -101992
30857 -101992 -83345 -118773 -158941 -271629 -517636 -772410 -779824 -447241 -9172 207482
30847 207482 142267 17940 27326 133853 193462 144684 20487 -139414 -312322 -459186
30837 -459186 -517696 -443455 -270556 -121885 -98505 -138387 -69288 149103 338190 343242 260831
30826 260831 291390 433797 477929 282830 -54419 -296923 -259743 47428 390029 487856
30816 487856 302927 62096 -67656 -166212 -318226 -407208 -360088 -381788 -643504 -902728
30806 -902728 -801643 -449947 -312057 -539398 -820744 -922586 -954161 -997037 -894719 -602018
30796 -602018 -382731 -425960 -555252 -540010 -427591 -347715 -256688 -119552 -89172 -233152
30786 -233152 -319941 -171165 -5182 -99939 -310823 -301964 -111617 -66849 -203566 -214163 -2929
30775 -2929 136712 31567 -66369 88962 294204 182716 -206313 -449189 -294014 58414
30765 58414 276977 301573 300458 350527 337570 169676 -64184 -216112 -249413 -196381 -50417
30754 -50417 163514 295057 230569 110164 173005 382570 432512 176422 -176533 -387678
30744 -387678 -487990 -614276 -745126 -777787 -725741 -671870 -632033 -594490 -576418 -534664 -377684
30733 -377684 -183176 -204733 -497442 -748029 -695219 -516072 -524235 -664394 -635744 -399101
30723 -399101 -207248 -182232 -206317 -225107 -323278 -464520 -475671 -362337 -347975 -502797 -605359
30712 -605359 -494919 -314545 -254608 -263407 -180115 2915 173450 283884 364897 429674 460925
30701 460925 433727 305788 66184 -186513 -324210 -359654 -404718 -452740 -374318 -164532
30691 -164532 -9043 -37125 -180774 -348081 -552822 -782178 -921775 -926588 -893000 -844066
30681 -844066 -636277 -238829 83007 80720 -114684 -171448 -5601 182372 255793 270684
30671 270684 257361 126729 -124046 -307192 -270752 -112013 -45311 -125680 -215595 -198735 -123337
30660 -123337 -111227 -193974 -291519 -325535 -295635 -245280 -217907 -264082 -404238 -524015 -403183
30649 -403183 26865 509368 692210 513294 213835 -9558 -178136 -340600 -432292 -421462
30639 -421462 -405913 -430791 -374489 -176127 -30615 -152082 -432889 -553980 -399431 -158494
30629 -158494 -15116 65310 184276 307996 321436 205858 74079 43138 103408 116856
30619 116856 -28160 -243910 -296711 -103464 103458 39439 -242790 -391184 -201817 134659
30609 134659 305363 247060 121170 26641 -82280 -215475 -267595 -182805 -67184 -36723
30599 -36723 -44268 19278 113984 97834 -31753 -121945 -124589 -175585 -314652 -331277 -83946
30588 -83946 190906 161565 -91941 -165074 75882 307483 244015 15013 -110137 -107372 -91093
30577 -91093 -40175 105821 220526 127569 -117722 -312642 -392790 -406738 -300061 -5915
30567 -5915 295344 314191 70601 -114121 -97719 -97054 -281456 -469513 -415046 -180219 -14706
30556 -14706 -12582 -88057 -178776 -278966 -348207 -363519 -403163 -518656 -581265 -427058 -127743
30545 -127743 40575 -103050 -493735 -941782 -1276385 -1395352 -1313590 -1167036 -1065613 -968501
30535 -968501 -808044 -662275 -635087 -629024 -470009 -246118 -248478 -506897 -660579 -448394
30525 -448394 -101478 -35471 -306334 -595398 -641726 -481162 -306206 -262894 -355256 -426622
30515 -426622 -299526 -36456 71281 -83422 -212291 -71881 83663 -141863 -598299 -713665
30505 -713665 -316337 137091 264020 210026 186941 29002 -424127 -872565 -937502 -754304
30495 -754304 -720808 -819287 -684447 -282245 -15199 -91263 -240385 -207057 -142506 -291463
30485 -291463 -571914 -703895 -582715 -335539 -132312 -81066 -197192 -356809 -372595 -203581
30475 -203581 -10577 37593 -85846 -316030 -550944 -636442 -466630 -148758 77855 113720
30465 113720 37476 -111464 -359712 -589724 -579721 -348505 -203105 -315989 -499421 -545754
30455 -545754 -538055 -624267 -711932 -635784 -464771 -392151 -428597 -426377 -326854 -191578 -58608
30444 -58608 64177 126063 87390 -23678 -193503 -435611 -640303 -602550 -329461 -113851
30434 -113851 -140269 -238290 -217816 -195611 -321715 -422286 -261320 13154 52325 -173293
30424 -173293 -387485 -451375 -439166 -346298 -98069 178239 251583 153409 108414 122489 7926
30413 7926 -190072 -203474 -25622 28675 -155566 -314709 -283874 -258540 -396221 -523295 -460062
30402 -460062 -317315 -246646 -198956 -154410 -275292 -564005 -676843 -401987 -63874 -97172
30392 -97172 -424861 -627968 -567601 -445827 -358220 -203605 -23120 -35399 -259287 -417310
30382 -417310 -324643 -132379 -76750 -185280 -340183 -469151 -554199 -563035 -482744 -368416 -292093
30371 -292093 -271100 -265211 -213850 -87888 55759 105008 32353 -42347 -503 110808 148146
30360 148146 64653 -59634 -149603 -199102 -215909 -194603 -156020 -154187 -226781 -350401 -428018
30349 -428018 -335912 -59628 207740 207112 -101098 -478402 -663940 -588325 -328640 -20112
30339 -20112 140900 13566 -255539 -314531 -64342 165333 78273 -162376 -219384 -104039
30329 -104039 -94239 -252573 -379157 -396661 -429034 -489361 -437208 -303715 -321320 -525598 -650726
30318 -650726 -570182 -529407 -726069 -931686 -811144 -430941 -153460 -136434 -219475 -246082
30308 -246082 -218837 -136034 62795 319458 430185 300513 92149 21743 114902 244432
30298 244432 319297 328178 253775 67505 -187344 -399708 -507146 -544825 -546312 -463246 -256551
30287 -256551 -29387 35896 -104832 -290481 -351875 -297734 -236783 -195571 -129120 -65566 -92508
30276 -92508 -190968 -229463 -179631 -206240 -436171 -723739 -782018 -535312 -234060 -188912 -441029
30265 -441029 -716015 -687099 -300319 133326 203067 -188231 -696154 -884298 -683544 -416612
30255 -416612 -371851 -484592 -508907 -383380 -277691 -315768 -408767 -394743 -232901 -17987
30245 -17987 109651 43547 -187970 -366163 -273494 -16710 13039 -352052 -758891 -773640
30235 -773640 -487797 -367065 -541247 -634256 -407308 -192569 -418642 -963586 -1316123 -1248672
30225 -1248672 -992726 -786580 -588653 -318376 -106649 -136827 -378419 -627334 -745126 -758009
30215 -758009 -761189 -801788 -840841 -794779 -632480 -438698 -341491 -368150 -420515 -406898 -348132
30204 -348132 -328293 -385761 -493102 -615640 -729680 -767299 -606677 -213600 196642 266964
30194 266964 -114445 -610393 -779071 -588260 -396347 -431629 -546473 -558876 -544015 -595448
30184 -595448 -559923 -304943 -65108 -159806 -446466 -437779 7243 459833 493036 175651
30174 175651 -154535 -346518 -454334 -488494 -397076 -229878 -138377 -221169 -458895 -758150
30164 -758150 -989976 -1048260 -942073 -780252 -628649 -459442 -262258 -88584 48862 180025
30154 180025 235971 85955 -193124 -293553 -95015 75884 -156711 -676699 -997552 -875252
30144 -875252 -535463 -289123 -193680 -174217 -237817 -406217 -578251 -620843 -534238 -417226
30134 -417226 -318222 -213061 -99467 -39983 -113674 -338607 -609936 -735201 -623162 -433988
30124 -433988 -411524 -545118 -568718 -361924 -139720 -91597 -55824 174835 395678 231771
30114 231771 -202356 -332553 61153 480375 411646 29642 -168859 -144172 -239547 -474726
30104 -474726 -472396 -140460 91598 -77968 -356009 -321118 -37390 127552 72257 382
30094 382 19422 30751 -30337 -122276 -243302 -414860 -539086 -491860 -342074 -267179 -266128
30083 -266128 -179246 1560 77009 -50541 -213510 -207791 -39452 122433 124430 -70563 -342875
30072 -342875 -465926 -328848 -110101 -78631 -228526 -302543 -199613 -131542 -282331 -521914
30062 -521914 -618320 -587770 -639107 -823678 -917577 -696831 -247347 72614 2604 -320196
30052 -320196 -514268 -418635 -269558 -332029 -521160 -573261 -462833 -396345 -455052 -517921 -527923
30041 -527923 -556549 -575227 -442719 -190732 -58744 -150040 -299406 -379811 -476684 -624029
30031 -624029 -638433 -417599 -188254 -229227 -493242 -702110 -701730 -555369 -392561 -310950 -331004
30020 -331004 -344647 -223750 -35335 35125 25534 184460 496901 557074 152307 -334252
30010 -334252 -424187 -191370 -44222 -79181 -77664 3749 16134 32520 284809 637406 600995
29999 600995 35337 -562136 -695826 -477549 -331050 -352391 -292826 -50481 148657 81908
29989 81908 -182498 -409936 -484742 -473654 -455510 -399645 -261408 -125818 -136832 -281672 -374670
29978 -374670 -302971 -162355 -79898 -36001 42831 149165 258359 378724 422773 217414
29968 217414 -190152 -442767 -321435 -88237 -97179 -251984 -216302 -18991 -4231 -224537
29958 -224537 -355778 -273024 -252199 -454690 -632845 -564811 -421664 -443136 -545324 -524603
29948 -524603 -401466 -278850 -80035 253692 466436 239088 -311643 -681946 -547316 -72683
29938 -72683 348944 479213 329779 44296 -222034 -360145 -315461 -96397 177443 298962
29928 298962 184802 37765 110003 301440 244077 -149379 -517280 -584184 -552523 -686576
29918 -686576 -782941 -466230 129899 446012 282169 62370 168491 397314 355577 110488
29908 110488 59748 262143 312906 -26551 -422586 -431896 -143599 -20965 -183226 -241243
29898 -241243 52819 369251 282617 -83007 -255467 -106427 61324 58172 9098 -25896
29888 -25896 -191727 -450420 -460931 -88860 297930 322525 102770 -41705 -120768 -338418
29878 -338418 -617316 -678376 -522346 -446974 -584182 -748096 -766408 -666414 -491964 -216137
29868 -216137 89870 242432 191108 87998 42671 -10528 -132132 -242077 -256863 -223984
29858 -223984 -227945 -257596 -236784 -128987 12851 59327 -93030 -362950 -506552 -407446 -245382
29847 -245382 -225443 -259943 -142235 61881 84884 -116498 -315397 -412761 -558435 -792629
29837 -792629 -884825 -692493 -423854 -352334 -467158 -591936 -675360 -765080 -829220 -807982 -756273
29826 -756273 -756585 -752815 -630843 -421793 -276841 -246346 -199936 976 296709 435321 235643
29815 235643 -139897 -295878 -97984 93497 -88956 -436505 -433161 -66528 100622 -207994
29805 -207994 -536735 -411919 -80338 -93401 -438307 -597255 -351655 -29414 56382 -20690
29795 -20690 -77882 -114148 -188832 -275459 -359649 -474490 -550886 -434682 -138422 109293 143880
29784 143880 22101 -159732 -409535 -708275 -909558 -893884 -721234 -555820 -517249 -612527
29774 -612527 -706172 -592382 -254753 7476 -59315 -242910 -137858 175406 163334 -319820
29764 -319820 -696158 -476885 -9404 32616 -368093 -628024 -490092 -344504 -541616 -850037
29754 -850037 -827857 -440490 -57807 25410 -120101 -196343 -17778 263656 292564 -56177
29744 -56177 -459473 -527297 -319713 -225359 -353451 -384652 -120103 162761 127873 -104850
29734 -104850 -163192 3315 72811 -148804 -456563 -551262 -430417 -355481 -499979 -726404
29724 -726404 -741519 -467254 -196738 -280052 -667581 -927285 -778527 -435990 -288987 -391091
29714 -391091 -467902 -340759 -115298 35232 67326 11996 -115502 -288896 -449142 -537852
29704 -537852 -492701 -257540 90313 290567 161508 -113302 -172334 30679 150987 -58388
29694 -58388 -419420 -630252 -675789 -722134 -759334 -628429 -357517 -194843 -252408 -342919 -290268
29683 -290268 -221416 -351330 -565921 -480505 7525 441709 308723 -260931 -579231 -260896
29673 -260896 274451 369524 -9422 -302908 -162373 158242 276760 184863 84783 11675
29663 11675 -106072 -191609 -125434 -22191 -116165 -379689 -507744 -331419 -46666 47433
29653 47433 -108833 -342059 -491540 -554955 -629615 -774944 -942825 -1036586 -1017934 -910845
29643 -910845 -718993 -444233 -199363 -148804 -265879 -317820 -210928 -159623 -316604 -424915
29633 -424915 -146640 363523 576565 294620 -109154 -248556 -195799 -218427 -319594 -302463
29623 -302463 -139346 -12103 -27131 -92388 -90761 -42615 -60705 -204536 -404034 -528693 -546267
29612 -546267 -573105 -701628 -831432 -791419 -591508 -404182 -324873 -322573 -389551 -509510 -495975
29601 -495975 -163268 290297 401046 67526 -274295 -289809 -210893 -378497 -644734 -630519
29591 -630519 -361218 -204529 -286865 -398105 -426495 -467838 -495944 -339964 -67165 -11564
29581 -11564 -293671 -627399 -733089 -653291 -535437 -399718 -278858 -300313 -435360 -422202
29571 -422202 -151406 99940 41731 -231199 -448845 -567068 -680343 -712232 -534243 -306208
29561 -306208 -347912 -657585 -858484 -701037 -383207 -261857 -409668 -577841 -513597 -226228
29551 -226228 39324 71062 -66076 -109218 50334 208758 143170 -59411 -137650 -37207
29541 -37207 50041 -8400 -156657 -323621 -494354 -566534 -376537 15594 270282 164838
29531 164838 -93232 -127500 124062 370305 366678 170669 -12819 -81029 -68031 -41209 -42820
29520 -42820 -77972 -102529 -65450 -3952 -33481 -173657 -248883 -85831 209657 330226 169153
29509 169153 -18146 23749 172364 116001 -163313 -359738 -307607 -199304 -237723 -328272
29499 -328272 -299775 -220447 -251291 -336936 -322715 -288010 -452437 -763930 -892015 -692908 -397040
29488 -397040 -224794 -89109 139742 309635 189477 -133999 -337231 -303120 -237489 -311181
29478 -311181 -401825 -302081 -52000 77132 -99747 -476476 -781971 -857136 -770515 -681264
29468 -681264 -651913 -637291 -604676 -562066 -464473 -214707 172963 503635 598036 498238 368532
29457 368532 244582 33662 -238660 -362009 -212481 34718 98577 -56552 -190600 -93658
29447 -93658 191994 460859 541004 371025 -272 -405452 -622956 -550031 -293685 -41533
29437 -41533 109450 146722 57476 -132576 -295498 -321957 -285030 -338578 -462022 -474318 -324651
29426 -324651 -187627 -199638 -266310 -230161 -86217 75527 207959 276112 228228 126454
29416 126454 162346 380701 520425 325491 -84287 -355126 -338051 -189399 -101311 -138363
29406 -138363 -290166 -478775 -553995 -475637 -438545 -606616 -814084 -799314 -645235 -641444 -753281
29395 -753281 -648548 -305029 -138535 -347986 -551245 -353600 64588 267657 205226 150184
29385 150184 171058 73402 -182115 -362441 -305694 -123741 -6200 -9473 -84340 -170146 -224971
29374 -224971 -250736 -287012 -327888 -310546 -249004 -266234 -393825 -467276 -352309 -151985 -42371
29363 -42371 -27385 -17695 -23641 -88156 -152728 -181001 -281284 -493795 -606562 -447828 -227208
29352 -227208 -270807 -510358 -584540 -404684 -246768 -260901 -270382 -159747 -113029 -289587 -532502
29341 -532502 -598108 -488114 -381168 -375120 -436383 -491576 -464940 -322684 -143866 -49116 -41343
29330 -41343 -41922 -64856 -172199 -276462 -229650 -125615 -234758 -565776 -775913 -640566 -350049
29319 -350049 -191731 -188900 -233089 -339601 -553401 -777885 -899142 -934119 -895227 -686492
29309 -686492 -311660 -950 67906 3581 -33913 -100449 -268795 -370853 -238265 -46368
29299 -46368 -97496 -364062 -559036 -577447 -547576 -506755 -367669 -185521 -116252 -99441 67861
29288 67861 299999 241608 -162091 -473563 -347954 -19340 47266 -225244 -516476 -569048
29278 -569048 -403111 -160464 31050 79577 10263 -5236 131853 242491 78716 -279243
29268 -279243 -460255 -296336 -70164 -130294 -412405 -546849 -381526 -164627 -151784 -240209
29258 -240209 -163667 68248 161124 -31283 -290190 -348177 -248749 -231535 -368756 -501205
29248 -501205 -494053 -380045 -241095 -99330 31531 95043 42241 -119448 -320578 -412953
29238 -412953 -224127 226688 600707 526669 57688 -347905 -383262 -239983 -265948 -465237
29228 -465237 -564101 -458921 -315865 -231707 -82783 180211 324860 130676 -238114 -385544
29218 -385544 -184123 85609 133860 16176 -12005 137110 301466 292657 76175 -242870
29208 -242870 -504898 -582887 -488384 -388371 -427804 -549401 -588533 -521750 -481597 -523114 -544717
29197 -544717 -492539 -469134 -530034 -524115 -299521 25198 175263 70629 -102189 -173226 -190351
29186 -190351 -283755 -442608 -517373 -403980 -152936 106106 296526 414401 442088 325492
29176 325492 84169 -129091 -177260 -110137 -78056 -109073 -111093 -72926 -81840 -124859 -77995
29165 -77995 44999 46962 -142092 -313057 -276874 -122418 -13414 73017 197766 237199 69862
29154 69862 -151382 -188431 -82702 -67002 -201917 -368516 -528991 -696233 -736006 -548359
29144 -548359 -380624 -554442 -890974 -862572 -394093 -36738 -162844 -451673 -463657 -303121
29134 -303121 -309600 -418216 -311716 -25436 92203 -29829 -81969 100123 291739 257898
29124 257898 53914 -179388 -438685 -703488 -782703 -537134 -138876 88541 44481 -84534
29114 -84534 -117617 -99649 -186974 -397829 -562290 -528735 -359732 -254479 -286146 -310393 -183138
29103 -183138 17770 89072 -21383 -150571 -144384 -52109 -48183 -204629 -394366 -429477 -277113
29092 -277113 -106683 -103691 -271233 -459781 -549025 -520253 -400179 -271114 -308085 -607973
29082 -607973 -950516 -959357 -606069 -320014 -419668 -660708 -614048 -309328 -145921 -247347
29072 -247347 -309034 -138187 38196 -28083 -203340 -201535 -15003 125136 96558 -21686
29062 -21686 -125638 -167390 -115697 -5130 14661 -170838 -472087 -701296 -791279 -771016 -600889
29051 -600889 -234709 175447 349805 196875 -106852 -377747 -581005 -686423 -593270 -324156
29041 -324156 -111120 -123830 -243633 -270129 -225193 -252805 -316558 -242148 -33107 100506 62377
29030 62377 1649 57329 166583 220417 227341 194748 10002 -388091 -823463 -1040646 -988438
29019 -988438 -803006 -581193 -344063 -175866 -185223 -296631 -264691 18685 353197 453058
29009 453058 260574 -34629 -224152 -256712 -228663 -268372 -424096 -630889 -777562 -791815
28999 -791815 -651063 -368776 -44114 120992 -14498 -326412 -500735 -376391 -131722 -60445
28989 -60445 -226704 -425190 -445012 -279203 -65418 98801 214954 275213 184026 -128226
28979 -128226 -535138 -775676 -733705 -551151 -390444 -218107 28449 189112 51518 -261469
28969 -261469 -370080 -177058 -47820 -287583 -677942 -778426 -526247 -245607 -136463 -67729
$$ [...]
##END NTUPLES=NMR SPECTRUM
##END=
